##TITLE=31Pdec_LR-731-CR7
 CDCl3, 24 sc
 22.12.2020
##JCAMPDX= 6.0         $$ Bruker NMR JCAMP-DX V2.0
##DATA TYPE= NMR SPECTRUM
##DATA CLASS= NTUPLES
##ORIGIN= UXNMR, Bruker Analytische Messtechnik GmbH
##OWNER= root
$$ XWIN-NMR		Version 3.5
$$ Tue Dec 22 12:36:07 2020 Russian Standard Time (UT+4h)  she@DPX200
##.OBSERVE FREQUENCY= 81.013821
##.OBSERVE NUCLEUS= ^31P
##.ACQUISITION MODE= SIMULTANEOUS
##.ACQUISITION SCHEME= undefined
##.AVERAGES= 24
##.DIGITISER RES= 17
##SPECTROMETER/DATA SYSTEM= spect
##.PULSE SEQUENCE= zgpg30
##.SOLVENT NAME= CDCl3
##.SHIFT REFERENCE= (INTERNAL, CDCl3, 0, 182.463)
##AUDIT TRAIL= $$ (NUMBER, WHEN, WHO, WHERE, WHAT)
$$ ##TITLE= Audit trail, XWIN-NMR		Version 3.5
$$ ##JCAMPDX= 5.01
$$ ##ORIGIN= Bruker BioSpin GmbH
$$ ##OWNER= she
$$ F:/spectra/data/she/nmr/P31/1/pdata/1/auditp.txt
$$ ##AUDIT TRAIL=  $$ (NUMBER, WHEN, WHO, WHERE, WHAT)
(   1,<2020-12-22 12:35:08.45 +0400>,<she>,<DPX200>,
      <created by zg, POWCHK disabled, PULCHK disabled
       configuration hash MD5:
       00 E9 B6 7A A2 85 ED C7 34 08 36 98 17 FE 4E 26
       data hash MD5: 32K
       89 EB A7 6C 3D 6B 83 62 4C E5 6D 55 DA B0 90 F7>)
(   2,<2020-12-22 12:35:11.09 +0400>,<she>,<DPX200>,
      <Start of raw data processing
       efp BC_mod = 2 LB = 1 FT_mod = 6 PKNL = 1 PHC0 = -2378.702 PHC1 = -176.5992 SI = 64K 
       data hash MD5: 64K
       28 AA 89 A7 1F CA 2C BC DB 9A F8 B6 46 19 01 15>)
(   3,<2020-12-22 12:35:35.07 +0400>,<she>,<DPX200>,
      <pk PHC0 = -190.5911 PHC1 = 561.4 
       data hash MD5: 64K
       C7 1A 46 E4 A6 BA 46 A1 8F 0D 5B AB 11 9E BE C2>)
(   4,<2020-12-22 12:35:38.10 +0400>,<she>,<DPX200>,
      <abs ABSG = 5 
       data hash MD5: 64K
       0D 67 63 51 41 E2 50 AD 6D 40 23 7B 42 91 DF B1>)
$$ ##END=
$$ 
$$ hash MD5
$$ 3F AA 97 FE BC 77 64 82 03 7E 65 AA EE 1F E5 DB
##$RELAX= 
##$RELAX= 
##$RELAX= 
##$RELAX= 
##$RELAX= 
##$RELAX= 
##$RELAX= 
##$RELAX= 
$$ Bruker specific parameters
$$ --------------------------
##$DU= <F:/spectra>
##$EXPNO= 1
##$NAME= <P31>
##$PROCNO= 1
##$TYPE= <nmr>
##$USER= <she>
##$AMP= (0..31)
100 100 100 100 100 100 100 100 100 100 100 100 100 100 100 100 100 100 
100 100 100 100 100 100 100 100 100 100 100 100 100 100 
##$AQSEQ= 0
##$AQ_mod= 1
##$AUNM= <au_zg>
##$AUTOPOS= <>
##$BF1= 81.014009
##$BF2= 200.13
##$BF3= 200.13
##$BF4= 200.13
##$BF5= 200.13
##$BF6= 200.13
##$BF7= 200.13
##$BF8= 200.13
##$BYTORDA= 1
##$CFDGTYP= 0
##$CFRGTYP= 5
##$CHEMSTR= <none>
##$CNST= (0..31)
1 1 145 1 1 1 1 1 1 1 1 1 1 1 1 1 1 1 1 1 1 1 1 1 1 1 1 1 1 1 1 1 
##$CPDPRG= <waltz16>
##$CPDPRG1= <>
##$CPDPRG2= <waltz16>
##$CPDPRG3= <>
##$CPDPRG4= <mlev>
##$CPDPRG5= <mlev>
##$CPDPRG6= <mlev>
##$CPDPRG7= <mlev>
##$CPDPRG8= <mlev>
##$CPDPRGB= <>
##$CPDPRGT= <>
##$D= (0..31)
0 1 0 0 0 0 0 0 0 0 0 0.03 2e-05 3e-06 0 0 0 0 0 0 0 0 0 0 0 0 0 0 0 0 
0 0 
##$DATE= 1608626107
##$DBL= (0..7)
120 120 120 11 120 120 24 19 
##$DBP= (0..7)
150 150 150 150 150 150 150 150 
##$DBP07= 0
##$DBPNAM0= <>
##$DBPNAM1= <>
$$ [...]
##$SUBNAM3= <"">
##$SUBNAM4= <"">
##$SUBNAM5= <"">
##$SUBNAM6= <"">
##$SUBNAM7= <"">
##$SUBNAM8= <"">
##$SUBNAM9= <"">
##$SW= 369.568048894756
##$SWIBOX= (0..15)
0 1 3 0 0 0 0 0 0 0 0 0 0 0 0 0 
##$SW_h= 29940.119760479
##$TD= 32768
##$TD0= 1
##$TE= 0
##$TE2= 300
##$TE3= 300
##$TEG= 300
##$TL= (0..7)
0 120 53 12 22 120 120 120 
##$TP= (0..7)
150 150 150 150 150 150 150 150 
##$TP07= 0
##$TPNAME0= <>
##$TPNAME1= <>
##$TPNAME2= <>
##$TPNAME3= <>
##$TPNAME4= <>
##$TPNAME5= <>
##$TPNAME6= <>
##$TPNAME7= <>
##$TPOAL= (0..7)
0.5 0.5 0.5 0.5 0.5 0.5 0.5 0.5 
##$TPOFFS= (0..7)
0 0 0 0 0 0 0 0 
##$TUNHIN= 0
##$TUNHOUT= 0
##$TUNXOUT= 0
##$USERA1= <user>
##$USERA2= <user>
##$USERA3= <user>
##$USERA4= <user>
##$USERA5= <user>
##$V9= 5
##$VALIST= <valist>
##$VCLIST= <CCCCCCCCCCCCCCC>
##$VD= 0
##$VDLIST= <DDDDDDDDDDDDDDD>
##$VPLIST= <PPPPPPPPPPPPPPP>
##$VTLIST= <TTTTTTTTTTTTTTT>
##$WBST= 1024
##$WBSW= 4
##$XGAIN= (0..3)
0 0 0 0 
##$XL= 0
##$YL= 0
##$YMAX_a= 11758
##$YMIN_a= -13219
##$ZGOPTNS= <>
##$ZL1= 120
##$ZL2= 120
##$ZL3= 120
##$ZL4= 120
##$ABSF1= 182.463
##$ABSF2= -187.1042
##$ABSG= 5
##$ABSL= 3
##$ALPHA= 0
##$AQORDER= 0
##$ASSFAC= 0
##$ASSFACI= 0
##$ASSFACX= 0
##$ASSWID= 0
##$AUNMP= <proc_1d>
##$AZFE= 0.1
##$AZFW= 0.5
##$BCFW= 0
##$BC_mod= 2
##$BYTORDP= 0
##$COROFFS= 0
##$CY= -3
##$DATMOD= 1
##$DC= 0
##$DFILT= <>
##$DTYPP= 0
##$F1P= 0
##$F2P= 0
##$FCOR= 1
##$FTSIZE= 65536
##$FT_mod= 6
##$GAMMA= 0
##$GB= 0
##$INTBC= 1
##$INTSCL= 5.30512e-09
##$ISEN= 30
##$LB= 1
##$LEV0= 0
##$LPBIN= 0
##$MAXI= 10000
##$MC2= 0
##$MEAN= 0
##$ME_mod= 0
##$MI= 50
##$NCOEF= 0
##$NC_proc= -8
##$NLEV= 6
##$NOISF1= 182.463
##$NOISF2= 159.3651
##$NSP= 0
##$NTH_PI= 0
##$NZP= 0
##$OFFSET= 182.463
##$PC= 4
##$PHC0= -2569.293
##$PHC1= 384.8008
##$PH_mod= 1
##$PKNL= yes
##$PPARMOD= 0
##$PSCAL= 0
##$PSIGN= 0
##$REVERSE= no
##$SF= 81.014009
##$SI= 65536
##$SIGF1= 159.3651
##$SIGF2= -187.1042
##$SINO= 113.3802
##$SIOLD= 16384
##$SREGLST= <1H.CDCl3>
##$SSB= 0
##$STSI= 65536
##$STSR= 0
##$SW_p= 29940.119760479
##$SYMM= 0
##$S_DEV= 0
##$TDeff= 32768
##$TDoff= 0
##$TI= <>
##$TILT= no
##$TM1= 0
##$TM2= 0
##$TOPLEV= 0
##$USERP1= <user>
##$USERP2= <user>
##$USERP3= <user>
##$USERP4= <user>
##$USERP5= <user>
##$WDW= 1
##$XDIM= 65536
##$YMAX_p= 436697112
##$YMIN_p= -75425316
$$ End of Bruker specific parameters
$$ ---------------------------------
##NTUPLES= NMR SPECTRUM
##VAR_NAME=  FREQUENCY,     SPECTRUM/REAL,   SPECTRUM/IMAG
##SYMBOL=    X,             R,               I
##VAR_TYPE=  INDEPENDENT,   DEPENDENT,       DEPENDENT
##VAR_FORM=  AFFN,          ASDF,            ASDF
##VAR_DIM=   65536,         65536,           65536
##UNITS=     HZ,            ARBITRARY UNITS, ARBITRARY UNITS
##FACTOR=    0.456856943014862, 1,           1
##FIRST=     14782.0589164895, 0,            0
##LAST=      -15158.0608439895, 0,           0
##MIN=       -15158.0608439895, -75425316,   0
##MAX=       14782.0589164895, 436697112,    0
$$ Real data points
##PAGE= N=1
##DATA TABLE= (X++(R..R)), XYDATA
$$ [...]
$$ plain form
44770 -1683721 6350334 6918966 2087489 104180 3920387 9094909 10300495 5629094
44762 5629094 -3587188 -13378397 -18611727 -16942744 -11031944 -5416491 -2363766 -1817934
44754 -1817934 -3128318 -4889947 -5082280 -3404487 -1604659 182225 4549304 11512162
44746 11512162 15174516 10223553 114562 -6265705 -5781496 -3751424 -4616908 -5363664
44738 -5363664 -1479952 4499993 5270228 -1598068 -10531279 -14930170 -13985266 -11242679
44730 -11242679 -9120562 -7446775 -6211169 -6645089 -8910236 -11031918 -11574729 -11659859 -12404199
44721 -12404199 -11918719 -7957496 -3066193 -3172168 -9699657 -16589836 -17806764 -15035077
44713 -15035077 -14263667 -16557788 -16839960 -11608848 -3160598 4993221 12282957 18035139
$$ packed form
44770a683721Q034055N68632m831477j983309L816207N174522J205586m671401
44762E629094r216282r791209n233330J668983N910800N615453L052725N45832
44754a817934j310384j761629j92333J677793J799828J786884M367079O962858
44746A1512162L662354m950963j0108991o380267M84209K030072q65484p46756
44738e363664L883712N979945P70235o868296q933211m398891R44904K742587
44730a1242679K122117J673787J235606m33920k265147k121682n42811q5130p44340
44721a2404199M85480L961223M891303j05975o527489o890179j216928K771687
44713a5035077P71410k294121k82172N231112Q448250Q153819P289736N752182
$$ plain form
44705 18035139 18507450 11703342 3038990 825908 5943851 10634503 8728645 2695218
44697 2695218 -1731359 -3544457 -4735059 -3627845 3702469 15156016 21707674 17682610
44689 17682610 8049047 1923089 1499786 1574544 -1510980 -5416846 -6878178 -6907939 -8553527
44680 -8553527 -11922114 -14091904 -13142328 -10400218 -8765266 -9605868 -11088842 -9615470
44672 -9615470 -4042811 1544127 1466230 -4000431 -6987173 -528513 12313344 20643745
44664 20643745 17246054 5701741 -4412903 -7185547 -3998704 543442 3770285 5932613
44656 5932613 7874628 9149007 8591323 6145507 3231543 721556 -2890513 -9811776
44648 -9811776 -18796108 -24101958 -20757185 -11125484 -4207625 -6726461 -15671626 -21421564
$$ packed form
44705A8035139M72311o804108q664352k213082N117943M690652j905858o033427
44697B695218m426577j813098j190602J107214P330314J1453547O551658m025064
44689A7682610r633563o125958m23303P4758l085524l905866j461332k9761j645588
44680h553527l368587k169790R49576K742110J634952q40602j482974J473372
44672i615470N572659N586938p7897n466661k986742O458660J2841857Q330401
44664B0643745l397691j1544313j0114644k772644L186843M542146L226843K162328
44656E932613J942015J274379n57684k445816k913964k509987l612069o921263
44648i811776q984332n305850L344773R631701O917859k518836q945165n749938
$$ plain form
44640 -21421564 -18034524 -8587850 -203853 3643633 4288116 3590239 1718054 -959203
44632 -959203 -2555690 -1440593 1925252 5556177 7371336 5969463 1520829 -3580865
44624 -3580865 -6449047 -6927666 -7856599 -11292269 -15746154 -18309685 -18424566 -18061688 -18622174
44615 -18622174 -19010094 -17029047 -12230294 -7134793 -5060413 -6057190 -5938263 -1281322
44607 -1281322 5063013 6340518 362253 -7562599 -11706016 -12631964 -14103350 -16278428
44599 -16278428 -16096694 -12812355 -8740241 -5015352 -825827 3077918 4431037 3897812
44591 3897812 5328809 9835985 13180903 11328746 5708305 632976 -1845663 -1942607
44583 -1942607 486967 5322491 10419655 13467630 14638146 14986163 13644315 9542940
$$ packed form
44640b1421564L387040R446674Q383997L847486O44483o97877j872185k677257
44632i59203j596487J115097L365845L630925J815159j401873m448634n101694
44624c580865k868182m78619r28933l435670m453885k563531j14881L62878n60486
44615a8622174l87920J981047M798753N095501K074380r96777J18927M656941
44607a281322O344335J277505n978265p924852m143417r25948j471386k175078
44599a6278428J81734L284339M072114L724889M189525L903745J353119n33225
44591C897812J430997M507176L344918j852157n620441n075329k478639r6944
44583a942607K429574M835524N097164L047975J170516L48017j341848m101375
$$ plain form
44575 9542940 4724260 2494005 2738209 2445762 718405 -377440 -354961 -1681552 -4858078
44566 -4858078 -5578965 145855 9752057 15904331 14175660 7133472 962929 -615099
44558 -615099 1040279 2183125 1589186 2101860 6384880 12059573 13600557 9480288 4646400
44549 4646400 4269649 7298706 8546347 5601876 974421 -1919334 -2267337 -1262532
44541 -1262532 -86999 826482 1544098 2064363 1948870 1255600 1836187 5678285 11054458
44532 11054458 13038665 10048342 7137920 9354850 14139698 14870597 10382373 5490756
44524 5490756 2742155 175556 -1866710 966723 8647355 13329690 9512471 2398143
44516 2398143 -67171 759606 -2389547 -9804555 -13624139 -9453662 -1586948 4539349
$$ packed form
44575I542940m818680k230255K44204k92447j727357j095845K2479j326591l176526
44566d858078p20887N724820R606202O152274j728671p042188o170543j578028
44558f15099J655378J142846n93939N12674M283020N674693J540984m120269m833888
44549D646400l76751L029057J247641k944471m627455k893755l48003J004805
44541a262532J175533R13481P17616N20265j15493o93270N80587L842098N376173
44532A1054458J984207k990323k910422K216930M784848P30899m488224m891617
44524E490756k748601k566599k042266K833433P680632M682335l817219p114328
44516B398143k465314Q26777l149153p415008l819584M170477P866714O126297
$$ plain form
44508 4539349 8109745 9118164 5716373 -944400 -4982355 -3449614 -1210003 -3481903
44500 -3481903 -7685811 -8323277 -6546510 -7865565 -11726101 -10909784 -2656253 6037992
44492 6037992 7577772 3811187 2569643 6283656 8558738 2754968 -8827112 -16513978
44484 -16513978 -13836362 -4810989 940482 -335827 -2870707 -362518 4771509 4959680
44476 4959680 -1346455 -7065953 -5882044 67968 4126231 3444603 261072 -3058778
44468 -3058778 -6464822 -9802750 -10947688 -7714678 -668521 6738686 10683476 9649333
44460 9649333 4906094 -1350776 -7472818 -11294514 -9216707 559997 13622456 21599629
44452 21599629 20707571 15356027 11114142 7392257 1023925 -5690263 -6699858 -1822489
$$ packed form
44508D539349L570396J008419l401791o660773m037955J532741K239611k271900
44500c481903m203908o37466J776767j319055l860536Q16317Q253531Q694245
44492F037992J539780l766585j241544L714013K275082n803770j1582080p686866
44484a6513978K677616R025373N751471j276309k534880K508189N134027J88171
44476D959680o306135n719498J183909N950012M058263o81628l183531l319850
44468c058778l406044l337928j144938L233010P046157P407207L944790j034143
44460I649333m743239o256870o122042l821696K077807R776704J3062459P977173
44452B1599629q92058n351544m241885l721885o368332o714188j009595M877369
$$ plain form
44444 -1822489 1627439 -1085948 -5772697 -6426251 -4098235 -3936336 -6608808 -8284719
44436 -8284719 -7548332 -6636501 -6174843 -4353946 -2037896 -3022329 -7255593 -9150096 -5796469
44427 -5796469 -2063963 -3224542 -6595726 -6203763 -3081932 -4112601 -10945111 -16709011
44419 -16709011 -15574822 -10102469 -6000539 -3951743 -964518 2792688 3542425 86457
44411 86457 -3706811 -4062085 -2280974 -2366023 -4956978 -6361235 -4152841 -1320977 -2484506
44402 -2484506 -6979024 -9001433 -5377042 81656 2070381 703455 -434883 -842638
44394 -842638 -2965824 -6259677 -6680795 -3309805 -847978 -3020488 -6945052 -7040121 -2200490
44385 -2200490 3810915 7527572 8550877 7927489 6115535 2799225 -2114580 -7267507
$$ packed form
44444a822489L449928k713387m686749o53554K328016J61899k672472j675911
44436h284719P36387R11831M61658J820897K316050r84433m233264j894503L353627
44427e796469L732506j160579l371184L91963L121831j030669o832510n763900
44419a6709011J134189N472353M101930K048796K987225L757206P49737l455968
44411H6457l793268l55274J781111q5049k590955j404257K208394K831864j163529
44402b484506m494518k022409L624391N458698J988725j366926j138338m07755
44394h42638k123186l293853m21118L370990K461827k172510l924564r5069M839631
44385b200490O011405L716657J023305o23388j811954l316310m913805n152927
$$ plain form
44377 -7267507 -10062068 -9446354 -7889654 -8222089 -8963001 -6193257 -226111 3825061 3343058
44368 3343058 1626084 1954942 2825817 2168394 1887114 4039475 6204096 5430425 3885065
44359 3885065 5551103 9524130 11587976 10773585 9594285 9237823 8969283 8565655 6973050
44350 6973050 1148809 -8371836 -13714861 -8581345 1098178 3587378 -2458505 -7177682
44342 -7177682 -5258624 -2588485 -4493120 -7141609 -5819720 -3447063 -4251035 -5503050
44334 -5503050 -2751586 1699760 2863221 1843359 3171271 5972566 5221411 697518
44326 697518 -2139490 -322337 3291187 5395496 6057275 6333288 6259498 6346849 7804175
44317 7804175 10207667 11370424 10097739 7112113 3396274 -128859 -1585536 409930
$$ packed form
44377g267507k794561O15714J556700l32435p40912K769744N967146M051172m82003
44368C343058j716974L28858Q70875o57423k81280K152361K164621p73671j545360
44359C885065J666038L973027K063846q14391j179300l56462k68540m03628j592605
44350F973050n824241r520645n343025N133516R679523K489200o045883m719177
44342g177682J919058K670139j904635k648489J321889K372657q03972j252015
44334e503050K751464M451346J163461j019862J327912K801295p51155m523893
44326F97518k837008J817153L613524K104309O61779K76013p3790Q7351J457326
44317G804175K403492J162757j272685k985626l715839l525133j456677J995466
$$ plain form
44309 409930 3735497 3569337 -2359190 -10180281 -12844393 -7500067 194262 1147510 -6049000
44300 -6049000 -11690352 -6831173 3575320 6389398 -977939 -6584075 -2003018 5080733
44292 5080733 3402210 -4575686 -7781775 -4035970 -1373645 -3916965 -7472917 -9624134
44284 -9624134 -13672208 -19765543 -21208910 -14221329 -4757922 -835142 -2589948 -3812233
44276 -3812233 168328 8917060 17892759 21038288 15908474 7760784 4723466 7738049
44268 7738049 9866449 6898201 3111264 3892501 7959596 10630836 10626968 9902382 10117680
44259 10117680 12438002 17416997 22095202 20796161 11998278 1090905 -6514708 -11113220
44251 -11113220 -14422924 -14174953 -7758600 1951718 9157047 11301071 9092744 3557400
$$ packed form
44309D09930L325567j66160n928527p821091k664112N344326P694329R53248p196510
44300f049000n641352M859179J0406493K814078p367337n606136M581057P083751
44292E080733j678523p977896l206089L745805K662325k543320l555952k151217
44284i624134m048074o093335j443367O987581R463407L922780j754806j222285
44276c812233L980561Q748732Q975699L145529n129814q147690l037318L014583
44268G738049K128400k968248l786937P81237M067095K671240l868p24586K15298
44259A0117680K320322M978995M678205j299041q797883j0907373p605613m598512
44251a1113220l309704K47971O416353R710318P205329K144024k208327n535344
$$ plain form
44243 3557400 -2650052 -4253740 980520 7711419 9246307 6553101 5994543 9527749
44235 9527749 12497822 10663513 4728294 -1747562 -4751221 -928964 9021264 18265579
44227 18265579 19579129 13383722 6395270 2891948 1745785 1658678 3848118 8200141
44219 8200141 11349107 10780816 7826425 5034131 3138679 1746823 633087 -498676
44211 -498676 -1402075 -142679 4976923 12033642 16467689 15769741 11130658 4929346 -629103
44202 -629103 -2913876 -533474 3946717 5957390 3919511 -331667 -5402355 -10686543
44194 -10686543 -13144576 -8935530 -9182 5348497 1489714 -7786908 -13898670 -12987155
44186 -12987155 -8693328 -6887612 -9383028 -12310214 -10171259 -1934729 7715321 14185596
$$ packed form
44243C557400o207452j603688N234260O730899J534888k693206n58558L533206
44235I527749K970073j834309n935219o475856l003659L822257R950228R244315
44227A8265579J313550o195407o988452l503322j146163q7107K189440M352023
44219H200141L148966n68291k954391k792294j895452j391856j113736j131763
44211d98676r03399J259396N119602P056719M434047o97948m639083o201312n558449
44202f29103k284773K380402M480191K010673k037879m251178n070688n284188
44194a0686543k458033M209046Q926348N357679l858783r276622o111762R11515
44186a2987155M293827J805716k495416k927186K138955Q236530R650050O470275
$$ plain form
44178 14185596 17819259 20380880 19597714 12359049 2057973 -3317494 -884558 4690241
44170 4690241 8817224 11098471 11036676 6725987 413907 -1469800 2287499 4472617
44162 4472617 222481 -5007532 -4006081 1066145 3164535 1867632 2425477 5615856
44154 5615856 6736826 4393928 2836080 4413526 5964111 4554838 1676204 -462127
44146 -462127 -2562210 -5631002 -7836106 -6512209 -1688855 3825393 6741710 5504367
44138 5504367 2084835 1618861 7772887 17660311 23388886 19830215 9800298 967831
44130 967831 -1510417 1030664 3456963 3000921 1964274 3277969 4828445 1925643
44122 1925643 -4278470 -5805325 1949538 13340598 19777332 20097431 18582011 15980927
$$ packed form
44178A4185596L633663K561621p83166p238665j0301076n375467K432936N574799
44170D690241M126983K281247o1795m310689o312080j883707L757299K185118
44162D472617m250136n230013J001451N072226K098390j296903N57845L190379
44154E615856J120970k342898j557848J577446J550585j409273k878634k138331
44146d62127k100083l068792k205104J323897M823354N514248K916317j237343
44138E504367l419532m65974O154026R887424N728575l558671j0029917q832467
44130I67831k478248K541081K426299m56042j036647J313695J550476k902802
44122A925643o204113j526855P754863J1391060O436734L20099j515420k601084
$$ plain form
44114 15980927 9397192 -1941 -6084753 -5489867 -913735 4209195 9162479 12809560
44106 12809560 12182469 6842162 1053263 -964499 240329 831208 -1996305 -7707191
44098 -7707191 -12515197 -12169088 -7034329 -3149036 -4835409 -8017374 -5768874 1048618
44090 1048618 5215624 4724315 5015748 8082020 7606188 -855470 -11626486 -16201231
44082 -16201231 -13839574 -9805388 -7307496 -6325696 -6803067 -7814892 -6448394 -2144495
44074 -2144495 811120 -339786 -1326199 3003400 10049814 12974924 10755616 8601787
44066 8601787 9501575 11150775 10744117 7613096 1743834 -5201930 -8255618 -4238750
44058 -4238750 1961256 2365633 -2652089 -4499113 871512 7346636 8727621 7736031
$$ packed form
44114A5980927o583735r399133o082812N94886M576132N122930M953284L647081
44106A2809560o27091n340307n788899k017762J204828N90879k827513n710886
44098g707191m808006L46109N134759L885293j686373l181965K248500O817492
44090A048618M167006m91309K91433L066272m75832q461658j0771016m574745
44082a6201231K361657M034186K497892R81800m77371j011825J366498M303899
44074b144495K955615j150906r86413M329599P046414K925110k219308k153829
44066H601787Q99788J649200m06658l131021n869262o945764l053688M016868
44058d238750O200006M04377n017722j847024N370625O475124J380985r91590
$$ plain form
44050 7736031 9836849 12972640 10172801 667851 -7802033 -8641812 -4043123 -1011562
44042 -1011562 -2432599 -4796459 -4044977 -879137 1060967 526407 -424710 -463004 -853968
44033 -853968 -2367316 -3355106 -2814905 -2610401 -4041323 -4681873 -1913887 2349717 4181183
44024 4181183 3551644 3893210 6448169 8708229 8296569 5361567 1481636 -1047253 369464
44015 369464 5925255 11812147 13870413 11599301 6403712 -1142220 -8764946 -11113329
44007 -11113329 -6511524 -1720095 -3077270 -6006411 -1999091 6304445 7975069 1752900
43999 1752900 -1067198 5118532 11078695 7930615 780847 -1210774 172141 -3083807
43991 -3083807 -11482977 -18634153 -21449054 -20964876 -16722742 -9108644 -4012469 -5978081
$$ packed form
44050G736031K100818L135791k799839r504950q469884q39779M598689L031561
44042a011562j421037k363860P51482L165840J940104n34560r51117l8294l90964
44033h53968j513348r87790N40201K04504j430922o40550K767986M263604J831466
44024D181183o29539L41566K554959K260060m11660k935002l879931k528889J416717
44015C69464N555791N886892K058266k271112n195589p545932p622726k348383
44007a1113329M601805M791429j357175k929141M007320Q303536J670624o222169
43999A752900k820098O185730N960163l148080p149768j991621J382915l255948
43991c083807q399170p151176k814901M84178M242134P614098N096175j965612
$$ plain form
43983 -5978081 -9290112 -5462473 2321940 2834994 -5383513 -10901035 -6299979 1975848
43975 1975848 4841961 2934963 2128254 3347059 3236524 916960 -1512471 -2863546
43967 -2863546 -3267955 -2782281 -2513098 -4649976 -8581137 -9638649 -4902479 1873237 4341147
43958 4341147 1128509 -3448026 -5071459 -3231609 -62150 2204417 2438405 723261
43950 723261 -2054387 -4597793 -5223809 -2724855 1484305 3271405 -39683 -6249276
43942 -6249276 -11288488 -14371284 -16967297 -17884137 -14019809 -6338560 -541003 -315260
43934 -315260 -3537703 -6516184 -8421717 -9898677 -10676406 -10515459 -9789644 -7654770 -2474448
43925 -2474448 4590934 9386465 9566699 6904520 4005949 1932737 1605425 3430064
$$ packed form
43983e978081l312031L827639P784413N13054q218507n517522M601056Q275827
43975A975848K866113j906998q06709J218805j10535k319564k429431j351075
43967b863546m04409M85674K69183k136878l931161j057512M736170O775716K467910
43958D341147l212638m576535j623433J839850L169459K266567K33988j715144
43950G23261k777648k543406o26016K498954M209160J787100l311088o209593
43942f249276n039212l082796k596013r16840L864328P681249N797557K25743
43934c15260l222443k978481j905533j476960p77729J60947P25815K134874N180322
43925b474448P065382M795531J80234k662179k898571k073212l27312J824639
$$ plain form
43917 3430064 4603516 1493996 -3953211 -5487137 -2094775 -117832 -2696028 -3716251
43909 -3716251 2616586 11963872 15913274 13270812 8674618 4046105 -1095193 -4049986
43901 -4049986 -2033696 1019458 -658975 -3811390 568037 12050428 18235199 11112326
43893 11112326 -1659718 -6955177 -2079651 5085419 7914887 6967868 5547814 4617804
43885 4617804 3080198 386152 -2479835 -4205803 -5031385 -6737140 -9897435 -12116949
43877 -12116949 -10711911 -6201981 -972781 4337636 10100356 14356541 14111926 9936422
43869 9936422 5660023 3433612 2647952 3379450 6420015 9797340 10326033 9268466 10933542
43860 10933542 14472845 13448945 6117019 -485297 -861986 725368 -2056402 -7135115
$$ packed form
43917C430064J173452l109520n447207j533926L392362J976943k578196j020223
43909c716251O332837R347286L949402k642462m596194m628513n141298k954793
43901d049986K016290L053154j678433l152415M379427J1482391O184771p122873
43893A1112326j2772044n295459M875526P165070K829468r47019j420054r30010
43885D617804j537606k694046k865987j725968q25582j705755l160295k219514
43877a2116949J405038M509930N229200N310417N762720M256185k44615m175504
43869I936422m276399k226411p85660P31498L040565L377325N28693j057567J665076
43860A0933542L539303j023900p331926o602316l76689J587354k781770n078713
$$ plain form
43852 -7135115 -8274120 -5818922 -5221353 -6954555 -6169835 -2203955 -551716 -3871808
43844 -3871808 -7873600 -8658404 -8283572 -9793555 -11686143 -11300538 -9986897 -10564566 -11973545
43835 -11973545 -10676775 -6412369 -3038956 -3603351 -6779161 -8342307 -5095588 2059621
43827 2059621 8057183 7834569 1724060 -4539277 -6173617 -3865078 -636559 2934340
43819 2934340 7248250 9771991 7473671 2890091 2709281 8750678 14740688 14793857 11408547
43810 11408547 11175239 15166859 18255513 16652499 11174141 3358183 -6141181 -14167889
43802 -14167889 -15962050 -12685069 -12822386 -20875373 -28546542 -24200763 -9592807 658334
43794 658334 -2382914 -11268010 -13827751 -9442300 -7318608 -11790120 -16819947 -15638431
$$ packed form
43852g135115j139005K455198N97569j733202P84720L965880J652239l320092
43844c871808m001792p84804L74832j509983j892588L85605J313641n77669j408979
43835a1973545J296770M264406L373413n64395l175810j563146L246719P155209
43827B059621N997562k22614o110509o263337j634340K308539L228519L570899
43819B934340M313910K523741k298320m583580j80810O041397N990010N3169l385310
43810A1408547k33308L991620L088654j603014n478358p815958r499364q026708
43802a4167889j794161L276981j37317q052987p671169M345779J4607956J0251141
43794F58334l041248q885096k559741M385451K123692m471512n029827J181516
$$ plain form
43786 -15638431 -9731574 -5344172 -4775792 -4787531 -2086305 2944716 7886487 10943175
43778 10943175 11113458 7907757 2828003 -91196 2043501 6540771 7130528 1874415
43770 1874415 -3455125 -2541934 2882826 5394147 1963331 -2831662 -4252268 -3253986
43762 -3253986 -2670403 -1943031 435770 2245565 132596 -4250026 -5177795 -161483 7015088
43753 7015088 10880604 9158858 3188930 -3303239 -5514807 -1153985 5948108 8661414
43745 8661414 4536451 -1514665 -3977586 -3237260 -2815754 -2866031 -668196 3140790 3528477
43736 3528477 -1835698 -7513355 -5631930 4363497 14176281 15679878 9365715 2215622
43728 2215622 -1089053 -1861816 -2679027 -2803586 -459369 2986734 4481539 3988578 4593637
$$ packed form
43786a5638431N906857M387402N68380j1739K701226N031021M941771L056688
43778A0943175J70283l205701n079754k919199K134697M497270N89757n256113
43770A874415n329540R13191N424760K511321l430816m794993j420606R98282
43762c253986N83583P27372K378801J809795k112969m382622r27769N016312P176571
43753G015088L865516j721746n969928o492169k211568M360822P102093K713306
43745H661414m124963o051116k462921P40326M21506n0277K197835L808986L87687
43736C528477n364175n677657J881425R995427R812784J503597o314163p150093
43728B215622l304675p72763q17211j24559K344217L446103J494805m92961O05059
$$ plain form
43719 4593637 8041016 13009783 17962118 22609557 25761817 24974986 20254863 15554757
43711 15554757 14130934 14170578 11589181 5937386 856266 -768213 283695 1206445
43703 1206445 -337186 -4882041 -10010631 -11007058 -5611325 1669752 3260702 -2317777
43695 -2317777 -8060167 -7145169 -1064884 3793676 5232209 6724968 10744538 15240664
43687 15240664 17759856 19169790 21097315 22496201 21570806 19427375 18885502 20248242
43679 20248242 20753860 18367111 14401225 12136954 13735880 17968352 19967902 14573500
43671 14573500 2199612 -9288794 -11330934 -3609436 6030772 10765793 11121732 11399872
43663 11399872 13112561 14431693 14005521 12160993 8922139 3671858 -2590307 -6496989
$$ packed form
43719D593637L447379M968767M952335M647439L152260p86831m720123m700106
43711A5554757j423823L9644k581397n651795n081120j624479J051908R22750
43703A206445j543631m544855n128590r96427N395733P281077J590950n578479
43695b317777n742390R14998O080285M858560J438533J492759M019570M496126
43687A5240664K519192J409934J927525J398886r25395k143431n41873J362740
43679B0248242N05618k386749l965886k264271J598926M232472J999550n394402
43671A4573500j2373888j1488406k042140P721498R640208M735021L55939K78140
43663A1399872J712689J319132m26172j844528l238854n250281o262165l906682
$$ plain form
43655 -6496989 -5142984 545644 5916821 6621925 2801190 -1321686 -2503122 -1840785
43647 -1840785 -1517847 50725 5984319 13923447 16104672 8918473 -1409788 -6340375
43639 -6340375 -5534682 -5592382 -9952724 -14908841 -15675579 -12098752 -7273631 -3898093 -3409581
43630 -3409581 -5975882 -9595688 -11039342 -9103104 -5634479 -2587385 251294 3617068
43622 3617068 6474469 6815144 4075549 -27892 -2663808 -1956179 1165595 3477981
43614 3477981 3158611 2454668 4657729 8856971 10655851 8569020 6352786 7295248 9241942
43605 9241942 8052981 3776229 -68636 -2171080 -4523966 -7662937 -8636206 -5609759
43597 -5609759 -1786778 -1771667 -5119004 -6664062 -3607726 730079 1968063 1084367 2656321
$$ packed form
43655f496989J354005N688628N371177P05104l820735m122876j181436O62337
43647a840785L22938J568572N933594P939128K181225p186199j0328261m930587
43639f340375Q05693n7700m360342m956117p66738L576827M825121L375538M88512
43630c409581k566301l619806j443654J936238L468625L047094K838679L365774
43622C617068K857401L40675k739595m103441k635916P07629L121774K312386
43614C477981l19370p03943K203061M199242J798880k086831k216234R42462J946694
43605I241942j188961m276752l844865k102444k352886l138971r73269L026447
43597e609759L822981J5111l347337j545058L056336M337805J237984q83696J571954
$$ plain form
43588 2656321 7668395 11909747 12318972 11310084 12503239 14891499 14545585 10753854
43580 10753854 7072298 6466742 8283373 10415377 12058651 13401881 14165785 13497780
43572 13497780 10883717 6984806 3610498 2055949 1222947 -1175538 -5177657 -8612982
43564 -8612982 -11328448 -15977201 -22533013 -25832582 -22190967 -15125096 -10094946 -6836971
43556 -6836971 -2459246 998665 -520581 -4348504 -3637573 1323661 2862196 -1730328
43548 -1730328 -6321285 -6999437 -8060125 -12547610 -15391691 -12287211 -8095317 -8768762
43540 -8768762 -10704303 -6674879 1540550 5178416 1239316 -4538958 -6607053 -4812847
43532 -4812847 -1215173 2261844 3166195 689528 -1818102 -872197 1864302 2887340
$$ packed form
43588B656321N012074M241352M09225j008888J193155K388260l45914l791731
43580A0753854l681556o05556J816631K132004J643274J343230P63904o68005
43572A3497780k614063l898911l374308j554549q33002k398485m002119l435325
43564h612982k715466m648753o555812l299569L641615P065871N030150L257975
43556f836971M377725L457911j519246l827923P10931M961234J538535m592524
43548a730328m590957o78152j060688m487485k844081L104480M191894o73445
43540h768762j935541M029424Q215429L637866l939100n778274k068095J794206
43532d812847L597674L477017R04351k476667k507630R45905K736499J023038
$$ plain form
43524 2887340 3418928 6998340 12133916 13727928 11151296 8701685 8267017 7555374 5617577
43515 5617577 4199334 3333976 1221230 -1316822 -1714029 -792170 -1380609 -2540069 -1621658
43506 -1621658 -1142865 -5710356 -12217165 -12098269 -4665616 1106006 617629 -83962 3935834
43497 3935834 7874081 6042350 1071313 -2280083 -5215146 -9791513 -12355899 -9657650
43489 -9657650 -5756100 -5168172 -4732168 -660422 1782940 -4257496 -13920847 -15815681
43481 -15815681 -9001538 -4033535 -6714598 -10956984 -9935226 -5329278 -1833313 393474
43473 393474 3489837 7071652 9417208 10174362 9497663 7359386 5071250 4505582 5008258
43464 5008258 4134804 1628573 -743428 -2915839 -5758583 -6913529 -2755568 4760932
$$ packed form
43524B887340N31588L579412N135576J594012k576632k449611m34668p11643j937797
43515E617577j418243q65358k112746k538052l97207R21859n88439j159460R18411
43506a621658M78793m567491o506809J18896P432653N771622m88377p01591M019796
43497C935834L938247j831731m971037l351396k935063m576367k564386K698249
43489i657650L901550N87928M36004M071746K443362o040436r663351j894834
43481a5815681O814143M968003k681063m242386J021758M605948L495965K226787
43473C93474L096363L581815K345556P57154o76699k138277k288136n65668N02676
43464E008258q73454k506231k372001k172411k842744j154946M157961P516500
$$ plain form
43456 4760932 8663886 6034499 1618036 490212 1907506 2813411 2858212 2769948 1392348
43447 1392348 -2277962 -6565418 -9286282 -10504857 -11338058 -12016555 -12334361 -11887629 -9442404
43438 -9442404 -4979543 -2413845 -6029076 -13295110 -15910183 -9834261 73990 7332642
43430 7332642 10928588 12488521 11394905 6873873 1338672 -2421055 -4713171 -6520447
43422 -6520447 -6893846 -6048946 -7360761 -12159075 -15894701 -14099609 -9188163 -6198654
43414 -6198654 -4261027 1616527 10980710 15929631 10082909 -3601401 -14980886 -15510575
43406 -15510575 -5776009 4597326 6415079 1053964 -2287731 -128978 944021 -3174955
43398 -3174955 -5083228 3052079 15512845 20100392 15438215 10223950 7262749 861436
$$ packed form
43456D760932L902954k629387m416463j127824J417294R05905M4801q8264j377600
43447A392348l670310m287456k720864j218575q33201o78497l17806M46732K445225
43438i442404M462861K565698l615231p266034k615073O075922R908251P258652
43430G332642L595946J559933j093616m521032n535201l759727k292116j807276
43422f520447l73399Q44900j311815m798314l735626J795092M911446K989509
43414f198654J937627N877554R364183M948921n846722j3684310j1379485n29689
43406a5510575R734566J0373335J817753n361115l341695K158753J072999m118976
43398c174955j908273Q135307J2460766M587547m662177n214265k961201o401313
$$ plain form
43390 861436 -8814159 -11855489 -4005217 5086098 5953002 2781983 4782830 11319277
43382 11319277 14931240 14467670 15594380 20186006 23747256 23275231 20857699 18945618
43374 18945618 17557893 16776249 17322000 17920342 15917698 11116288 6023164 2405872
43366 2405872 389185 168969 1414375 1900800 255991 -919221 1447196 5291269
43358 5291269 5891904 3464551 3111920 6615114 9393507 7351274 2442995 -709887
43350 -709887 -287918 2540302 5721775 6874534 4872935 2527958 4340447 9737232
43342 9737232 12252113 8089170 2014603 1319770 6702826 12774021 15272732 13847625
43334 13847625 9546234 3988409 264224 498461 2539426 2548400 782213 1210539 5132460
$$ packed form
43390H61436r675595l041330P850272R091315Q66904l171019K000847O536447
43382A1319277L611963m63570J126710M591626L561250m72025k417532j912081
43374A8945618j387725p81644N45751N98342k002644m801410n093124l617292
43366B405872k016687k20216J245406M86425j644809j175212K366417L844073
43358E291269O00635k427353l52631L503194K778393k042233m908279l152882
43350g09887M21969K828220L181473J152759k001599k344977J812489N396785
43342I737232K514881m162943o074567o94833N383056O071195K498711j425107
43334A3847625m301391n557825l724185K34237K040965Q974j766187M28326L921921
$$ plain form
43325 5132460 8886866 8927094 5954738 2731679 720391 427125 2294847 5201607 6317811
43316 6317811 4721474 3392949 5241480 8511117 8727195 4543545 -736017 -3243734
43308 -3243734 -2049504 1382840 5112887 7540735 7962435 7171244 6545648 6019320 3873098
43299 3873098 -939530 -7076253 -11962174 -13986833 -13002681 -9327263 -3296526 3959392
43291 3959392 9867148 11485029 8162267 3156582 1329763 4173169 7842049 7360737
43283 7360737 2241440 -3431993 -5844322 -4432672 -545789 4078779 7115377 7092127
43275 7092127 6448703 9978106 17730729 22438649 17826885 7473477 709705 640800
43267 640800 1749368 -1175 -917877 3256443 9071674 9887573 6177231 5186658 10254874
$$ packed form
43325E132460L754406M0228k972356l223059k011288k93266J867722K906760J116204
43316F317811j596337j328525J848531L269637K16078m183650n279562k507717
43308c243734J194230L432344L730047K427848M21700p91191o25596n26328k146222
43299C873098m812628o136723m885921k024659R84152L675418O030737P255918
43291C959392N907756J617881l322762n005685j826819K843406L668880m81312
43283G360737n119297n673433k412329J411650L886883M624568L036598k3250
43275G092127o43424L529403P752623M707920m611764j0353408o763772o8905
43267F40800J108568j750543r16702M174320N815231Q15899l710342r90573N068216
$$ plain form
43258 10254874 15907284 15522264 9734652 4099991 1179420 -888963 -2648103 -676038
43250 -676038 7049433 15655293 16903868 8454148 -3235492 -10511257 -12452138 -12829110
43242 -12829110 -12597561 -9014776 -2101171 3005089 2414454 -1334963 -3291717 -2572090
43234 -2572090 -1799758 -2440647 -4213496 -7350826 -11616863 -14272100 -12950866 -9844516
43226 -9844516 -9093707 -10544609 -10335597 -7553688 -5658790 -6651120 -8476187 -9459753 -10588065
43217 -10588065 -11395252 -8382231 -827745 5694087 5699109 1425848 455789 6881924 17141925
43208 17141925 23233619 18817918 4965853 -8326291 -9908301 361121 10586950
43201 10586950 11071310 5470178 3315509 5931561 7049443 5134632 6407626 14215864
$$ packed form
43258A0254874N652410l85020n787612n634661k920571k068383j759140J972065
43250f76038P725471Q605860J248575q449720j1689640p275765j940881l76972
43242a2829110K31549L582785O913605N106260n90635l749417j956754P19627
43234b572090P72332o40889j772849l137330m266037k655237J321234L106350
43226i844516P50809j450902K09012K781909J894898r92330j825067r83566j128312
43217a0588065q07187L013021P554486O521832N022m273261r70059O426135J0260001
43208A7141925O091694m415701j3852065j3292144j582010J0269422J0225829
43201A0586950M84360n601132k154669K616052J117882j914811J272994P808238
$$ plain form
43193 14215864 22496415 23284972 16462182 8885263 6365929 8640196 10602418 7540622
43185 7540622 517494 -3956159 -1754949 2819160 2428747 -3341376 -8472521 -10191429
43177 -10191429 -11833634 -15221671 -16856969 -14263269 -10215286 -7401622 -4389984 -722295
43169 -722295 -527976 -5977616 -11731760 -11703253 -7711917 -5279461 -3936087 1083977 9055658
43160 9055658 13366614 11621267 9517349 12452556 18178270 20278836 15436374 5264475
43152 5264475 -5955182 -13374337 -14058121 -9528930 -4354577 -1186543 959398 2879821
43144 2879821 2572239 -1384875 -5763765 -4992703 2239752 10415364 12218112 5713141
43136 5713141 -4407446 -12661249 -17814140 -20314433 -17277599 -5489432 10128474 17726826
$$ packed form
43193A4215864Q280551P88557o822790p576919k519334K274267J962222l061796
43185G540622p023128m473653K201210M574109l90413n770123n131145j718908
43177a0191429j642205l388037j635298K593700M047983K813664L011638L667689
43169g22295J94319n449640n754144K8507L991336K432456J343374N020064P971681
43160I055658M310956j745347k103918K935207N725714K100566m842462j0171899
43152E264475j1219657p419155o83784M529191N174353L168034K145941J920423
43144B879821l07582l957114m378890P71062P232455Q175612J802748o504971
43136E713141j0120587q253803n152891k500293L036834J1788167J5617906P598352
$$ plain form
43128 17726826 12368848 3464010 2486360 7431369 7314260 -272587 -5757090 -2615108
43120 -2615108 3707261 5783486 5031256 6409984 8163906 4457180 -4388848 -11180414
43112 -11180414 -10924071 -5572211 37065 2572189 597098 -5030421 -10084102 -9630892
43104 -9630892 -3294220 4043988 7469787 6161037 2080282 -2915008 -7301856 -9063662
43096 -9063662 -6836589 -1915515 2150101 2746213 783672 -601348 -14887 738076 -55137
43087 -55137 -1062640 -511651 -184259 -2948846 -6734669 -6059266 -1026620 689193 -5393251
43078 -5393251 -12489463 -10920409 -1680457 4955332 3389488 -1611552 -3995006 -4241219
43070 -4241219 -4945281 -4477890 -473469 3688068 1962363 -5487974 -11736999 -12129446 -9255887
$$ packed form
43128A7726826n357978q904838r77650M945009j17109p586847n484503L141982
43120b615108O322369K076225p52230J378728J753922l706726q846028o791566
43112a1180414K56343N351860N609276K535124j975091n627519n053681M53210
43104i630892O336672P338208L425799j308750m080755m995290m386848j761806
43096i063662K227073M921074M065616N96112j962541j385020N86461P52963p93213
43087e5137j007503N50989L27392k764587l785823O75403N032646J715813o082444
43078e393251p096212J569054R239952O635789j565844n001040k383454k46213
43070d241219p04062M67391M004421M161537j725705p450337o249025l92447K873559
$$ plain form
43061 -9255887 -6991466 -3941926 2991128 11028046 13251679 8552017 4579785 7808578
43053 7808578 14605190 16608232 12322501 7687902 6089592 4272941 -691324 -6714201
43045 -6714201 -11692127 -17203230 -22985290 -23355610 -15311595 -5953088 -4320797 -8295981
43037 -8295981 -7730951 262752 7803373 9037706 7753867 8925422 10444239 8496188
43029 8496188 5156487 4532125 5614081 5140773 4416950 6932935 11210168 12378592 10022480
43020 10022480 8370735 8591262 6776140 946304 -4955618 -6356260 -3793795 -1177822
43012 -1177822 -797620 -1803894 -1937982 127591 2746312 1993438 -3233996 -7793394 -5859084
43003 -5859084 521090 3524231 944879 -480721 4220798 10133281 9712747 3501766
$$ packed form
43061i255887K264421L049540O933054Q036918K223633m699662l972232L228793
43053G808578O796612K003042m285731m634599j598310j816651m964265o022877
43045f714201m977926n511103n782060l70320Q044015R358507J632291l975184
43037h295981N65030P993703P540621J234333j283839J171555J518817j948051
43029H496188l339701o24362J081956m73308p23823K515985M277233J168424k356112
43020A0022480j651745K20527j815122n829836n901922j400642K562465K615973
43012a177822L80202j006274j34088K065573K618721p52874n227434m559398J934310
43003e859084O380174L003141k579352j425600M701519N912483m20534o210981
$$ plain form
42995 3501766 -2306139 -5730733 -9700578 -14410369 -15846638 -12280373 -6452148 -579594
42987 -579594 5286952 8946621 6186095 -2223821 -9061517 -9630082 -7647994 -8411272 -10552788
42978 -10552788 -9663502 -6647557 -6322146 -9246690 -10915712 -8990145 -6048984 -4407934
42970 -4407934 -2931438 -567292 816040 -749664 -4223801 -6912235 -7025129 -4033896
42962 -4033896 1295669 6327809 8190958 6893290 4898551 3284665 923774 -1979447
42954 -1979447 -2762654 -295678 2592607 2636901 166759 -2004307 -2146609 -981940 -992992
42945 -992992 -4624641 -11061123 -15278349 -13840754 -11099898 -14094474 -20620334 -19735593
42937 -19735593 -7538582 5103052 6637261 54897 -3989239 -3677476 -5124522 -8203401
$$ packed form
42995C501766n807905l424594l969845m709791j436269L566265N828225N872554
42987e79594N866546L659669k760526q409916o837696n68565J982088p63278k141516
42978a0552788Q89286L015945L25411k924544j669022J925567K941161J641050
42970d407934J476496K364146J383332j565704l474137k688434j12894K991233
42962d033896N329565N032140J863149j297668j994739j613886k360891k903221
42954a979447p83207K466976K888285M4294k470142k171066j42302J164669j1052
42945i92992l631649o436482m217226J437595K740856k994576o525860Q84741
42937a9735593J2197011J2641634J534209o582364m044136L11763j447046l078879
$$ plain form
42929 -8203401 -5729863 2462333 6543602 1531931 -5090235 -5784982 -3824549 -5105956
42921 -5105956 -7254723 -5419687 -2825796 -5933931 -12751161 -15440965 -12522454 -9209694
42913 -9209694 -6661408 -826035 6977351 8293950 140848 -8811512 -9827020 -5352538
42905 -5352538 -2791766 -2443596 1020003 8042400 12787210 11965563 8770675 6917196
42897 6917196 5746962 3197097 -72480 -1971879 -2270846 -2511329 -3562670 -4365275 -2675147
42888 -2675147 2732843 9539414 12489355 8871024 2839919 1064061 3935386 5166215
42880 5166215 1535849 -1541777 2241127 10356467 14650985 12634657 9820002 10465497
42872 10465497 11593187 8748348 3579438 1882617 5969726 12305160 16198794 16446373
$$ packed form
42929h203401K473538Q192196M081269n011671o622166o94747J960433j281407
42921e105956k148767J835036K593891l108135o817230k689804K918511L312760
42913i209694K548286N835373P803386J316599q153102q952360j015508M474482
42905e352538K560772L48170L463599P022397M744810q21647l194888j853479
42897F917196j170234k549865l269577j899399k98967k40483j051341q02605J690128
42888b675147N407990O806571K949941l618331o031105j775858K871325J230829
42880E166215l630366l077626L782904Q115340M294518k016328k814655O45495
42872A0465497J127690k844839n168910j696821M087109O335434L893634K47579
$$ plain form
42864 16446373 15220753 14797507 14770714 12537509 7207503 2412299 2895634 7992375 11556863
42855 11556863 9901184 6696914 7326714 11137306 13176131 11949523 10894532 12194687
42847 12194687 13335933 11090286 5939455 962857 -1731641 -2152353 -1308414 49129
42839 49129 2140398 5619491 9712389 11804658 10238225 6466273 2767283 -672798
42831 -672798 -4052112 -5283782 -2841134 15293 -1276886 -4920919 -3893374 3858673
42823 3858673 11370431 11472039 5574907 478882 -279242 1701079 4049286 6047792
42815 6047792 7671205 9011405 10209307 10496855 8512023 4771349 2118173 2490620
42807 2490620 5126964 8743518 12603727 14349824 10772553 3242760 -1439384 1007207
$$ packed form
42864A6446373j225620m23246k6793k233205n330006m795204M83335N096741L564488
42855A1556863j655679l204270O29800L810592K038825j226608j054991J300155
42847A2194687J141246k245647n150831m976598k694498m20712Q43939J357543
42839D9129K091269L479093M092898K092269j566433l771952l698990l440081
42831f72798l379314j231670K442648K856427j292179l644033J027545P752047
42823C858673P511758J01608n897132n096025p58124J980321K348207J998506
42815F047792J623413J340200J197902K87548j984832l740674k653176L72447
42807B490620K636344L616554L860209J746097l577271p529793m682144K446591
$$ plain form
42799 1007207 6897582 10641525 12390961 14591077 14348526 6426500 -6814092 -15417151
42791 -15417151 -13585688 -6636328 -4020011 -8575770 -14562824 -14372021 -6175952 3815735
42783 3815735 6990186 1650945 -4656929 -4288532 1262397 4842427 4071510 2953172
42775 2953172 4024056 5105910 4852004 5844809 9846180 14262954 15708158 13754236
42767 13754236 9520778 4037450 -521349 -1803730 -1113319 -2193068 -4420426 -2151651
42759 -2151651 6071560 12612314 9835983 621958 -5488178 -4352858 -87148 2709469
42751 2709469 3800725 4162957 3267073 1294871 301498 1011954 1095959 -1217589 -3739388
42742 -3739388 -2850933 1580669 5972488 7349632 5815339 2411630 -3128098 -10530608
$$ packed form
42799A007207N890375L743943J749436K200116k42551p922026j3240592q603059
42791a5417151J831463O949360K616317m555759n987054J90803Q196069R991687
42783C815735L174451n339241o307874L68397N550929L580030p70917j118338
42775B953172J070884J081854k53906R92805M001371M416774J445204j953922
42767A3754236m233458n483328m558799j282381O90411j079749k227358K268775
42759b151651Q223211O540754k776331r214025o110136J135320M265710K796617
42751B709469J091256L62232q95884j972202r93373P10456Q4005k313548k521799
42742c739388Q88455M431602M391819J377144j534293l403709n539728p402510
$$ plain form
42734 -10530608 -16221053 -15639832 -9203216 -3354906 -3606714 -8083407 -10248546 -6990598
42726 -6990598 -1493336 1513719 955440 -331246 1088820 5653787 9536687 7959639
42718 7959639 992923 -5659967 -7317771 -5318200 -3036648 -390099 3549926 5978003
42710 5978003 4533441 3567652 8716734 16355210 16932121 9226081 2320664 1601922 2350470
42701 2350470 846204 1759021 7980412 11985776 6254994 -3939227 -7533114 -3189990
42693 -3189990 1299068 1949969 1656240 2228871 2573825 4237234 9913429 15789727 13688091
42684 13688091 2759210 -7965197 -10951163 -8044940 -4766749 -2576307 -63611 2570149
42676 2570149 3789480 3226541 1882837 1270105 2551309 4744629 4936929 2946426 3451825
$$ packed form
42734a0530608n690445N81221O436616N848310k51808m476693k165139L257948
42726f990598N497262L007055n58279j286686J420066M564967L882900j577048
42718G959639o966716o652890j657804J999571K281552K646549L940025K428077
42710E978003j444562r65789N149082P638476N76911p706040o905417p18742P48548
42701B350470j504266R12817O221391M005364n730782j0194221l593887M343124
42693c189990M489058O50901k93729N72631L44954J663409N676195N876298k101636
42684A3688091j0928881j0724407k985966K906223L278191K190442K512696K633760
42676B570149J219331n62939j343704o12732J281204K193320J92300j990503N05399
$$ plain form
42667 3451825 8973007 13096397 7411124 -5349614 -12478144 -7127518 3542734 8591756
42659 8591756 6055625 2200700 2316521 5790373 8108741 5838900 1112751 677112
42651 677112 7597965 15428488 15420652 8357686 3210878 4663268 8961864 12221155 14755527
42642 14755527 15689470 11748879 4513597 1091359 3951985 7499780 8247984 9956261
42634 9956261 13894930 13230501 4533002 -3057512 704545 12282935 20113329 20648009
42626 20648009 19181527 18153710 14817683 9451443 6743480 8520394 12064753 15491188
42618 15491188 18368407 17783534 10889901 1562389 -2061532 2413506 9291795 12630211
42610 12630211 11523179 7853390 3861698 1997896 3034649 5091334 7888711 14681445
$$ packed form
42667C451825N521182M123390n685273j2760738p128530N350626J0670252N049022
42659H591756k536131l854925J15821L473852K318368k269841m726149m35639
42651F77112O920853P830523p836p062966n146808J452390M298596L259291K534372
42642A4755527R33943l940591p235282l422238K860626L547795P48204J708277
42634I956261L938669o64429q697499p590514L762057J1578390P830394N34680
42626B0648009j466482j027817l336027n366240k707963J776914L544359L426435
42618A5491188K877219n84873o893633r327512l623921M475038O878289L338416
42610A2630211j107032l669789l991692j863802J036753K056685K797377O792734
$$ plain form
42602 14681445 24662221 27892584 16593996 -760525 -6580791 4353279 19525330
42595 19525330 25592064 21624663 13874945 6688928 2167553 1134106 655673 -3168395
42587 -3168395 -7631346 -5581723 2925681 9403876 10021858 10563321 14131220 14082103 6180205
42578 6180205 -1430315 278942 6681854 6739532 139656 -3373247 439970 5368301
42570 5368301 5258031 1151574 -2949457 -4687188 -2536295 3967413 11646807 15453121
42562 15453121 13968781 10348286 7864070 7218215 7584183 7608261 6231218 4528487 4803341
42553 4803341 6048200 4005311 -1200743 -2242735 5397239 14804749 15740680 8370632
42545 8370632 1625268 152875 1054137 2439934 6179906 11203566 12741794 10841742
$$ packed form
42602A4681445R980776L230363j1298588j7354521n820266J0934070J5172051
42595A9525330O066734l967401p749718p186017m521375j033447m78433l824068
42587c168395m462951K049623Q507404O478195O17982N41463L567899m9117p901898
42578F180205p610520J709257O402912N7678o599876l512903L813217M928331
42570E368301j10270m106457m101031j737731K150893O503708P679394L806314
42562A5453121j484340l620495k484216o45855L65968K4078j377043j702731K74854
42553D803341J244859k042889n206054j041992P639974R407510R35931p370048
42545H370632o745364j472393R01262J385797L739972N023660J538228j900052
$$ plain form
42537 10841742 11932937 18249389 22487184 17786835 7754096 1280858 1153763 3150765
42529 3150765 4160333 5810043 9975242 14367538 14094338 6945696 -3206557 -9011713
42521 -9011713 -6924855 -1311345 486107 -3636038 -9528466 -12762417 -12241740 -8675937
42513 -8675937 -3579454 176899 854808 1181938 5215033 11677736 14837030 12452662
42505 12452662 8078455 4741392 1632920 -1538461 -2474519 -760198 928456 2549702
42497 2549702 7964622 17183220 23077667 20448033 13665670 10411163 11863211 13961831
42489 13961831 14445328 13367802 10344885 6997606 8724969 17802288 27621112 30371970
42481 30371970 27802378 27112429 28642766 26483297 20397073 17188841 18630756 17846658
$$ packed form
42537A0841742J091195O316452M237795m700349j0032739o473238j27095J997002
42529C150765J009568J649710M165199M392296k73200p148642j0152253n805156
42521i011713K086858N613510J797452m122145n892428l233951N20677L565803
42513h675937N096483L756353O77909L27130M033095O462703L159294k384368
42505A2452662m374207l337063l108472l171381r36058J714321J688654J621246
42497B549702N414920R218598N894447k629634o782363l254507J452048K098620
42489A3961831M83497j077526l022917l347279J727363R077319R818824K750858
42481C0371970k569592o89949J530337k159469o086224l208232J441915p84098
$$ plain form
42473 17846658 11719874 7959720 13351537 21804844 22130534 13684563 6103669 5270410
42465 5270410 7498209 8010058 7748737 8842303 8751652 3490652 -5648167 -12368991 -11781371
42456 -11781371 -4308872 5966464 14584577 18821506 18970606 17906556 17746803 17048680
42448 17048680 13380115 8399225 6940003 9941187 12216252 10068000 7368042 9432236
42440 9432236 13712538 12958385 6654085 2143523 3357152 5631717 4495363 2602689
42432 2602689 3390683 4126933 1486465 -891118 2284487 8419262 10497141 8132800
42424 8132800 7429061 10661390 13923193 15210388 16833849 18315476 14955746 6798027
42416 6798027 1891345 5812366 13315808 15556746 11552116 7284229 6518357 7954140
$$ packed form
42473A7846658o126784l760154N391817Q453307L25690q445971p580894q33259
42465E270410K227799N11849k61321J093566r0651n261000r138819o720824N87620
42456a1781371P472499J0275336Q618113M236929J49100j064050j59753o98123
42448A7048680l668565m980890j459222L001184K275065k148252k699958K064194
42440I432236M280302p54153o304300m510562J213629K274565j136354j892674
42432B602689P87994P36250k640468k377583L175605O134775K077879k364341
42424H132800p03739L232329L261803J287195J623461J481627l359730q157719
42416F798027m906682L921021P503442K240938m004630m267887p65872J435783
$$ plain form
42408 7954140 9846158 12316885 15072890 16460267 15408457 12486622 9201313 7367451
42400 7367451 8200693 10928991 13476278 15188712 17082016 18929989 18903868 17126115 16306265
42391 16306265 17194002 16929468 14219384 12465715 14572772 18105113 19561678 20394984
42383 20394984 23871776 27889545 26271440 17112360 5867726 -39602 2900410 12697155
42375 12697155 23089128 27631886 25852494 24040173 26867077 30720910 29837520 26272189
42367 26272189 26977061 31966216 33271043 27225116 20551249 20824505 26624064 31302570
42359 31302570 32162431 31583464 32184891 34713671 38300738 39868659 36165118 29199379
42351 29199379 25960922 28958029 30930165 24220058 12301153 5547954 7273981 11130516
$$ packed form
42408G954140J892018K470727K756005J387377j051810k921835l285309j833862
42400G367451Q33242K728298K547287J712434J893304J847973k6121j777753q19850
42391A6306265Q87737k64534k710084j753669K107057L532341J456565Q33306
42383B0394984L476792M017769j618105r159080j1244634n907328K940012R796745
42375A2697155J0391973M542758j779392j812321K826904L853833q83390l565331
42367B6272189P04872M989155J304827o045927o673867K73256N799559M678506
42359C1302570Q59861n78967O01427K528780L587067J567921l703541o965739
42351B9199379l238457K997107J972136o710107j1918905o753199J726027L856535
$$ plain form
42343 11130516 12283103 13512900 17898517 22355415 23013534 22164111 24487007 29395365
42335 29395365 32636888 33725355 35810249 38240566 35495545 26026665 17339181 18041643
42327 18041643 27445046 37448422 43289504 47287648 51603773 53046373 48625546 42478386
42319 42478386 42063652 48561306 55948989 59864632 62366701 65932201 67524358 63033549
42311 63033549 55099081 51521043 56196228 65689728 75102163 83408043 91906791 101346877
42303 101346877 113035077 129732973 152226274 176992729 200666507 225403782 255928102
42296 255928102 291790071 326867124 357164675 384564303 410555219 430261950 436697112
42289 436697112 428792865 411194264 387469247 358066246 324763927 292127688 262742594
$$ packed form
42343A1130516J152587J229797M385617M456898O58119q49423K322896M908358
42335B9395365L241523J088467K084894K430317k745021r468880q687484P02462
42327A8041643R403403J0003376N841082L998144M316125J442600m420827o147160
42319D2478386m14734O497654P387683L915643K502069L565500J592157m490809
42311F3033549p934468l578038M675185R493500R412435Q305880Q498748R440086
42303A01346877J1688200J6697896K2493301K4766455K3673778K4737275L0524320
42296B55928102L5861969L5077053L0297551K7399628K5990916J9706731O435162
42289D36697112p904247j7598601k3725017k9403001l3302319l2636239k9385094
$$ plain form
42282 262742594 234736463 206285710 179440037 156871388 137762903 120375347 106391401
42275 106391401 98366027 93874301 86794425 74851097 61967531 52220788 45310352 39733310
42267 39733310 36756658 38199146 42623066 46898547 50088824 52817785 54021482 51828547
42259 51828547 47408585 44469352 44238449 43991698 41791999 39752433 40322062 41491215
42251 41491215 38836467 31720075 24568724 21542952 22181512 23281915 23282974 23204401 24171129
42242 24171129 25716997 26627199 26409877 25544950 24701357 24025936 23306516 22869739 23758967
42233 23758967 26113513 27759833 26280791 23084927 23266547 29670615 38831504 45162538
42225 45162538 47546306 48378628 47365678 41574539 32725324 28786442 34300628 42828903
$$ packed form
42282B62742594k8006131k8450753k6845673k2568649j9108485j7387556j3983946
42275A06391401q025374m491726p079876j1943328j2883566r746743o910436n577042
42267C9733310k976652J442488M423920M275481L190277K728961J203697k192935
42259E1828547m419962k939233k30903k46751k199699k039566N69629J169153
42251D1491215k654748p116392p151351l025772O38560J100403J059p8573R66728
42242B4171129J545868R10202k17322q64927q43593o75421p19420m36777Q89228
42233B3758967K354546J646320j479042l195864J81620O404068R160889O331034
42225D5162538K383768Q32322j012950n791139q849215l938882N514186Q528275
$$ plain form
42217 42828903 44126206 37006644 29849869 28987372 32354962 35900484 40483512 48281015
42209 48281015 55818336 56160846 48212896 39859241 39980428 49165405 60139225 66522571
42201 66522571 69074971 72847519 80230410 89087252 97204241 105568171 115874727 127153846
42193 127153846 137312471 146697772 157492279 170344913 184422454 200471225 220654193
42186 220654193 244806183 269760386 293399574 316654202 340008248 360471888 373998163
42179 373998163 379123703 376396889 366036530 348591607 326826600 304386634 282662534
42172 282662534 260659355 237747948 214924804 193317983 172908322 153273983 134938659
42165 134938659 119537739 108525496 101422410 95563610 88474048 80550119 74356219 71197659
$$ packed form
42217D2828903J297303p119562p156775q62497L367590L545522M583028P797503
42209D8281015P537321L42510p947950q353655J21187R184977J0973820O383346
42201F6522571K552400L772548P382891Q856842Q116989Q363930J0306556J1279119
42193A27153846J0158625R385301J0794507J2852634J4077541J6048771K0182968
42186B20654193K4151990K4954203K3639188K3254628K3354046K0463640J3526275
42179C73998163N125540k726814j0360359j7444923k1765007k2439966k1724100
42172B82662534k2003179k2911407k2823144k1606821k0409661j9634339j8335324
42165A34938659j5400920j1012243p103086n858800p089562p923929o193900l158560
$$ plain form
42157 71197659 69704934 67975204 65491147 62522859 59452932 57299907 56851065 56370342
42149 56370342 52460869 44587188 36425219 30974099 26840083 21873710 18069025 19209944
42141 19209944 24935433 30981288 35034608 38708084 43135807 45859467 43753973 37391941
42133 37391941 31119565 29060235 30932626 31658154 26653140 18477485 15603998 21975085
42125 21975085 30529527 31537815 25458482 21534081 23941370 26458436 23116696 17216105
42117 17216105 14949991 15519611 14208166 11958733 14195649 20763372 24657702 22745981
42109 22745981 21324296 27039437 36810346 41834280 39141002 33811194 30434511 27954448
42101 27954448 24556538 22762254 25688230 30817127 32227008 28763307 25769686 27617693
$$ packed form
42157G1197659j492725j729730k484057k968288l069927k153025m48842m80723
42149E6370342l909473p873681q161969n451120m134016m966373l804685J140919
42141A9209944N725489O045855M053320L673476M427723K723660k105494o362032
42133C7391941o272376k059330J872391P25528n005014q175655k873487O371087
42125B1975085Q554442J008288o079333l924401K407289K517066l341740n900591
42117A7216105k266114N69620j311445k249433K236916O567723L894330j911721
42109B2745981j421685N715141R770909N023934k693278n329808l376683k480063
42101B7954448l397910j794284K925976N128897J409881l463701k993621J848007
$$ plain form
42093 27617693 32321710 35854423 38453481 42786995 47756414 48873159 44964573 40296098
42085 40296098 38689959 39075716 38905581 38829098 40893496 44122757 45399565 44056743 42508710
42076 42508710 42355427 42602103 42165278 41604010 41332938 40188689 37313051 34147260 32847461
42067 32847461 33193553 32586995 29500727 26199618 27260032 34917412 45943873 53956048
42059 53956048 55434210 52818291 51002199 51994361 54605742 58002390 62326428 65847298
42051 65847298 65459547 61833020 60632038 65544764 72714880 76044873 76325793 80311257
42043 80311257 90886758 102870916 109744158 110793728 110476526 114422031 126938707 147501703
42035 147501703 167512923 176161416 173864189 175081498 192048244 219691771 243732102
$$ packed form
42093B7617693M704017L532713K599058M333514M969419J116745l908586m668475
42085D0296098j606139L85757j70135p6483K064398L229261J276808j342822j548033
42076D2508710j53283K46676m36825n61268k71072j144249k875638l165791j299799
42067C2847461L46092o06558l086268l301109J060414P657380J1026461Q012175
42059E3956048J478162k615919j816092R92162K611381L396648M324038L520870
42051F5847298l87751l626527j200982M912726P170116L329993K80920L985464
42043H0311257J0575501J1984158O873242J049570l17202L945505J2516676K0562996
42035A47501703K0011220Q648493k297227J217309J6966746K7643527K4040331
$$ plain form
42028 243732102 260449039 278824380 303166284 323927727 329961104 322381688 310915376
42021 310915376 301767131 294363046 285916756 273744667 255889911 234317768 215227862
42014 215227862 202073761 191000433 177569502 164749980 158336694 156600433 151282745
42007 151282745 138792886 124611009 115897278 114538800 118040806 122580326 124278141 121673686
41999 121673686 117770896 115862359 113547482 106142946 96500117 94786584 105415522 119663597
41991 119663597 125702101 122201378 117472056 117909869 122194123 125704227 126216074 124987938
41983 124987938 125143957 129215503 136190036 141163460 140042518 134708409 131588745 134544822
41975 134544822 140616112 143687988 141386892 136866007 133741398 131269589 126625974 120931979
$$ packed form
42028B43732102J6716937J8375341K4341904K0761443O033377p579416j1466312
42021C10915376r148245p404085q446290j2172089j7854756k1572143j9089906
42014B15227862j3154101j1073328j3430931j2819522o413286j736261n317688
42007A51282745j2489859j4181877q713731j358478L502006M539520J697815k604455
41999A21673686l902790j908537k314877p404536r642829j713533J0628938J4248075
41991A19663597O038504l500723m729322M37813M284254L510104N11847j228136
41983A24987938J56019M071546O974533M973424j120942n334109l119664K956077
41975A34544822O071290L071876k301096m520885l124609k471809m643615n693995
$$ plain form
41967 120931979 119298256 123685285 129334350 130973822 129414894 128268012 126927645 121901513
41959 121901513 113548985 105961718 100536851 94920884 88247554 81989742 75413689 66140701
41951 66140701 56143598 50969651 51256625 51134002 47235278 42967490 41095329 38973228
41943 38973228 35217689 34297578 38875569 43467639 42253207 38375545 38485287 42036839
41935 42036839 43594914 42899621 44615481 49316035 52234948 50991721 48159511 45804481
41927 45804481 43108569 39926745 37729836 36425080 34326847 31279780 28167668 24320194
41919 24320194 19472020 16629766 17927728 19205416 14697687 6277321 1762734 4353594
41911 4353594 10203528 16411581 24033627 31691429 33437061 26290390 14799200 5463240
$$ packed form
41967A20931979j633723M387029N649065J639472j558928j146882j340367n026132
41959A21901513q352528p587267n424867n615967o673330o257812o576053r272988
41951F6140701r997103n173947K86974j22623l898724m267788j872161k122101
41943C8973228l755539r20111M577991M592070j214432l877662J09742L551552
41935D2036839J558075o95293J715860M700554K918913j243227k832210k355030
41927D5804481k695912l181824k196909j304756k098233l047067l112112l847474
41919B4320194m848174k842254J297962J277688m507729q420366m514587K590860
41911D353594N849934O208053P622046P657802J745632p146671j1491190r335960
$$ plain form
41903 5463240 1012025 1758091 7153201 13473259 15062616 11026305 6741402 6522378
41895 6522378 9200571 13081248 19881101 29957546 37926582 37544111 28866533 17900725
41887 17900725 11270527 12465148 19830939 26596884 26588363 21575832 19242488 23004340
41879 23004340 28819625 32940171 35994446 36992951 31149492 18561277 8098457 6461787
41871 6461787 9250526 9498363 9221008 14272188 22412291 26044828 24319623 23047642
41863 23047642 23567181 21043646 14538747 10164527 12059102 17245104 21711324 25236941
41855 25236941 27681786 26583288 21929126 18552081 20186163 24598061 27390505 27311235
41847 27311235 25212127 21111558 15430207 10730218 9335037 10806105 13668933 17600850
$$ packed form
41903E463240m451215P46066N395110O320058J589357m036311m284903k19024
41895F522378K678193L880677O799853J0076445P969036l82471q677578j0965808
41887A7900725o630198J194621P365791O765945q521n012531k333344L761852
41879B3004340N815285M120546L054275R98505n843459j2588215j0462820j636670
41871F461787K788739K47837k77355N051180Q140103L632537j725205j271981
41863B3047642N19539k523535o504899m374220J894575N186002M466220L525617
41855B5236941K444845j098498m654162l377045J634082M411898K792444p9270
41847B7311235k099108m100569n681351m699989j395181J471068K862828L931917
$$ plain form
41839 17600850 21931258 24173946 22710308 19618311 18266730 18596277 16950872 10895829
41831 10895829 2907037 -1515912 631443 6717570 11628456 13801425 16210748 20731691
41823 20731691 24464305 24220009 22109301 22477402 24467709 22630954 15680124 10133051
41815 10133051 12833706 22462645 30784705 31141422 24509838 18133127 18710532 26087869
41807 26087869 33759034 36220191 34347364 32015703 30116976 27713820 27042006 31678407
41799 31678407 39598269 43536701 39806842 32343761 26594716 23960397 23880377 26115470
41791 26115470 27955398 24159685 14020233 4713479 2961800 6310814 7577838 5506732
41783 5506732 5179931 8607354 10793447 6724708 -1643899 -7479142 -6168195 923240
$$ packed form
41839A7600850M330408K242688j463638l091997j351581L29547j645405o055043
41831A0895829p988792m422949K147355O086127M910886K172969K409323M520943
41823B0731691L732614k44296k110708L68101J990307j836755o950830n547073
41815A0133051K700655R628939Q322060L56717o631584o376711N77405P377337
41807B6087869P671165K461157j872827k331661j898727k403156o71814M636401
41799C1678407P919862L938432l729859p463081n749045k634319q0020K235093
41791B6115470J839928l795713j0139452r306754j751679L349014J267024k071106
41783E506732l26801L427423K186093m068739q368607n835243J310947P091435
$$ plain form
41775 923240 8434015 11869447 11165290 9783823 10409559 12537593 14461344 15581099 15574076
41766 15574076 13458464 9477961 6218513 5756051 7169248 8788069 11048467 14799645
41758 14799645 18664121 20694008 20776506 18751547 12773411 3395642 -3286247 -1885174
41750 -1885174 4276025 7131080 5068189 3566261 4300531 1425530 -8030371 -16883977
41742 -16883977 -16341300 -7458670 1410841 5616738 7204398 8769827 9734513 8650913
41734 8650913 5588325 2416767 2740916 9238968 18035623 19175712 7994133 -6573165
41726 -6573165 -11539614 -6064875 -574263 -587590 -1025753 1542832 1615555 -4470023 -9557296
41717 -9557296 -6048279 1342963 3115944 622779 2877652 9863653 11388218 3943765
$$ packed form
41775I23240P510775L435432p04157j381467O25736K128034J923751J119755p023
41766A5574076k115612l980503l259448m62462J413197J618821K260398L751178
41758A4799645L864476K029887Q2498k024959n978136r377769o681889J401073
41750a885174O161199K855055k062891j501928P34270k875001r455901q853606
41742a6883977N42677Q882630Q869511M205897J587660J565429R64686j083600
41734H650913l062588l171558L24149O498052Q796655J140089j1181579j4567298
41726f573165m966449N474739N490612j3327m38163K568585P2723o085578n087273
41717i557296L509017P391242J772981k493165K254873O986001J524565p444453
$$ plain form
41709 3943765 -3066605 -2122173 1860689 2099208 2047922 8320533 17916470 22215517 20199038
41700 20199038 18308282 18751101 16995534 11072983 5135019 2285535 1084493 1103809
41692 1103809 4816495 10756896 11472113 3243806 -7038253 -10244112 -6918984 -5106928
41684 -5106928 -8166013 -10698922 -6847963 2198826 10484628 13768589 12006748 7714959
41676 7714959 3982408 3023509 4699485 6350700 5322358 2220490 837463 3748262
41668 3748262 8375362 9319705 5291885 1497236 2979758 7352864 7636042 1908325
41660 1908325 -3835463 -3559993 1676864 6669775 9204843 10986782 12990102 13572244
41652 13572244 11699267 9625331 10865205 15856800 20384637 19212434 12177285 5948980
$$ packed form
41709C943765p010370R44432L982862K38519n1286O272611R595937M299047k016479
41700B0199038j890756M42819j755567n922551n937964k849484j201042J9316
41692A103809L712686N940401P15217q228307j0282059l205859L325128J812056
41684e106928l059085k532909L850959R046789Q285802L283961j761841m291789
41676G714959l732551r58899J675976J651215j028342l101868j383027K910799
41668C748262M627100R44343m027820l794649J482522M373106K83178n727717
41660A908325n743788K75470N236857M992911K535068J781939K003320N82142
41652A3572244j872977k073936J239874M991595M527837j172203p035149o228305
$$ plain form
41644 5948980 7561846 15833208 21633309 18014136 7948136 110622 -1154142 983599
41636 983599 1520559 -844066 -4368782 -7689666 -10472368 -11436462 -8008818 490869 9786641
41627 9786641 13097368 8395117 1918303 1911560 9261837 16998456 18821734 14692227 7667083
41618 7667083 -220460 -6756078 -8600837 -5427210 -2030032 -2231458 -3145718 3923
41610 3923 5631252 7967940 6289331 5565962 7644092 8552047 6562603 6147538 9792432
41601 9792432 11686014 5581339 -4890173 -10563460 -9437929 -8020729 -10336519 -12818589
41593 -12818589 -11812551 -9443047 -8480851 -6932759 -2551735 1534785 1439106 -89676
41585 -89676 2855843 9891117 14779986 15017957 14305248 14497447 11983431 4742397 -3290320
$$ packed form
41644E948980J612866Q271362N800101l619173j0066000p837514j264764K137741
41636I83599N36960k364625l524716l320884k782702r64094L427644Q499687R295772
41627I786641L310727m702251o476814o743P350277P736619J823278m129507p025144
41618G667083p887543o535618j844759L173627L397178k01426r14260L149641
41610C923N627329K336688j678609p23369K078130R07955j989444m15065L644894
41601I792432J893582o104675j0471512n673287J125531J417200k315790k482070
41593a2818589J006038K369504R62196J548092M381024M086520r5679j528782
41585h9676K945519P035274M888869K37971p12709J92199k514016p241034q032717
$$ plain form
41576 -3290320 -8582824 -12770281 -16447053 -14427826 -4212918 5665420 4686417 -4519988
41568 -4519988 -9217993 -4309118 2313558 3576460 2820076 5298476 8235825 6038091
41560 6038091 268073 -2562322 -526487 2497300 3998171 5991252 10696569 16613180
41552 16613180 19823619 17809816 12000055 6853318 5286759 5265183 3256103 458264
41544 458264 1461569 6448115 9993416 9193933 7400342 7464244 7443840 6611885 9014226
41535 9014226 15583351 19084553 14115147 6696486 5422335 7624351 4491595 -2926147
41527 -2926147 -4477212 2299012 7668759 4771603 -1021726 -2337179 -582791 -561967
41519 -561967 -1299313 816987 4284700 4496880 996325 -2448811 -3201866 -1301527 2252180
$$ packed form
41576c290320n292504m187457l676772K019227J0214908R878338r79003r206405
41568d519988m698005M908875O622676J262902p56384K478400K937349k197734
41560F038091n770018k830395K035835L023787J500871J993081M705317N916611
41552A6613180L210439k013803n809761n146737j566559k1576k009080k797839
41544D58264J003305M986546L545301p99483j793591O3902k0404q31955K402341
41535I014226O569125L501202m969406p418661j274151K202016l132756p417742
41527b926147j551065O776224N369747k897156n793329j315453J754388K0824
41519e61967p37346K116300L467713K12180l500555l445136p53055J900339L553707
$$ plain form
41510 2252180 5281561 4832069 1200677 -995704 502644 606267 -6584010 -17943450
41502 -17943450 -23467910 -18334062 -8149604 -1233227 75932 -1725342 -5475222 -12056244
41494 -12056244 -19467752 -21472893 -14073110 -1901067 5365163 3696026 -1168770 -1850829
41486 -1850829 1677447 4322218 4152414 3592365 3675278 2605839 499971 630894 4526704
41477 4526704 9686747 13328630 14762794 13325421 8267059 1922221 -1423076 -1371495
41469 -1371495 -1744209 -3713159 -3862529 -1166922 151655 -1695636 -1611373 3884731 9003548
41460 9003548 6419301 -913080 -3322020 1668646 6473970 5031648 704257 221503
41452 221503 4267543 7459924 6012693 2851071 4311751 11860738 18683392 17205467
$$ packed form
41510B252180L029381m49492l631392k196381J498348J03623p190277j1359440
41502a7943450n524460N133848J0184458O916377J309159j801274l749880o581022
41494a2056244p411508k005141P399783J2172043P266230j669137m864796o82059
41486a850829L528276K644771j69804n60049Q2913j069439k105868J30923L895810
41477D526704N160043L641883J434164j437373n058362o344838l345297N1581
41469a371495l72714j968950j49370K695607J318577j847291Q4263N496104N118817
41460I003548k584247p332381k408940M990666M805324j442322m327391m82754
41452B21503M046040L192381j447231l161622J460680P548987O822654j477925
$$ plain form
41444 17205467 9307260 4386347 6346617 8421491 3917347 -4195459 -9487201 -11798112
41436 -11798112 -13635356 -12136217 -4074960 4299158 3238219 -5185564 -8524407 -2322411
41428 -2322411 3446953 -96882 -8612770 -13497841 -14393805 -15503724 -16205379 -13679117
41420 -13679117 -10291467 -9940459 -10067905 -5678989 495765 577489 -5689432 -9210681 -4637761
41411 -4637761 2201911 3514391 97282 -2102612 -1613353 -1957357 -4595369 -6663751
41403 -6663751 -5677519 -2529385 813872 3625115 5511039 5449976 2913444 -1309172 -5959710
41394 -5959710 -9788278 -11032266 -8153721 -1777787 5544064 12026808 17383705 20335160
41386 20335160 18102001 10514140 2550714 -319511 1426657 2418530 -421947 -4517768
$$ packed form
41444A7205467p898207m920913J960270K074874m504144q112806n291742k310911
41436a1798112j837244J499139Q061257Q374118j060939q423783l338843O201996
41428b322411N769364l543835q515888m885071q95964j109919p01655K526262
41420a3679117L387650L51008j27446M388916O174754Q1724o266921l521249M572920
41411d637761O839672J312480l417109k199894M89259l44004k638012k068382
41403f663751R86232L148134L343257K811243J885924o1063k536532m222616m650538
41394e959710l828568j243988K878545O375934P321851O482744N356897K951455
41386B0335160k233159p587861p963426k870225J746168R91873k840477m095821
$$ plain form
41378 -4517768 -5596742 -2380007 3124722 7507584 7498141 2186382 -5074448 -8907049 -7166327
41369 -7166327 -2611953 777205 979777 -2559612 -9206541 -15644529 -17290459 -13322446
41361 -13322446 -8018415 -5395432 -5002432 -4742977 -4784479 -5930881 -6805889 -6147674 -6214048
41352 -6214048 -10384353 -18004652 -24295749 -25105093 -20242082 -13159359 -8582586 -8739744
41344 -8739744 -10659734 -9410511 -5018611 -2558102 -3480654 -1749049 7173952 17729352
41336 17729352 20569704 14912999 8402163 6040048 5621424 4013735 1798682 346053
41328 346053 -839582 -2045955 -2073429 -379828 1940373 3726540 4263652 2949062 717048
41319 717048 148765 1362828 313627 -5029974 -9910923 -9315059 -6091476 -6046551 -8010203
$$ packed form
41378d517768j078974L216735N504729M382862r443n311759p260830l832601J740722
41369g166327M554374L389158K02572l539389o646929o437988j645930L968013
41361a3322446N304031K622983L93000K59455m1502j146402q75008O58215o6374
41352f214048m170305p620299o291097q09344M863011P082723M576773j57158
41344h739744j919990J249223M391900K460509r22552J731605Q923001J0555400
41336A7729352K840352n656705o510836k362115m18624j607689k215053j452629
41328C46053j185635j206373k7474J693601K320201J786167N37112j314590k232014
41319G17048n68283J214063j049201n343601m880949N95864L223583M4925j963652
$$ plain form
41310 -8010203 -7128274 -5856036 -11374048 -22078071 -27769847 -25609922 -24716589 -30373978
41302 -30373978 -34465960 -28642070 -17743409 -11341283 -9111601 -4363942 2949205 6884830
41294 6884830 6330062 5483300 4536507 -1055744 -11060328 -17852794 -15853117 -8481489
41286 -8481489 -3227322 -2916782 -3683710 -68642 8490407 16016064 16354435 11332696 8761318
41277 8761318 10969087 11054207 4512745 -1571524 1758543 10557115 12010860 2226676
41269 2226676 -8760187 -10945677 -5646571 -191812 2120784 2549576 1721102 -1315066
41261 -1315066 -6188267 -10386152 -11302948 -8343615 -3639979 -720596 -1478977 -4577708
41253 -4577708 -7329967 -7963460 -5538078 -349711 3866890 1537885 -7642240 -16111545
$$ packed form
41310h010203Q81929J272238n518012j0704023n691776K159925Q93333n657389
41302c0373978m091982N823890J0898661O402126K229682M747659P313147L935625
41294F884830n54768q46762r46793n592251j0004584o792466J999677P371628
41286h481489N254167L10540p66928L615068Q559049P525657L38371n021739k571378
41277H761318K207769Q5120o541462o084269L330067Q798572J453745r784184
41269B226676j0986863k185490N299106N454759K312596M28792q28474l036168
41261a315066m873201m197885r16796K959333M703636K919383p58381l098731
41253d577708k752259o33493K425382N188367M216601k329005r180125q469305
$$ plain form
41245 -16111545 -16988466 -12660192 -10241353 -10955993 -9898469 -5106104 -593630 -17442
41237 -17442 -2549771 -5575727 -6960827 -4697322 777440 3937059 -754779 -10620597
41229 -10620597 -16987395 -16219928 -12783944 -10386299 -6733109 215488 6795402 8397169
41221 8397169 5426102 1107135 -2993856 -6374330 -8202750 -9267529 -11675815 -14196175
41213 -14196175 -12224296 -5335172 -111577 -1382562 -5112745 -5149901 -3308020 -6443523
41205 -6443523 -15440115 -23344293 -24192666 -18592935 -10500378 -3340563 -144652 -2953825
41197 -2953825 -9853601 -15337851 -15628837 -12109822 -8457290 -6228296 -4701899 -3409569
41189 -3409569 -2435874 -552891 4191641 10413473 12001965 4433644 -7567675 -13217514
$$ packed form
41245a6111545q76921M328274K418839p14640J057524M792365M512474N76188
41237a7442k532329l025956j385100K263505N474762L159619m691838r865818
41229a0620597o366798P67467L435984K397645L653190O948597O579914J601767
41221H397169k971067m318967m100991l380474j828420j064779k408286k520360
41213a4196175J971879O889124N223595j270985l730183l7156J841881l135503
41205f443523q996592p904178q48373N599731Q092557P159815L195911k809173
41197b953825o899776n484250k90986L519015L652532K228994J526397J292330
41189c409569R73695J882983M744532O221832J588492p568321j2001319n649839
$$ plain form
41181 -13217514 -8751185 -2708783 -3677680 -7133860 -2150213 10851522 18917906 14918731
41173 14918731 7392586 6881232 10605535 8647703 21532 -6532625 -5675607 -1065785
41165 -1065785 2119682 3270166 3854440 4360133 5136891 6221438 5759261 2553759 44006
41156 44006 2801637 8647855 9865206 3878144 -2898273 -4688842 -4392366 -7514308 -12486218
41147 -12486218 -13228915 -9336484 -7094684 -9735525 -12308331 -8837112 -693738 5737872
41139 5737872 7661465 8167748 10132018 11522611 8654006 2041315 -3603805 -4935039
41131 -4935039 -3410039 -2539833 -3274229 -3529788 -1740510 781065 1785390 1493109 2525220
41122 2525220 6057970 9542767 9734882 6995073 4303215 2428176 -706432 -5094366
$$ packed form
41181a3217514M466329O042402r68897l456180M983647J3001735Q066384l999175
41173A4918731p526145n11354L724303j957832q626171o554157Q57018M609822
41165a065785L185467J150484N84274N05693P76758J084547m62177l205502k509753
41156D4006K757631N846218J217351n987062o776417j790569K96476l121942m971910
41147a2486218p42697L892431K241800k640841k572806L471219Q143374O431610
41139E737872J923593N06283J964270J390593k868605o612691n645120j331234
41131d935039J525000Q70206p34396k55559J789278K521575J004325k92281J032111
41122B525220L532750L484797J92115k739809k691858j875039l134608m387934
$$ plain form
41114 -5094366 -6792986 -3397706 1704872 3794836 3018690 2433602 2267088 847330 -510879
41105 -510879 812901 2851127 841802 -4719389 -7849040 -5931413 -2528915 370111
41097 370111 5857694 14297142 18811317 14253535 5738754 2085890 4412692 7464531
41089 7464531 9236711 12094976 15473353 14605588 7787348 -219322 -3906101 -2950514
41081 -2950514 -1106240 -1366474 -3252644 -4032811 -2667353 -2320738 -6678629 -13357619 -14905210
41072 -14905210 -8402902 158788 4199933 4672573 5433937 5220507 841928 -4704943
41064 -4704943 -4879534 539094 4977177 4475663 1686585 236137 554592 1865198 3575242
41055 3575242 4280664 3358489 2971288 4488032 4703789 732539 -3629446 -2970671 469367
$$ packed form
41114e094366j698620L395280N102578K089964p76146n85088j66514j419758j358209
41105e10879J323780K038226k009325n561191l129651J917627L402498K899026
41097C70111N487583Q439448M514175m557782q514781l652864K326802L051839
41089G464531J772180K858265L378377q67765o818240q006670l686779R55587
41081b950514J844274k60234j886170p80167J365458L46615m357891o678990j547591
41072a4905210O502308Q561690M041145M72640P61364k13430m378579n546871
41064d704943j74591N418628M438083n01514k789078j450448L18455J310606J710044
41055C575242P05422r22175l87201J516744K15757l971250m361985O58775L440038
$$ plain form
41046 469367 622163 -904981 3004724 11035785 12560186 3707698 -5795395 -6567689 -1412041
41037 -1412041 2273588 3562376 4798918 4525915 1116793 -1980201 -1635404 -875695 -2878600
41028 -2878600 -4341292 -1961880 -325839 -4872998 -11162938 -10564376 -4098744 -917098
41020 -917098 -3870292 -6159883 -3250374 689663 780059 -1330956 -1572074 487305 2771535
41011 2771535 3945292 3165803 -7384 -3578760 -4083910 -1191906 1374576 690547 -2222904
41002 -2222904 -4927845 -6362386 -5977537 -2801935 2899602 8522948 10887004 8616512
40994 8616512 3029455 -2524943 -5130504 -5165947 -5338697 -6039123 -4459747 -97055 2780871
40985 2780871 1760440 1511101 6998178 14316011 14921530 7900425 1377536 1493135 5968663
$$ packed form
41046D69367J52796j527144L909705Q031061J524401q852488r503093p72294N155648
41037a412041L685629J288788J236542k73003l409122l096994L44797P59709k002905
41028b878600j462692K379412J636041m547159o289940N98562O465632L181646
41020i17098k953194k289591K909509L940037R0396k111015k41118K059379K284230
41011B771535J173757p79489l173187l571376n05150K892004K566482o84029k913451
41002b222904k704941j434541L84849L175602N701537N623346K364056k270492
40994H616512n587057n554398k605561l5443j72750p00426J579376M362692K877926
40985B780871j020431k49339N487077P317833O05519p021105o522889J15599M475528
$$ plain form
40976 5968663 9379335 9243715 5716072 282133 -3946843 -5007670 -5697891 -9766640
40968 -9766640 -14582467 -13596621 -6851365 -2370919 -5062735 -10591675 -12948780 -11852437
40960 -11852437 -9273096 -4796559 1033541 3960930 1543848 -2582786 -4199015 -4106379
40952 -4106379 -4119629 -2231979 2918434 6981695 5452354 1245148 645391 4139401 7380216
40943 7380216 9254676 12401100 16581246 17993654 15584850 12663349 11513790 10932539
40935 10932539 9712017 8429096 7159893 5199976 3690017 5154491 9792903 14804385
40927 14804385 17227628 15124059 7485701 -3394974 -11003713 -10784658 -6546281 -5878400
40919 -5878400 -9694862 -11715990 -8407296 -3510493 -1519285 -2369491 -4565092 -8174542
$$ packed form
40976E968663L410672j35620l527643n433939m228976j060827o90221m068749
40968i766640m815827R85846O745256M480446k691816n528940k357105J096343
40960a1852437K579341M476537N830100K927389k417082m126634j616229R2636
40952d106379j3250J887650N150413M063261j529341m207206n99757L494010L240815
40943G380216J874460L146424M180146J412408k408804k921501j149559n81251
40935A0932539j220522j282921j269203j959917j509959J464474M638412N011482
40927A4804385K423243k103569p638358j0880675p608739K19055M238377O67881
40919e878400l816462k021128L308694M896803J991208q50206k195601l609450
$$ plain form
40911 -8174542 -12035640 -12721481 -9254201 -4843776 -1524241 2447548 7173843 8311972
40903 8311972 3802545 -1214976 -1244874 1493973 1181969 -2585300 -5821655 -7734358 -10599332
40894 -10599332 -13157961 -11082106 -4640526 262225 207707 -1937579 -3106515 -4566726
40886 -4566726 -7603840 -9517513 -7842471 -4997160 -4469992 -4931176 -2592597 2197890
40878 2197890 5311046 5157175 4146343 3577504 1660767 -1764901 -2808440 876632
40870 876632 4918814 3035191 -3757326 -7071127 -1456531 8462217 13277399 9078539
40862 9078539 40856 -7586409 -10820577 -9823569 -6306932 -3435853 -4279905 -7896794
40854 -7896794 -8900404 -3751384 3723435 6317656 2620936 -1324825 -344712 3482243
$$ packed form
40911h174542l861098o85841L467280M410425L319535L971789M726295J138129
40903H311972m509427n017521k9898K738847l12004l767269l236355j912703k864974
40894a0599332k558629K075855O441580M902751n4518k145286j168936j460211
40886d566726l037114j913673J675042K845311N27168m61184K338579M790487
40878B197890L113156j53871j010832n68839j916737l425668j043539L685072
40870H76632M042182j883623o792517l313801N614596R918748M815182m198860
40862I078539r037683p627265l234168R97008L516637K871079q44052l616889
40854g896794j003610N149020P474819K594221l696720l945761R80113L826955
$$ plain form
40846 3482243 5043359 3882485 3926091 6752362 9369347 9418967 8929222 10664433 13140661
40837 13140661 12250899 7018342 1021451 -2045346 -2003284 -692676 1274443 4728843
40829 4728843 9540137 13329676 13092051 8172584 1625154 -1992324 -894233 2261810
40821 2261810 3793024 3311618 3054548 3606887 3038205 834128 -213667 2192588 6365628
40812 6365628 9064735 9599821 9161902 7890288 5771173 5170410 8493981 13330165 13819861
40803 13819861 7929034 128025 -4508440 -5828815 -6483748 -7191748 -6698368 -4510185
40795 -4510185 -1170771 2786357 6042410 6212393 2690706 -1656192 -4003421 -5068921
40787 -5068921 -6250371 -5416312 -136387 5952499 5910904 -243889 -3955446 -34256 5041949
$$ packed form
40846C482243J561116j160874M3606K826271K616985M9620m89745J735211K476228
40837A3140661q89762n232557n996891l066797M2062J310608J967119L454400
40829D728843M811294L789539k37625m919467o547430l617478J098091L156043
40821B261810J531214m81406k57070N52339n68682k204077j047795K406255M173040
40812F365628K699107N35086m37919j271614k119115o00763L323571M836184M89696
40803A3819861n890827p801009m636465j320375o54933p08000M93380K188183
40795d510185L339414L957128L256053J69983l521687m346898k347229j065500
40787e068921j181450Q34059N279925O088886m1595o154793l711557L921190N076205
$$ plain form
40778 5041949 2002574 -7588956 -13395545 -10916476 -6720682 -7434383 -10267613 -8850066
40770 -8850066 -3629340 -462710 -1225984 -2133140 -1095748 -594070 -1589376 -94790 6607754
40761 6607754 14108007 15628593 10772467 5465222 4061625 5311905 6043226 5133896
40753 5133896 2866229 -678950 -4815325 -7524408 -7182029 -4465272 -1793397 -1112290
40745 -1112290 -2123453 -2262263 859087 6088062 8852886 6160780 561015 -2589103
40737 -2589103 -810901 4367365 10375897 14907223 15718740 12774467 9700670 9296635
40729 9296635 8718898 4000530 -1601936 -418442 7772522 14024289 12797918 8673721
40721 8673721 6352777 1932194 -8687616 -19152714 -19993454 -13244406 -9857223 -13470030
$$ packed form
40778E041949l039375r591530n806589K479069M195794p13701k833230J417547
40770h850066N220726L166630p63274r07156J037392N01678r95306J494586O702544
40761F607754P500253J520586m856126n307245j403597J250280P31321r09330
40753E133896k267667l545179m136375k709083L42379K716757K671875O81107
40745a112290j011163j38810L121350N228975K764824k692106n599765l150118
40737b589103J778202N178266O008532M531326Q11517k944273l073797m04035
40729I296635n77737m718368n602466J183494Q190964O251767j226371m124197
40721H673721k320944m420583j0619810j0465098q40740O749048L387183l612807
$$ plain form
40713 -13470030 -16303265 -12300758 -5525377 -2544742 -3892347 -7146324 -12459601 -19979577
40705 -19979577 -25717566 -25021533 -18445238 -10789377 -5569403 -2754092 -760412 1195621
40697 1195621 2230175 951345 -1633011 -1680754 2364111 5813368 3342016 -2333242
40689 -2333242 -3189747 2221806 6156780 3137962 -2251691 -2706582 2030083 7157944
40681 7157944 10230130 11849440 12199517 11118589 9025498 4803113 -3502286 -12910764
40673 -12910764 -15751092 -10364487 -6092849 -11105838 -19989171 -21304008 -13853230 -6473620
40665 -6473620 -3916467 -2823258 -1401006 -2865094 -7251635 -9150119 -7118353 -7023111
40657 -7023111 -11357985 -12793272 -4730018 7212781 11282781 4172037 -6499344 -12320257
$$ packed form
40713a3470030k833235M002507O775381K980635j347605l253977n313277p519976
40705a9979577n737989O96033O576295P655861N219974K815311J993680J956033
40697A195621J034554j278830k584356m7743M044865L449257k471352n675258
40689b333242q56505N411553L934974l018818n389653m54891M736665N127861
40681G157944L072186J619310L50077j080928k093091m222385q305399r408478
40673a2910764k840328N386605M271638n012989q883333j314837P450778P379610
40665f473620K557153J093209J422252j464088m386541j898484K031766R5242
40657g023111m334874j435287Q063254J1942799M070000p110744j0671381n820913
$$ plain form
40649 -12320257 -11259030 -5763135 1088863 6750936 9722124 10032220 8361930 5277921
40641 5277921 1965258 -26203 -938188 -2778377 -5859120 -7567854 -6096232 -3039456
40633 -3039456 -594078 1289257 3010104 3371682 2117982 1904470 4709537 8176387
40625 8176387 8423060 4946116 286251 -3346521 -4732861 -3235030 -524497 -288867
40617 -288867 -3040496 -3810487 1249549 8701281 12854263 14313664 17559423 21696136
40609 21696136 20752889 13544129 6355389 3931255 3752810 1802151 -1428530 -3868976
40601 -3868976 -5941515 -7935941 -7473408 -3707712 -485966 -886097 -1740610 1368309 6114176
40592 6114176 6256403 1483515 -1523716 1335692 5976461 6057437 916647 -4700144 -6558722
$$ packed form
40649a2320257J061227N495895O851998N662073K971188L10096j670290l084009
40641E277921l312663j991461r11985j840189l080743j708734J471622L056776
40633c039456K445378J883335J720847L61578j253700k13512K805067L466850
40625H176387K46673l476944m659865l632772j386340J497831K710533K35630
40617b88867k751629p69991N060036P451732M152982J459401L245759M136713
40609B1696136r43247p208760p188740k424134j78445j950659l230681k440446
40601c868976k072539j994426M62533L765696L221746m00131q54513L108919M745867
40592F114176J42227m772888l007231K859408M640769Q0976n140790n616791j858578
$$ plain form
40583 -6558722 -4587021 -1877193 -1366769 -2972653 -3923933 -2634036 -1153830 -1911101 -3340914
40574 -3340914 -1985906 1589778 2875030 -58802 -3843619 -4752630 -2862446 -56846
40566 -56846 2401775 2813006 -211709 -3762616 -2129794 4375577 7012022 -124833 -10894715
40557 -10894715 -15397609 -13654073 -13237780 -15881394 -15943920 -12026341 -9967638 -11697388
40549 -11697388 -10659069 -3185892 3885388 3467318 -764401 -1329599 396707 -2605940
40541 -2605940 -10189966 -14648706 -12498407 -8294463 -5735512 -2382358 4301891 11430817
40533 11430817 14406003 12452346 7964845 3036419 -1454317 -5099329 -7350237 -6782679
40525 -6782679 -2077045 4420901 6538575 1491640 -4756997 -4214283 2599085 8368117
$$ packed form
40583f558722J971701K709828N10424j605884r51280J289897J480206p57271j429813
40574c340914J355008L575684J285252k933832l784817r09011J890184K805600
40566e6846K458621M11231l024715l550907J632822O505371K636445p136855j0769882
40557a0894715m502894J743536M16293k643614o2526L917579K058703j729750
40549a1697388J038319P473177P071280m18070m231719n65198J726306l002647
40541b605940p584026m458740K150299M203944K558951L353154O684249P128926
40533A1430817K975186j953657m487501m928426m490736l645012k250908N67558
40525f782679M705634O497946K117674n046935o248637N42714O813368N769032
$$ plain form
40517 8368117 9830368 9900579 9220609 3855025 -6310613 -14319562 -15005473 -11206216 -7712604
40508 -7712604 -4908658 -2291435 -2354862 -5969450 -8840091 -7661139 -5352366 -5163377 -4314261
40499 -4314261 514126 5639516 5293447 986386 -1220357 -570591 -1187030 -2893396 -404221
40490 -404221 7346696 13928541 13825991 9169874 5705839 5814678 7818079 9503053 10103350
40481 10103350 9956652 9504824 8805854 8576723 11038138 16731860 20252321 14290910 613496
40472 613496 -8590084 -5225622 3944280 7561351 5898644 7846893 14498143 16569123
40464 16569123 9184414 -502890 -3857351 -1498612 353796 -1477416 -5744177 -9484973
40456 -9484973 -9341471 -4344178 703596 -656543 -7234212 -10383312 -5867014 161370
$$ packed form
40517H368117J462251P0211o79970n365584j0165638q008949o85911L799257L493612
40508g712604K803946K617223o3427l614588k870641J178952K308773J88989Q49116
40499d314261M828387N125390l46069m307061k206743O49766o16439j706366K489175
40490d04221P750917O581845j02550m656117l464035J08839K003401J684974O00297
40481A0103350j46698m51828o98970k29131K461415N693722L520461n961411j3677414
40472F13496r203580L364462R169902L617071j662707J948249O651250K070980
40464A6569123p384709r687304l354461K358739J852408j831212m266761l740796
40456i484973J43502M997293N047774j360139o577669l149100M516298O028384
$$ plain form
40448 161370 318766 -4341528 -7964675 -8329319 -6816915 -3870607 263576 2780441 1040541
40439 1040541 -3490062 -7577683 -10656644 -13602686 -15101359 -13024818 -8382984 -4796316
40431 -4796316 -4584174 -7296548 -10956089 -13042987 -11628527 -7123828 -1873446 2356179
40423 2356179 4600929 3015464 -3057914 -9021663 -8172479 -764883 5174627 4716082
40415 4716082 2340213 3603076 5940166 3619850 -1863616 -3094243 2735376 10113686
40407 10113686 12132788 7423063 254724 -3700878 -2265541 869298 52653 -4887751
40399 -4887751 -7893150 -4982983 360840 2660856 1410126 -675061 -2451961 -3467265
40391 -3467265 -1915665 2165308 4883720 3928741 2631641 4169222 5504273 2392372
$$ packed form
40448A61370J57396m660294l623147l64644J512404K946308M134183K516865j739900
40439A040541m530603m087621l078961k946042j498673K076541M641834L586668
40431d796316K12142k712374l659541k086898J414460M504699N250382M229625
40423B356179K244750j585465o073378n963749Q49184P407596N939510m58545
40415D716082k375869J262863K337090k320316n483466j230627N829619P378310
40407A0113686K019102m709725p168339l955602J435337L134839q16645m940404
40399d887751l005399K910167N343823K300016j250730k085187j776900j015304
40391c467265J551600M080973K718412r54979j297100J537581J335051l111901
$$ plain form
40383 2392372 -3074937 -5807854 -5642730 -5952056 -7024121 -6882245 -6140411 -5996487 -4278964
40374 -4278964 38228 1765841 -3366994 -9678388 -8638462 -2685640 -1806283 -7262445
40366 -7262445 -9643264 -4157672 2792606 4946807 4332855 4541365 4713769 4389125 6478588
40357 6478588 11108722 13390791 11002066 7363527 4656019 1509465 181865 6236965
40349 6236965 16710836 19186158 9316915 -931230 -883636 3039437 -181214 -7017059
40341 -7017059 -6486514 -176301 274294 -6726511 -10437916 -6373120 -2941571 -6208948
40333 -6208948 -10671806 -10391004 -8431269 -8851764 -8643871 -5021830 -2892486 -6697194 -10947189
40324 -10947189 -8064132 -1478018 -1163879 -7927072 -11778050 -6609233 2154891 6918614
$$ packed form
40383B392372n467309k732917J65124l09326j072065J41876P41834J43924J717523
40374d278964M317192J727613n132835o311394J039926N952822Q79357n456162
40366g262445k380819N485592O950278K154201o13952K08510J72404l24644K089463
40357F478588M630134K282069k388725l638539k707508l146554j327600O055100
40349F236965J0473871K475322r869243j0248145M7594L923073l220651o835845
40341g017059N30545O310213M50595p000805l711405M064796L431549l267377
40333f208948m462858K80802J959735m20495K07893L622041K129344l804708m249995
40324a0947189K883057O586114L14139o763193l850978N168817Q764124M763723
$$ plain form
40316 6918614 7282862 6184489 3289487 -2100562 -6266515 -5802090 -4270169 -7183768
40308 -7183768 -11949221 -10720101 -3576359 -121676 -4877864 -9667586 -6535575 -738515
40300 -738515 -1953410 -7784175 -7216454 1276404 6914278 3516111 -1855928 -1416488 1976331
40291 1976331 2305399 1095588 2611921 4210302 282797 -7355626 -11120821 -8339584
40283 -8339584 -3758374 -2350163 -4965479 -9815954 -13406011 -11813072 -5783170 -1931862
40275 -1931862 -3663759 -4514547 2554558 12852046 15977971 11802953 9709097 12129749
40267 12129749 10774716 2144671 -4837921 -2713894 2686704 2069689 -3256841 -5844906
40259 -5844906 -4887849 -4964413 -5505449 -1476067 6174762 9892299 6962722 4253333 8419649
$$ packed form
40316F918614L64248j098373k895002n390049m165953M64425J531921k913599
40308g183768m765453J229120P143742L454683m756188m789722L132011N797060
40300g38515j214895n830765N67721Q492858N637874l398167n372039M39440L392819
40291A976331L29068j209811J516333J598381l927505p638423l765195K781237
40283h339584M581210J408211k615316m850475l590057J592939O029902L851308
40275a931862j731897q50788P069105J0297488L125925m175018k093856K420652
40267A2129749j355033q630045o982592K124027N400598o17015n326530k588065
40259e844906R57057p6564n41036M029382P650829L717537k929577k709389M166316
$$ plain form
40250 8419649 16413698 19276471 12710987 1216608 -7064600 -8158519 -5438958 -5259066
40242 -5259066 -9317440 -12827149 -11135419 -5648230 -1075087 388109 -1027941 -5351325
40234 -5351325 -10517264 -9967559 433938 13554028 16646996 7777366 -350531 3425093
40226 3425093 14691972 20566312 16165275 7998798 3711585 4553290 7075625 7075151 1959406
40217 1959406 -6554075 -12183727 -10274696 -3838864 376321 933195 1905278 4466100
40209 4466100 4596930 889322 -1501995 1605558 6674715 7840539 5720839 5797489 9827289
40200 9827289 13803989 14109972 11496278 8240036 4430894 -1405298 -9103404 -15222013
40192 -15222013 -15271754 -8734218 -1217481 1097663 -949409 -1355206 1209642 1203847 -3701958
$$ packed form
40250H419649P994049K862773o565484j1494379q281208j093919K719561J79892
40242e259066m058374l509709J691730N487189M573143J463196j416050m323384
40234e351325n165939N49705J0401497J3120090L092968q869630q127897L775624
40226C425093J1266879N874340m401037q166477m287213Q41705K522335m74n115745
40217A959406q513481n629652J909031O435832M215185N56874R72083K560822
40209D466100J30830l707608k391317L107553N069157J165824k119700P6650M029800
40200I827289L976700L05983k613694l256242l809142n836192p698106o118609
40192a5222013m9741O537536P516737K315144k047072m05797K564848n795m905805
$$ plain form
40183 -3701958 -7030862 -3217124 3020918 4224038 2242525 3871133 7898487 6968193
40175 6968193 1143521 -1445880 1528692 3044616 -223433 -2126881 1001141 2825953
40167 2825953 -1900902 -7577202 -7063947 -3481136 -3829018 -6477722 -4505264 2038465
40159 2038465 6197102 4444011 -743674 -6892301 -13001006 -16597165 -15969217 -13750938
40151 -13750938 -12268209 -8037773 2046349 11977058 12749340 5613900 214509 153831
40143 153831 -183705 -3936491 -6632239 -5058351 -2555605 -2192345 -2057955 -552861 415985
40134 415985 474189 2327348 5449723 5231802 1536583 595799 4365113 5737478 -210809
40125 -210809 -7409844 -7869812 -3460393 -1316811 -2505468 -3057384 -2405230 -2676771 -2227186
$$ packed form
40183c701958l328904L813738O238042J203120j981513J628608M027354r30294
40175F968193n824672k589401K974572J515924l268049j903448L128022J824812
40167B825953m726855n676300N13255L582811l47882k648704J972458O543729
40159B038465M158637j753091n187685o148627o108705l596159O27948K218279
40151a3750938J482729M230436J0084122R930709P72282p135440n399391o0678
40143A53831l37536l752786k695748J573888K502746L63260J34390J505094R68846
40134D15985N8204J853159L122375k17921l695219r40784L769314J372365n948287
40125b10809p199035m59968M409419K143582j188657n51916O52154k71541M49585
$$ plain form
40116 -2227186 1953537 6729004 5622227 -902061 -5100441 -2747598 2020292 4053719
40108 4053719 3720217 3922839 5158322 6145511 6253035 5121923 2049120 -2786405 -8166753
40099 -8166753 -13456206 -18444728 -21521870 -20701967 -17048095 -14264603 -13643789 -11897037
40091 -11897037 -5837090 2549651 7829445 7094465 2303041 -3077929 -7696241 -11657074
40083 -11657074 -13887922 -12580242 -8475982 -5422729 -6242166 -9658997 -12773568 -14443475
40075 -14443475 -13943190 -9082148 -106398 6278448 2786406 -8127392 -15577016 -13428005
40067 -13428005 -6758942 -3143530 -3417483 -4612223 -6330498 -8939448 -9704267 -6655166
40059 -6655166 -3560327 -5379536 -10629643 -13540874 -12319972 -10078654 -8590898 -6336694
$$ packed form
40116b227186M180723M775467j106777o524288m198380K352843M767890K033427
40108D053719l33502K02622J235483R87189J07524j131112l072803m835525n380348
40099h166753n289453m988522l077142Q19903L653872K783492O20814J746752
40091a1897037O059947Q386741N279794p34980m791424n380970m618312l960833
40083a1657074k230848J307680M104260L053253q19437l416831l114571j669907
40075a4443475N00285M861042Q975750O384846l492042j0913798p449624K149011
40067a3428005O669063L615412k73953j194740j718275k608950p64819L049101
40059f655166L094839j819209n250107k911231J220902K241318J487756K254204
$$ plain form
40051 -6336694 -2529981 1432780 4531138 6384695 5613547 1873757 -1361373 -475165
40043 -475165 2535212 2747696 256782 -96006 2614839 2991894 -2146062 -7837862 -7199907
40034 -7199907 -561315 5058286 4178464 -1954903 -7852248 -9845405 -9356935 -10010993 -11794727
40025 -11794727 -10395283 -4007308 1990584 953075 -6025414 -11482106 -11334327 -8539891
40017 -8539891 -6876112 -6052962 -4407213 -2150447 -15390 1856503 2096948 -1225953
40009 -1225953 -6365612 -8109199 -4736489 -1366460 -3256720 -8516458 -11046347 -8891776
40001 -8891776 -5927597 -5917740 -8363135 -10791567 -12581789 -14896638 -17671770 -18396634 -15018778
39992 -15018778 -9568604 -6684238 -7340624 -6476627 124338 8235775 8928477 113761
$$ packed form
40051f336694L806713L962761L098358J853557p71148l739790l235130Q86208
40043d75165L010377K12484k490914l52788K710845L77055n137956n691800O37955
40034g199907O638592N619601q79822o133367n897345j993157M88470o54058j783734
40025a1794727J399444O387975N997892j037509o978489n456692J47779K794436
40017h539891J663779Q23150J645749K256766K135057J871893K40445l322901
40009a225953n139659j743587L372710L370029j890260n259738k529889K154571
40001h891776K964179R857k445395k428432j790222k314849k775132p24864L377856
39992a5018778N450174K884366o56386Q63997O600965Q111437O92702q814716
$$ plain form
39984 113761 -10071000 -12900935 -8108430 -1067940 4986669 9791872 11633989 7595508
39976 7595508 -1108341 -8118868 -8608274 -5017557 -3778509 -7118754 -10607961 -9224114
39968 -9224114 -3442022 2324498 5361301 6078846 5252083 3659263 4098272 9090470 15434800
39959 15434800 15750343 7749460 -2297785 -7843965 -8953548 -7773093 -3271675 3810118
39951 3810118 6486048 147638 -8072741 -7510047 747394 6188532 5128379 4055684
39943 4055684 6216768 6082071 441642 -5170598 -5993444 -5124116 -5649204 -4013082 2235502
39934 2235502 7447804 6004439 1340880 -576040 -1025416 -3550651 -4437682 1939666
39926 1939666 11275571 13110931 5974243 -458488 607857 4871432 4921615 9968
$$ packed form
39984A13761j0184761k829935M792505P040490O054609M805203J842117m038481
39976G595508q703849p010527m89406L590717J239048l340245l489207J383847
39968i224114N782092N766520L036803P17545q26763j592820M39009M992198O344330
39959A5434800L15543q000883j0047245n546180j109583J180455M501418P081793
39951C810118K675930o338410q220379N62694Q257441N441138j060153j072695
39943D055684K161084j34697n640429n612240q22846Q69328n25088J636122O248584
39934B235502N212302j443365m663559j916920m49376k525235q87031O377348
39926A939666R335905J835360p136688o432731J066345M263575N0183m911647
$$ plain form
39918 9968 -4952767 -5668806 -1554471 4114863 6133797 2580140 -1802598 -1136989 2905392
39909 2905392 2672990 -4647142 -12947373 -15843419 -14605043 -14126450 -14602943 -11937619 -5478805
39900 -5478805 -871960 -3198774 -9308400 -10200938 -1952514 8410595 10968152 5327564
39892 5327564 374466 1441091 3538680 297130 -5576322 -6024524 1021584 9341627
39884 9341627 12383016 9386732 4342018 2151202 4927665 9433148 9599494 3753461
39876 3753461 -3157913 -6762891 -8704158 -11393467 -12092141 -7672902 -1147202 2989105
39868 2989105 6141886 10950576 12926033 6169479 -4459247 -7169505 589703 9546735
39860 9546735 13034374 13800188 14422439 11827599 5675802 2077926 3050845 1416907 -6765372
$$ packed form
39918I968m962735p16039M114335N669334K018934l553657m382738O65609M042381
39909B905392k32402p320132q300231k896046J238376M78593m76493K665324O458814
39900e478805M606845k326814o109626q92538Q248424J0363109K557557n640588
39892E327564m953098J066625K097589l241550n873452m48202P046108Q320043
39884I341627L041389k996284n044714k190816K776463M505483J66346n846033
39876C753461o911374l604978j941267k689309o98674M419239O525700M136307
39868B989105L152781M808690J975457o756554j0628726k710258P759208Q957032
39860I546735L487639P65814O22251k594840o151797l597876R72919j633938q182279
$$ plain form
39851 -6765372 -13195179 -9406673 -727976 1920596 -1005107 -111853 6136951 8809957
39843 8809957 3609780 -1779755 704329 7987408 10934030 6529007 268346 -1607813
39835 -1607813 1412993 5134348 5977030 4504834 3866674 5453262 7406045 7452356 5113398
39826 5113398 355259 -7242116 -16081959 -21743834 -21207904 -16394087 -11400243 -7894049
39818 -7894049 -5299734 -3620909 -3626619 -5676524 -10105689 -16681394 -22124158 -21506154 -14782580
39809 -14782580 -8383039 -6764248 -6065891 -826204 6498908 8869824 5377064 2134081
39801 2134081 3420808 8084087 14043099 19830573 21793925 16797889 8559624 4273446
$$ packed form
39851f765372o429807L788506Q678697K648572k925703Q93254O248804K673006
39843H809957n200177n389535K484084P283079K946622m405023o260661j876159
39835a607813L020806L721355Q42682j472196o38160J586588J952783M6311k338958
39826E113398m758139p597375q839843n661875N35930M813817M993844L506194
39818g894049K594315J678825n710k049905m429165o575705n442764O18004O723574
39809a4782580O399541J618791O98357N239687P325112K370916l492760l242983
39801B134081J286727M663279N959012N787474J963352m996036q238265m286178
$$ [...]
##END NTUPLES=NMR SPECTRUM
##END=
