##TITLE=31Pdec_LR-731-CR6K
 CDCl3, 24 sc
 23.12.2020
##JCAMPDX= 6.0         $$ Bruker NMR JCAMP-DX V2.0
##DATA TYPE= NMR SPECTRUM
##DATA CLASS= NTUPLES
##ORIGIN= UXNMR, Bruker Analytische Messtechnik GmbH
##OWNER= root
$$ XWIN-NMR		Version 3.5
$$ Wed Dec 23 10:05:20 2020 Russian Standard Time (UT+4h)  she@DPX200
##.OBSERVE FREQUENCY= 81.013821
##.OBSERVE NUCLEUS= ^31P
##.ACQUISITION MODE= SIMULTANEOUS
##.ACQUISITION SCHEME= undefined
##.AVERAGES= 24
##.DIGITISER RES= 17
##SPECTROMETER/DATA SYSTEM= spect
##.PULSE SEQUENCE= zgpg30
##.SOLVENT NAME= CDCl3
##.SHIFT REFERENCE= (INTERNAL, CDCl3, 0, 182.463)
##AUDIT TRAIL= $$ (NUMBER, WHEN, WHO, WHERE, WHAT)
$$ ##TITLE= Audit trail, XWIN-NMR		Version 3.5
$$ ##JCAMPDX= 5.01
$$ ##ORIGIN= Bruker BioSpin GmbH
$$ ##OWNER= she
$$ F:/spectra/data/she/nmr/P31/1/pdata/1/auditp.txt
$$ ##AUDIT TRAIL=  $$ (NUMBER, WHEN, WHO, WHERE, WHAT)
(   1,<2020-12-23 10:04:17.31 +0400>,<she>,<DPX200>,
      <created by zg, POWCHK disabled, PULCHK disabled
       configuration hash MD5:
       00 E9 B6 7A A2 85 ED C7 34 08 36 98 17 FE 4E 26
       data hash MD5: 32K
       A3 1F EB 59 A4 89 D5 AC DB EE A2 E7 54 19 6F 7F>)
(   2,<2020-12-23 10:04:19.81 +0400>,<she>,<DPX200>,
      <Start of raw data processing
       efp BC_mod = 2 LB = 1 FT_mod = 6 PKNL = 1 PHC0 = -2571.418 PHC1 = 384.8008 SI = 64K 
       data hash MD5: 64K
       6E 8C C6 BF DF 8A 66 0C D5 48 84 88 67 39 73 2F>)
(   3,<2020-12-23 10:04:47.09 +0400>,<she>,<DPX200>,
      <pk PHC0 = 30.28185 PHC1 = -109.2 
       data hash MD5: 64K
       81 86 2D 69 6D A1 10 BD AD 14 86 2C 02 63 59 63>)
(   4,<2020-12-23 10:04:56.81 +0400>,<she>,<DPX200>,
      <abs ABSG = 5 
       data hash MD5: 64K
       4A C0 A2 E8 9C 9E 39 20 0B B2 E3 74 E3 1F A5 03>)
$$ ##END=
$$ 
$$ hash MD5
$$ 18 31 2D AA 11 3D E1 CF 97 32 5F 51 EF A1 17 87
##$RELAX= 
##$RELAX= 
##$RELAX= 
##$RELAX= 
##$RELAX= 
##$RELAX= 
##$RELAX= 
##$RELAX= 
$$ Bruker specific parameters
$$ --------------------------
##$DU= <F:/spectra>
##$EXPNO= 1
##$NAME= <P31>
##$PROCNO= 1
##$TYPE= <nmr>
##$USER= <she>
##$AMP= (0..31)
100 100 100 100 100 100 100 100 100 100 100 100 100 100 100 100 100 100 
100 100 100 100 100 100 100 100 100 100 100 100 100 100 
##$AQSEQ= 0
##$AQ_mod= 1
##$AUNM= <au_zg>
##$AUTOPOS= <>
##$BF1= 81.014009
##$BF2= 200.13
##$BF3= 200.13
##$BF4= 200.13
##$BF5= 200.13
##$BF6= 200.13
##$BF7= 200.13
##$BF8= 200.13
##$BYTORDA= 1
##$CFDGTYP= 0
##$CFRGTYP= 5
##$CHEMSTR= <none>
##$CNST= (0..31)
1 1 145 1 1 1 1 1 1 1 1 1 1 1 1 1 1 1 1 1 1 1 1 1 1 1 1 1 1 1 1 1 
##$CPDPRG= <waltz16>
##$CPDPRG1= <>
##$CPDPRG2= <waltz16>
##$CPDPRG3= <>
##$CPDPRG4= <mlev>
##$CPDPRG5= <mlev>
##$CPDPRG6= <mlev>
##$CPDPRG7= <mlev>
##$CPDPRG8= <mlev>
##$CPDPRGB= <>
##$CPDPRGT= <>
##$D= (0..31)
0 1 0 0 0 0 0 0 0 0 0 0.03 2e-05 3e-06 0 0 0 0 0 0 0 0 0 0 0 0 0 0 0 0 
0 0 
##$DATE= 1608703456
##$DBL= (0..7)
120 120 120 11 120 120 24 19 
##$DBP= (0..7)
150 150 150 150 150 150 150 150 
##$DBP07= 0
##$DBPNAM0= <>
##$DBPNAM1= <>
$$ [...]
##$SUBNAM3= <"">
##$SUBNAM4= <"">
##$SUBNAM5= <"">
##$SUBNAM6= <"">
##$SUBNAM7= <"">
##$SUBNAM8= <"">
##$SUBNAM9= <"">
##$SW= 369.568048894756
##$SWIBOX= (0..15)
0 1 3 0 0 0 0 0 0 0 0 0 0 0 0 0 
##$SW_h= 29940.119760479
##$TD= 32768
##$TD0= 1
##$TE= 0
##$TE2= 300
##$TE3= 300
##$TEG= 300
##$TL= (0..7)
0 120 53 12 22 120 120 120 
##$TP= (0..7)
150 150 150 150 150 150 150 150 
##$TP07= 0
##$TPNAME0= <>
##$TPNAME1= <>
##$TPNAME2= <>
##$TPNAME3= <>
##$TPNAME4= <>
##$TPNAME5= <>
##$TPNAME6= <>
##$TPNAME7= <>
##$TPOAL= (0..7)
0.5 0.5 0.5 0.5 0.5 0.5 0.5 0.5 
##$TPOFFS= (0..7)
0 0 0 0 0 0 0 0 
##$TUNHIN= 0
##$TUNHOUT= 0
##$TUNXOUT= 0
##$USERA1= <user>
##$USERA2= <user>
##$USERA3= <user>
##$USERA4= <user>
##$USERA5= <user>
##$V9= 5
##$VALIST= <valist>
##$VCLIST= <CCCCCCCCCCCCCCC>
##$VD= 0
##$VDLIST= <DDDDDDDDDDDDDDD>
##$VPLIST= <PPPPPPPPPPPPPPP>
##$VTLIST= <TTTTTTTTTTTTTTT>
##$WBST= 1024
##$WBSW= 4
##$XGAIN= (0..3)
0 0 0 0 
##$XL= 0
##$YL= 0
##$YMAX_a= 19957
##$YMIN_a= -3650
##$ZGOPTNS= <>
##$ZL1= 120
##$ZL2= 120
##$ZL3= 120
##$ZL4= 120
##$ABSF1= 182.463
##$ABSF2= -187.1042
##$ABSG= 5
##$ABSL= 3
##$ALPHA= 0
##$AQORDER= 0
##$ASSFAC= 0
##$ASSFACI= 0
##$ASSFACX= 0
##$ASSWID= 0
##$AUNMP= <proc_1d>
##$AZFE= 0.1
##$AZFW= 0.5
##$BCFW= 0
##$BC_mod= 2
##$BYTORDP= 0
##$COROFFS= 0
##$CY= -3
##$DATMOD= 1
##$DC= 0
##$DFILT= <>
##$DTYPP= 0
##$F1P= 0
##$F2P= 0
##$FCOR= 1
##$FTSIZE= 65536
##$FT_mod= 6
##$GAMMA= 0
##$GB= 0
##$INTBC= 1
##$INTSCL= 5.30512e-09
##$ISEN= 30
##$LB= 1
##$LEV0= 0
##$LPBIN= 0
##$MAXI= 10000
##$MC2= 0
##$MEAN= 0
##$ME_mod= 0
##$MI= 50
##$NCOEF= 0
##$NC_proc= -8
##$NLEV= 6
##$NOISF1= 182.463
##$NOISF2= 159.3651
##$NSP= 0
##$NTH_PI= 0
##$NZP= 0
##$OFFSET= 182.463
##$PC= 4
##$PHC0= -2541.136
##$PHC1= 275.6008
##$PH_mod= 1
##$PKNL= yes
##$PPARMOD= 0
##$PSCAL= 0
##$PSIGN= 0
##$REVERSE= no
##$SF= 81.014009
##$SI= 65536
##$SIGF1= 159.3651
##$SIGF2= -187.1042
##$SINO= 113.3802
##$SIOLD= 16384
##$SREGLST= <1H.CDCl3>
##$SSB= 0
##$STSI= 65536
##$STSR= 0
##$SW_p= 29940.119760479
##$SYMM= 0
##$S_DEV= 0
##$TDeff= 32768
##$TDoff= 0
##$TI= <>
##$TILT= no
##$TM1= 0
##$TM2= 0
##$TOPLEV= 0
##$USERP1= <user>
##$USERP2= <user>
##$USERP3= <user>
##$USERP4= <user>
##$USERP5= <user>
##$WDW= 1
##$XDIM= 65536
##$YMAX_p= 317168020
##$YMIN_p= -33914676
$$ End of Bruker specific parameters
$$ ---------------------------------
##NTUPLES= NMR SPECTRUM
##VAR_NAME=  FREQUENCY,     SPECTRUM/REAL,   SPECTRUM/IMAG
##SYMBOL=    X,             R,               I
##VAR_TYPE=  INDEPENDENT,   DEPENDENT,       DEPENDENT
##VAR_FORM=  AFFN,          ASDF,            ASDF
##VAR_DIM=   65536,         65536,           65536
##UNITS=     HZ,            ARBITRARY UNITS, ARBITRARY UNITS
##FACTOR=    0.456856943014862, 1,           1
##FIRST=     14782.0589164895, 0,            0
##LAST=      -15158.0608439895, 0,           0
##MIN=       -15158.0608439895, -33914676,   0
##MAX=       14782.0589164895, 317168020,    0
$$ Real data points
##PAGE= N=1
##DATA TABLE= (X++(R..R)), XYDATA
$$ [...]
$$ plain form
39826 3971322 362013 -2057961 -1005398 4481391 10053084 9882942 6171372 8060256
39818 8060256 18287546 27775952 27521812 19442688 10647604 3465373 -2450650 -3932201
39810 -3932201 1560902 9088313 11506868 9409228 8448054 9033587 7011988 3348431
39802 3348431 3916009 8789750 10509471 5504248 -420511 -1365787 549324 254503 -2730190
39793 -2730190 -5830167 -7615320 -6676672 -1163069 6344299 8109977 349372 -10577842
39785 -10577842 -15890795 -14959848 -13188100 -12601821 -10525047 -5720988 722 5424125
39777 5424125 10009517 11121330 6431894 -1020709 -5102153 -4237718 -2382362 -2164869
39769 -2164869 -1856897 -97002 1050409 -305371 -2828731 -4510793 -5531106 -6931995
$$ packed form
39826C971322l609309k419974J052563N486789N571693j70142l711570J888884
39818H060256J0227290R488406k54140q079124q795084p182231n916023j481551
39810c932201N493103P527411K418555k097640r61174N85533k021599l663557
39802C348431N67578M873741J719721n005223n924759r45276J915111k94821k984693
39793b730190l099977j785153R38648N513603P507368J765678p760605j0927214
39785a0577842n312953R30947J771748N86279K076774M804059N721710N423403
39777E424125M585392J111813m689436p452603m081444Q64435J855356K17493
39769b164869L07972J759895J147411j355780k523360j682062j020313j400889
$$ plain form
39761 -6931995 -8694208 -10235718 -10671494 -8080396 -1270056 6955262 11125692 8843730
39753 8843730 2964245 -2416194 -5551350 -6454074 -5965587 -5924933 -6985132 -6098207 -284306
39744 -284306 6863839 7899483 2206918 -2081494 245265 4098445 2918930 -972650
39736 -972650 -1260827 1578050 1966317 -749188 -1552350 1856142 6824213 11504293 16013066
39727 16013066 17704006 12536107 2787655 -3162917 -1255140 3590325 5460896 4277176
39719 4277176 1728463 -3491699 -11657264 -17846536 -17179068 -11464102 -6240252 -3663572
39711 -3663572 -2317009 -1445858 -998961 376840 2965911 3495152 -391807 -4647846 -2664290
39702 -2664290 5973714 14854547 18418536 16313524 10825261 4503683 328741 -113120
$$ packed form
39761f931995j762213j541510m35776K591098O810340Q225318M170430k281962
39753H843730n879485n380439l135156r02724M88487M0654j060199Q86925N813901
39744b84306P148145J035644n692565m288412K326759L853180j179515l891580
39736i72650k88177K838877L88267k715505q03162L408492M968071M680080M508773
39727A6013066J690940n167899r748452n950572J907777M845465J870571j183720
39719D277176k548713n220162q165565o189272O67468N714966N223850K576680
39711c663572J346563Q71151M46897J375801K589071N29241l886959m256039J983556
39702b664290Q638004Q880833L563989k105012n488263o321578m174942m41861
$$ plain form
39694 -113120 930252 431281 -202482 2595284 7206794 7334869 1212268 -5049665 -5752412
39685 -5752412 -2475606 385170 2445622 5496923 8131980 7042326 2352042 -2097072
39677 -2097072 -3091216 -119402 5567297 11287670 13640428 11760514 9058596 9358194
39669 9358194 12265797 14417919 13738035 10031971 3400771 -4481422 -9166757 -7832653
39661 -7832653 -4282293 -5141866 -10822457 -14582283 -11644513 -5273259 -1998830 -4115968
39653 -4115968 -9015381 -13171813 -14397192 -12175613 -8086390 -4686992 -2665740 -800815
39645 -800815 340158 -2379089 -9562898 -16309596 -17678588 -14972699 -12666530 -10872441
39637 -10872441 -6159965 266288 1407944 -5590866 -13014192 -10918462 135511 9564037
$$ packed form
39694a13120J043372m98971o33763K797766M611510J28075o122601o261933p02747
39685e752412L276806K860776K060452L051301K635057j089654m690284m449114
39677b097072r94144K971814N686699N720373K352758j879914k701918K99598
39669I358194K907603K152122o79884l706064o631200p882193m685335J334104
39661g832653L550360q59573n680591l759826K937770O371254L274429k117138
39653d115968m899413m156432j225379K221579M089223L399398K021252J864925
39645h00815J140973k719247p183809o746698j368992K705889K306169J794089
39637a0872441M712476O426253J141656o998810p423326K095730J1053973R428526
$$ plain form
39629 9564037 9795700 4335047 1347584 2956167 4211751 1107639 -4016828 -5768201
39621 -5768201 -2257458 2895083 4326333 52028 -6526981 -9317183 -5056467 3176978
39613 3176978 8620325 7676183 3425841 1440081 2971276 4089241 1530703 -2795815
39605 -2795815 -4557647 -2867501 -1058332 -1439990 -1632193 1959467 8020205 10388275
39597 10388275 5113826 -4605714 -12328750 -15649240 -16869238 -17262065 -14680339 -8188266
39589 -8188266 -1410117 1763560 2424310 4011374 6025731 4711274 -373341 -5169814
39581 -5169814 -7519359 -10174240 -15016906 -18247257 -15100082 -6946898 133748 2443797
39573 2443797 897633 -2398912 -5810392 -7155685 -5309835 -2951138 -3631184 -5703444
$$ packed form
39629I564037K31663n460653k987463J608583J255584l104112n124467j751373
39621e768201L510743N152541J431250m274305o579009k790202M260716Q233445
39613C176978N443347r44142m250342j985760J531195J117965k558538m326518
39605b795815j761832J690146J809169l81658j92203L591660O060738K368070
39597A0388275n274449r719540p723036l320490j219998l92827K581726O492073
39589h188266O778149L173677O60750J587064K014357j314457n084615m796473
39581e169814k349545k654881m842666l230351L147175Q153184P080646K310049
39573B443797j546164l296545l411480j345293J845850K358697o80046k072260
$$ plain form
39565 -5703444 -3708663 2938654 7532381 4996139 -1204108 -4767113 -5214757 -5891429
39557 -5891429 -6384201 -3417020 1497971 1887138 -4731860 -12878969 -16282628 -14871757
39549 -14871757 -12261062 -10140957 -8249245 -6791279 -5354581 -1665490 4998505 10807067
39541 10807067 11470021 8406828 7230583 10221639 13447711 11786434 4568391 -3888969
39533 -3888969 -7597853 -3508490 4755636 8636776 3358911 -5447871 -7514992 -494936
39525 -494936 7503413 9109669 6688256 7008847 10762815 12309688 8501217 2920523
39517 2920523 522497 1462872 2029253 -104716 -3377793 -4646843 -2905076 -524369
39509 -524369 -1010602 -5453288 -11038792 -13167687 -9568735 -2978003 569992 -2418807
$$ packed form
39565e703444J994781O647317M593727k536242o200247l563005m47644o76672
39557e891429m92772K967181M914991L89167o618998q147109l403659J410871
39549a4871757K610695K120105J891712J457966J436698L689091O663995N808562
39541A0807067O62954l063193j176245K991056L226072j661277p218043q457360
39533c888969l708884M089363Q264126L881140n277865q806782k067121P020056
39525d94936P998349J606256k421413L20591L753968J546873l808471n580694
39517B920523k398026R40375N66381k133969l273077j269050J741767K380707
39509e24369m86233m442686n585504k128895L598952O590732L547995k988799
$$ plain form
39501 -2418807 -8312467 -9503005 -3498348 3230873 2909237 -4002146 -10387410 -11928576
39493 -11928576 -10181831 -6987370 -1999532 2926782 3195372 -1491237 -4927570 -3149890
39485 -3149890 -272306 -784944 -1214610 3741363 10604236 10811855 3394299 -4104833 -7121090
39476 -7121090 -8603537 -11215966 -12785848 -11709975 -9867501 -7462950 -1820168 5387276
39468 5387276 6788628 -47083 -7008378 -6196712 -607561 2383236 2718832 4697964
39460 4697964 6661727 3641010 -1500671 -228030 7324721 10305313 2992716 -6117831
39452 -6117831 -6649970 -868579 1058104 -4252875 -10873319 -13537423 -13047372 -11694630
39444 -11694630 -9185781 -4863168 -242069 2592142 3250134 2777437 2324519 2156686 1125512
$$ packed form
39501b418807n893660j190538O004657O729221l21636o911383o385264j541166
39493a1928576J746745L194461M987838M926314K68590m686609l436333J777680
39485c149890K877584n12638m29666M955973O862873K07619p417556p499132l016257
39476g121090j482447k612429j569882J075873J842474K404551N642782P207444
39468E387276J401352o835711o961295Q11666N589151K990797L35596J979132
39460D697964J963763l020717n141681J272641P552751K980592p312597r110547
39452f117831n32139N781391J926683n310979o620444k664104M90051J352742
39444a1694630K508849M322613M621099K834211O57992m72697m52918j67833j031174
$$ plain form
39435 1125512 -1946744 -5338563 -5011773 -304809 3529474 2064340 -1520969 -1592795 -91992
39426 -91992 -4141919 -13411795 -18312601 -13977074 -7820296 -7258646 -7225958 1117252 14013378
39417 14013378 18419779 10638958 864462 -2525331 -2910482 -5505101 -7002301 -2462180
39409 -2462180 3988089 3840844 -3716999 -11885900 -16244716 -17526110 -15760092 -9217330
39401 -9217330 74343 6181172 6526323 4679471 4514415 5791988 6764502 7017034 6230982
39392 6230982 3740255 420537 -2580384 -7407700 -16900981 -27233989 -28964978 -18604833
39384 -18604833 -4276996 3939204 4975128 3929631 2825795 289303 -2306907 -1157379
39376 -1157379 3865453 8816883 11498371 12892750 12615911 8026982 -743418 -9146105
$$ packed form
39435A125512l072256l391819L26790M706964L834283j465134l585309p1826J500803
39426i1992m049927r269876m900806M335527O156778N61650L2688Q343210J2896126
39417A4013378M406401p780821r774496l389793l85151k594619j497200M540121
39409b462180O450269j47245p557843q168901m358816j281394J766018O542762
39401i217330R291673O106829L45151j846852j65056J277573R72514K52532p86052
39392F230982k490727l319718l000921m827316r493281j0333008j730989J0360145
39384a8604833J4327837Q216200J035924j045497j103836k536492k596210J149528
39376a157379N022832M951430K681488J394379k76839m588929q770400q402687
$$ plain form
39368 -9146105 -13423047 -14030459 -12335892 -7727738 -596632 4981950 4975064 143560 -5667793
39359 -5667793 -10361597 -13756464 -14508099 -11078434 -6014252 -5181138 -10673405 -17193406
39351 -17193406 -18185977 -13979185 -10759946 -11987868 -14156104 -11973591 -4957927 2949384
39343 2949384 8256975 10063022 8746789 5349747 1877708 -311257 -2497530 -6792556
39335 -6792556 -12300548 -15447671 -14467697 -11161472 -7678705 -4190161 -768850 1132927
39327 1132927 874623 197347 675337 1223154 -72289 -3143459 -6748656 -10605677 -14684981
39318 -14684981 -17481406 -17078939 -13428955 -8120092 -2604513 2022607 4372885 3535152
39310 3535152 386286 -2533531 -2237580 2972282 11111115 16187680 13350601 5118486
$$ packed form
39368i146105m276942o07412J694567M608154P131106N578582o886m831504n811353
39359e667793m693804l394867p51635L429665N064182Q33114n492267o520001
39351a7193406r92571M206792L219239j227922k168236K182513P015664P907311
39343B949384N307591J806047j316233l397042l472039k188965k186273m295026
39335f792556n507992l147123R79974L306225L482767L488544L421311J901777
39327A132927k58304o77276M77990N47817j295443l071170l605197l857021m079304
39318a4684981k796425M02467L649984N308863N515579M627120K350278q37733
39310C535152l148866k919817K95951N209862Q138833N076565k837079q232115
$$ plain form
39302 5118486 -665849 -188958 2607413 3118540 2283635 2568908 2258919 -1309399 -5845432
39293 -5845432 -6758418 -3850979 -410645 2691281 6715030 10112143 9619676 6163217
39285 6163217 4386130 5928073 7885066 8154923 7510415 6077462 2792917 -946452
39277 -946452 -2027570 -810574 -677461 -1783748 -769082 2377353 3439271 1786598
39269 1786598 2312918 6402579 7745976 2101364 -4513601 -3658344 3258242 6773392
39261 6773392 1475251 -8584813 -14967622 -11681752 483493 12665364 14132972 4202573
39253 4202573 -5410305 -5118135 -246064 -2286248 -10870403 -14139506 -6829819 2000745
39245 2000745 2339297 -4002859 -8830705 -9410602 -8949542 -9442930 -10164484 -11111350 -12541815
$$ packed form
39302E118486n784335M76891K796371N11127q34905K85273l09989l568318m536033
39293e845432r12986K907439L440334L101926M023749L397113m92467l456459
39285F163217j777087J541943J956993K69857o44508j432953l284545l739369
39277i46452j081118J216996J33113j106287J014666L146435J061918j652673
39269A786598N26320M089661J343397n644612o614965Q55257O916586L515150
39261F773392n298141j0060064o382809L285870J2165245J2181871J467608r930399
39253D202573r612878K92170M872071k040184q584155l269103P309687Q830564
39245B000745L38552o342156m827846n79897M61060m93388p21554r46866j430465
$$ plain form
39236 -12541815 -12205013 -8046266 -3490923 -5156156 -13872118 -21679994 -20211028 -10062872
39228 -10062872 377178 4135911 1255026 -4141337 -9034374 -12154895 -11988285 -7798865
39220 -7798865 -2647290 -1843140 -6473514 -10812107 -8718482 -1194929 5117281 5954114
39212 5954114 2790833 -1363593 -5581070 -9163403 -9743527 -6173829 -1447690 459917
39204 459917 148501 2184441 8353119 14107822 13442317 5696578 -4588243 -13504168
39196 -13504168 -20438364 -24804109 -24087107 -18022344 -12150365 -12784668 -18711998 -22007860
39188 -22007860 -17986961 -10600833 -6389772 -6810581 -9170176 -11785984 -14383869 -15497406
39180 -15497406 -13620146 -10077163 -7273804 -4882063 -1198924 2562266 3344582 1325797
$$ packed form
39236a2541815L36802M158747M555343j665233q715962p807876J468966J0148156
39228a0062872J0440050L758733k880885n396363m893037l120521J66610M189420
39220g798865N151575Q04150m630374m338593K093625P523553O312210Q36833
39212E954114l163281m154426m217477l582333n80124L569698M726139J907607
39204D59917l11416K035940O168678N754703o65505p745739j0284821q915925
39196a3504168o934196m365745P17002O064763N871979o34303n927330l295862
39188b2007860M020899P386128M211061m20809k359595k615808k597885j113537
39180a5497406J877260L542983K803359K391741L683139L761190P82316k018785
$$ plain form
39172 1325797 -333449 -1111718 -3912374 -9020778 -11957601 -9847397 -5927797 -4497265
39164 -4497265 -4751242 -3532450 -1473772 -1562674 -2918216 -1205223 4287998 8547773 7563135
39155 7563135 3734574 2176757 3921467 5438979 3754773 -364338 -3991143 -4882160
39147 -4882160 -2604026 1699698 6019342 8546755 8605104 6944626 5681921 7582468
39139 7582468 13717521 21101321 24416667 21651452 16501681 13152294 10426391 4491143
39131 4491143 -3712703 -8509881 -7735638 -6098219 -7906353 -10813284 -10560276 -8411341
39123 -8411341 -8953732 -12547276 -15024184 -14022549 -11069525 -8055727 -6163587 -7520460
39115 -7520460 -12679268 -16730398 -13857332 -6454300 -3467149 -8012638 -13125312 -12563771
$$ packed form
39172A325797j659246p78269k800656n108404k936823K110204L919600J430532
39164d497265k53977J218792K058678q8902j355542J712993N493221M259775r84638
39155G563135l828561j557817J744710J517512j684206m119111l626805q91017
39147d882160K278134M303724M319644K527413N8349j660478j262705J900547
39139G582468O135053P383800L315346k765215n149771l349387k725903n935248
39131D491143q203846m797178P74243J637419j808134k906931K53008K148935
39123h411341n42391l593544k476908J001635K953024L013798J892140j356873
39115g520460n158808m051130K873066P403032K987151m545489n112674N61541
$$ plain form
39107 -12563771 -9166635 -8117556 -8150499 -5579729 -2335352 -2856229 -5682995 -5020665 445583
39098 445583 6013474 7423551 4012169 -3179436 -11192430 -14346615 -9456837 -1372372
39090 -1372372 2170663 719227 362930 3338694 5244239 3396675 736076 -943176
39082 -943176 -4675312 -11277233 -14721586 -10208773 -2853999 -2117482 -9266001 -15955989
39074 -15955989 -15306207 -9816389 -6846093 -9238241 -12765282 -11913771 -5994507 1196588
39066 1196588 6031662 7038053 3219022 -5244689 -13193828 -12427324 -1758365 8606255
39058 8606255 8403022 420732 -4143550 -1360370 2336628 2127513 662886 26956 -2995562
39049 -2995562 -9237657 -12598339 -9012445 -3696410 -3112896 -5017939 -3469101 565677
$$ packed form
39107a2563771L397136J049079l2943K570770L244377n20877k826766O62330N466248
39098D45583N567891J410077l411382p191605q012994l154185M889778Q084465
39090a372372L543035j451436l56297K975764J905545j847564k660599j679252
39082i43176l732136o601921l444353M512813P354774P36517p148519o689988
39074a5955989O49782N489818K970296k392148l527041Q51511N919264P191095
39066A196588M835074J006391l819031q463711p949139P66504J0668959J0364620
39058H606255k03233p982290m564282K783180L696998k09115j464627o35930l022518
39049b995562o242095l360682L585894N316035N83514j905043J548838M034778
$$ plain form
39041 565677 1288598 -2024353 -4879113 -5770977 -6987062 -7689816 -3837790 3728802 7906172
39032 7906172 4673311 -1457295 -4433292 -4823189 -7101715 -11480371 -12827501 -7555213
39024 -7555213 1457559 7912099 8548648 5050060 78511 -5981900 -12620770 -15865415
39016 -15865415 -11467399 -1345431 7380711 10840907 11754482 12955468 12790585 10106559
39008 10106559 8558573 10750757 12082267 6755535 -2562659 -7818902 -7223087 -7002586
39000 -7002586 -11084236 -15341301 -13960485 -6571024 3094782 11594895 16655236 17062560
38992 17062560 14126094 11154717 9935674 9436500 8530931 7635565 6911249 5162661 1424167
38983 1424167 -3978009 -9896731 -14047998 -13259405 -7243645 -1420146 -1802046 -6831463
$$ packed form
39041E65677P22921l312951k854760q91864j216085p02754L852026P566592M177370
39032G906172l232861o130606k975997l89897k278526m378656j347130N272288
39024g555213R012772O454540O36549l498588m971549o060411o638870l244645
39016a5865415M398016J0121968Q726142L460196R13575J200986j64883k684026
39008A0106559j547986K192184J331510n326732r318194n256243N95815K20501
39000g002586m081650m257065J380816P389461R665806Q500113N060341M07324
38992A7062560k936466k971377j219043m99174r05569q95366p24316j748588l738494
38983A424167n402176n918722m151267P88593O015760N823499l81900n029417
$$ plain form
38975 -6831463 -8701358 -3819249 2492853 3562971 -595408 -5374919 -7831443 -7380983
38967 -7380983 -3268224 4296773 11550093 13415435 8669082 1009365 -4833616 -6759882
38959 -6759882 -5786147 -4376053 -4004212 -3580098 -894502 3992109 8175128 9509962 9178352
38950 9178352 9281475 9348763 7389824 3939219 2802852 6827419 13883168 18214903 15960228
38941 15960228 8676330 994887 -4284005 -7418845 -8916609 -8303948 -6274673 -5035604
38933 -5035604 -4872538 -3279911 189083 1315967 -3075316 -9455485 -11960983 -10473272
38925 -10473272 -9523125 -10552111 -10715685 -8965964 -7789933 -8413644 -9255159 -9552381 -9492373
38916 -9492373 -6687049 1261276 9808862 10151561 1281473 -7528147 -9694492 -9731558 -13715737
$$ packed form
38975f831463j869895M882109O312102J070118m158379m779511k456524M50460
38967g380983M112759P564997P253320J865342m746353p659717n842981j926266
38959f759882R73735J410094L71841M24114K685596M886611M183019J334834l31610
38950I178352J03123O7288j958939l450605j136367M024567P055749M331735k254675
38941A5960228p283898p681443n278892l134840j497764O12661K029275J239069
38933e035604J63066J592627L468994J126884m391283o380169k505498J487711
38925a0473272R50147j028986j63574J749721J176031o23711q41515k97222O0008
38916i492373K805324P948325Q547586L42699q870088q809620k166345l7066l984179
$$ plain form
38907 -13715737 -18065637 -15059730 -5168039 3632620 6389744 4409251 109924 -4546831
38899 -4546831 -5795040 -1203451 4861154 5044528 -1156816 -6853147 -7601117 -6080753
38891 -6080753 -5620143 -4727809 -887771 4388962 7378883 6383828 2195785 -3081306 -6267052
38882 -6267052 -5246988 -2487014 -3044431 -7111317 -8474258 -3675017 1128365 -2321248
38874 -2321248 -12159288 -18050574 -15301358 -10831498 -12100674 -15571465 -11955201 -338408
38866 -338408 9674809 10479292 5231478 1697050 2367599 4667363 7053280 9487939
38858 9487939 9966361 6403239 1458700 -12451 1457789 487203 -4040120 -6293808
38850 -6293808 -2479982 2705674 2266528 -4247110 -11459226 -14406412 -11083083 -2616035
$$ packed form
38907a3715737m349900L005907R891691Q800659K757124j980493m299327m656755
38899d546831j248209M591589O064605J83374o201344n696331p47970J520364
38891f080753M60610Q92334L840038N276733K989921r95055m188043n277091l185746
38882f267052J020064K759974n57417m066886j362941M799241M803382l449613
38874b321248r838040n891286K749216M469860j269176l470791L616264J1616793
38866c38408J0013217Q04483n247814l534428O70549K299764K385917K434659
38858I487939M78422l563122m944539j471151J470240r70586m527323k253688
38850f293808L813826N185656m39146o513638p212116k947186L323329Q467048
$$ plain form
38842 -2616035 5359433 5207947 -4120236 -13608728 -13779177 -5601301 2397299 5336987
38834 5336987 5080633 3858115 712561 -5252314 -12255806 -17255738 -17844522 -13670298
38826 -13670298 -8003794 -5670536 -6915171 -6564633 -2479419 -176739 -3838684 -7815514
38818 -7815514 -4944724 725059 -361532 -6833981 -7311087 1336886 8572870 6924804
38810 6924804 2947288 4820312 8580635 6018072 -129710 576045 10166747 18599324
38802 18599324 16672882 6062313 -4649622 -9078353 -6667298 -644632 5482485 10068138
38794 10068138 12680245 12367398 8607140 3743310 1391789 1910367 2709908 3209401 4919244
38785 4919244 6136037 2880762 -2737368 -2349759 6043973 12279364 7412772 -3036038
$$ packed form
38842b616035P975468j51486r328183r488492j70449Q177876P998600K939688
38834E336987k56354j222518l145554n964875p003492m999932n88784M174224
38826a3670298N666504K333258j244635L50538M085214K302680l661945l976830
38818g815514K870790N669783j086591o472449m77106Q647973P235984j648066
38810F924804l977516J873024L760323k562563o147782P05755R590702Q432577
38802A8599324j926442j0610569j0711935m428731K411055O022666O127117M585653
38794A0068138K612107l12847l760258m863830k351521N18578P99541M99493J709843
38785D919244J216793l255275n618130L87609Q393732O235391m866592j0448810
$$ plain form
38777 -3036038 -7421334 -4998893 -4774186 -9382901 -10645701 -2600105 9740917 17700269
38769 17700269 18596032 15176088 10759902 7970234 8070024 8863484 6669138 2267190 1246541
38760 1246541 6498502 14006477 18382280 19280153 19639800 20157635 18510943 13130781 6015705
38751 6015705 1939587 4344620 10577395 12641464 5909178 -3812691 -5957995 2389322
38743 2389322 14159217 22021496 24745131 23136370 16565276 6978394 662712 1125639
38735 1125639 3880627 2732092 -1784535 -4496464 -3464835 -1368816 -933084 -2989182
38727 -2989182 -7479442 -12610620 -14421238 -10770065 -4513929 422657 4341802 9484235
38719 9484235 14264141 14410922 9463560 4112518 2706015 5085158 7576244 5920062
$$ packed form
38777c036038m385296K422441K24707m608715j262800Q045596J2341022P959352
38769A7700269Q95763l419944m416186k789668R9790P93460k194346m401948j020649
38760A246541N251961P507975M375803Q97873L59647N17835j646692n380162p115076
38751F015705m076118K405033O232775K064069o732286r721869k145304Q347317
38743B389322J1769895P862279K723635j608761o571094r586882o315682M62927
38735A125639K754988j148535m516627k711929J031629K096019M35732k056098
38727b989182m490260n131178j810618L651173O256136M936586L919145N142433
38719I484235M779906J46781m947362n351042j406503K379143K491086j656182
$$ plain form
38711 5920062 -1553209 -11096645 -15545124 -12095836 -6147578 -4140496 -5278643 -4818530
38703 -4818530 -2701312 -2742918 -5001538 -5911665 -5424083 -6848655 -9453308 -8768061 -5169781
38694 -5169781 -4133086 -6099377 -4791046 1113807 3861804 -382616 -3260538 3345883
38686 3345883 13917283 17381450 12776903 6965550 1538664 -6482457 -13602619 -12163981
38678 -12163981 -4094861 -428597 -4694032 -7865481 -3659302 1958550 2393784 1650767
38670 1650767 5848095 11338848 10814864 6022196 4646514 7652379 9204303 7667427
38662 7667427 7388611 9331680 8697178 3803333 -160053 816987 3975859 5622335 7125891
38653 7125891 10933466 14806935 14798337 11519095 9114811 9252103 9750978 8690912 6966908
$$ packed form
38711E920062p473271r543436m448479L449288N948258K007082j138147M60113
38703d818530K117218m1606k258620r10127M87582j424572k604653O85247L598280
38694e169781J036695j966291J308331N904853K747997m244420k877922O606421
38686C345883J0571400L464167m604547n811353n426886q021121p120162J438638
38678a2163981Q069120L666264m265435l171449M206179N617852M35234p43017
38670A650767M197328N490753n23984m792668j375682L005865J551924j536876
38662G667427k78816J943069o34502m893845l963386R77040L158872J646476J503556
38653G125891L807575L873469q598l279242k404284J37292M98875j060066j724004
$$ plain form
38644 6966908 6685175 8864434 12621603 15414470 14704449 10713461 6986340 6953766 10269747
38635 10269747 13383322 13176222 9366752 4162570 383657 -723152 -340982 -78260
38627 -78260 643119 3270423 6093290 4776642 -1230587 -5906870 -3658725 2912399 6371304
38618 6371304 4629120 3050744 5844907 10106840 10809494 8044250 5840195 6023607
38610 6023607 6991002 7525309 8046150 7991550 5559409 1354093 -605138 2216090 6690711
38601 6690711 7433863 3913044 1504834 4538860 10184690 11263865 4736562 -4683394
38593 -4683394 -10204156 -10448532 -9172629 -8507897 -6023940 265326 7350582 10866801
38585 10866801 11245782 12273828 14539515 14982155 13045846 11923237 12033048 8936807
$$ packed form
38644F966908k81733K179259L757169K792867p10021l990988l727121l2574L315981
38635A0269747L113575k07100l809470n204182l778913j106809L82170K62722
38627g8260P21379K627304K822867j316648o007229m676283K248145O571124L458905
38618F371304j742184j578376K794163M261933P02654k765244k204055J83412
38610F023607R67395N34307N20841n4600k432141m205316j959231K821228M474621
38601F690711P43152l520819k408210L034026N645830J079175o527303r419956
38593d683394n520762k44376J275903O64732K483957O289266P085256L516219
38585A0866801L78981J028046K265687M42640j936309j122609J09811l096241
$$ plain form
38577 8936807 1378810 -3776394 -223275 7819389 10880318 7261248 3628155 3482859
38569 3482859 2954771 -711719 -4129949 -4404640 -4469981 -7710426 -12172167 -14223498 -13845052
38560 -13845052 -12485799 -9733099 -5992800 -4317815 -5342870 -4660249 -23374 3205563
38552 3205563 -431163 -7457302 -10460399 -8733645 -6793406 -5293638 -1748067 1438742
38544 1438742 -1310056 -8943904 -14127775 -14185429 -13618165 -14518928 -12871095 -6762571 -467570
38535 -467570 2486196 2996951 694991 -7025483 -16628971 -17970987 -7871993 3584084
38527 3584084 6601837 4184895 4024320 5249283 2511659 -2204331 -2193545 2439189 5405115
38518 5405115 4798440 4311284 4860354 3311407 -670835 -4002492 -6161381 -8659577 -9221999
$$ packed form
38577H936807p557997n155204L553119Q042664L060929l619070l633093j45296
38569C482859n28088l666490l418230k74691o5341l240445m461741k051331L78446
38560a3845052J359253K752700L740299J674985j025055O82621M636875L228937
38552C205563l636726p026139l003097J726754J940239J499768L545571L186809
38544A438742k748798p633848n183871n7654N67264r00763J647833O108524O295001
38535d67570K953766N10755k301960p720474r603488j342016J0098994J1456077
38527C584084L017753k416942j60575J224963k737624m715990J0786M632734K965926
38518E405115o06675m87156N49070j548947l982242l331657k158889k498196n62422
$$ plain form
38509 -9221999 -4367051 2296493 2748809 -3411853 -7778763 -5841773 -3014722 -5274737
38501 -5274737 -11067546 -15821712 -18012411 -17413040 -13465827 -8726122 -7937674 -10449586
38493 -10449586 -9902141 -4977910 -3393422 -10335355 -19788627 -23364734 -21401637 -18459339
38485 -18459339 -14103964 -6915223 -2593136 -7497477 -16430679 -17501210 -9117240 -2174134
38477 -2174134 -3844126 -8724568 -9377569 -6987630 -6325902 -6927050 -5599999 -3194283 -2591363
38468 -2591363 -2742090 -546469 2773271 2453571 -2849636 -8988686 -11497881 -9844721
38460 -9844721 -6522889 -4595484 -6094695 -10313351 -13524964 -12473737 -8003591 -3293418
38452 -3293418 704373 5234753 9694063 11348095 9834212 8488326 9692904 11840173
$$ packed form
38509i221999M854948O663544M52316o160662m366910J936990K827051k260015
38501e274737n792809m754166k190699N99371L947213M739705P88448k511912
38493a0449586N47445M924231J584488o941933r453272l576107J963097K942298
38485a8459339M355375P188741M322087m904341q933202j070531Q383970O943106
38477b174134j669992m880442o53001K389939O61728o01148J327051K405716O02920
38468b591363j50727K195621L319740l19700n303207o139050k509195J653160
38460i844721L321832J927405j499211m218656l211613J051227M470146M710173
38452c293418L997791M530380M459310J654032j513883j345886J204578K147269
$$ plain form
38444 11840173 12575701 12126883 11294362 9031890 4872662 1398739 1140043 2909836 4240761
38435 4240761 5168833 5874795 3195491 -5006369 -13382805 -13505373 -5231070 2392462 2912090
38426 2912090 -676574 -2569588 -1252695 2924094 10534127 18646561 19530761 10043674
38418 10043674 -2025390 -7389568 -7270591 -9017315 -13108064 -13037500 -6867376 -187539
38410 -187539 3218042 5890551 9925188 12413270 10510634 5915289 1708841 -1059182
38402 -1059182 -1827548 98389 2813532 2585512 -939295 -4121724 -4972850 -5093168 -5152764
38393 -5152764 -3648114 -1575134 -2644416 -6532991 -7529120 -2875774 2860065 5114200
38385 5114200 5820778 8614286 12239833 13135674 10770760 6510477 905376 -4360518
$$ packed form
38444A1840173P35528m48818q32521k262472m159228l473923k58696J769793J330925
38435D240761R28072P05962k679304q201860q376436j22568Q274303P623532N19628
38426B912090l588664j893014J316893M176789P610033Q112434Q84200r487087
38418A0043674j2069064n364178J18977j746724m090749P0564O170124O679837
38410a87539L405581K672509M034637K488082j902636m595345m206448k768023
38402a059182p68366J925937K715143k28020l524807l182429q51126j20318n9596
38393e152764J504650K072980j069282l888575r96129M653346N735839K254135
38385E114200P06578K793508L625547Q95841k364914m260283n605101n265894
$$ plain form
38377 -4360518 -5977575 -4109477 -3519805 -5899435 -6346281 -2062217 1316100 -1743536
38369 -1743536 -7229439 -8141942 -5882996 -6583696 -9608105 -9311191 -6465338 -7835249 -13838668
38360 -13838668 -15983556 -9117374 1138532 6139270 3792759 -1855016 -5546138 -3403135
38352 -3403135 4594407 12670144 13793835 7762747 1370539 -29968 2525360 4859083
38344 4859083 3376529 -4010518 -15244580 -22393361 -18584279 -7379161 781217 2085051
38336 2085051 2233241 4491556 3520214 -4386871 -12372471 -11181729 -1964074 5497136
38328 5497136 4997672 -869745 -6061025 -7009949 -3885944 454457 2498998 644323
38320 644323 -4374408 -11111348 -17161257 -17977484 -10431824 1402789 8555601 7137087
$$ packed form
38377d360518j617057J868098N89672k379630m46846M284064L378317l059636
38369a743536n485903r12503K258946p00700l024409K96914K845853j369911o003419
38360a3838668k144888O866182J0255906N000738k346511n647775l691122K143003
38352c403135P997542Q075737J123691o031088o392208j400507K555328K333723
38344D859083j482554p387047j1234062p148781L809082J1205118Q160378J303834
38336B085051J48190K258315r71342p907085p985600J190742R217655P461210
38328E497136m99464n867417n191280r48924L124005M340401K044541j854675
38320F44323n018731o736940o049909q16227P545660J1834613P152812j418514
$$ plain form
38312 7137087 1960824 -1333054 -2766792 -4237936 -4698887 -3043541 -1319102 -824070
38304 -824070 1036497 5593137 8325532 4413812 -3838906 -9786630 -10442629 -7658817
38296 -7658817 -3756982 -145635 1909419 3036282 6044929 11011922 13140968 9515096
38288 9515096 4486277 3426605 4514803 2630547 -1380189 -2025131 1852753 5983327
38280 5983327 7777677 8461584 8780750 8583915 10017124 14679041 17837606 12505959 193121
38271 193121 -9169106 -9727548 -5837214 -3675598 -3233338 -2024926 -1055868 -2480836 -5072911
38262 -5072911 -6284823 -6362218 -7027852 -8020454 -7638268 -5134549 -716814 5111687 10909863
38253 10909863 14941138 17223775 18595655 17645169 12282317 5020393 2034968 5001124
$$ packed form
38312G137087n176263l293878j433738j471144m60951J655346J724439M95032
38304h24070J860567M556640K732395l911720q252718n947724o55999K783812
38296g658817L901835L611347K055054J126863L008647M966993K129046l625872
38288I515096n028819j059672J088198j884256m010736o44942L877884M130574
38280E983327J794350O83907L19166j96835J433209M661917L158565n331647j2312838
38271A93121r362227n58442L890334K161616M42260J208412R69058j424968k592075
38262e072911j211912p7395o65634r92602L82186K503719M417735N828501N798176
38253A0909863M031275K282637J371880r50486n362852p261924k985425K966156
$$ plain form
38245 5001124 8412069 7812557 6247851 8654735 13676192 15911660 13789534 10248290
38237 10248290 7128225 3839664 1132499 1538398 5328321 9432150 11190861 10647172
38229 10647172 8864594 6778984 6229602 9084467 13832044 15409929 10592643 2366741
38221 2366741 -3034833 -2940680 -324133 693442 -754131 -3228210 -6173970 -9689074
38213 -9689074 -11998232 -10360673 -5175550 -344254 1737733 2626505 3346085 850933
38205 850933 -7413063 -17857805 -24000333 -23859349 -19886828 -13412123 -4863160 1502332
38197 1502332 295573 -6206017 -8653939 -2758875 5095665 7687827 6531377 7004380
38189 7004380 9103548 9030238 6494711 4282330 2647298 -179003 -3334189 -4510873
$$ packed form
38245E001124L410945n99512j564706K406884N021457K235468k122126l541244
38237A0248290l120065l288561k707165M05899L789923M103829J758711n43689
38229A0647172j782578k085610n49382K854865M747577J577885m817286q225902
38221B366741n401574R4153K616547J017575j447573k474079k945760l515104
38213i689074k309158J637559N185123M831296K081987Q88772P19580k495152
38205H50933q263996j0444742o142528J40984L972521O474705Q548963O365492
38197A502332j206759o501590k447922N895064P854540K592162j156450M73003
38189G004380K099168p3310k535527k212381j635032k826301l155186j176684
$$ plain form
38181 -4510873 -4692114 -6471584 -8420661 -6483974 -812079 4052491 6045274 7279532
38173 7279532 8052298 4848027 -3238129 -10725477 -11670849 -6348442 589978 5722057
38165 5722057 7824892 5964745 404588 -5522836 -7509737 -4405025 1062386 4896794
38157 4896794 3983020 -2678186 -12387953 -19193902 -18679990 -12578686 -6526859 -3194877
38149 -3194877 -448178 2810911 2786949 -3481684 -10756822 -9795379 26367 7955662 5492605
38140 5492605 -1830352 -2322432 5085497 9978664 6485034 1460746 3046767 8396967
38132 8396967 8797404 1985663 -7150341 -14482510 -18358499 -16260138 -7616044 1220346
38124 1220346 2883190 110865 2713278 11811610 15935478 7369177 -5170902 -7212224
$$ packed form
38181d510873j81241j779470j949077J936687N671895M864570J992783J234258
38173G279532P72766l204271q086156p487348r45372N322407O938420N132079
38165E722057K102835j860147n560157n927424j986901L104712N467411L834408
38157D896794r13774o661206r709767o805949N13912O101304O051827L331982
38149c194877K746699L259089k3962o268633p275138R61443R821746P929295k463057
38140E492605p322957m92080P407929M893167l493630n024288J586021N350200
38132H396967M00437o811741r136004p332169l875989K098361Q644094Q836390
38124A220346J662844k772325K602413R098332M123868q566301j2540079k041322
$$ plain form
38116 -7212224 2739788 12641468 12964100 6122770 -155066 -2453947 -2424218 -2274929 -2794884
38107 -2794884 -4107841 -5833127 -6737520 -5588049 -2575514 585462 2229199 2434305
38099 2434305 2906301 4842800 7242904 8067679 6885788 5440227 5623980 7694817 10119164
38090 10119164 10114933 5175035 -3856856 -11543458 -12402033 -7412370 -3567548 -5751270 -11158667
38081 -11158667 -13194620 -8964826 -1153542 5821413 9226223 8480665 4594766 -479402
38073 -479402 -5014330 -8251200 -9752900 -8783086 -5256784 -948568 1299665 37081
38065 37081 -3359575 -6215106 -7728360 -9637476 -12439521 -12325221 -5518734 4138590 7070727
38056 7070727 141273 -8201847 -9645298 -7722626 -10575139 -16431334 -16796937 -12500952
$$ packed form
38116g212224R952012R901680L22632o841330o277836k298881K9729J49289n19955
38107b794884j312957j725286r04393J149471L012535L160976J643737K05106
38099B434305M71996J936499K400104Q24775j181891j445561J83753K070837K424347
38090A0119164m231m939898r031891p686602q58575M989663L844822k183722n407397
38081a1158667k035953M229794P811284O974955L404810p45558l885899n074168
38073d79402m534928l236870j501700R69814L526302M308216K248233j262584
38065C7081l396656k855531j513254j909116k802045J14300O806487R657324K932137
38056G070727o929454q343120j443451J922672k852513n856195l65603M295985
$$ plain form
38048 -12500952 -13898213 -22547989 -25522279 -14752985 -1083500 768046 -6895621 -10190627
38040 -10190627 -4468648 2461367 5093457 5814027 5804274 2135599 -3580065 -3866747 3162930
38031 3162930 9296289 7758824 2247743 -519444 -984721 -3403401 -6971316 -7124704
38023 -7124704 -3661228 -1645389 -4345860 -9341394 -12089877 -10841503 -7589674 -5419288
38015 -5419288 -5003737 -3693380 873110 6536355 8199450 4040435 -2166462 -5642215
38007 -5642215 -5331151 -3362912 -2016265 -2079232 -2539334 -1709337 -252703 -1893546 -7972092
37998 -7972092 -12641429 -8581931 2249743 9119855 5549544 -3089922 -7398016 -4713212
37990 -4713212 953283 5409448 6675218 3874884 -2156099 -8467756 -12698398 -14926278
$$ packed form
38048a2500952j397261q649776k974290J0769294J3669485J851546p663667l295006
38040a0190627N721979O930015K632090P20570r753l668675n715664k86682P029677
38031C162930O133359j537465n511081k767187m65277k418680l567915j53388
38023g124704L463476K015839k700471m995534k748483J248374L251829K170386
38015e419288M15551J310357M566490N663245J663095m159015o206897l475753
38007e642215L11064J968239J346647o2967m60102Q29997J456634j640843o078546
37998g972092m669337M059498J0831674O870112l570311q639466m308094K684804
37990d713212N666495M456165J265770k800334o030983o311657m230642k227880
$$ plain form
37982 -14926278 -15803838 -15308190 -14169516 -13227207 -10580741 -3646633 4887468 8412924
37974 8412924 5453144 1446661 -795733 -5179621 -12950094 -17285687 -13816831 -9295173
37966 -9295173 -11288131 -15222490 -11736396 -2625606 1717622 -1355333 -4264939 -2665061
37958 -2665061 -227642 1154050 4835013 10055662 9501336 1081113 -6673065 -6617380 -2753496
37949 -2753496 -1760048 -1691951 3218682 11364243 15498111 13224765 8613341 4569332 178821
37940 178821 -4177791 -4807277 311812 7882589 12401932 11315470 6346269 1050102
37932 1050102 -2185211 -3370516 -4056805 -5913656 -9960381 -15566355 -19374727 -17427919
37924 -17427919 -10336523 -3979437 -2271207 -1998873 1182022 4807374 3656166 -677255
$$ packed form
37982a4926278q77560M95648J138674R42309K646466O934108Q534101L525456
37974H412924k959780m006483k242394m383888p770473m335593L468856M521658
37966i295173j992958l934359L486094R110790M343228l072955k909606J599878
37958b665061K437419J381692L680963N220649n54326q420223p754178N5685L863884
37949b753496R93448O8097M910633Q145561M133868k273346m611424m044009m390511
37940A78821m356612o29486N119089P570777M519343j086462m969201n296167
37932A050102l235313j185305o86289j856851m046725n605974l808372J946808
37924a7427919P091396O357086J708230K72334L180895L625352j151208m333421
$$ plain form
37916 -677255 -1905513 235214 -24309 -3367867 -3707049 158969 1019899 -4236325 -7936007
37907 -7936007 -3706894 2931934 3536182 -646413 -3191047 -3684440 -5477915 -6915087
37899 -6915087 -4133344 565833 2106100 1909114 5018510 10066741 11180222 8561469
37891 8561469 7952573 10051225 9766161 6441652 5488966 8192603 8799566 4582335 812691
37882 812691 2043801 5103990 4599226 12390 -5877667 -10766232 -12372535 -9069778
37874 -9069778 -3457304 -762657 -1716854 -1712272 1498815 4777841 6000254 7430795 10274043
37865 10274043 11896531 11401172 12042775 14844909 15676510 12225422 8075671 6149964
37857 6149964 4166059 770410 -182418 3491659 7313494 7589956 7644312 10259977 10372877
$$ packed form
37916f77255j228258K140727k59523l343558l39182L866018Q60930n256224l699682
37907g936007M229113O638828O04248m182595k544634m93393j793475j437172
37899f915087K781743M699177J540267j96986L109396N048231J113481k618753
37891H561469o08896K098652k85064l324509r52686K703637O06963m217231l769644
37882H12691J231110L060189n04764m586836n890057m888565j606303L302757
37874i069778N612474K694647r54197M582L211087L279026J222413J430541K843248
37865A0274043J622488m95359O41603K802134Q31601l451088m149751j925707
37857F149964j983905l395649r52828L674077L821835K76462N4356K615665J12900
$$ plain form
37848 10372877 3446410 -4355510 -3940207 2508498 5169692 2266076 1661516 6947450
37840 6947450 12024927 11543921 8210092 6595614 6372207 4951452 1780061 -2602317
37832 -2602317 -7709489 -11758658 -13031209 -13154889 -14821404 -16509090 -14791338 -11426846
37824 -11426846 -11282306 -12850959 -9173702 -491023 3021438 -3781496 -11331188 -8084319
37816 -8084319 2835655 8473893 4337854 -1302969 -1125572 1748252 662382 -4397975
37808 -4397975 -8098845 -8219173 -8163093 -11018598 -14506456 -14111613 -10090145 -8025865 -10933768
37799 -10933768 -13869832 -10221399 -1718937 3097074 742569 -2503452 -43380 5913552
37791 5913552 8405137 5163513 -114206 -3207331 -2113948 3273371 10161420 13471623
$$ packed form
37848A0372877o926467p801920M15303O448705K661194k903616o04560N285934
37840F947450N077477m81006l333829j614478k23407j420755l171391m382378
37832b602317n107172m049169j272551j23680j666515j687686J717752L364492
37824a1426846J44540j568653L677257Q682679L512461o802934p549692L246869
37816h084319J0919974N638238m136039n640823J77397K873824j085870n060357
37808d397975l700870j20328N6080k855505l487858L94843M021468K064280k907903
37799a0933768k936064L648433Q502462M816011k354505l246021K460072N956932
37791E913552K491585l241624n277719l093125J093383N387319O888049L310203
$$ plain form
37783 13471623 11384352 8318770 8460357 8956242 4891320 -1169614 -1628240 4434623
37775 4434623 9380929 8529635 6475942 8318350 10748332 7572588 410750 -2348607
37767 -2348607 3699770 14069224 21180140 21374243 15986740 8820981 3588894 1628542
37759 1628542 1071574 -664481 -3529041 -5322944 -5204790 -4629603 -4360951 -2633616 2247742
37750 2247742 8504472 11719139 9352678 3747376 42851 957674 4095498 5112524
37742 5112524 3161148 1594887 2837216 4656801 3437290 -246053 -2028238 492380
37734 492380 4994715 7883676 8113046 6678923 4668807 3407138 4508522 7527094
37726 7527094 8946679 6197520 2026779 1853499 6392476 9907675 7423548 1296180
$$ packed form
37783A3471623k087271l065582J41587M95885m064922o060934m58626O062863
37775D434623M946306q51294k053693J842408K429982l175744p161838k759357
37767b348607O048377J0369454P110916J94103n387503p165759n232087j960352
37759A628542n56968j736055k864560j793903J18154N75187K68652J727335M881358
37750B247742O256730L214667k366461n605302l704525R14823L137824J017026
37742E112524j951376j566261J242329J819585j219511l683343j782185K520618
37734D92380M502335K888961K29370j434123k010116j261669J101384L018572
37726G527094J419585k749159m170741j73280M538977L515199k484127o127368
$$ plain form
37718 1296180 -2108134 -1042824 -111405 -2682185 -5129933 -1829845 5776549 9574685
37710 9574685 5213135 -1965994 -4480737 -2933664 -3546197 -6869149 -5861593 2611845
37702 2611845 10738255 9483585 1390995 -2808032 1485852 8713504 13233354 15799471
37694 15799471 17634048 15363860 7149982 -1277102 -3245928 -737679 -436688 -1951395
37686 -1951395 1888831 12044840 18922328 15471407 8317467 9074972 17963686 23735173
37678 23735173 19505963 11064370 6710874 5113695 -1138525 -13026117 -22580030 -23058352
37670 -23058352 -16477390 -9200681 -4095657 -98182 3215755 4641654 4208941 3604643
37662 3604643 3290535 1674880 -2037546 -5946013 -7373234 -5851166 -3899794 -5315577
$$ packed form
37718A296180l404314J065310R31419k570780k447748L300088P606394L798136
37710I574685m361550p179129k514743J547073o12533l322952J007556Q473438
37702B611845Q126410j254670q092590m199027M293884P227652M519850K566117
37694A5799471J834577k270188q213878q427084j968826K508249L00991j514707
37686a951395L840226J0156009O877488l450921p153940P57505Q888714N771487
37678B3735173m229210q441593m353496j597179o252220j1887592r553913m78322
37670b3058352O580962P276709N105024L997475L313937J425899m32713o04298
37662C604643l14108j615655l712426l908467j427221J522068J951372j415783
$$ plain form
37654 -5315577 -11824276 -20029569 -22786984 -16140819 -4544486 3565885 5332947 5398358
37646 5398358 7888455 10621552 9531724 5364980 2276068 1421774 -370613 -5574658
37638 -5574658 -12171294 -15649743 -13908551 -9879385 -8985737 -13097692 -17684775 -17121045
37630 -17121045 -12225309 -8997220 -9778805 -10662365 -9452035 -10376678 -16441807 -21923198
37622 -21923198 -18939053 -8944136 -982820 641369 610370 4187253 10323961 14536648
37614 14536648 14145385 9300130 2551809 -1682546 -887110 1620771 188238 -5332384
37606 -5332384 -9313658 -8392626 -5168889 -2852085 -1041226 1403493 3810042 6135466
37598 6135466 9777599 13768348 14160782 9373437 2313537 -4350902 -10160316 -12360999
$$ packed form
37654e315577o508699q205293k757415O646165J1596333Q110371J767062O5411
37646E398358K490097K733097j089828m166744l088912q54294j792387n204045
37638e574658o596636l478449J741192M029166Q93648m111955m587083N63730
37630a7121045M895736L228089p81585q83560J210330r24643o065129n481391
37622b1923198K984145R994917P961316J624189l0999L576883O136708M212687
37614A4536648l91263m845255o748321m234355P95436K507881j432533n520622
37606e332384l981274R21032L223737K316804J810859K444719K406549K325424
37598F135466L642133L990749L92434m787345p059900o664439n809414k200683
$$ plain form
37590 -12360999 -5955588 7664163 18059370 17255357 9335155 3103716 43423 -3677413
37582 -3677413 -7637961 -8242946 -7025596 -8895515 -12576661 -11393520 -4323670 1973248
37574 1973248 3690718 4067741 4420914 -61402 -10357150 -17481474 -14052886 -6360291
37566 -6360291 -6050139 -13275052 -17867302 -16059114 -15145770 -19019257 -19658736 -9999555 2340140
37557 2340140 3957881 -5286817 -12625978 -11610443 -10116108 -15383075 -21092706 -17440167
37549 -17440167 -7384051 -2533020 -5702720 -8211626 -4708402 -297023 31727 -420545
37541 -420545 2204104 4231139 1154346 -3391980 -3371115 -1211242 -4364543 -12626156 -17288983
37532 -17288983 -13589084 -6878771 -4465335 -6928965 -9995351 -10590592 -8265231 -3810418
$$ packed form
37590a2360999O405411J3619751J0395207q04013p920202o231439l060293l720836
37582c677413l960548o04985J217350j869919l681146J183141P069850O296918
37574A973248J717470L77023L53173m482316j0295748p124324L428588P692595
37566f360291L10152p224913m592250J808188R13344l873487o39479R659181J2339695
37557B340140J617741r244698p339161J015535J494335n266967n709631L652539
37549a7440167J0056116M851031l169700k508906L503224M411379L28750m52272
37541d20545K624649K027035l076793m546326K0865K159873l153301q261613m662827
37532a7288983L699899O710313K413436k463630l066386n95241K325361M454813
$$ plain form
37524 -3810418 740483 2527171 373234 -3860808 -7146537 -7678017 -5520362 -2192158
37516 -2192158 478677 2025399 3259415 3984385 2752927 148486 -468834 2215281
37508 2215281 4903739 4996882 5080928 7906811 10386370 8380446 4682379 5133225 8312195
37499 8312195 6997011 -105771 -6161386 -7060524 -6482461 -7485248 -6828955 -2048193 2330488
37490 2330488 1004795 -4355387 -8545722 -10184244 -11050262 -11515296 -11182977 -11293365 -12379852
37481 -12379852 -12063084 -8829887 -5328957 -4363037 -4437069 -2910871 -612427 532431 1429138
37472 1429138 3183387 3559304 762176 -1983345 -845217 1831041 709516 -4055178
37464 -4055178 -7183146 -6360038 -4436635 -3639094 -2826891 -1047936 846529 2859530 5871469
$$ packed form
37524c810418M550901J786688k153937m234042l285729n31480K157655L328204
37516b192158K670835J546722J234016P24970j231458k604441o17320K684115
37508B215281K688458R3143Q4046K825883K479559k005924l698067M50846L178970
37499H312195j315184p102782o055615q99138N78063j002787O56293M780762M378681
37490B330488j325693n360182m190335j638522q66018m65034L32319j10388j086487
37481a2379852L16768L233197L500930R65920p4032J526198K298444J144858Q96707
37472A429138J754249L75917k797128k745521J138128K676258j121525m764694
37464d055178l127968Q23108J923403P97541Q12203J778955J894465K013001L011939
$$ plain form
37455 5871469 8308852 7011375 2491917 -591564 452085 3310622 5137871 6570665
37447 6570665 9264119 12134616 12304478 8276049 878117 -7428412 -13312964 -14355712
37439 -14355712 -11110195 -6291083 -1740833 2226697 4705272 4148757 1367911 91414
37431 91414 2687143 6750377 7855855 5159033 2525272 3618189 6932062 7163299 1971392
37422 1971392 -4121278 -4557875 1105835 6574650 6670906 2797457 -667738 -2354448 -4064731
37413 -4064731 -7234297 -11355172 -14117513 -11994345 -3693529 5665766 8177826 3417140
37405 3417140 -33790 2894798 5760467 1469424 -4697634 -2562902 5734792 7576245
37397 7576245 -683723 -7530932 -3297326 6470090 10674551 8088747 5600264 5959687
$$ packed form
37455E871469K437383j297477m519458l083481J043649K858537J827249J432794
37447F570665K693454K870497J69862m028429p397932q306529n884552j042748
37439a4355712L245517M819112M550250L967530K478575n56515k780846j276497
37431I1414K595729M063234J105478k696822k633761J092917L313873K31237n191907
37422A971392o092670m36597N663710N468815R6256l873449l465195j686710j710283
37413d064731l169566m120875k762341K123168Q300816R359295K512060m760686
37405C417140l450930K928588K865669m291043o167058K134732Q297694J841453
37397G576245q259968o847209M233606R767416M204461k585804k488483L59423
$$ plain form
37389 5959687 5419350 2104246 -54441 3084552 10040216 14924128 13455182 7588135
37381 7588135 3953292 6578342 11904929 13283498 9367570 4536913 1958174 1095720
37373 1095720 1804905 4854984 7422527 4588226 -2448494 -6128514 -3561850 -1108347
37365 -1108347 -3706692 -6436042 -2838561 4092337 6750332 4781095 4208848 6923645
37357 6923645 8685002 6997830 4381212 3573051 4804101 7989810 13019704 17925360
37349 17925360 20985610 24463151 32308959 44325116 56129058 65153489 75214936 96714636
37341 96714636 141840767 211737821 283269866 317168020 291455574 225116941 159249352
37334 159249352 116821987 90888652 68611504 50160529 39952041 34588796 29098295
$$ packed form
37389E959687n40337l315104k158687L138993O955664M883912j468946n867047
37381G588135l634843K625050N326587J378569l915928m830657k578739q62454
37373A095720P09185L050079K567543k834301p036720l680020K566664K453503
37365a108347k598345k729350L597481O930898K657995j969237n72247K714797
37357F923645J761357j687172k616618q08161J231050L185709N029894M905656
37349A7925360L060250L477541P845808J2016157J1803942R024431J0061447K1499700
37341I6714636M5126131O9897054P1532045L3898154k5712446o6338633o5867589
37334A59249352m2427365k5933335k2277148j8450975j0208488n363245n490501
$$ plain form
37327 29098295 25331600 25068099 22811498 14693437 7518059 8816991 13552896 11741924
37319 11741924 5230073 4693546 11443007 14864723 9804155 4877790 8496041 15580054
37311 15580054 15006872 4847051 -6298656 -10331972 -6933657 -1372285 1140707 -341248
37303 -341248 -1719961 1669813 8743883 13145080 11371073 7304299 6286002 7820455
37295 7820455 7697721 5027880 2858034 2789103 3254320 3368838 4759318 8364193 11946955
37286 11946955 12012686 6795771 -2566085 -11657319 -14031334 -6607365 4990540 10195844
37278 10195844 5068965 -2838363 -4010962 1600696 6495569 6165415 2217045 -3515435
37270 -3515435 -11008045 -17307075 -16879424 -10075287 -5276484 -7839371 -11778311 -8260956
$$ packed form
37327B9098295l766695k63501k256601q118061p175378J298932M735905j810972
37319A1741924o511851n36527O749461L421716n060568m926365L618251P084013
37311A5580054n73182j0159821j1145707m033316L398315N561372K512992j481955
37303c41248j378713L389774P074070M401197j774007m066774j018297J534453
37295G820455j22734k669841k169846o8931M65217J14518J390480L604875L582762
37286A1946955O5731n216915r361856r091234k374015P423969J1597905N205304
37278A0195844n126879p907328j172599N611658M894873l30154l948370n732480
37270c515435p492610o299030M27651O804137M798803k562887l938940L517355
$$ plain form
37262 -8260956 1507373 8708508 9556256 7845696 5990858 1815064 -4696782 -9161343
37254 -9161343 -9759763 -9826567 -10951980 -10321180 -8132556 -10093688 -17219521 -20206133 -11431165
37245 -11431165 2733117 10047638 9097123 8548068 11712241 12099794 5481218 -2850138
37237 -2850138 -6325805 -5661704 -5175849 -5841216 -6106663 -5796948 -5437008 -4282645 -1724525
37228 -1724525 1612738 5925883 12752768 21949954 30815942 37090946 39611064 35786404
37220 35786404 23485548 6942611 -4743331 -7866006 -7921058 -10275801 -12723824 -11479361
37212 -11479361 -8737199 -8368673 -8885314 -7327946 -6029852 -7970941 -8735575 -1823921
37204 -1823921 9631894 15418529 12471908 7991499 7453804 8064939 6217606 3140755
$$ packed form
37262h260956R768329P201135Q47748j710560j854838m175794o511846m464561
37254i161343n98420o6804j125413O30800K188624j961132p125833k986612Q774968
37245a1431165J4164282P314521r50515n49055L164173L87553o618576q331356
37237b850138l475667O64101M85855o65367k65447L09715L59940J154363K558120
37228a724525L337263M313145O826885R197186Q865988O275004K520118l824660
37220C5786404j2300856j6542937j1685942l122675n5052k354743k448023J244463
37212a1479361K742162L68526n16641J557368J298094j941089p64634O911654
37204a823921J1455815N786635k946621m480409n37695O11135j847333l076851
$$ plain form
37196 3140755 -143444 -5641895 -11815556 -11361398 -992203 12489555 21316166 26198750
37188 26198750 30678985 32127117 26647261 18731166 16556043 19376814 18808051 12635589
37180 12635589 8293112 10577370 14040684 11447171 3499718 -4271904 -9289081 -11637049
37172 -11637049 -9831283 -2702080 5929314 9652622 7043853 3403435 4031274 8132194
37164 8132194 10597254 8395185 3640186 376111 -410757 -1225982 -3663828 -5701237
37156 -5701237 -4917536 -2672018 -2386816 -4442559 -5742364 -4204276 -645476 3956408
37148 3956408 9585349 14602764 15560202 11568236 6194892 3078549 2014712 1121433
37140 1121433 122906 -814423 -2831732 -6141998 -8342972 -7893916 -6960066 -7521089 -7255260
$$ packed form
37196C140755l284199n498451o173661M54158J0369195J3481758Q826611M882584
37188B6198750M480235J448132n479856p916095k175123K820771n68763o172462
37180A2635589m342477K284258L463314k593513p947453p771622n017177k347968
37172a1637049J805766P129203Q631394L723308k608769l640418O27839M100920
37164H132194K465060k202069m754999l264075p86868q15225k437846k037409
37156e701237P83701K245518K85202k055743j299805J538088L558800M601884
37148C956408N628941N017415R57438l991966n373344l116343j063837q93279
37140A121433r98527r37329k017309l310266k200974M49056R33850n61023K65829
$$ plain form
37131 -7255260 -3726507 -459399 -2981806 -9511290 -12147299 -8611229 -6363157 -11662063
37123 -11662063 -19836950 -21534695 -15479312 -9454291 -9616287 -13841994 -16330753 -14990159
37115 -14990159 -12543876 -12292089 -14176881 -14441781 -9199878 754892 9293881 10689034
37107 10689034 5665981 101995 -1836713 -1105191 -497684 -687241 -615639 52698 169403
37098 169403 -2103797 -7995559 -16189432 -22213083 -22031514 -16757002 -11282035 -7594094
37090 -7594094 -2859323 4187235 9021360 7200269 1392822 -2190668 -2412771 -2950423
37082 -2950423 -4611916 -4156468 -1177434 302015 -971123 -925589 2059951 3017590 -1168344
37073 -1168344 -4776558 -1350383 5332321 6260107 755534 -3639141 -4189355 -6266766
$$ packed form
37131g255260L528753L267108k522407o529484k636009L536070K248072n298906
37123a1662063q174887j697745O055383O025021j61996m225707k488759J340594
37115a4990159K446283K51787j884792k64900N241903R954770Q538989J395153
37107A0689034n023053n563986j938708P31522O07507j89557P1602O68337J16705
37098A69403k273200n891762q193873o023651J81569N274512N474967L687941
37090g594094M734771P046558M834125j821091n807447l583490k22103n37652
37082b950423j661493M55448K979034J479449j273138M5534K985540R57639m185934
37073a168344l608214L426175O682704R27786n504573m394675n50214k077411
$$ plain form
37065 -6266766 -11539717 -12432916 -3827272 7129536 10109169 5413719 904009 -1229114
37057 -1229114 -5392071 -11280605 -11653126 -4351322 1771858 -1430069 -9439927 -11682212
37049 -11682212 -6743836 -3281031 -6346206 -10674685 -10092966 -6979181 -7296800 -10521320
37041 -10521320 -10923537 -7141477 -3797669 -3066543 -1031311 4833147 9817321 8028931
37033 8028931 973041 -4692721 -6212861 -7007727 -10561119 -15974235 -19636832 -18523740
37025 -18523740 -12513763 -6143995 -6368073 -14578387 -22292251 -19700708 -7677050 4132981
37017 4132981 10324265 13761371 16269822 14200434 6958748 1826325 4224726 9456620
37009 9456620 10764011 9759743 10724916 9724806 270015 -12227162 -13584333 -508351
$$ packed form
37065f266766n272951q93199Q605644J0956808K979633m695450m509710k133123
37057a229114m162957n888534l72521P301804O123180l201927q009858k242285
37049a1682212M938376L462805l065175m328479N81719L113785l17619l224520
37041a0521320m02217L782060L343808P31126K035232N864458M984174j788390
37033H028931p055890n665762j520140p94866l553392n413116l662597J113092
37025a8523740O009977O369768k24078q210314p713864K591543J2023658J1810031
37017D132981O191284L437106K508451k069388p241686n132423K398401N231894
37009I456620J307391j004268R65173j000110r454791j2497177j357171J3075982
$$ plain form
37001 -508351 13113754 13953546 4954066 -2330290 -4152827 -5813417 -10545426 -15106618
36993 -15106618 -15724739 -12427552 -7064427 -1445694 2109954 2162187 729157 1264950 3537239
36984 3537239 3880866 1492865 769023 5034103 10892146 12229098 8283294 4080235
36976 4080235 3298143 4478254 4943118 4632504 4098483 2162061 -1218475 -2443843 1114429
36967 1114429 5615725 4783550 -989226 -4803209 -3143105 -53163 409377 90854 1582726
36958 1582726 2502579 164318 -2093736 484815 5625290 6788013 3338796 1380015
36950 1380015 4120514 7610074 7607640 5299758 3740859 2901900 1180847 -1079644 -2155619
36941 -2155619 -1151237 1872299 6091123 9287582 9208347 6494806 4207261 3819122 3838906
$$ packed form
37001e08351J3622105Q39792q999480p284356j822537j660590m732009m561192
36993a5106618o18121L297187N363125N618733L555648N2233j433030N35793K272289
36984C537239L43627k388001p23842M265080N858043J336952l945804m203059
36976D080235p82092J180111M64864l10614n34021j936422l380536j225368L558272
36967A114429M501296q32175n772776l813983J660104L089942M62540l18523J491872
36958A582726R19853k338261k258054K578551N140475J162723l449217j958781
36950A380015K740499L489560k434k307882j558899q38959j721053k260491j075975
36941b155619J004382L023536M218824L196459p9235k713541k287545l88139J9784
$$ plain form
36932 3838906 2684430 395835 -2681627 -5999352 -7390358 -4889615 -416263 1879699
36924 1879699 1410251 1312509 2292726 1327443 -1826845 -2273040 2598227 8064588 8703881
36915 8703881 6169673 5365944 5784129 2432647 -5624729 -13003417 -14862175 -12204482
36907 -12204482 -9398558 -9109296 -10563543 -11030929 -8490907 -4035916 -1559912 -3787746
36899 -3787746 -8661393 -10776896 -6651456 1705168 8289809 8469969 3625742 -209250
36891 -209250 386926 1684103 -1793414 -8594228 -11444705 -7184485 -774847 2011205
36883 2011205 1115940 -873559 -3454509 -6144966 -5664949 87739 7452873 10609734
36875 10609734 8515327 5043643 3555129 4266285 5811165 6729633 6156064 4672472
$$ packed form
36932C838906j154476k288595l077462l317725j391006K500743M473352K295962
36924A879699m69448r7742R80217r65283l154288m46195M871267N466361O39293
36915H703881k534208q03729M18185l351482q057376p378688j858758K657693
36907a2204482K805924K89262j454247m67386K540022M454991K476004k227834
36899c787746m873647k115503M125440Q356624O584641J80160m844227l834992
36891b09250N96176J297177l477517o800814k850477M260220O409638K786052
36883B011205q95265j989499k580950k690457M80017N752688P365134L156861
36875A0609734k094407l471684j488514P11156J544880R18468n73569j483592
$$ plain form
36867 4672472 3354550 1348718 -3164133 -8962973 -12269289 -12341815 -12440931 -13788079 -13515050
36858 -13515050 -10611125 -8137469 -6702118 -2293929 5330807 9201675 5744980 1928577
36850 1928577 4851017 10854184 13094867 13167951 15143703 14325189 4559104 -7339683
36842 -7339683 -8412780 697954 6725332 4553470 2736000 6379748 9266227 7599494
36834 7599494 7544998 12118026 13151462 4998815 -4528996 -6423226 -4252875 -5369633
36826 -5369633 -6685357 -1228374 6819728 6203612 -4613739 -15361885 -17585796 -11544910
36818 -11544910 -1018812 9684623 14071803 7836705 -3806779 -10203974 -7776217 -2444005
36810 -2444005 639547 2733902 5372980 5516595 629085 -5665273 -6806590 -408468
$$ packed form
36867D672472j317922k005832m512851n798840l306316p2526r9116j347148K73029
36858a3515050K903925K473656J435351M408189P624736L870868l456695l816403
36850A928577K922440O003167K240683P3084J975752q18514r766085j1898787
36842g339683j073097R110734O027378k171862j817470L643748K886479j666733
36834G599494n4496M573028J033436q152647r527811j894230K170351j116758
36826e369633j315724N456983Q048102o16116j0817351j0748146k223911O040886
36818a1544910J0526098J0703435M387180o235098j1643484o397195K427757N332212
36810b444005L083552K094355K639078J43615m887510o294358j141317O398122
$$ plain form
36802 -408468 9849749 18103737 20855817 18367176 12264300 2993767 -8011367 -14527670
36794 -14527670 -9694226 3401910 11260729 5469026 -6026674 -9697066 -4322486 285350
36786 285350 -238602 133637 5715529 11936499 13667846 12735295 12476496 11047221 5576035
36777 5576035 -1257018 -4145786 -2328997 319986 779874 -671777 -2050039 -1225995
36769 -1225995 2634166 7179153 8069476 3887972 -1977549 -6136600 -9606030 -14795236
36761 -14795236 -19850628 -19523949 -11888801 -1776778 3702902 2485265 -377563 1564916
36753 1564916 8552100 14143015 13259634 8754052 7428541 10849837 13791502 11757318
36745 11757318 6146417 778318 -3138608 -6326751 -8326657 -7886346 -5497973 -3559565
$$ packed form
36802d08468J0258217Q253988K752080k488641o102876r270533j1005134o516303
36794a4527670M833444J3096136P858819n791703j1495700l670392N374580M607836
36786B85350n23952L72239N581892O220970J731347r32551k58799j429275n471186
36777E576035o833053k888768J816789K648983M59888j451651j378262Q24044
36769a225995L860161M544987Q90323m181504n865521m159051l469430n189206
36761a4795236n055392L26679P635148J0112023N479680j217637k862828J942479
36753A564916O987184N590915q83381m505582j325511L421296K941665k034184
36745A1757318n610901n368099l916926l188143j999906M40311K388373J938408
$$ plain form
36737 -3559565 -4163163 -7320717 -10745066 -11339033 -8058024 -3204970 408341 2836210
36729 2836210 5401799 6845305 4840440 1329014 1729969 7197134 11919569 10785861
36721 10785861 5982194 2594654 1123463 -1016424 -2959809 -1073453 4094881 6895219
36713 6895219 4081984 -873433 -3176263 -3193652 -4624301 -8216500 -10623810 -8999817
36705 -8999817 -3978866 2033525 7022443 9170167 7182443 2784264 990836 4960062
36697 4960062 11190472 12923089 8614440 3839787 3634806 6427399 8222011 9702862
36689 9702862 14575835 21828994 24669375 18658502 7444860 -1796345 -6366805 -9076033
36681 -9076033 -12552690 -15158123 -12989066 -4723381 6065859 13164510 12446904 5080352
$$ packed form
36737c559565o03598l157554l424349n93967L281009M853054L613311K427869
36729B836210K565589J443506k004865l511426M00955N467165M722435j133708
36721A0785861m803667l387540j471191k139887j943385J886356N168334K800338
36713F895219k813235m955417k302830j7389j430649l592199k407310J623993
36705h999817N020951O012391M988918K147724j987724m398179j793428L969226
36697D960062O230410J732617m308649m774653k04981K792593J794612J480851
36689I702862M872973P253159K840381o010873j1213642r241205m570460k709228
36681i076033l476657k605433K169057Q265685J0789240P098651p17606p366552
$$ plain form
36673 5080352 -3446429 -7609310 -5942887 -1644888 920125 674454 378083 2362508
36665 2362508 5062735 5365655 3081135 504663 -1423442 -3107164 -3316280 -876034
36657 -876034 885961 -2554535 -8045001 -6481779 3329794 10293266 6190855 -2154863
36649 -2154863 -3856264 -410582 -529855 -3388546 -266016 8350591 11238283 4454667
36641 4454667 -1955400 -225698 3649374 1692185 -2708068 -2176270 1304670 404473
36633 404473 -4471882 -5494547 841419 9651012 14758207 14644407 12211813 12295559 17403338
36624 17403338 23014761 20884406 10601560 2763225 5272641 11631418 10114586 598211
36616 598211 -6147667 -3720411 3706881 9542374 11330703 9131315 4374287 914097
$$ packed form
36673E080352q526781m162881J666423M297999K565013k45671k96371J984425
36665B362508K700227L02920k284520k576472j928105j683722k09116K440246
36657h76034J761995l440496n490466J563222R811573O963472m102411q345718
36649b154863j701401L445682j19273k858691L122530Q616607K887692o783616
36641D454667o410067J729702L875072j957189m400253N31798L480940r00197
36633D04473m876355j022665O335966Q809593N107195j13800k432594Q3746N107779
36624A7403338N611423k130355j0282846p838335K509416O358777j516832r516375
36616E98211o745878K427256P427292N835493J788329k199388m757028l460190
$$ plain form
36608 914097 1492080 3391467 3021049 3090737 8167224 14738283 14556905 7691580 2653417
36599 2653417 2355748 312234 -5978092 -8540629 -2027047 5697354 4323193 -3930728
36591 -3930728 -8903154 -7826645 -7065112 -10276892 -13211706 -11185343 -5751096 -2029020
36583 -2029020 -2555917 -4826009 -3668310 3076542 10422896 10578393 3095953 -3274222
36575 -3274222 -1853907 3441280 5486325 5099169 7718981 12168971 11721170 6185552
36567 6185552 4094409 10380467 19213112 22858718 21684357 20707216 20906820 19476337
36559 19476337 15855841 12019124 7998080 2112602 -4300404 -6642603 -2801894 3549521
36551 3549521 6762374 4854975 611396 -1828574 -917133 1144545 1147108 -956726 -1660461
$$ packed form
36608I14097N77983J899387l70418O9688N076487O571059j81378o865325n038163
36599B653417k97669k043514o290326k562537O513582P724401j374161q253921
36591c930728m972426J076509P61533l211780k934814K026363N434247L722076
36583b029020n26897k270092J157699O744852P346354J55497p482440o370175
36575c274222J420315N295187K045045l87156K619812M449990m47801n535618
36567F185552k091143O286058Q832645L645606j174361r77141J99604j430483
36559A9476337l620496l836717m021044n885478o413006k342199L840709O351415
36551C549521L212853j907399m243579k439970R11441K061678K563k103834p03735
$$ plain form
36542 -1660461 1261480 5021065 5316540 2713376 2091516 5061067 6526812 1415920
36534 1415920 -7423658 -11618042 -7295351 360613 3651814 1359428 -797841 1755946
36526 1755946 5883381 3826229 -7129980 -19929440 -24686079 -19689582 -12609192 -10257684
36518 -10257684 -10884415 -9059781 -4537824 -1464113 -720355 933795 3839399 3607673
36510 3607673 -1447925 -6180309 -5350756 -559249 3229886 4461693 3941608 360279
36502 360279 -7337896 -14814535 -15789121 -10790838 -6974155 -8165188 -10170666 -8045610
36494 -8045610 -3634091 -2684837 -7063884 -12667692 -13663826 -7138765 4784270 15932376
36486 15932376 20889392 20307484 19812105 22384870 24044684 19262022 9002939 615829
$$ packed form
36542a660461K921941L759585K95475k603164o21860K969551J465745n110892
36534A415920q839578m194384M322691P655964L291201k292386k157269K553787
36526A755946M127435k057152j0956209j2799460m756639M996497P080390K351508
36518a0257684o26731J824634M521957L073711P43758J654150K905604k31726
36510C607673n055598m732384Q29553M791507L789135J231807n20085l581329
36502C60279p698175p476639r74586M998283L816683j191033k005478K125056
36494h045610M411519R49254m379047n603808r96134O525061J1923035J1148106
36486A5932376M957016n81908m95379K572765J659814m782662j0259083q387110
$$ plain form
36478 615829 19286 6019889 12452168 14362751 11553263 7034195 3239059 504127
36470 504127 -1147883 -640409 2388018 5934778 7990845 9560147 12517756 15069251
36462 15069251 13014027 6050782 -937477 -4382062 -6315035 -9908096 -13842914 -14266373
36454 -14266373 -10386354 -5145524 -1724129 -1904731 -6138129 -11986769 -13839380 -8133042
36446 -8133042 1226687 6281761 4354334 419652 -976847 -2206277 -7754700 -15545797
36438 -15545797 -17840992 -11070261 -700716 5596965 6375195 4872257 1867208 -4362243
36430 -4362243 -11129469 -10925045 -1270976 9854700 13224646 9488740 5664106 3688020
36422 3688020 -137667 -5679637 -7757595 -5844618 -6464273 -12217228 -16094609 -12227741
$$ packed form
36478F15829n96543O000603O432279J910583k809488m519068l795136k734932
36470E04127j652010N07474L028427L546760K056067J569302K957609K551495
36462A5069251k055224o963245o988259l444585j932973l593061l934818m23459
36454a4266373L880019N240830L421395j80602m233398n848640j852611N706338
36446h133042R359729N055074j927427l934682j396499j229430n548423p791097
36438a5545797k295195O770731J0369545O297681P78230j502938l005049o229451
36430d362243o767226K04424R654069J1125676L369946l735906l824634j976086
36422C688020l825687n541970k077958J912977o19655n752955l877381L866868
$$ plain form
36414 -12227741 -5815003 -5316738 -9546345 -10411836 -5560565 -222500 2191751 3407852
36406 3407852 4167859 2345860 -1378955 -2578419 -42226 1930801 610301 -1051958
36398 -1051958 -224146 896181 -279007 -1340536 1372067 6349656 8644857 6603115
36390 6603115 3240227 1776192 2716872 4631513 5354294 3178180 -938995 -3261155
36382 -3261155 -1563689 1437519 1331666 -2232310 -5832834 -7770600 -9838715 -12794789
36374 -12794789 -13257140 -7686019 1704845 7636714 5147597 -2923367 -9062874 -9402791
36366 -9402791 -7336898 -8050337 -11129217 -11042779 -4714965 3994657 8194103 4402437 -5525975
36357 -5525975 -16456314 -22662895 -21135464 -14652415 -9866916 -10099824 -11814557 -10607562
$$ packed form
36414a2227741O412738M98265m229607q65491M851271N338065K414251J216101
36406C407852P60007j821999l724815j199464K536193J973027j320500j662259
36398a051958Q27812J120327j175188j061529K712603M977589K295201k041742
36390F603115l362888j464035R40680J914641P22781k176114m117175k322160
36382c261155J697466L001208j05853l563976l600524j937766k068115k956074
36374a2794789m62351N571121R390864N931869k489117q070964o139507l39917
36366i402791K065893p13439l078880Q6438O327814Q709622M199446l791666r928412
36357e525975j0930339o206581J527431O483049M785499k32908j714733J206995
$$ plain form
36349 -10607562 -8090479 -8645117 -11188099 -10037534 -4316684 -315388 -1841735 -3594251
36341 -3594251 1276107 10614653 15800124 13281404 8214265 6532057 8070231 8747346
36333 8747346 6000606 630358 -4064516 -4076136 1532236 7783243 8055616 2546459 -1215838
36324 -1215838 1513550 5966030 4747380 -1979076 -8099630 -11154500 -14348414 -18912939
36316 -18912939 -20159582 -13486929 -875195 10865300 16277172 14552637 9061605 4897906
36308 4897906 4721937 5842429 3547787 -1791262 -4006199 346596 5522711 2382592
36300 2382592 -9888857 -21071452 -20151223 -6992572 7449329 12504580 8250805 3401872
36292 3401872 3676631 5831046 4827924 2513262 3964351 7609546 6092914 -2385979
$$ packed form
36349a0607562K517083n54638k542982J150565N720850M001296j526347j752516
36341c594251M870358R338546N185471k518720n067139j682208J538174O77115
36333H747346k746740n370248m694874j1620N608372O251007K72373n509157l762297
36324a215838K729388M452480j218650o726456o120554l054870l193914m564525
36316a8912939j246643O672653J2611734J1740495N411872j724535n491032m163699
36308D897906j75969J120492k294642n339049k214937M352795N176115l140119
36300B382592j2271449j1182595R20229J3158651J4441901N055251m253775m848933
36292C401872K74759K154415j003122k314662J451089L645195j516632q478893
$$ plain form
36284 -2385979 -10311922 -10880689 -5979617 -932646 3064063 6618336 7128147 2227485
36276 2227485 -4466353 -6821394 -3951555 260280 3745315 7326164 10468054 11323955
36268 11323955 10790020 11614911 13217265 11988773 7623039 5103389 8797145 17114229
36260 17114229 24131918 25081843 20350121 15244466 14554074 16149421 12813214 2661579
36252 2661579 -6286798 -6093854 507926 5082290 5231116 4158616 1830371 -4020945
36244 -4020945 -9388226 -7042905 781150 3207909 -2853448 -7405991 -3257764 2789046
36236 2789046 1782797 -2935550 -2265697 3867168 8232742 9099077 11353511 16058590
36228 16058590 17800970 13157133 5008916 -2382240 -7066419 -7854942 -4478221 23598
$$ packed form
36284b385979p925943n68767M901072N046971L996709L554273N09811m900662
36276B227485o693838k355041K869839M211835L485035L580849L141890Q55901
36268A1323955n33935Q24891J602354j228492m365734k519650L693756Q317084
36260A7114229P017689R49925m731722n105655o90392J595347l336207j0151635
36252B661579q948377J92944O601780M574364J48826j072500k328245n851316
36244d020945n367281K345321P824055K426759o061357m552543M148227O046810
36236B789046j006249m718347O69853O132865M365574Q66335K254434M705079
36228A6058590J742380m643837q148217p391156m684179p88523L376721M501819
$$ plain form
36220 23598 1717196 999040 1096209 1568592 -1489597 -8175026 -13071515 -12567244 -9313938
36211 -9313938 -7195762 -5808985 -2722245 1636025 4265632 3380002 57154 -2981273
36203 -2981273 -3489857 -1790945 -910981 -3058076 -6264086 -6845587 -4913073 -4244925 -6285504
36194 -6285504 -7969534 -7053334 -5995497 -7624662 -9538479 -6679397 1228063 8265542
36186 8265542 8975887 4056522 -1542019 -4152544 -3248836 788401 7624089 14888746
36178 14888746 17911411 14209043 7079494 1749228 -1575991 -7097671 -15195131 -19254922
36170 -19254922 -13870510 -3272045 2585927 -652850 -7875091 -11541496 -9180481 -3472960
36162 -3472960 1912961 4893936 5173190 3815221 2486668 2123754 1799988 -910153 -7370692
$$ packed form
36220B3598J693598p18156R7169M72383l058189o685429m896489N04271L253306
36211i313938K118176J386777L086740M358270K629607q85630l322848l038427
36203b981273n08584J698912Q79964k147095l206010n81501J932514O68148k040579
36194f285504j684030R16200J057837j629165j913817K859082P907460P037479
36186H265542P10345m919365n598541k610525R03708M037237O835688P264657
36178A4888746L022665l702368p129549n330266l325219n521680q097460m059791
36170a9254922N384412J0598465N857972l238777p222241l666405K361015N707521
36162c472960N385921K980975K79254j357969j328553l62914l23766k710141o460539
$$ plain form
36153 -7370692 -14886043 -17686721 -13077193 -5575667 -1900987 -2691991 -3412989 -2911623 -4806945
36144 -4806945 -8998042 -9219759 -3228617 1569363 -942766 -5023526 -1742938 6225767
36136 6225767 8306855 2184429 -4286473 -7090154 -10950447 -17805903 -20825000 -15087614
36128 -15087614 -6095594 -1558345 -908815 850798 3911917 4830032 3639221 3774875
36120 3774875 6661764 10769205 14199328 14840785 10713372 3759384 147584 2708605
36112 2708605 6197190 4570157 -229935 -2046127 -248613 390438 -2227825 -5807252
36104 -5807252 -8949073 -11862749 -12307588 -7562646 -1038382 -193765 -6123198 -11555175
36096 -11555175 -11726179 -10846629 -13692781 -16581411 -12777739 -3324192 4056353 5425191
$$ packed form
36153g370692p515351k800678M609528P501526L674680p91004p20998N01366j895322
36144d806945m191097k21717N991142M797980k512129m080760L280588P968705
36136F225767K081088o122426o470902k803681l860293o855456l019097N737386
36128a5087614Q992020M537249O49530J759613L061119R18115j190811J35654
36120C774875K886889M107441L430123O41457m127413o953988l611800K561021
36112B708605L488585j627033m800092j816192J797514O39051k618263l579427
36104e807252l141821k913676m44839M744942O524264Q44617n929433n431977
36096a1555175j71004Q79550k846152k888630L803672R453547P380545J368838
$$ plain form
36088 5425191 4016893 3393132 2959072 1552743 333204 -691104 -5055020 -14759742
36080 -14759742 -24812156 -26980196 -18932684 -6738357 1845799 3933622 1245743 -3224425
36072 -3224425 -6402728 -5642151 -1117308 3079120 2753551 -1448982 -4614725 -3044131
36064 -3044131 2160712 6723361 7075398 2963900 -2435439 -5269965 -4892159 -4167947 -4881220
36055 -4881220 -4776110 -1602842 1825972 599037 -4901554 -8864592 -7760333 -4129696
36047 -4129696 -1650033 -384994 1322183 3631575 5746749 6763085 4713421 -1695046
36039 -1695046 -8967656 -10723763 -6002102 -1280307 -1289871 -2514659 206629 5347688 8219506
36030 8219506 8536712 7996501 3974368 -6191362 -16422786 -16444077 -5825191 4715212
$$ packed form
36088E425191j408298o23761m34060j406329j219539j024308m363916r704722
36080a4759742j0052414k168040Q047512J2194327Q584156K087823k687879m470168
36072c224425l178303P60577M524843M196428l25569m202533l165743J570594
36064c044131N204843M562649L52037m111498n399339k834526L77806P24212p13273
36055d881220J05110L173268L428814j226935n500591l963038J104259L630637
36047d129696K479663J265039J707177K309392K115174J016336k049664o408467
36039a695046p272610j756107M721661M721795r564j224788K721288N141059K871818
36030H219506L17206n40211m022133j0165730j0231424k1291J0618886J0540403
$$ plain form
36022 4715212 7900534 7805455 9995224 11794649 8287815 2106416 -86837 2104969
36014 2104969 2811615 -934074 -5795222 -7898792 -7390848 -6773952 -8187554 -12396983 -17299687
36005 -17299687 -17973281 -12160611 -5410480 -5768265 -12408882 -15174012 -8347290 545565
35997 545565 1053399 -4995861 -6122644 1884225 9903667 8929019 2441518 -20124 3306112
35988 3306112 6017007 4577103 2093248 899020 -1268221 -5182535 -6396375 -1673034
35980 -1673034 5326151 9265560 10510526 12285016 13215782 8856665 102293 -5651192
35972 -5651192 -3079216 5256237 12839399 15561384 13002900 6900336 637538 -1986766
35964 -1986766 59931 3865040 5776056 4897714 2678232 351933 -1996917 -4589383
$$ packed form
36022D715212L185322r5079K189769J799425l506834o181399k193253K191806
36014B104969P06646l745689m861148k103570N07944O16896j413602m209429m902704
36005a7299687o73594N812670O750131l57785o640617k765130O826722Q892855
35997E45565N07834o049260j126783Q006869Q019442r74648o487501k461642L326236
35988C306112K710895j439904k483855j194228k167241l914314j213840M723341
35980a673034O999185L939409J244966J774490R30766m359117q754372n753485
35972e651192K571976Q335453P583162K721985k558484o102564o262798k624304
35964a986766K046697L805109J911016q78342k219482k326299k348850k592466
$$ plain form
35956 -4589383 -7247321 -9355987 -10168782 -9427274 -7703407 -5756059 -3777883 -1780040
35948 -1780040 -343281 -344757 -2181880 -5467598 -8762843 -9648348 -6752995 -2232439 -107926
35939 -107926 -1162770 -2074199 -1126229 -1432767 -5519998 -9910162 -9479583 -5007476 -1484908
35930 -1484908 -498008 151369 109330 -3748360 -10380579 -13784080 -11460386 -8222984 -8596029
35921 -8596029 -10430847 -9943376 -8768175 -10996641 -15791546 -17985009 -15103596 -9699069
35913 -9699069 -4854830 -752235 3666972 7844933 9478047 6808522 1007613 -4007487
35905 -4007487 -5203647 -3660019 -2590594 -2585681 -1314482 2130583 5707222 7721023 8461104
35896 8461104 7950535 5631969 3137985 3395257 5757385 6303928 4319564 3371722 4016008
$$ packed form
35956d589383k657938k108666q12795P41508J723867J947348J978176J997843
35948a780040J436759j476j837123l285718l295245q85505K895353M520556K124513
35939a07926j054844r11429R47970l06538m087231m390164M30579M472107L522568
35930a484908R86900O49377m2039l857690o632219l403501K323694L237402l73045
35921h596029j834818M87471J175201k228466m794905k193463K881413N404527
35913i699069M844239M102595M419207M177961J633114k669525n800909n015100
35905d007487j196160J543628J069425M913J271199L445065L576639K013801P40081
35896H461104n10569k318566k493984K57272K362128N46543j984364r47842O44286
$$ plain form
35887 4016008 1682336 -4532501 -7500864 -2186473 5567821 7548825 5857575 8553132
35879 8553132 15563732 18417097 13501050 6648720 3385018 2561803 1665826 1235921 1343209
35870 1343209 79505 -1546692 822817 7252733 11226399 8912312 5570515 8242092
35862 8242092 16272923 23561513 26426132 24638360 18303370 9229661 2933395 3586842
35854 3586842 8087442 10075828 8999973 10246009 16372557 22990580 24349109 19384119
35846 19384119 11223554 3804056 41121 566544 2872865 3648636 2911388 3955248
35838 3955248 8347982 13031305 13916793 11051673 8473253 9160549 11377212 10773769 6178693
35829 6178693 2355059 5144144 13370690 18039744 12037346 -800550 -9575787 -8952884
$$ packed form
35887D016008k333672o214837k968363N314391P754294J981004j691250K695557
35879H553132P010600K853365m916047o852330l263702q23215q95977m29905J07288
35870A343209j263704j626197K369509O429916L973666k314087l341797K671577
35862H242092Q030831P288590K864619j787772o334990r073709o296266O53447
35854C586842M500600J988386j075855J246036O126548O618023J358529m964990
35846A9384119q160565p419498l762935N25423K306321P75771p37248J043860
35838C955248M392734M683323Q85488k865120k578420O87296K216663o03443m595076
35829F178693l823634K789085Q226546M669054o002398j2837896q775237O22903
$$ plain form
35821 -8952884 -4192672 -2668255 -4468021 -4702770 -2405695 -2040749 -5947513 -10078059
35813 -10078059 -9962298 -7651000 -8431601 -11862294 -11189257 -3052947 6694826 10116031
35805 10116031 6954118 3050818 1210795 -874187 -4084002 -5444111 -4040749 -3818495
35797 -3818495 -7067015 -9617602 -6948405 -1621634 483611 -1075703 -1974181 -1128501
35789 -1128501 -1768388 -4325650 -4547155 -687552 2691234 1055586 -4046253 -8331921
35781 -8331921 -10624239 -11973301 -12110984 -10751482 -10099231 -11911460 -13712583 -12138358
35773 -12138358 -8832791 -8482988 -11535646 -13708368 -13037251 -12256446 -12648223 -10787031 -4826918
35764 -4826918 154011 -1963285 -9191480 -13283443 -10416245 -5315324 -3586617 -4123830
$$ packed form
35821h952884M760212J524417j799766k34749K297075L64946l906764m130546
35813a0078059J15761K311298p80601l430693O73037Q136310R747773L421205
35805A0116031l161913l903300j840023k084982l209815j360109J403362K22254
35797c818495l248520k550587K669197N326771K105245j559314q98478Q45680
35789a128501o39887k557262k21505L859603L378786j635648n101839m285668
35781h331921k292318j349062j37683J359502O52251j812229j801123J574225
35773a2138358L305567L49803l052658k172722O71117P80805l91777J861192N960113
35764d826918M980929k117296p228195m091963K867198N100921J728707n37213
$$ plain form
35756 -4123830 -2079661 3041419 6172332 3800606 -624680 -425906 6099266 13540678
35748 13540678 16174592 14828500 14597307 16801779 17035629 12210318 5534721 1416245
35740 1416245 -1291236 -6105436 -10952070 -9788044 -2674088 2357633 267384 -4015424
35732 -4015424 -3892000 -1089530 -1161153 -3061529 -1330082 3131704 3681277 170328 972647
35723 972647 8848800 13601144 5881654 -8146625 -14668452 -10680110 -5042207 -3107809
35715 -3107809 -1035473 3423010 5237969 1928156 145374 5353443 11452805 9086423
35707 9086423 139363 -5021823 -2751727 700521 1299532 3076930 8991295 14140111
35699 14140111 13179553 8495078 5221356 2762256 -2202543 -7454483 -7377445 -2478861
$$ packed form
35756d123830K044169N121080L130913k371726m425286J98774O525172P441412
35748A3540678K633914j346092k31193K204472K33850m825311o675597m118476
35740A416245k707481m814200m846634J164026P113956N031721k090249m282808
35732d015424J23424K802470p1623j900376J731447M461786N49573l510949Q02319
35723I72647P876153M752344p719490j4028279o521827L988342N637903J934398
35715c107809K072336M458483J814959l309813j782782N208069O099362k366382
35707I086423q947060n161186K270096L452248N99011J777398N914365N148816
35699A4140111r60558m684475l273722k459100m964799n251940P7038M898584
$$ plain form
35691 -2478861 268327 -2351338 -5197120 -2582422 4192272 9977658 12480248 12404884
35683 12404884 9990851 5499947 1468044 381410 554063 -2034647 -7404037 -10369359
35675 -10369359 -7115340 -647419 2371903 -757097 -6037318 -7415291 -2910575 3961323
35667 3961323 7932345 6772626 2919729 855556 2807168 6911453 9684426 9963467
35659 9963467 9537857 9780579 9290366 6500471 3549552 4650497 10054976 14578396 14039566
35650 14039566 10687619 9158387 8762215 4210945 -5670288 -14317010 -14795160 -7920923
35642 -7920923 -304156 3545281 3732030 923444 -5499674 -13863977 -18731942 -16699886
35634 -16699886 -12041169 -12308671 -18023367 -21160165 -16109261 -7814216 -4331122 -4555144
$$ packed form
35691b478861K747188k619665k845782K614698O774694N785386K502590p5364
35683A2404884k414033m490904m031903j086634J72653k588710n369390k965322
35675a0369359L254019O467921L019322l129000n280221j377973M504716O871898
35667C961323L971022j159719l852897k064173J951612M104285K772973K79041
35659I963467m25610K42722m90213k789895k950919J100945N404479M523420n38830
35650A4039566l351947j529232l96172m551270r881233q646722m78150O874237
35642g920923P616767L849437J86749k808586o423118q364303m867965K032056
35634a6699886M658717k67502n714696l136798N050904Q295045L483094k24022
$$ plain form
35626 -4555144 -718249 7405799 9849470 1642045 -7571071 -6102084 3533448 9661228
35618 9661228 8734773 7335932 8548903 7773415 3780845 2913927 7802203 11453111 8698963
35609 8698963 5261453 7906115 12446458 10414031 2906492 -1425520 594482 4324550
35601 4324550 6267886 7099463 6580388 3411703 205267 1288056 5158309 6015652 3241335
35592 3241335 2348354 5618652 8801632 8507026 6028714 2213571 -4285733 -11220687
35584 -11220687 -12361596 -6396984 -101300 662355 -2890035 -8113509 -15351281 -22330767
35576 -22330767 -21976681 -12625268 -4034685 -5173005 -10880759 -9476305 -158403 6916709
35568 6916709 6636993 4954786 7253734 9503719 5366869 -3623267 -9972355 -9613366
$$ packed form
35626d555144L836895Q124048K443671q207425r213116J468987R635532O127780
35618I661228r26455j398841J212971p75488l992570q66918M888276L650908k754148
35609H698963l437510K644662M540343k032427p507539m332012K020002L730068
35601D324550J943336Q31577n19075l168685l206436J082789L870253Q57343k774317
35592C241335q92981L270298L182980k94606k478312l815143o499304o934954
35584a1220687j140909N964612O295684P63655l552390n223474p237772o979486
35576b2330767L54086R351413Q590583j138320n707754J404454R317902P075112
35568F916709k79716j682207K298948K249985m136850q990136o349088L58989
$$ plain form
35560 -9613366 -5503027 -2733443 -2590841 -1964848 1840611 6543485 6901935 1652155 -4484991
35551 -4484991 -7425609 -8820593 -11347517 -12733167 -9864054 -6221842 -8247002 -14724736
35543 -14724736 -16915375 -10746135 -2386124 1133493 1008850 2115583 3990904 2088781
35535 2088781 -3916862 -8430137 -6797717 -380128 5845631 8308200 6798875 3261809
35527 3261809 -299581 -3290717 -6242666 -8884353 -9119202 -5007136 2289616 8702268
35519 8702268 11069326 10239251 9594542 10657751 11294997 8945967 4637900 2216341 3644589
35510 3644589 6550384 6880528 2958540 -3258707 -7806314 -7655547 -3629463 -389906
35502 -389906 -1616170 -5219418 -5760016 -1588906 3735714 7567571 11292523 15566925
$$ packed form
35560i613366M110339K769584J42602O25993L805459M702874L58450n249780o137146
35551d484991k940618j394984k526924j385650K869113L642212k025160o477734
35543a4724736k190639O169240Q360011L519617j24643J106733J875321j902123
35535B088781o005643m513275J632420O417589O225759K462569j509325l537066
35527C261809l561390k991136k951949k641687k34849M112066P296752O412652
35519H702268K367058q30075o44709J063209O37246k349030m308067k421559J428248
35510C644589K905795L30144l921988o217247m547607J50767M026084L239557
35502c89906j226264l603248n40598M171110N324620L831857L724952M274402
$$ plain form
35494 15566925 17267974 14707727 11720941 12031416 13087656 10871246 7759771 8825331
35486 8825331 11960014 9531631 606844 -6081291 -4382074 338652 -797938 -7494912
35478 -7494912 -11194210 -7041511 255666 3238165 635874 -2760235 -3348241 -2586534
35470 -2586534 -2891508 -2791560 371755 4305095 3335773 -3005745 -8170664 -7858541 -5906012
35461 -5906012 -6874836 -7782637 -3224997 4861933 9407820 8062720 4262656 228707
35453 228707 -4155335 -6831053 -5464843 -3354145 -5848758 -10991527 -11660280 -7251549
35445 -7251549 -4475834 -5425349 -4411550 711778 3889556 1836599 287823 3447865
35437 3447865 5711643 1088072 -6178057 -8166364 -4961719 -2367186 -2589391 -4065973
$$ packed form
35494A5566925J701049k560247k986786L10475J056240k216410l111475J065560
35486H825331L134683k428383q924787o688135J699217M720726j136590o696974
35478g494912l699298M152699P297177K982499k602291l396109n88006P61707
35470b586534l04974R9948L163315L933340r69322o341518n164919L12123J952529
35461e906012r68824r07801M557640Q086930M545887j345100l800064m033949
35453B28707m384042k675718J366210K110698k494613n142769o68753M408731
35445g251549K775715r49515J013799N123328L177778k052957j548776L160042
35437C447865K263778m623571p266129j988307L204645K594533k22205j476582
$$ plain form
35429 -4065973 -6112103 -7247191 -3882923 2346418 1495900 -11806557 -26999072 -28840849
35421 -28840849 -17010041 -4764574 -344197 -96472 643814 606091 -1654512 -3881724
35413 -3881724 -4659475 -5194694 -5020825 -2170140 1542652 1942228 -167848 49600 2676464
35404 2676464 2943428 1095571 3767523 12594658 19594976 18227807 12089656 7761030
35396 7761030 5203449 902676 -4315324 -6599205 -5119644 -1739363 3042599 9413289
35388 9413289 15195235 17234209 15001863 10567831 6153376 3091206 1561198 420598
35380 420598 -988173 -1060356 1368001 3582502 2676517 1802351 6498168 14388213 16018323
35371 16018323 8409935 333836 -206231 2917653 1082012 -6064396 -11212563 -9864940
$$ packed form
35429d065973k046130j135088L364268O229341q50518j3302457j5192515j841777
35421b8840849J1830808J2245467M420377K47725P40286l7723k260603k227212
35413c881724p77751n35219J73869K850685L712792L99576k110076K17448K626864
35404B676464K66964j847857K671952Q827135P000318j367169o138151m328626
35396G761030k557581m300773n218000k283881J479561L380281M781962O370690
35388I413289N781946K038974k232346m434032m414455l062170j530008j140600
35380D20598j408771p2183K428357K214501r05985q74166M695817P890045J630110
35371A6018323p608388q076099n40067L123884j835641p146408n148167J347623
$$ plain form
35363 -9864940 -4318001 995695 3562756 3665150 4543792 9836119 18381810 24218855
35355 24218855 23826036 19891522 16084734 12890660 10859494 11782579 13074479 7923819
35347 7923819 -3770318 -11602960 -8443329 -1256932 -143185 -3106419 -1744199 3313102
35339 3313102 4551394 2022171 3098226 8592693 11310378 9305461 8915706 12432768
35331 12432768 13873442 10297357 6805969 6075885 3006449 -4784992 -10315490 -7579873
35323 -7579873 -1009109 1751746 -124657 -3681293 -8335304 -12542418 -11009098 -2584258
35315 -2584258 4893758 5093279 2824329 5119959 8534394 5329255 -2038752 -3988718
35307 -3988718 540529 2867912 -860076 -4666188 -4124693 -2719133 -3487215 -3243711 263096
$$ packed form
35363i864940N546939N313696K567061J02394Q78642N292327Q545691N837045
35355B4218855l92819l934514l806788l194074k031166R23085J291900n150660
35347G923819j1694137p832642L159631P186397J113747k963234J362220N057301
35339C313102J238292k529223J076055N494467K717685k004917l89755L517062
35331A2432768J440674l576085l491388p30084l069436p791441n530498K735617
35323g579873O570764K760855j876403l556636m654011m207114J533320Q424840
35315b584258P478016J99521k268950K295630L414435l205139p368007j949966
35307c988718M529247K327383l727988l806112N41495J405560p68082K43504L506807
$$ plain form
35298 263096 2892143 1016042 -2195405 -2643898 -2038896 -3061577 -2603398 3304670 10855485
35289 10855485 11974779 5514815 -1460708 -3782882 -3732075 -5129352 -7089823 -6557477
35281 -6557477 -3542021 -479724 1603350 3096328 3163001 602255 -2438071 -937639
35273 -937639 6907115 16032432 19341579 15371809 9001812 5309364 5568237 8959840
35265 8959840 14003828 16635464 11246225 -2217348 -14777792 -17065995 -10607785 -5486891
35257 -5486891 -6508290 -7155819 296058 13164727 20967369 17535065 6763818 -2978919
35249 -2978919 -7027733 -6772686 -6194073 -7236762 -8272374 -6922211 -3821304 -2083396
35241 -2083396 -2798223 -3199233 -643147 3441977 5543810 4642842 2538479 480617 -1961550
$$ packed form
35298B63096K629047j876101l211447m48493O05002j022681M58179N908068P550815
35289A0855485J119294o459964o975523k322174N0807j397277j960471N32346
35281f557477L015456L062297K083074J492978O6673k560746l040326J500432
35273i37639P844754R125317L309147l969770o369997l692448K58873L391603
35265H959840N043988K631636n389239j3463573j2560444k288203O458210N120894
35257e486891j021399o47529P451877J2868669P802642l432304j0771247r742737
35249b978919m048814K55047N78613j042689j035612J350163L100907J737908
35241b083396p14827m01010K556086M085124K101833r00968k104363k057862k442167
$$ plain form
35232 -1961550 -4721491 -6266640 -5487219 -3066383 -492742 1032186 470893 -2581967
35224 -2581967 -6380009 -7348825 -3550643 2496585 5890706 4600837 1611956 1073584
35216 1073584 3208853 4596084 3282552 1394334 1626176 3331583 4349472 5000669
35208 5000669 6902911 8533541 6113479 -289510 -5486155 -5886869 -4191936 -5078114
35200 -5078114 -9231623 -14259590 -18373500 -19827136 -15944270 -7497262 -1762033 -5367079
35192 -5367079 -14712606 -19306923 -15193631 -9420738 -9546309 -14185170 -17044207 -15788332
35184 -15788332 -12639159 -9034684 -4270427 1401100 5790485 7119187 5668236 3331490
35176 3331490 2291317 3091234 3546602 1346369 -1909491 -2130515 841558 2031672 -1006120
$$ packed form
35232a961550k759941j545149P79421K420836K573641J524928n61293l052860
35224b581967l798042r68816L798182O047228L394121j289869k988881n38372
35216A073584K135269J387231j313532j888218K31842J705407J017889O51197
35208E000669J902242J630630k420062o402989n196645m00714J694933q86178
35200e078114m153509n027967m113910j453636L882866Q447008N735229l605046
35192e367079r345527m594317M113292N772893j25571m638861k859037J255875
35184a5788332L149173L604475M764257N671527M389385J328702j450951k336746
35176C331490j040173P99917M55368k200233l255860k21024K972073J190114l037792
$$ plain form
35167 -1006120 -3187215 1200246 9134716 11515065 4532534 -6081955 -12415059 -12142469
35159 -12142469 -8229869 -4290469 -1832927 -142832 2419054 6249537 9640175 10869962
35151 10869962 10183861 8404594 5308051 1718732 1378523 7071029 15604397 20342015
35143 20342015 18664950 13679397 8945206 5418954 3596710 4179718 5561275 4761741
35135 4761741 2272747 2122778 5695967 9609744 11524416 13449132 16467692 16892682
35127 16892682 12016084 5980740 4651870 6948161 6732661 2166745 -2307243 -3313330
35119 -3313330 -2578983 -2328727 -1258270 2274157 6102840 6331288 2188570 -3522230 -8145714
35110 -8145714 -11368658 -13726308 -14625442 -12902287 -8817408 -4202898 -92068 4651367
$$ packed form
35167a006120k181095M387461P934470K380349o982531j0614489o333104K72590
35159a2142469L912600L939400K457542J690095K561886L830483L390638J229787
35151A0869962o86101j779267l096543l589319l40209N692506Q533368M737618
35143B0342015j677065m985553m734191l526252j822244N83008J381557p99534
35135D761741k488994j49969L573189L913777J914672J924716L018560M24990
35127A6892682m876598o035344j328870K296291k15500m565916m473988j006087
35119c313330P34347K50256J070457L532427L828683K28448m142718n710800m623484
35110h145714l222944k357650q99134J723155M084879M614510M110830M743435
$$ plain form
35102 4651367 10904051 16265907 16843964 12326884 6882365 4160316 3832789 4277053 5766517
35093 5766517 8620489 10647459 9588416 6510172 3665729 528055 -4320393 -8508582
35085 -8508582 -7842484 -3344909 -1585173 -5971954 -11611561 -12005342 -8156660 -6838506
35077 -6838506 -10472977 -12931173 -7206896 5058939 14416137 13662338 4860787 -4179923
35069 -4179923 -8051889 -6569116 -1782282 3775646 6060203 1405807 -8172978 -14730498
35061 -14730498 -12607598 -5240127 -1111440 -4275984 -11390633 -16832347 -17970217 -15992636
35053 -15992636 -13811153 -12890450 -11191339 -5881714 1035636 3213290 -1519106 -7158774
35045 -7158774 -8170025 -7970359 -12465696 -18278311 -16012412 -4929007 4421265 4229824
$$ packed form
35102D651367O252684N361856N78057m517080n444519k722049l27527M44264J489464
35093E766517K853972K026970j059043l078244k844443l137674m848448m188189
35085h508582O66098M497575J759736m386781n639607l93781L848682J318154
35077f838506l634471k458196N724277J2265835R357198p53799q801551r040710
35069d179923l871966J482773M786834N557928K284557m654396r578785o557520
35061a4730498K122900P367471M128687l164544p114649n441714j137870J977581
35053a5992636K181483R20703J699111N309625O917350K177654m732396n639668
35045g158774j011251J99666m495337n812615K265899J1083405R350272j91441
$$ plain form
35037 4229824 -1861582 -7292827 -11923323 -17362886 -19583117 -13985596 -4636033 -964977
35029 -964977 -5844528 -12632261 -14232657 -10518160 -6134038 -4661615 -6169956 -8225731
35021 -8225731 -8251164 -5822204 -2702198 -356349 1206960 1553266 -732726 -4936137 -6969216
35012 -6969216 -3941780 1615064 4632681 3264623 -466108 -4012605 -5562860 -3564679
35004 -3564679 1755135 7158340 9425045 8966335 8182800 7445400 5336357 1745905 -2051677
34995 -2051677 -5444682 -8033577 -8439784 -6409103 -4693938 -5694363 -7647127 -7459747
34987 -7459747 -5502099 -3534359 64386 7532361 15422131 17464326 13802623 10738757
34979 10738757 10325892 7566679 611810 -3905910 -961291 3648040 1207528 -6635298
$$ packed form
35037D229824o091406n431245m630496n439563k220231N597521R349563L671056
35029i64977m879551o787733j600396L714497M384122J472423j508341k055775
35021h225731k5433K428960L120006K345849J563309L46306k285992m203411k033079
35012f969216L027436N556844L017617j368058l730731l546497j550255J998181
35004c564679N319814N403205K266705m58710p83535p37400k109043l590452l797582
34995b051677l393005k588895m06207K030681J715165j000425j952764J87380
34987g459747J957648J967740L598745P467975P889770K042195l661703l063866
34979A0738757m12865k759213o954869m517720K944619M609331k440512p842826
$$ plain form
34971 -6635298 -9963702 -4283805 4855506 10638038 11819932 9822978 5128109 -695186
34963 -695186 -3781055 -2067939 1997442 5153789 7118257 8454945 7635015 3641921
34955 3641921 -563181 -1165502 951351 1926607 1795144 4619540 10452316 12535680 6442480
34946 6442480 -2001046 -3651675 1098079 3182136 -1069331 -3919723 2369719 14017465
34938 14017465 20917970 19385106 13677180 7630009 2045754 -477426 3697902 11541227
34930 11541227 13531153 5689867 -3883399 -5281037 749101 6105173 7481948 8221151
34922 8221151 9693194 8728606 4810882 2621330 4013897 3281284 -4526014 -14548205
34914 -14548205 -17394054 -11506900 -4027825 326364 4459896 10789268 14273983 8950697
$$ packed form
34971f635298l328404N679897R139311N782532J181894j996954m694869n823295
34963f95186l085869J713116M065381L156347J964468J336688q19930l993094
34955C641921m205102o02321K116853R75256j31463K824396N832776K083364o093200
34946F442480q443526j650629M749754K084057m251467k850392O289442J1647746
34938A4017465O900505j532864n707926o047171n584255k523180M175328P843325
34930A1541227J989926p841286r573266j397638O030138N356072J376775P39203
34922H221151J472043r64588l917724k189552J392567p32613p807298j0022191
34914a4548205k845849N887154P479075M354189M133532O329372L484715n323286
$$ plain form
34906 8950697 -1871029 -8188839 -5776469 -798934 -688763 -4758786 -6599240 -3130422
34898 -3130422 1929719 2971002 -1176362 -5995619 -6033465 -1368606 1432476 -3057542
34890 -3057542 -11091530 -13066645 -5814971 2690979 3520186 -2316291 -7162397 -7593568
34882 -7593568 -6484905 -5871328 -3947680 161368 3817849 4861237 4438233 4073540 2948620
34873 2948620 -109768 -4153796 -6932332 -6511879 -1977254 4943286 9020263 5900474
34865 5900474 -1723759 -5846069 -2629306 2860413 3071316 -3556335 -12034045 -16150420
34857 -16150420 -13039601 -5188980 769074 12249 -4634646 -5808933 -1188366 4060129
34849 4060129 5249382 3321103 164528 -4914031 -10245011 -9616783 -960936 7687449
$$ packed form
34906H950697j0821726o317810K412370M977535J10171m070023j840454L468818
34898c130422N060141J041283m147364m819257l7846M664859K801082m490018
34890c057542q033988j975115P251674Q505950Q29207n836477m846106m31171
34882g593568J108663O13577J923648M109048L656481J043388m23004l64693j124920
34873B948620l058388m044028k778536M20453M534625O920540M076977l119789
34865E900474p624233m122310L216763N489719K10903o627651q477710m116375
34857a6150420L110819P850621N958054p56825m646895j174287M620567N248495
34849D060129J189253j928279l156575n078559n330980O28228Q655847Q648385
$$ [...]
##END NTUPLES=NMR SPECTRUM
##END=
