##TITLE=31Pdec_LR-731-CR-10
 CDCl3, 24 sc
 23.12.2020
##JCAMPDX= 6.0         $$ Bruker NMR JCAMP-DX V2.0
##DATA TYPE= NMR SPECTRUM
##DATA CLASS= NTUPLES
##ORIGIN= UXNMR, Bruker Analytische Messtechnik GmbH
##OWNER= root
$$ XWIN-NMR		Version 3.5
$$ Wed Dec 23 09:57:14 2020 Russian Standard Time (UT+4h)  she@DPX200
##.OBSERVE FREQUENCY= 81.013821
##.OBSERVE NUCLEUS= ^31P
##.ACQUISITION MODE= SIMULTANEOUS
##.ACQUISITION SCHEME= undefined
##.AVERAGES= 24
##.DIGITISER RES= 17
##SPECTROMETER/DATA SYSTEM= spect
##.PULSE SEQUENCE= zgpg30
##.SOLVENT NAME= CDCl3
##.SHIFT REFERENCE= (INTERNAL, CDCl3, 0, 182.463)
##AUDIT TRAIL= $$ (NUMBER, WHEN, WHO, WHERE, WHAT)
$$ ##TITLE= Audit trail, XWIN-NMR		Version 3.5
$$ ##JCAMPDX= 5.01
$$ ##ORIGIN= Bruker BioSpin GmbH
$$ ##OWNER= she
$$ F:/spectra/data/she/nmr/P31/1/pdata/1/auditp.txt
$$ ##AUDIT TRAIL=  $$ (NUMBER, WHEN, WHO, WHERE, WHAT)
(   1,<2020-12-23 09:56:01.53 +0400>,<she>,<DPX200>,
      <created by zg, POWCHK disabled, PULCHK disabled
       configuration hash MD5:
       00 E9 B6 7A A2 85 ED C7 34 08 36 98 17 FE 4E 26
       data hash MD5: 32K
       0D AD 17 BE 34 49 60 F6 A2 86 77 B1 0C 5D 02 73>)
(   2,<2020-12-23 09:56:03.87 +0400>,<she>,<DPX200>,
      <Start of raw data processing
       efp BC_mod = 2 LB = 1 FT_mod = 6 PKNL = 1 PHC0 = -2569.293 PHC1 = 384.8008 SI = 64K 
       data hash MD5: 64K
       E0 8C 1C 77 91 B2 96 C0 12 78 60 ED 7A A6 FF 11>)
(   3,<2020-12-23 09:56:18.17 +0400>,<she>,<DPX200>,
      <pk PHC0 = -12.72487 PHC1 = 0 
       data hash MD5: 64K
       88 10 18 A0 63 DA A1 A4 D2 6F 77 D6 ED 1F 5C F9>)
(   4,<2020-12-23 09:56:35.12 +0400>,<she>,<DPX200>,
      <pk PHC0 = 10.6 PHC1 = 0 
       data hash MD5: 64K
       60 06 10 29 C3 6B F1 CE 09 3B EB E0 D5 17 5A 75>)
(   5,<2020-12-23 09:56:43.17 +0400>,<she>,<DPX200>,
      <abs ABSG = 5 
       data hash MD5: 64K
       C3 AA 67 3C CE 90 ED 3D E6 0D 31 6F 14 15 69 60>)
$$ ##END=
$$ 
$$ hash MD5
$$ 59 84 48 1A F0 C6 C5 B1 F9 73 EB 52 50 E3 EC E4
##$RELAX= 
##$RELAX= 
##$RELAX= 
##$RELAX= 
##$RELAX= 
##$RELAX= 
##$RELAX= 
##$RELAX= 
$$ Bruker specific parameters
$$ --------------------------
##$DU= <F:/spectra>
##$EXPNO= 1
##$NAME= <P31>
##$PROCNO= 1
##$TYPE= <nmr>
##$USER= <she>
##$AMP= (0..31)
100 100 100 100 100 100 100 100 100 100 100 100 100 100 100 100 100 100 
100 100 100 100 100 100 100 100 100 100 100 100 100 100 
##$AQSEQ= 0
##$AQ_mod= 1
##$AUNM= <au_zg>
##$AUTOPOS= <>
##$BF1= 81.014009
##$BF2= 200.13
##$BF3= 200.13
##$BF4= 200.13
##$BF5= 200.13
##$BF6= 200.13
##$BF7= 200.13
##$BF8= 200.13
##$BYTORDA= 1
##$CFDGTYP= 0
##$CFRGTYP= 5
##$CHEMSTR= <none>
##$CNST= (0..31)
1 1 145 1 1 1 1 1 1 1 1 1 1 1 1 1 1 1 1 1 1 1 1 1 1 1 1 1 1 1 1 1 
##$CPDPRG= <waltz16>
##$CPDPRG1= <>
##$CPDPRG2= <waltz16>
##$CPDPRG3= <>
##$CPDPRG4= <mlev>
##$CPDPRG5= <mlev>
##$CPDPRG6= <mlev>
##$CPDPRG7= <mlev>
##$CPDPRG8= <mlev>
##$CPDPRGB= <>
##$CPDPRGT= <>
##$D= (0..31)
0 1 0 0 0 0 0 0 0 0 0 0.03 2e-05 3e-06 0 0 0 0 0 0 0 0 0 0 0 0 0 0 0 0 
0 0 
$$ [...]
##$SUBNAM3= <"">
##$SUBNAM4= <"">
##$SUBNAM5= <"">
##$SUBNAM6= <"">
##$SUBNAM7= <"">
##$SUBNAM8= <"">
##$SUBNAM9= <"">
##$SW= 369.568048894756
##$SWIBOX= (0..15)
0 1 3 0 0 0 0 0 0 0 0 0 0 0 0 0 
##$SW_h= 29940.119760479
##$TD= 32768
##$TD0= 1
##$TE= 0
##$TE2= 300
##$TE3= 300
##$TEG= 300
##$TL= (0..7)
0 120 53 12 22 120 120 120 
##$TP= (0..7)
150 150 150 150 150 150 150 150 
##$TP07= 0
##$TPNAME0= <>
##$TPNAME1= <>
##$TPNAME2= <>
##$TPNAME3= <>
##$TPNAME4= <>
##$TPNAME5= <>
##$TPNAME6= <>
##$TPNAME7= <>
##$TPOAL= (0..7)
0.5 0.5 0.5 0.5 0.5 0.5 0.5 0.5 
##$TPOFFS= (0..7)
0 0 0 0 0 0 0 0 
##$TUNHIN= 0
##$TUNHOUT= 0
##$TUNXOUT= 0
##$USERA1= <user>
##$USERA2= <user>
##$USERA3= <user>
##$USERA4= <user>
##$USERA5= <user>
##$V9= 5
##$VALIST= <valist>
##$VCLIST= <CCCCCCCCCCCCCCC>
##$VD= 0
##$VDLIST= <DDDDDDDDDDDDDDD>
##$VPLIST= <PPPPPPPPPPPPPPP>
##$VTLIST= <TTTTTTTTTTTTTTT>
##$WBST= 1024
##$WBSW= 4
##$XGAIN= (0..3)
0 0 0 0 
##$XL= 0
##$YL= 0
##$YMAX_a= 9726
##$YMIN_a= -11796
##$ZGOPTNS= <>
##$ZL1= 120
##$ZL2= 120
##$ZL3= 120
##$ZL4= 120
##$ABSF1= 182.463
##$ABSF2= -187.1042
##$ABSG= 5
##$ABSL= 3
##$ALPHA= 0
##$AQORDER= 0
##$ASSFAC= 0
##$ASSFACI= 0
##$ASSFACX= 0
##$ASSWID= 0
##$AUNMP= <proc_1d>
##$AZFE= 0.1
##$AZFW= 0.5
##$BCFW= 0
##$BC_mod= 2
##$BYTORDP= 0
##$COROFFS= 0
##$CY= -3
##$DATMOD= 1
##$DC= 0
##$DFILT= <>
##$DTYPP= 0
##$F1P= 0
##$F2P= 0
##$FCOR= 1
##$FTSIZE= 65536
##$FT_mod= 6
##$GAMMA= 0
##$GB= 0
##$INTBC= 1
##$INTSCL= 5.30512e-09
##$ISEN= 30
##$LB= 1
##$LEV0= 0
##$LPBIN= 0
##$MAXI= 10000
##$MC2= 0
##$MEAN= 0
##$ME_mod= 0
##$MI= 50
##$NCOEF= 0
##$NC_proc= -9
##$NLEV= 6
##$NOISF1= 182.463
##$NOISF2= 159.3651
##$NSP= 0
##$NTH_PI= 0
##$NZP= 0
##$OFFSET= 182.463
##$PC= 4
##$PHC0= -2571.418
##$PHC1= 384.8008
##$PH_mod= 1
##$PKNL= yes
##$PPARMOD= 0
##$PSCAL= 0
##$PSIGN= 0
##$REVERSE= no
##$SF= 81.014009
##$SI= 65536
##$SIGF1= 159.3651
##$SIGF2= -187.1042
##$SINO= 113.3802
##$SIOLD= 16384
##$SREGLST= <1H.CDCl3>
##$SSB= 0
##$STSI= 65536
##$STSR= 0
##$SW_p= 29940.119760479
##$SYMM= 0
##$S_DEV= 0
##$TDeff= 32768
##$TDoff= 0
##$TI= <>
##$TILT= no
##$TM1= 0
##$TM2= 0
##$TOPLEV= 0
##$USERP1= <user>
##$USERP2= <user>
##$USERP3= <user>
##$USERP4= <user>
##$USERP5= <user>
##$WDW= 1
##$XDIM= 65536
##$YMAX_p= 324941044
##$YMIN_p= -71264948
$$ End of Bruker specific parameters
$$ ---------------------------------
##NTUPLES= NMR SPECTRUM
##VAR_NAME=  FREQUENCY,     SPECTRUM/REAL,   SPECTRUM/IMAG
##SYMBOL=    X,             R,               I
##VAR_TYPE=  INDEPENDENT,   DEPENDENT,       DEPENDENT
##VAR_FORM=  AFFN,          ASDF,            ASDF
##VAR_DIM=   65536,         65536,           65536
##UNITS=     HZ,            ARBITRARY UNITS, ARBITRARY UNITS
##FACTOR=    0.456856943014862, 1,           1
##FIRST=     14782.0589164895, 0,            0
##LAST=      -15158.0608439895, 0,           0
##MIN=       -15158.0608439895, -71264948,   0
##MAX=       14782.0589164895, 324941044,    0
$$ Real data points
##PAGE= N=1
##DATA TABLE= (X++(R..R)), XYDATA
$$ [...]
$$ plain form
44621 -27352043 -32983602 -24256394 -9854304 -3073521 -4393436 -4189116 -1895473 -8535211
44613 -8535211 -25447777 -34739513 -21921720 1934951 13666285 7033332 -4998480
44606 -4998480 -11833032 -13864334 -11461262 -1538167 12064058 18408252 14520239 9956246
44598 9956246 12125255 17139125 19269672 18716258 14739964 2419507 -15806786 -25341879
44590 -25341879 -16320823 1729075 12074305 11718878 9470405 7788338 -346953 -16100534
44582 -16100534 -27697772 -23219752 -4578686 14631481 21857488 14877438 1979932
44575 1979932 -5515333 -3163590 3188801 4829436 -28990 -5771850 -7202560 -4854252
44567 -4854252 -2945649 -4724441 -10223298 -16983841 -22180950 -23922643 -20710547 -11801385
$$ packed form
44621b7352043n631559Q727208J4402090O780783j319915K04320K293643o639738
44613h535211j6912566r291736J2817793K3856671J1731334o632953j2031812
44606d998480o834552k031302K403072R923095J3602225O344194l888013m563993
44598I956246K169009N013870K130547n53414l976294j2320457j8226293r535093
44590b5341879R021056J8049898J0345230l55427k248473j682067q135291j5753581
44582a6100534j1597238M478020J8641066J9210167P226007o980050j2897506
44575A979932p495265K351743O352391J640635m858426n742860j430710K348308
44567d854252J908603j778792n498857o760543n197109j741693L212096Q909162
$$ plain form
44559 -11801385 -234247 7098320 6881857 4975592 8515778 13892431 10979370 -453454
44551 -453454 -8940444 -8940017 -9002396 -16017360 -22283883 -18221409 -9026967 -6097224 -7820821
44542 -7820821 -2989459 9027171 15640827 9906678 -132642 -4516314 -4049738 -5268963
44534 -5268963 -9926003 -14477436 -15867160 -14285348 -12207249 -11497004 -10033350 -3727139
44526 -3727139 5110494 6517041 -3430036 -12767185 -7384275 8554734 17565317 13100033
44518 13100033 6002966 5278178 5766302 -118819 -9981759 -17644635 -22688553 -26722616
44510 -26722616 -27280840 -22058056 -13687307 -5391556 2425204 7748418 6597601 1221685
44502 1221685 203192 5234048 6916247 277768 -5317111 -818691 6892132 5447897
$$ packed form
44559a1801385J1567138P332567k16463j906265L540186N376653k913061j1432824
44551d53454q486990M27o2379p014964o266523M062474R194442K929743j723597
44542g820821M831362J2016630O613656n734149j0039320m383672M66576j219225
44534e268963m657040m551433j389724J581812K078099P10245J463654O306211
44526c727139Q837633J406547r947077r337149N382910J5939009R010583m465284
44518A3100033p097067p24788M88124n885121r862940p662876n043918m034063
44510b6722616n58224N222784Q370749Q295751P816760N323214j150817n375916
44502A221685j018493N030856J682199o638479n594879M498420P710823j444235
$$ plain form
44494 5447897 -3707140 -9099935 -8015692 -8431148 -13711254 -17737084 -16278349 -12941823
44486 -12941823 -11853185 -12577661 -13639107 -13526983 -7361080 9151732 30038875 40722784
44478 40722784 33202521 14885172 -337311 -5703853 -4220054 -1811883 -1138453 -1042513
44470 -1042513 -590821 -2628106 -10538793 -20780704 -23970918 -17364429 -10994854 -15162150
44462 -15162150 -26209587 -32395168 -30192521 -25394757 -20324476 -11168685 864824 6347528
44454 6347528 -195455 -12101441 -18293642 -13884623 -1254745 13168714 21044826 17527033
44446 17527033 7565002 1507752 2479610 4102749 2292802 1317715 4354168 6092453
44438 6092453 1148023 -6236950 -8421856 -6527581 -8688509 -17441430 -25512924 -24811766
$$ packed form
44494E447897r155037n392795J084243m15456n280106m025830J458735L336526
44486a2941823J088638p24476j061446J12124O165903J6512812K0887143J0683909
44478D0722784p520263j8317349j5222483n366542J483799K408171O73430R5940
44470a042513M51692k037285p910687j0241911l190214O606489O369575m167296
44462a5162150j1047437o185581K202647M797764N070281R155791J2033509N482704
44454F347528o542983j1905986o192201M409019J2629878J4423459P876112l517793
44446A7527033r962031o057250R71858J623139j809947r75087L036453J738285
44438F092453m944430p384973k184906J894275k160928q752921q071494P01158
$$ plain form
44430 -24811766 -14826719 -810182 12610289 23177544 27780480 21575647 3873028
44423 3873028 -16022734 -24594303 -19035430 -11681661 -14384761 -22959667 -24755255 -18034119
44415 -18034119 -13101497 -14471814 -13650758 -3375139 10756815 18255205 15731894 6019069
44407 6019069 -7024169 -16909825 -15069690 -889707 13496730 15816621 7984569 1795863
44399 1795863 3376232 8050485 8834552 4721401 899676 3137830 10582701 14284102
44391 14284102 7393495 -3791380 -6962352 -2471199 -3205510 -12040543 -14090354 -1446001
44383 -1446001 8570696 -3333836 -26237520 -30778096 -10793861 7394612 1256589
44376 1256589 -19939998 -31341093 -23471737 -7341982 2468192 441338 -8831673 -14765225
$$ packed form
44430b4811766R985047J4016537J3420471J0567255M602936o204833j7702619
44423C873028j9895762q571569N558873P353769k703100q574906j795588O721136
44415a8034119M932622j370317Q21056J0275619J4131954P498390k523311r712825
44407F019069j3043238r885656J840135J4179983J4386437K319891p832052o188706
44399A795863J580369M674253P84067m113151l821725K238154P444871L701401
44391A4284102o890607j1184875l170972M491153p34311q835033k049811J2644353
44383a446001J0016697j1904532k2903684m540576J9984235J8188473o138023
44376A256589k1196587j1401095P869356J6129755R810174k026854r273011n933552
$$ plain form
44368 -14765225 -9310225 3625773 10608194 3888188 -9988361 -19514025 -20656622 -16352798
44360 -16352798 -9708915 -3518968 -2330726 -8533521 -17705957 -22033822 -17677491 -7327452
44352 -7327452 1790599 1443432 -11129022 -27591647 -34406985 -27834425 -18080002 -14911840
44344 -14911840 -15625242 -13260575 -10089035 -13256564 -20629611 -22104743 -15176104 -8966824
44336 -8966824 -10214094 -14397606 -15326935 -15469866 -19726862 -24491534 -21641428 -11759261
44328 -11759261 -5335255 -9331195 -18276761 -21362652 -14720995 -4055990 2399555 983842
44320 983842 -5726046 -12004446 -14310055 -14509540 -16490834 -19195486 -16454483 -6442691
44312 -6442691 2143066 -1162892 -14474465 -24208666 -21565430 -13000807 -10448111 -15023182
$$ packed form
44368a4765225N455000J2935998O982421o720006j3876549r525664j142597M303824
44360a6352798O643883O189947J188242o202795r172436m327865M356331J0350039
44352g327452R118051l47167j2572454j6462625o815338O572560R754423L168162
44344a4911840p13402K364667L171540l167529p373047j475132O928639O209280
44336h966824j247270m183512r29329j42931m256996m764672K850106R882167
44328a1759261O424006l995940q945566l085891O641657J0665005O455545j415713
44320I83842o709888o278400k305609j99485j981294k704652K741003J0011792
44312f442691Q585757l305958j3311573r734201K643236Q564623K552696m575071
$$ plain form
44304 -15023182 -16255764 -6777209 7970033 17206613 18488922 19517159 26503732 35271040
44296 35271040 37301011 32133029 28065781 29924305 32390898 29087526 22584473 19309721
44288 19309721 19033829 17520032 16660167 22017595 30847748 33281548 27094539 20406101
44280 20406101 16450943 7662190 -8692158 -20797335 -18354683 -9082134 -7180161 -12177120
44272 -12177120 -12443263 -5255455 876564 2432131 5296296 11295446 12864951 5072702
44264 5072702 -6877300 -15953990 -20390974 -19005706 -8774711 7178481 16783661 11567184
44256 11567184 -2119619 -10488560 -8378587 -2844841 -2104598 -5671425 -6765688 -2229343
44248 -2229343 3049079 3319022 823625 1781450 4332890 -76929 -10152349 -11306550
$$ packed form
44304a5023182j232582R478555J4747242R236580J282309J028237O986573Q767308
44296C5271040K029971n167982m067248J858524K466593l303372o503053l274752
44288A9309721k75892j513797q59865N357428Q830153K433800o187009o688438
44280B0406101l955158q788753j6354348j2105177K442652R272549J901973m996959
44272a2177120k66143P187808O132019J555567K864165N999150J569505p792249
44264E072702j1950002r076690m436984J385268J0230995J5953192R605180n216477
44256A1567184j3686803q368941K109973N533746P40243l566827j094263M536345
44248b229343N278422K69943k495397R57825K551440m409819j0075420j154201
$$ plain form
44240 -11306550 2681324 15990182 12402320 1282273 3847351 19412880 27218200
44233 27218200 21188437 18730811 28766346 34327350 19997742 -2046126 -10088925 -3667564
44225 -3667564 1216782 -1138796 -1688698 5015162 13202279 16323206 14635888 12575361
44217 12575361 15124815 24091194 32761295 29743172 14070897 -560034 -3454283 -217292
44209 -217292 33690 466446 7233750 13694435 9930052 2244676 5800551 19776273
44201 19776273 26935820 19491929 9990037 11947977 21904934 26709414 20613378 10107773
44193 10107773 6018441 12218465 19301832 12611368 -8658544 -26358247 -25219003 -12517705
44185 -12517705 -4671957 -2062727 6439618 19005577 21297456 12000522 7747685 17308748
$$ packed form
44240a1306550J3987874J3308858l587862j1120047K565078J5565529P805320
44233B7218200o029763k457626J0035535N561004j4329608k2043868q042799O421361
44225c667564M884346k355578n49902O703860Q187117L120927j687318k060527
44217A2575361K549454Q966379Q670101l018123j5672275j4630931k894249L236991
44209b17292K50982M32756O767304O460685l764383p685376L555875J3975722
44201A9776273P159547p443891r501892J957940R956957M804480o096036j0505605
44193A0107773m089332O200024P083367o690464k1269912j7699703J139244J2701298
44185a2517705P845748K609230Q502345J2565959K291879r296934m252837R561063
$$ plain form
44177 17308748 28482733 27956795 18669244 9306813 1071663 -5612126 -4359153 6355560
44169 6355560 16260441 17483341 16219322 20494917 25777922 23427719 15235739 8824246
44161 8824246 5695480 3884101 5131995 8975328 7146800 -4486437 -15085746 -12665172
44153 -12665172 -3470757 -4138436 -17936572 -32089891 -36709545 -33232753 -24759719 -11331729
44145 -11331729 3290801 11394736 10627506 5125244 -2967499 -13449544 -19738181 -13065058
44137 -13065058 1726614 6489154 -7763283 -27768857 -34399088 -25196640 -13587921
44130 -13587921 -10954494 -16535667 -21903703 -19405223 -7774762 6625128 15564806 17679280
44122 17679280 18197622 19038209 15637769 7085899 1590337 4318606 6029155 -5269479
$$ packed form
44177A7308748J1173985n25938r287551r362431q235150o683789J252973J0714713
44169F355560R904881J222900j264019M275595N283005k350203q191980o411493
44161H824246l128766j811379J247894L843333j828528j1633237j0599309K420574
44153a2665172R194415o67679j3798136j4153319m619654L476792Q473034J3427990
44145a1331729J4622530Q103935p67230n502262q092743j0482045o288637O673123
44137a3065058J4791672M762540j4252437k0005574o630231R202448J1608719
44130a3587921K633427n581173n368036K498480J1630461J4399890Q939678K114474
44122A7679280N18342Q40587l400440q551870n495562K728269J710549j1298634
$$ plain form
44114 -5269479 -23830290 -29802065 -15706029 2102488 4886342 -4302016 -7325244 3139558
44106 3139558 15387796 16085381 6011986 -4569969 -8588220 -5666955 1040897 5744479
44098 5744479 1698891 -11837458 -26201910 -31886918 -28865231 -24000422 -20942390 -18823991
44090 -18823991 -18944585 -24351648 -31597995 -30760282 -17669462 -1186709 5607050 -1562761
44082 -1562761 -16382442 -29751788 -36359292 -35829351 -30419733 -21835851 -10733438 49352
44074 49352 5195882 3872195 3430196 9303102 14023886 6187911 -10029373 -16297013
44066 -16297013 -4775131 9908697 10040821 -2949018 -13409188 -11018771 2692975
44059 2692975 20404592 32540477 30727096 17641784 9076587 16518335 31382371 36265771
$$ packed form
44114e269479j8560811n971775J4096036J7808517K783854r188358l023228J0464802
44106C139558J2248238O97585j0073395j0581955m018251K921265O707852M703582
44098E744479m045588j3536349j4364452n685008L021687M864809L058032K118399
44090a8823991j20594n407063p246347Q37713J3090820J6482753O793759p169811
44082a562761j4819681j3369346o607504N29941N409618Q583882J1102413J0782790
44074D9352N146530j323687m41999N872906M720784p835975j6217284o267640
44066a6297013J1521882J4683828J32124j2989839j0460170K390417J3711746
44059B692975J7711617J2135885j813381j3085312q565197P441748J4864036M883400
$$ plain form
44051 36265771 28159386 19460342 18421473 20818843 21052902 19655175 17440364 12357047
44043 12357047 5452589 1763390 2524355 3846159 4794577 8591318 13948411 14434214
44035 14434214 9686462 7944253 12785601 16339852 11747452 3827625 -651586 -5974632
44027 -5974632 -20111272 -37856355 -42403718 -25246777 2785540 22926700 26397073
44020 26397073 18525465 8210281 -2361163 -15571708 -28114520 -29620593 -16892474
44013 -16892474 -4472735 -9895093 -27993153 -32950067 -12108197 14834378 22229322
44006 22229322 14015880 14898239 29508353 32350867 6193099 -27648834 -33685590 -8236834
43998 -8236834 16509857 13367432 -10539269 -29257657 -29273006 -16288200 128560 16060261
$$ packed form
44051C6265771q106385q699044j038869K397370K34059j397727k214811n083317
44043A2357047o904458l689199P60965J321804R48418L796741N357093M85803
44035A4434214m747752j742209M841348L554251m592400p919827m479211n323046
44027e974632j4136640j7745083m547363J7156941K8032317K0141160L470373
44020B6397073p871608j0315184j0571444j3210545j2542812j506073J2728119
44013a6892474J2419739n422358j8098060m956914K0841870K6942575P394944
44006B2229322q213442Q82359J4610114K842514k6157768l3841933o036756K5448756
43998h236834K4746691l142425k3906701j8718388j5349J2984806J6416760J5931701
$$ plain form
43990 16060261 29132388 35396408 33257093 25212002 14075290 1622584 -8531814
43983 -8531814 -11886905 -8766838 -5035637 -5401778 -9572998 -15878505 -23660054 -29864930
43975 -29864930 -28434457 -17160057 -2165646 7572157 7909945 511462 -9617288 -15609036
43967 -15609036 -12925869 -5374913 -2305999 -6760701 -11865124 -12316548 -12196144 -15757743
43959 -15757743 -18103273 -13444571 -6357412 -4688985 -5914877 -1780716 6396954 8976427
43951 8976427 3481499 -2991154 -7056685 -12565707 -18993581 -18710249 -10204628 -2945803
43943 -2945803 -3244854 -4985032 -1138841 4223792 3553091 -1291507 -2587448 824020
43935 824020 2595665 -1495948 -8754870 -13027578 -9286697 2679978 15830033 20330721
$$ packed form
43990A6060261J3072127O264020k139315q045091j1136712j2452706j0154398
43983h531814l355091L120067L731201l66141m171220o305507p781549o204876
43975b9864930J430473J1274400J4994411R737803L37788p398483j0128750n991748
43967a5609036K683167P550956L068914m454702n104423m51424J20404l561599
43959a5757743k345530M658702P087159J668427j225892M134161Q177670K579473
43951H976427n494928o472653m065531n509022o427874K83332Q505621P258825
43943b945803k99051j740178L846191N362633o70701m844598j295941L411468
43935H24020J771645m091613p258922m272708L740881J1966675J3150055M500688
$$ plain form
43927 20330721 13904706 4487476 -304598 -2006741 -6036591 -12473293 -17095567 -17757610
43919 -17757610 -14674182 -7924083 -26821 2358556 -4439574 -14272669 -17368347 -12071848
43911 -12071848 -4927345 -370014 3242016 7082248 8013199 4198341 -148686 -82052
43903 -82052 1875367 -2503290 -15951231 -29427358 -30445147 -17172905 -776895 7026655
43895 7026655 5105171 326169 -1008836 4328059 16817271 30565642 33848624 21678338
43887 21678338 5174654 -534425 4250632 6615017 1901447 -1059258 2373704 3292197
43879 3292197 -5813907 -17276188 -17744666 -4620974 13728912 28178755 33563300 29307799
43871 29307799 20967431 15798346 12800287 3957897 -10909695 -19801626 -15411471 -7503487
$$ packed form
43927B0330721o426015r417230m792074j702143m029850o436702m622274o62043
43919a7757610L083428O750099P897262K385377o798130r833095l095678N296499
43911a2071848P144503M557331L612030L840232R30951l814858m347027O6634
43903h2052J957419m378657j3447941j3476127j017789J3272242J6396010P803550
43895G026655j921484m779002j335005N336895J2489212J3748371L282982j2170286
43887B1678338j6503684n709079M785057K364385m713570k960705L432962R18493
43879C292197r106104j1462281m68478J3123692J8349886J4449843N384545m255501
43871B9307799q340368n169085k998059q842390j4867592q891931M390155P907984
$$ plain form
43863 -7503487 -9974209 -22208973 -31533767 -29007916 -16067634 -938027 6056828 425776
43855 425776 -8187889 -4365345 11150732 19485348 11158521 1586472 7022886 18984814
43847 18984814 19630755 11289341 10056817 17095401 18697290 12793495 13502258 26709660
43839 26709660 39922568 41300797 33658478 24946264 17955761 13749045 14025636 16747554
43831 16747554 18609027 21727648 27583181 27320067 12446666 -6971959 -11837341 -1491883
43823 -1491883 6551959 5232816 5715494 12766078 14572353 5696942 -705374 4307849
43815 4307849 8775109 174815 -12800404 -13841356 -2354764 10555658 18747635 21382185
43807 21382185 17589003 12669568 17964413 32482727 37758504 24791713 11875041 18286546
$$ packed form
43863g503487k470722j2234764r324794K525851J2940282J5129607O994855n631052
43855D25776q613665L822544J5516077Q334616q326827r572049N436414J1961928
43847A8984814O45941q341414j232524P038584J601889n903795P08763J3207402
43839B6709660J3212908J378229p642319q712214o990503m206716K76591K721918
43831A6747554J861473L118621N855533k63114j4873401j9418625m865382J0345458
43823a491883Q043842j319143M82678P050584J806275q875411o402316N013223
43815D307849M467260q600294j2975219j040952J1486592J2910422Q191977K634550
43807B1382185l793182m919435N294845J4518314N275777j2966791j2916672O411505
$$ plain form
43799 18286546 33624370 34327634 20132088 10505478 11696585 12461203 10058166 14973091
43791 14973091 27019529 29921221 16257083 -1204219 -9864240 -11823086 -11113022 -3548822
43783 -3548822 10864066 19879381 14850115 4059674 21124 2549934 4035360 2978098
43775 2978098 1879539 -1491807 -9922360 -18394460 -19973418 -17081002 -17432638 -20298141
43767 -20298141 -16181903 -1274322 15480361 22947699 20511006 16308178 15333021 14106807
43759 14106807 8355272 2016238 3303488 11625718 14598786 2424890 -18798973 -33757406
43751 -33757406 -35274653 -28759093 -21201081 -13685979 -5988038 -1298040 -2134300 -4953465
43743 -4953465 -2458575 8948272 24415929 33359170 29170900 17248075 9420913 8495810
$$ packed form
43799A8286546J5337824P03264j4195546r626610J191107P64618k403037M914925
43791A4973091J2046438K901692j3664138j7461302q660021j958846P10064P564200
43783c548822J4412888R015315n029266j0790441m038550K528810J485426j057262
43775B978098j098559l371346q430553q472100j578958K892416l51636k865503
43767b0298141M116238J4907581J6754683P467338k436693m202828r75157j226214
43759A4106807n751535o339034J287250Q322230K973068j2173896k1223863j4958433
43751c3757406j517247O515560P558012P515102P697941M689998q36260k819165
43743d953465K494890J1406847J5467657Q943241m188270j1922825p827162r25103
$$ plain form
43735 8495810 4782723 -7202771 -16488106 -9732427 7953584 18557343 15285040 8189972
43727 8189972 5325188 1680376 -8990400 -22620137 -31318693 -33525172 -32310693 -29745792
43719 -29745792 -27045846 -24851116 -20859687 -13024994 -6022425 -6682068 -11972051 -11302678
43711 -11302678 -3028073 2466866 127303 -1471705 3940834 7557262 -1714640 -20365285
43703 -20365285 -35841663 -41759820 -38629111 -27173167 -11366415 -1375795 -2018365 -3442167
43695 -3442167 5296175 18085703 19789253 9411428 1808247 6229603 15361221 17951301
43687 17951301 12424804 4961943 1535409 4260902 10128161 12830686 10873521 12008132
43679 12008132 22736873 35610400 35829787 20029146 78967 -11595013 -12338525 -5838812
$$ packed form
43735H495810l713087j1985494r285335O755679J7686011J0603759l272303p095068
43727H189972k864784l644812j0670776j3629737q698556k206479J214479K564901
43719b9745792K699946K194730L991429P834693P002569o59643n289983O69373
43711a1302678Q274605N494939k339563j599008N412539L616428r271902j8650645
43703b0365285j5476378n918157L130709J1455944J5806752R990620o42570j423802
43695c442167Q738342J2789528J703550j0377825p603181M421356R131618K590080
43687A7951301n526497p462861l426534K725493N867259K702525j957165J134611
43679A2008132J0728741J2873527K19387j5800641j9950179j1673980p43512O499713
$$ plain form
43671 -5838812 2197600 4900543 253787 -3424703 2552332 12492766 13138849 5103719
43663 5103719 3090215 12002837 18835376 15030230 10887639 16464862 22024219 12920763
43655 12920763 -5095486 -12047870 -1142839 14749990 22512768 21547686 16868675 11006868
43647 11006868 5040394 -408926 -6349005 -11593821 -9824005 1689232 13094030 11748770
43639 11748770 -216437 -8690632 -7377223 -3122670 -740831 4294387 13981690 20883342
43631 20883342 19478488 14385983 10716388 5781612 -2116592 -5746826 1006665 12097841
43623 12097841 17177347 14503390 8083722 -613232 -8306005 -5072888 12972470 31426188
43615 31426188 32565426 19897953 12868870 18258502 23370436 19482530 14313862 14726171
$$ packed form
43671e838812Q036412K702943m646756l678490N977035R940434O46083q035130
43663E103719k013504Q912622O832539l805146m142591N577223N559357r103456
43655A2920763j8016249o952384J0905031J5892829P762778r65082m679011n861807
43647A1006868n966474n449320n940079n244816J769816J1513237J1404798j345260
43639A1748770j1965207q474195J313409M254553K381839N035218R687303O901652
43631B0883342j404854n092505l669595m934776p898204l630234O753491J1091176
43623A2097841N079506k673957o419668q696954p692773L233117J8045358J8453718
43615C1426188J139238j2667473p029083N389632N111934l887906n168668M12309
$$ plain form
43607 14726171 13780837 5877678 950336 9605059 23909248 28000527 21313697 15841229
43599 15841229 14427487 8680345 -1615776 -4293561 4868506 12561114 7927696 746421
43591 746421 7164905 23582557 28788917 12367416 -10830101 -19329464 -10116772 1974567
43583 1974567 5351039 3068409 2960064 5361158 6020639 5445181 7598413 11744804 13641204
43574 13641204 14054220 17078565 18983676 9289508 -12534402 -31530729 -35672662 -30940458
43566 -30940458 -29118490 -29467351 -24832661 -18571967 -19216912 -21653248 -11798565 8292156
43558 8292156 17800175 5844148 -12474080 -17279494 -8070227 3108792 10336096 13299543
43550 13299543 8359097 -4902975 -14504387 -8771312 4749881 7753613 -2205479 -8233813
$$ packed form
43607A4726171r45334p903159m927342Q654723J4304189M091279o686830n472468
43599A5841229j413742n747142j0296121k677785R162067P692608m633418p181275
43591G46421O418484J6417652N206360j6421501k3197517q499363R212692J2091339
43583A974567L376472k282630j08345K401094O59481n75458K153232M146391J896400
43574A3641204M13016L024345J905111r694168k1823910j8996327m141933M732204
43566c0940458J821968l48861M634690O260694o44945k436336R854683K0090721
43558H292156R508019j1956027j8318228m805414R209267J1179019P227304K963447
43550A3299543m940446j3262072r601412N733075J3521193L003732r959092o028334
$$ plain form
43542 -8233813 224727 11728428 9158278 -7898647 -24587833 -29005284 -22298234 -13262036
43534 -13262036 -8129044 -5936200 -2217392 3684789 7297322 6367029 5354873 8257388
43526 8257388 11105481 8319675 3286495 4193195 11218519 17219212 20211022 24332137
43518 24332137 27580173 20932679 4013404 -9806810 -10821622 -5852621 -5520119 -7016595
43510 -7016595 226342 16925156 32159669 36997902 32302907 25180619 23900929 32854757
43502 32854757 45644232 47043406 29950975 7082418 -3263083 -480614 -472435 -12271620
43494 -12271620 -27023280 -31900929 -24627397 -10607454 5258319 18670857 24632066
43487 24632066 21639947 13627944 5373340 324519 3184924 16626248 32886479 37574052
$$ packed form
43542h233813Q458540J1503701k570150j7056925j6689186m417451O707050R036198
43534a3262036N132992K192844L718808N902181L612533r30293j012156K902515
43526H257388K848093k785806n033180R06700P025324O000693K991810M121115
43518B4332137L248036o647494j6919275j3820214j014812M969001L32502j496476
43510g016595P242937J6698814J5234513M838233m694995p122288j279690Q953828
43502C2854757J2789475J399174j7092431k2868557j0345501K782469Q179j1799185
43494a2271620j4751660m877649P273532J4019943J5865773J3412538N961209
43487B4632066k992119q012003q254604n048821K860405J3441324J6260231M687573
$$ plain form
43479 37574052 27036358 14115948 10539120 11438242 5526444 -6230327 -12663174 -9318041
43471 -9318041 -2709784 1057753 2389474 2891964 2502547 2787322 5785807 8892773 7831692
43462 7831692 4900560 6487912 11754162 12573575 6805923 2376045 4175303 6019972
43454 6019972 1966552 -2317210 1762065 10708347 12318130 2819885 -7568745 -7420951
43446 -7420951 3138572 14326397 18170211 16490113 18196399 28341770 40227975 41447104
43438 41447104 28569627 11509157 1156546 -2307170 -5117835 -9283598 -12148476 -12950454
43430 -12950454 -13294703 -13108554 -11947717 -12510753 -17054674 -21823525 -20712737 -13113102
43422 -13113102 -2879295 8116700 19040234 25263449 22482481 14528890 9195277 7425971
$$ packed form
43479C7574052j0537694j2920410l576828Q99122n911798j1756771o432847L345133
43471i318041O608257L767537J331721N02490l89417K84775K998485L106966j061081
43462G831692k931132J587352N266250Q19413n767652m429878J799258J844669
43454F019972m053420m283762M079275Q946282J609783r498245j0388630J47794
43446g420951J0559523J1187825L843814j680098J706286J0145371J1886205J219129
43438D1447104j2877477j7060470j0352611l463716k810665m165763k864878q01978
43430a2950454l44249J86149J160837n63036m543921m768851J110788P599635
43422a3113102J0233807J0995995J0923534O223215k780968p953591n333613j769306
$$ plain form
43414 7425971 5247379 4821959 12126544 23008832 24823009 16325462 13002064 24746551
43406 24746551 39465750 39522652 26025996 14426984 11107388 7413903 -3902959 -17426430
43398 -17426430 -22194416 -13003890 6132035 23963928 28089261 15877732 -420140
43391 -420140 -5786552 41427 3594733 -3230718 -12558162 -11951178 -208525 12846612
43383 12846612 18357784 15235262 6930543 -3322096 -12637260 -16847069 -12190920 352366
43375 352366 14357156 23968998 29741356 35369067 39221077 34134827 17578591 -2189787
43367 -2189787 -13230279 -11035978 -1566352 3479921 -5414182 -26104319 -41851199 -35754351
43359 -35754351 -11583808 8053937 8800530 -101978 -4058908 -4169734 -7459781 -7384321
$$ packed form
43414G425971k178592m25420P304585J0882288J814177q497547l323398J1744487
43406B4746551J4719199N6902j3496656j1599012l319596l693485j1316862j3523471
43398a7426430m767986R190526J9135925J7831893M125333j2211529j6297872
43391d20140n366412N827979L553306o825451r327444O06984J1742653J3055137
43383A2846612N511172l122522q304719j0252639r315164m209809M656149J2543286
43375C52366J4004790R611842N772358N627711L852010n086250j6556236j9768378
43367b189787j1040492K194301R469626N046273q894103k0690137j5746880O096848
43359c5754351K4170543J9637745P46593q902508l956930j10826l290047P5460
$$ plain form
43351 -7384321 6654161 25053771 24370610 148045 -24910025 -30803596 -22164088 -13654282
43343 -13654282 -9172518 -5780637 -5309856 -9369500 -11489543 -6240778 141689 -785507
43335 -785507 -5040239 -2126337 8410765 17365583 20346473 21033138 20809700 15901550
43327 15901550 6816025 1876691 7399781 19514851 28850314 30064577 24784079 17747363
43319 17747363 12055879 7517337 2980069 -471171 -541599 2179731 4285158 4200425 2921715
43310 2921715 -457647 -8476968 -18565279 -22726810 -17777841 -10436457 -7787136 -7869364
43302 -7869364 -4737543 2105743 8950707 14039869 16586363 13746711 4687205 -5761599
43294 -5761599 -12790866 -16786021 -17904043 -11883122 1230133 10499461 6427411 -4224084
$$ packed form
43351g384321J4038482J8399610o83161k4222565k5058070n893571Q639508Q509806
43343a3654282M481764L391881M70781m059644k120043N248765O382467r27196
43335g85507m254732K913902J0537102Q954818K980890O86665k23438m908150
43327A5901550r085525m939334N523090J2115070R335463J214263n280498p036716
43319A7747363n691484m538542m537268l451240p0428K721330K105427q4733j278710
43310B921715l379362q019321j0088311m161531M948969P341384K649321q2228
43302g869364L131821O843286O844964N089162K546494k839652r059506j0448804
43294e761599p029267l995155j118022O020921J3113255R269328m072050j0651495
$$ plain form
43286 -4224084 -6492047 2783667 13766124 19964548 23432487 23986454 16506868 2425405
43278 2425405 -7165214 -5077666 3332421 9472865 12335759 15675222 20488014 24741465
43270 24741465 26211094 22441524 11732912 -3570237 -17864033 -26986077 -29294131 -24154672
43262 -24154672 -14545263 -8514916 -10830692 -15368619 -13975843 -10039220 -12574254 -19123418
43254 -19123418 -18348862 -10222253 -8346603 -17996274 -26604571 -23045472 -13119378 -7505895
43246 -7505895 -6517473 -6349290 -9047497 -15155064 -16316148 -7163330 3675668 6358388
43238 6358388 5861833 12467190 23048871 25997456 20320136 15780386 16463122 17235340
43230 17235340 15170511 12471383 8885382 2151279 -5152783 -9507317 -14893200 -26137809
$$ packed form
43286d224084k267963R275714J0982457O198424L467939N53967p479586j4081463
43278B425405r590619K087548Q410087O140444K862894L339463M812792M253451
43270B4741465J469629l769570j0708612j5303149j4293796r122044k308054N139459
43262b4154672R609409O030347k315776m537927J392776L936623k535034o549164
43254a9123418P74556Q126609J875650r649671q608297L559099R926094N613483
43246g505895R88422J68183k698207o107567j161084R152818J0838998K682720
43238F358388m96555O605357J0581681K948585n677320m539750O82736P72218
43230A7235340k064829k699128l586001o734103p304062m354534n385883j1244609
$$ plain form
43222 -26137809 -36468755 -34466470 -21777783 -10607630 -5011227 560347 4906656 -169249
43214 -169249 -11137246 -11920389 1769049 13943723 12715211 7286696 9451374 12766705
43206 12766705 5000905 -9313984 -15057782 -9281571 -2916482 -2942051 -5924679 -7566003
43198 -7566003 -6925718 -1830896 9266494 20469187 22562654 14833570 5605906 1201958
43190 1201958 1300464 4466496 10616085 17558624 21466849 20906733 15348878 2087775
43182 2087775 -18078554 -34462092 -35375552 -23483329 -13057071 -11053121 -10520604 -4746450
43174 -4746450 2703829 6908790 10920810 18833648 26583684 27801219 24041096 21087598
43166 21087598 18317249 10075268 -3612436 -15601671 -21454747 -23868864 -25647808 -24486348
$$ packed form
43222b6137809j0330946K002285J2688687J1170153N596403N571574M346309n075905
43214a69249j0967997p83143J3689438J2174674j228512n428515K164678L315331
43206A2766705p765800j4314889n743798N776211O365089k5569k982628j641324
43198g566003O40285N094822J1097390J1202693K093467p729084r227664m403948
43190A201958R8506L166032O149589O942539L908225n60116n557855j3261103
43182B087775k0166329j6383538r13460J1892223J0426258K003950N32517N774154
43174d746450P450279M204961M012020P912838P750036J217535l760123k953498
43166B1087598k770349q241981j3687704j1989235n853076k414117j778944J161460
$$ plain form
43158 -24486348 -18052860 -9524729 -3754159 -970126 1156759 1428534 -2968987 -8610412
43150 -8610412 -6841692 3864602 12305568 7631689 -5428026 -12458074 -9104238 -4795514
43142 -4795514 -4620071 635939 17885737 34544096 31756782 11890027 -1745107 4640086
43134 4640086 17876676 17697740 4055686 -5775697 -2290007 5509283 5042578 -3071374
43126 -3071374 -7410780 -519486 13087521 22534481 21200424 11353676 149752 -7135067
43118 -7135067 -9857838 -9969503 -9083726 -7196061 -2976046 4377629 12778345 18097332
43110 18097332 18888072 18385555 19336593 19221493 14878286 10085424 12326745 21410682 27496649
43101 27496649 23037304 11751884 2546418 -1216409 -2467094 -3776092 -4619401 -4158929
$$ packed form
43158b4486348O433488Q528131N770570K784033K126885K71775m397521n641425
43150h610412J768720J0706294Q440966m673879j3059715p030048L353836M308724
43142d795514J75443N256010J7249798J6658359k787314j9866755j3635134O385193
43134D640086J3236590j78936j3642054r831383L485690P799290m66705q113952
43126c071374m339406O891294J3607007R446960j334057r846748j1203924p284819
43118g135067k722771j11665Q85777J887665M220015P353675Q400716N318987
43110A8097332P90740n02517R51038j15100m343207m792862K241321R083937O085967
43101B7496649m459345j1285420r205466l762827j250685j308998q43309M60472
$$ plain form
43093 -4158929 -3257385 -3566365 -5753243 -7915947 -5901028 2449449 13374804 20734349
43085 20734349 23554183 25986742 29582728 30953132 28188800 23508577 17564052 7900370
43077 7900370 -3852331 -10616007 -10170334 -9419351 -12843998 -14682001 -10052723 -5660296
43069 -5660296 -9027225 -13716820 -7882924 6548395 16642031 18441941 20312852 26026299
43061 26026299 28591267 24075753 18876331 18377097 19080178 16810194 12864322 7853022
43053 7853022 257904 -4186574 5670892 27407377 40195788 29996186 9589528 1007227
43045 1007227 6370118 10627689 7275666 4671713 7998939 10951441 8552687 5517406
43037 5517406 6955736 10407468 12024991 12788497 13659164 11129476 2833307 -7057511
$$ packed form
43093d158929R01544l08980k186878k162704K014919Q350477J0925355P359545
43085B0734349K819834K432559L595986J370404k764332m680223n944525r663682
43077G900370j1752701o763676M45673P50983l424647j838003M629278M392427
43069e660296l366929m689595N833896J4431319J0093636J799910J870911N713447
43061B6026299K564968m515514n199422m99234P03081k269984l945872n011300
43053G853022p595118m444478R857466K1736485J2788411j0199602k0406658q582301
43045A007227N362891M257571l352023k603953L327226K952502k398754l035281
43037E517406J438330L451732J617523P63506Q70667k529688q296169r890818
$$ plain form
43029 -7057511 -12471462 -11991591 -7577040 -554442 7281193 11299044 7144894 -3518159
43021 -3518159 -12169973 -9668482 4790316 20341697 23600813 13978637 5939080 11403331
43013 11403331 24313901 29774349 24508196 18117011 15952278 13376759 8899525 9637025
43005 9637025 17344343 20640326 10891427 -2623640 -4746057 3701116 8074203 1860846
42997 1860846 -5191147 -2080133 10165517 23356618 32349431 35836070 32876360 24539042
42989 24539042 16347492 13872108 16080806 16574846 12198890 7876297 10701306 19979873
42981 19979873 26261235 22177183 11816542 5537442 6875944 10129656 11092159 12919483
42973 12919483 18130658 22048801 20317775 17032997 17510401 17783154 11164219 1957166
$$ packed form
43029g057511n413951M79871M414551P022598P835635M017851m154150j0663053
43021c518159q651814K501491J4458798J5551381L259116r622176q039557N464251
43013A1403331J2910570N460448n266153o391185k164733k575519m477234P37500
43005I637025P707318L295983r748899j3515067k122417Q447173M373087o213357
42997A860846p051993L111014J2245650J3191101Q992813L486639k959710q337318
42989B4539042q191550k475384K208698M94040m375956m322593K825009R278567
42981A9979873O281362m084052j0360641o279100J338502L253712R62503J827324
42973A2919483N211175L918143j731026l284778M77404K72753o618935r207053
$$ plain form
42965 1957166 377266 4297308 289779 -13255125 -18835686 -5070333 13273714 14551695
42957 14551695 1260934 -5143632 3072754 11245925 8624158 4413515 8501434 12174471
42949 12174471 2726162 -13197072 -18165422 -11157017 -8479202 -17004770 -23082934 -13423891
42941 -13423891 6366939 21734218 27373100 27298331 25088180 22818016 23196014 24150127
42933 24150127 16950912 -1451643 -19265984 -22407666 -12210651 -1457742 3000058
42926 3000058 3331729 451611 -6847768 -13860510 -13098047 -5234473 3944371 15438983
42918 15438983 32277006 44803568 38807059 20641646 14409760 27027291 36047581
42911 36047581 24140731 6754647 8256561 25894773 38290000 38852824 37799552 37079992
$$ packed form
42965A957166j579900L920042m007529j3544904n580561J3765353J8344047J277981
42957A4551695j3290761o404566Q216386Q173171k621767m210643M087919L673037
42949A2174471r448309j5923234m968350P008405K677815q525568o078164R659043
42941a3423891J9790830J5367279N638882p4769k210151k270164L77998R54113
42933B4150127p199215j8402555j7814341l141682J0197015J0752909M457800
42926C000058L31671k880118p299379p012742P62463P863574R178844J1494612
42918A5438983J6838023J2526562n996509j8165413o231886J2617531R020290
42911C6047581j1906850j7386084J501914J7638212J2395227N62824j053272p19560
$$ plain form
42903 37079992 27364881 9630475 -2370668 -4623981 -8715046 -20333173 -29325643 -27431862
42895 -27431862 -20120425 -13600209 -4769764 7535676 14593348 10446413 1546371 -4222555
42887 -4222555 -6890214 -5398799 6946044 27296775 37164965 26081845 10564859 13045820
42879 13045820 29991116 38882166 31845517 23208723 24299612 29152631 29057129 26236293
42871 26236293 27059692 32441454 39850826 46062946 44979674 32286747 15443124 9047338
42863 9047338 15979867 22596844 17549072 6119461 -51606 1392095 5603613 10713670
42855 10713670 17187217 21977660 21667656 18576651 17154379 16947796 14720838 10423229
42847 10423229 5484366 -1479996 -11224993 -19137380 -20256079 -16662472 -13726766 -11309720
$$ packed form
42903C7079992r715111j7734406j2001143k253313m091065j1618127q992470J893781
42895b7431862P311437O520216Q830445J2305440P057672m146935q900042n768926
42887d222555k667659J491415J2344843K0350731R868190j1083120j5516986K480961
42879A3045820J6945296Q891050p036649q636794J090889M853019r5502k820836
42871B6236293Q23399N381762P409372O212120j083272j2692927j6843623o395786
42863I047338O932529O616977n047772j1429611o171067J443701M211518N110057
42855A0713670O473547M790443l10004l091005j422272k06583k226958m297609
42847A0423229m938863o964362r744997p912387j118699L593607K935706K417046
$$ plain form
42839 -11309720 -5329913 3590865 9966159 11354433 10332536 9138362 8109831 8538719
42831 8538719 10975421 11744900 7852790 4202832 7935794 16030515 17882975 11336294
42823 11336294 5913563 6951910 7204689 101023 -8551474 -10399468 -7890004 -8040740
42815 -8040740 -9439074 -6502786 -1923758 -2623075 -5871417 -2375784 7022721 10948748
42807 10948748 5949937 2196575 5962801 9093445 3696151 -3898332 -4355287 -1602412
42799 -1602412 -5046638 -11019698 -6195670 11246760 26504234 26503818 13835292 -5306
42791 -5306 -6746201 -4142374 4996849 12849215 12749434 8846586 12401684 24649850 31869849
42782 31869849 24244903 12027960 12979195 27573247 37311939 27933224 5721185 -11623791
$$ packed form
42839a1309720N979807Q920778O375294J388274j021897j194174j028531M28888
42831H538719K436702P69479l892110l649958L732962Q094721J852460o546681
42823A1336294n422731J038347K52779p103666q652497j847994K509464j50736
42815h040740j398334K936288M579028o99317l248342L495633R398505L926027
42807A0948748m998811l753362L766226L130644n397294p594483m56955K752875
42799a602412l444226n973060M824028J7442430J5257474m16j2668526j3840598
42791e306o740895K603827R139223P852366r9781l902848L555098J2248166P219999
42782C1869849p624946j2216943R51235J4594052R738692r378715k2212039j7344976
$$ plain form
42774 -11623791 -14213228 -6947092 -1116306 -2313778 -5915738 -3695368 5219031 12026628
42766 12026628 8490925 -3111441 -13094149 -14925362 -9427773 -1393698 3550497 1430634
42758 1430634 -5360138 -8087391 -2188473 4822983 3254586 -3216979 -1491368 11414552
42750 11414552 23177835 23075027 14241217 5313144 74849 1149140 13356093 33959015
42742 33959015 47832642 43874801 31192690 27517715 35001300 39658361 33412917 23878546
42734 23878546 20436946 22043564 22718679 19760724 12252897 -129867 -12076636 -14322785
42726 -14322785 -5995980 1750184 614985 -2986575 1575943 12578089 19553757 20794064
42718 20794064 26927275 45194140 67275606 76452517 64242880 38695501 17876754
$$ packed form
42774a1623791k589437P266136N830786j197472l601960K220370Q914399O807597
42766A2026628l535703j1602366r982708j831213N497589Q034075M944195k119863
42758A430634o790772k727253N898918P011456j568397o471565J725611J2905920
42750A1414552J1763283j02808q833810q928073n238295J074291J2206953K0602922
42742C3959015J3873627l957841j2682111l674975P483585M657061o245444r534371
42734B3878546l441600J606618O75115k957955p507827j2382764j1946769k246149
42726a4322785Q326805P746164j135199l601560M562518J1002146O975668J240307
42718B0794064O133211J8266865K2081466R176911j2209637k5547379k0818747
$$ plain form
42711 17876754 14424158 24031945 29972817 21101959 3631291 -7213643 -3929611 8956375
42703 8956375 23545576 34395635 36996952 28902332 15196696 7041005 10815355 21376673
42695 21376673 28022849 24634242 13482995 3119279 3467616 17814565 36959417 46050884
42687 46050884 40874795 33001065 34109473 39378823 33560666 12210587 -10804655 -19094345
42679 -19094345 -11381708 212744 5678676 6112725 8298025 14679384 20249259 17676701
42671 17676701 4667349 -12574412 -22865502 -18970307 -4602512 8460963 11584393
42664 11584393 6589992 894852 -1919191 -3119219 -2615474 1852678 8252267 9376680
42656 9376680 2101877 -7343627 -11572310 -10870065 -8793955 -4056114 5546745 14689291
$$ packed form
42711A7876754l452596R607787N940872q870858j7470668j0844934L284032J2885986
42703H956375J4589201J0850059K601317q094620j3705636q155691L774350J0561318
42695B1376673O646176l388607j1151247j0363716L48337J4346949J9144852R091467
42687D6050884n176089p873730J108408N269350n818157k1350079k3015242q289690
42679a9094345P712637J1594452N465932M34049K185300O381359N569875k572558
42671A7676701j3009352j7241761j0291090L895195J4367795J3063475L123430
42664A1584393m994401n695140k814043j200028N03745M468152O399589J124413
42656I376680p274803r445504m228683P02245K076110M737841R602859R142546
$$ plain form
42648 14689291 15494472 9870737 7109602 8623511 5619899 -4937253 -12503877 -7136896
42640 -7136896 6950454 19212597 27060213 34053926 39586287 40059783 37241440 36116064
42632 36116064 35804330 31161675 22798768 17034897 15230526 11166159 1046434 -10499282
42624 -10499282 -16605385 -14859283 -6492010 4991422 12822939 11676266 6433043 9264234
42616 9264234 23390008 36299026 35411060 24889958 18757658 21195576 23769053 21489761
42608 21489761 20670660 27227447 36463424 40912767 41030805 39491025 30648394 8086618
42600 8086618 -18433264 -27614589 -13269396 5467609 8973142 2197919 3446863 16352178
42592 16352178 28547678 34100551 39085115 43761375 38139283 21977968 11980856 18185613
$$ packed form
42648A4689291Q05181n623735k761135J513909l003612j0557152p566624N366981
42640g136896J4087350J2262143P847616O993713N532361M73496k818343j125376
42632C6116064l11734m642655q362907n763871j804371m064367j0119725j1545716
42624a0499282o106103J746102Q367273J1483432P831517j146673n243223K831191
42616I264234J4125774J2909018q87966j0521102o132300K437918K573477k279292
42608B1489761q19101O556787R235977M449343J18038j539780q842631k2561776
42600H086618k6519882r181325J4345193J8737005L505533o775223J248944J2905315
42592A6352178J2195500N552873M984564M676260n622092j6161315r997112O204757
$$ plain form
42584 18185613 27594345 24469530 14395907 12493541 18137362 19867297 18212308 22940401
42576 22940401 30565192 26174760 9529335 -1046863 3591662 10042080 4832955 -5828907
42568 -5828907 -9070320 -4830856 -927535 1210690 4908892 10024651 15327633 21551954
42560 21551954 24609522 15448262 -4027744 -14961234 -3394422 19926520 33976013
42553 33976013 34310636 31969674 32351056 31681005 31319737 37992196 48149475 47578729 31321661
42544 31321661 12065415 3626231 5754086 10055702 12099662 11987022 9909454 7171001
42536 7171001 7393207 12253424 18558628 21396276 17565361 6532714 -7367439 -15082334
42528 -15082334 -12130541 -7074208 -12028578 -23922472 -25412109 -8084838 15288312 27864329
$$ packed form
42584A8185613R408732l124815j0073623j902366N643821J729935j654989M728093
42576B2940401P624791m390432j6645425j0576198M638525O450418n209125j0661862
42568e828907l241413M239464L903321K138225L698202N115759N302982O224321
42560B1551954L057568r161260j9476006j0933490J1566812K3320942J4049493
42553C3976013L34623k340962L81382o70051l61268O672459J0157279n70746j6257068
42544C1321661j9256246q439184K127855M301616K043960j12640k077568k738453
42536G171001K22206M860217O305204K837648l830915j1032647j3900153p714895
42528a5082334K951793N056333m954370j1893894j489637J7327271K3373150J2576017
$$ plain form
42520 27864329 29023794 28798415 29263761 23489213 10947491 2274875 5772700 16988425
42512 16988425 25679766 27694187 25546493 21267610 14482206 6492309 916766 -768447
42504 -768447 -120850 3456789 14004873 31100610 44790998 45207020 35829872 29716303
42496 29716303 31876341 33206833 24635577 9696065 -1693095 -5593874 -4605710 -1490892
42488 -1490892 1603673 1871272 -335701 -168989 4459077 9343340 12622642 19786671
42480 19786671 32670203 40938976 34728100 19814634 9057379 4186720 -1247060 -5850967
42472 -5850967 -2830264 3756986 1759437 -8895560 -14196288 -6814778 5564877 15498535
42464 15498535 24322647 31443762 30770106 24112785 23383221 32054056 38453970 35000716
$$ packed form
42520B7864329J159465k25379M65346n774548j2541722q672616L497825J1215725
42512A6988425Q691341K014421k147694m278883o785404p989897n575543j685213
42504g68447O47597L577639J0548084J7095737J3690388M16022r377148o113569
42496B9716303K160038J330492q571256j4939512j1389160l900779R88164L114818
42488a490892L094565K67599k206973J66712M628066M884263L279302P164029
42480A9786671J2883532Q268773o210876j4913466j0757255m870659n433780m603907
42472e850967L020703O587250j997549j0654997n300728P381510J2379655R933658
42464A5498535Q824112P121115o73656o657321p29564Q670835O399914l453254
$$ plain form
42456 35000716 29090247 26006922 17644058 952098 -8456416 1836576 18315948 19702243
42448 19702243 8457011 4086963 11482349 17076712 13907123 9513987 7696341 2009677
42440 2009677 -8003127 -11282591 -3062773 5430460 2941591 -6579801 -11936819 -9471287
42432 -9471287 -3297121 2517313 6211899 7894517 10927490 19057619 29546753 34231083
42424 34231083 29173754 17755974 3591442 -12029538 -24137435 -24748365 -14034795
42417 -14034795 -3367395 -2053387 -7034030 -10200802 -9333185 -6135672 224011 9896973
42409 9896973 16610180 13226374 1936289 -7488861 -9295398 -6157428 -2112205 2942362
42401 2942362 9554763 14330119 13554129 9342179 7754940 10552855 13043576 11975047
$$ packed form
42456C5000716n910469l083325q362864j6691960r408514J0292992J6479372J386295
42448A9702243j1245232m370048P395386N594363l169589m393136j817646n686664
42440B009677j0012804l279464Q219818Q493233k488869r521392n357018K465532
42432i471287O174166N814434L694586J682618L032973Q130129J0489134M684330
42424C4231083n057329j1417780j4164532j5620980j2107897o10930J0713570
42417a4034795J0667400J314008m980643l166772Q67617L197513O359683R672962
42409I896973O713207l383806j1290085r425150j806537L137970M045223N054567
42401B942362O612401M775356p75990m211950j587239K797915K490721j068529
$$ plain form
42393 11975047 10988991 13704724 15459862 9885846 2179939 5429308 21201377 34340157
42385 34340157 32980691 24011259 20097052 20353631 15985234 8751810 8954667 16611959
42377 16611959 19067087 9792065 -2009983 -4232393 4802378 18816022 30732293 34091006
42369 34091006 25548963 10460924 178385 594265 7852720 15774258 21082154 21383648
42361 21383648 16548967 13519295 20908352 36268461 46914416 45852256 38598369 32028140
42353 32028140 25983071 19393272 15209956 14756614 15734338 19541107 30963265 46478711
42345 46478711 53811119 49047955 43287961 45110890 47619305 41967011 32975411 29940890
42337 29940890 30855362 28218088 23531186 23277954 25854875 25083437 22688681 25328289
$$ packed form
42393A1975047r86056K715733J755138n574016p705907L249369J5772069J3138780
42385C4340157j359466q969432l914207K56579m368397p233424K02857P657292
42377A6611959K455128r275022j1802048k222410R034771J4013644J1916271L358713
42369C4091006q542043j5088039j0282539M15880P258455P921538N307896L01494
42361B1383648m834681l029672P389057J5360109J0645955j062160p253887o570229
42353C2028140o045069o589799m183316m53342R77724L806769J1422158J5515446
42345D6478711P332408m763164n759994J822929K508415n652294q991600l034521
42337B9940890R14472k637274m686902k53232K576921p71438k394756K639608
$$ plain form
42329 25328289 32629649 39493609 46334785 54820260 57384503 45390227 26171340 17015594
42321 17015594 21122200 23812215 15706582 6125172 7846620 19870663 32500392 41205563
42313 41205563 47932259 53761839 56758106 55424951 51654528 51252511 59736153 73720290
42305 73720290 80090680 71294782 58499901 59177443 72612525 79977392 70693800 56231144
42297 56231144 52706222 60794384 69687384 71817575 66216770 55060172 44829527 44559165
42289 44559165 54841546 63429988 59210840 46301853 37213047 36219595 37375572 36110213
42281 36110213 34633280 36400255 41463977 47420237 50919986 49291743 44036769 40727404
42273 40727404 42367096 45932589 48730703 53649960 63349607 74031244 81203670 87177362
$$ packed form
42329B5328289P301360O863960O841176Q485475K564243j1994276j9218887r155746
42321A7015594M106606K690015q105633r581410J721448J2024043J2629729Q705171
42313D1205563O726696N829580K996267j333155l770423m02017Q483642J3984137
42305G3720290O370390q795898j2794881O77542J3435082P364867r283592j4462656
42297E6231144l524922Q088162Q893000K130191n600805j1156598j0230645k70362
42289D4559165J0282381Q588442m219148j2908987r088806r93452J155977j265359
42281C6110213j476933J766975N063722N956260L499749j628243n254974l309365
42273D0727404J639692L565493K798114M919257R699647J0681637P172426N973692
$$ plain form
42265 87177362 95446516 101912817 101157024 98844184 107117249 127690517 149837803 166135354
42257 166135354 179265893 190831039 196124223 196786661 207005056 235781221 270361634
42250 270361634 290051541 293027575 296522987 310649113 324941044 324635191 309425782
42243 309425782 289598456 271683130 255896748 242703027 233923329 229860157 231466041
42236 231466041 242289061 261466362 277789894 279356148 268236882 256991962 250726245
42229 250726245 242407464 227777992 213716883 205825296 197230102 178623467 152985726
42222 152985726 130725005 114660147 100331057 88970854 88517513 99652884 110360817
42215 110360817 109255841 98739479 90399115 90530514 94020748 91815873 82735407 76912780
$$ packed form
42265H7177362Q269154O466301p55793k312840Q273065K0573268K2147286J6297551
42257A66135354J3130539J1565146N293184O62438J0218395K8776165L4580413
42250B70361634J9689907K976034L495412J4126126J4291931l05853j5209409
42243C09425782j9827326j7915326j5786382j3193721q779698m063172J605884
42236B31466041J0823020J9177301J6323532J566254j1119266j1244920o265717
42229B50726245q318781j4629472j4061109p891587q595194j8606635k5637741
42222A52985726k2260721j6064858j4329090j1360203m53341J1135371J0707933
42215A10360817j104976j0516362q340364J31399L490234k204875r080466n822627
$$ plain form
42207 76912780 85114719 103932886 116696502 113243900 103373956 103445647 114171803 121736913
42199 121736913 118476724 110322165 103016258 93770390 81052119 71489617 70622359 75720756
42191 75720756 83684029 96336820 110258467 111593275 92740552 67630191 57777024
42184 57777024 66419478 77922128 80316925 76312542 72503718 70143516 69200706 71204280
42176 71204280 74563201 75739140 77867790 88579468 105035543 111649876 100601879 86099125
42168 86099125 87587843 103903176 116020371 113947093 108242920 111546347 119912154 120847112
42160 120847112 113248146 108551027 112944049 118513525 115853661 107979606 104915436 108688068
42152 108688068 112137528 111979743 114126302 122615828 130538535 128426771 117632469 108155576
$$ packed form
42207G6912780Q201939J8818167J2763616l452602r869944P1691J0726156P565110
42199A21736913l260189q154559p305907r245868j2718271r562502q67258N098397
42191G5720756P963273J2652791J3921647J334808j8852723k5110361r853167
42184E7777024Q642454J1502650K394797m004383l808824k360202r42810K003574
42176G1204280L358921J175939K128650J0711678J6456075O614333j1047997j4502754
42168H6099125J488718J6315333J2117195k073278n704173L303427Q365807R34958
42160A20847112p598966m697119M393022N569476k659864p874055l064170L772632
42152A08688068L449460j57785K146559Q489526P922707k111764j0794302r476893
$$ plain form
42144 108155576 104536244 100997856 91758207 80335737 75767011 83168389 100276584 119757273
42136 119757273 132061968 129836639 115231272 102246756 105713827 124680144 140354653
42129 140354653 135421908 114260452 98497066 101702774 115267214 123712332 126910315
42122 126910315 136889086 155292463 167646584 164529345 156667327 159724781 172366784
42115 172366784 181145998 182021893 183107272 186869854 184182459 170278559 154200545 145088456
42107 145088456 138949550 128292567 117387944 116766129 126413504 135496417 137575208 135731522
42099 135731522 132255040 124031295 111630952 103587420 105666312 112379195 115102172 113200868
42091 113200868 110844190 108024912 102984532 100219436 106436499 118687897 125316373 120321893
$$ packed form
42144A08155576l619332l538388r239649j1422470m568726P401378J7108195J9480689
42136A19757273J2304695k225329j4605367j2984516L467071J8966317J5674509
42129A40354653m932745k1161456j5763386L205708J3564440Q445118L197983
42122A26910315R978771J8403377J2354121l117239p862018L057454J2642003
42115A72366784Q779214Q75895J085379L762582k687395j3903900j6078014r112089
42107A45088456o138906j0656983j0904623o21815R647375R082913K078791j843686
42099A35731522l476482q223745j2400343q043532K078892O712883K722977j901304
42091A13200868k356678k819278n040380k765096O217063J2251398O628476m994480
$$ plain form
42083 120321893 109072484 97820016 86315949 75345850 73036574 85314541 104732891
42076 104732891 117323179 118822927 117136749 119984373 127051091 134252154 139391740 142702267
42068 142702267 146647532 155255441 168778584 179683693 179883670 171600690 164226754 160276618
42060 160276618 152755366 138492882 125200644 120500567 121477931 121526476 121707002 127678731
42052 127678731 138597863 146491274 146207343 140983007 137919542 140599051 145758512 146423685
42044 146423685 140104885 133105902 132235961 133489164 127284371 115854205 114037421 127426261
42036 127426261 141307174 140717287 131243305 127199821 127443762 119345842 103204531 95185491
42028 95185491 103972073 119121163 126910230 125834459 121536103 116802342 112499589 110655058
$$ packed form
42083A20321893j1249409j1252468j1504067j0970099k309276J2277967J9418350
42076A04732891J2590288J499748j686178K847624P066718P201063N139586L310527
42068A42702267L945265Q607909J3523143J0905109J99977q282980p373936l950136
42060A60276618p521252j4262484j3292238m700077R77364M8545J80526N971729
42052A27678731J0919132P893411k83931n224336l063465K679509N159461O65173
42044A46423685o318800o998983q69941J253203o204793j1430166j816784J3388840
42036A27426261J3880913n89887r473982m043484K43941q097920j6141311q019040
42028I5185491Q786582J5149090P789067j075771m298356m733761m302753j844531
$$ plain form
42020 110655058 111579114 113733406 118661090 128892815 139574473 141175515 132861970 123778445
42012 123778445 118643709 112899388 105452908 103399115 107771073 107529605 97050870 87996248
42004 87996248 92408038 104111008 110136623 112300103 122176923 139759898 152978200 157047910
41996 157047910 160052801 168524794 179549087 188580073 194841499 198195678 200353064 209137905
41988 209137905 230920663 258202040 275588329 279263464 279474503 282547685 283380492 279259215
41980 279259215 277579878 282946716 288033665 285365626 278485792 273183060 267015853 257035199
41972 257035199 249281992 249486931 251326022 246107235 238730302 240561895 249634046 252561299
41964 252561299 246216696 242574730 247751152 249618746 234832752 209244868 191305592
$$ packed form
42020A10655058R24056K154292M927684J0231725J0681658J601042q313545r083525
42012A23778445n134736n744321p446480k053793M371958k41468j0478735r054622
42004H7996248M411790J1702970O025615K163480R876820J7582975J3218302M069710
41996A57047910L004891Q471993J1024293R030986O261426L354179K157386Q784841
41988B09137905K1782758K7281377J7386289L675135K11039L073182Q32807m121277
41980B79259215j679337N366838N086949k668039o879834n302732o167207r980654
41972B57035199p753207K04939J839091n218787p376933J831593R072151K927253
41964B52561299o344603l641966N176422J867594j4785994k5587884j7939276
$$ plain form
41957 191305592 189233596 193527439 191039868 179226167 165089086 155038963 149166409
41950 149166409 144427862 140721420 141324442 146567056 149939044 144584117 133175964 126417025
41942 126417025 129901297 136659767 135865358 125621191 112959094 103393758 95917832 88609058
41934 88609058 83937640 85374940 91451699 96886131 98986181 99704890 100889722 100652862
41926 100652862 96406617 89229518 82532220 77975285 75753447 77048227 81227361 81489401
41918 81489401 70603049 53341597 45605833 55442644 71132670 76197802 71646184 72798423
41910 72798423 85668193 98517039 99451879 91501327 84760943 82604152 82816430 85111504
41902 85111504 89034713 89440305 82685082 74043587 71054446 72457254 71773090 68921161
$$ packed form
41957A91305592k071996M293843k487571j1813701j4137081j0050123n872554
41950A49166409m738547l706442O03022N242614L371988n354927j1408153o758939
41942A26417025L484272O758470p94409j0244167j2662097r565336p475926p308774
41934H8609058m671418J437300O076759N434432K100050P18709J184832k36860
41926A00652862m246245p177099o697298m556935k221838J294780M179134K62040
41918H1489401j0886352j7261452p735764R836811J5690026N065132m551618J152239
41910G2798423J2869770J2848846R34840p950552o740384k156791K12278K295074
41902H5111504L923209M05592o755223q641495k989141J402808o84164k851929
$$ plain form
41894 68921161 69055443 71895818 72555719 72368807 77599301 86062814 86994242 78159298 71377996
41885 71377996 74356560 77564491 68415054 50321215 37028734 33619088 34113158 34390281
41877 34390281 36293030 40044616 42805466 45071194 49628981 53883420 52382140 48188041
41869 48188041 52227562 67941757 84539606 89623110 82111302 69174829 57105011
41862 57105011 49514036 48050761 49304060 46024428 36771721 29653203 30977938 35161224
41854 35161224 33011659 26304823 25680514 35287854 47614198 54303791 54983870 53248068
41846 53248068 50161013 45738095 42809836 44474112 48599334 48663212 41404720 31991144
41838 31991144 29196322 34649134 39353881 34581478 25341824 26823165 44224636 61602165
$$ packed form
41894F8921161J34282K840375O59901j86912N230494Q463513R31428q834944o781302
41885G1377996K978564L207931r149437j8093839j3292481l409646M94070K77123
41877C4390281J902749L751586K760850K265728M557787M254439j501280m194099
41869D8188041M039521J5714195J6597849N083504p511808j2936473j2069818
41862E7105011p590975j463275J253299l279632r252707p118518J324735M183286
41854C5161224k149565o706836o24309R607340J2326344O689593O80079j735802
41846E3248068l087055m422918k928259J664276M125222O3878p258492r413576
41838C1991144k794822N452812M704747m772403r239654J481341J7401471J7377529
$$ plain form
41830 61602165 57622021 30790640 2274386 -7304258 1793495 13703213 17706524 18402688
41822 18402688 25807014 40305096 51651582 52750116 49647387 53271123 63424529 68157450
41814 68157450 60642292 49318045 46307563 51575140 55500852 53300681 49035762 47135685
41806 47135685 47539362 48723306 48843581 44524654 35296279 28279621 30767871 38917475
41798 38917475 42651676 41216378 42572713 45871820 38245078 15490427 -6261532 -9451204
41790 -9451204 3141155 15563850 19858270 19007869 15642172 10853665 9900588 15594160
41782 15594160 18791176 9936883 -794818 8961912 42579695 75563289 84490126 72494410
41774 72494410 57975971 49339629 42145403 33795643 28434703 28914235 32496966 34261842
$$ packed form
41830F1602165l980144k6831381k8516254r578644R097753J1909718M003311O96164
41822A8402688P404326J4498082J1346486J098534l102729L623736J0153406M732921
41814F8157450p515158j1324247l010482N267577L925712k200171m264919j900077
41806D7135685M03677J183944J20275m318927r228375p016658K488250Q149604
41798C8917475L734201j435298J356335L299107p626742k2754651k1751959l189672
41790i451204J2592359J2422695M294420q50401l365697m788507r53077N693572
41782A5594160L197016q854293j0731701R756730L3617783L2983594Q926837j1995716
41774G2494410j4518439q636342p194226q349760n360940M79532L582731J764876
$$ plain form
41766 34261842 30201816 19640300 8791739 7673317 18328726 30559989 34839592
41759 34839592 34350991 37626367 44608285 48367792 46483841 42000897 36792634 32901080
41751 32901080 36084577 47200170 54161274 45915531 32046004 32639253 48085745 56489059
41743 56489059 45802762 30815084 29011067 35768272 36595747 30506809 25303024 19918374
41735 19918374 9447874 1113949 6047887 17735131 17552280 2445480 -11210599 -14522337
41727 -14522337 -18199973 -30491925 -40440168 -35227292 -20862893 -11289526 -6432098 3240137
41719 3240137 15920603 18731883 8309235 -3070140 -4349164 2794585 12249039 21982794
41711 21982794 28810231 24969208 9316114 -3944865 1739036 24348094 43638319
$$ packed form
41766C4261842m060026j0561516j0848561j118422J0655409J2231263M279603
41759C4839592m88601L275376O981918L759507j883951m482944n208263l891554
41751C2901080L183497J1115593O961104q245743j3869527N93249J5446492Q403314
41743E6489059j0686297j4987678j804017O757205Q27475o088938n203785n384650
41735A9918374j0470500q333925M933938J1687244j82851j5106800j3656079l311738
41727a4522337l677636j2291952r948243N212876J4364399R573367M857428R672235
41719C240137J2680466K811280j0422648j1379375j279024P143749R454454R733755
41711B1982794O827437l841023j5653094j3260979N683901K2609058J9290225
$$ plain form
41704 43638319 43778514 29157903 15006714 8088097 2320168 -8707597 -21312453 -26096749
41696 -26096749 -19582421 -8232269 -1084042 -360455 -396000 4512894 12404499 15385847
41688 15385847 9647731 1823436 2763592 15463681 31973702 42295981 43093072 37248317
41680 37248317 29361999 24007430 24328542 28671802 31235079 28981055 24858717 21538625
41672 21538625 16721146 9085378 3699040 5124152 9902965 13582337 20091166 33689352
41664 33689352 45882857 44306410 33591231 31560882 41801787 46420716 33151003
41657 33151003 14169050 7025536 10108203 10790749 7417578 7226886 9407144 6921929
41649 6921929 1675824 1902664 5745648 2549208 -9192203 -19263357 -21826030 -19961923
$$ packed form
41704D3638319J40195j4620611j4151189o918617n767929j1027765j2604856m784296
41696b6096749O514328J1350152P148227P23587l5545M908894P891605K981348
41688A5385847n738116p824295R40156J2700089J6510021J0322279P97091n844755
41680C7248317p886318n354569L21112M343260K563277k254024m122338l320092
41672B1538625m817479p635768n386338J425112M778813L679372O508829J3598186
41664C3689352J2193505j576447j0715179k030349J0240905M618929j3269713
41657C3151003j8981953p143514L082667O82546l373171j90692K180258k485215
41649F921929n246105K26840L842984l196440j1741411j0071154k562673J864107
$$ plain form
41641 -19961923 -13078392 4172867 26098001 34961920 23718317 6798864 -154793
41634 -154793 605005 -1000017 -5896758 -10456553 -17364706 -27963956 -31547108 -17447902
41626 -17447902 6430442 21333489 21331064 15930079 11347318 4157696 -5792783 -11163549
41618 -11163549 -9801813 -9070156 -12754107 -14943404 -11835797 -8169732 -6076730 260816
41610 260816 10720262 12536583 -775818 -14789186 -13432601 -4191262 -5730113 -15742631
41602 -15742631 -13441165 4614395 14579820 328813 -21976317 -28945726 -23105978 -21780866
41594 -21780866 -24386224 -14206410 10522050 30047344 31081852 22679596 18242966 18028735
41586 18028735 17494738 18384463 21154655 18292765 6598254 -3159542 90431 12382751
$$ packed form
41641a9961923O883531J7251259K1925134Q863919j1243603j6919453o953657
41634a54793P59798j605022m896741m559795o908153j0599250l583152J4099206
41626a7447902K3878344J4903047k425n400985m582761p189622r950479n370766
41618a1163549J361736P31657l683951k189297L107607L666065K093002O337546
41610B60816J0459446J816321j3312401j4013368J356585R241339j538851j0012518
41602a5742631K301466J8055560R965425j4251007k2305130o969409N839748J325112
41594b1780866k605358J0179814K4728460J9525294J034508q402256m436630k14231
41586A8028735n33997Q89725K770192k861890j1694511r757796L249973J2292320
$$ plain form
41578 12382751 23273694 30738634 35726488 31678908 15574030 2327418 9175424 28404305
41570 28404305 35170570 23382368 13921382 21859835 34293829 30946193 12124696 -6074002
41562 -6074002 -14011159 -13791853 -9435886 -3000449 3523046 10548178 21043775 32466173
41554 32466173 34919040 24335774 10653411 4683798 3568650 -1323945 -8607849 -10558190
41546 -10558190 -7819317 -7391819 -7883049 -185252 15733739 26826647 23975248 13936165
41538 13936165 9447762 14127077 22041286 27444583 29963934 31957233 33597043 30661295
41530 30661295 18481644 8940 -13095513 -12304501 -3081339 2101683 53297 -1366568
41522 -1366568 2192972 4087715 -2572838 -13576863 -18707835 -14622906 -7389339 -3354874
$$ packed form
41578A2382751J0890943P464940M987854m047580j6104878j3246612O848006J9228881
41570B8404305O766265j1788202r460986P938453J2433994l347636j8821497j8198698
41562f074002p937157K19306M355967O435437O523495P025132J0495597J1422398
41554C2466173K452867j0583266j3682363n969613j115148m892595p283904j950341
41546a0558190K738873M27498m91230P697797J5918991J1092908k851399j0039083
41538A3936165m488403M679315P914209N403297K519351J993299J639810k935748
41530C0661295j2179651j8472704j3104453P91012R223162N183022k048386j419865
41522a366568L559540J894743o660553j1004025n130972M084929P233567M034465
$$ plain form
41514 -3354874 -1621452 3291301 12754144 20003748 17080116 5830105 -2074344 1248363
41506 1248363 10406980 15236156 14379117 13556815 13815336 11023835 6517519 8069276 17726335
41497 17726335 27368771 29891396 26879961 21379241 11997586 671354 -2164997 9647738
41489 9647738 24631401 24278774 6863579 -8731038 -5298187 13646003 30381090 33037323
41481 33037323 24648265 15486043 11665732 11637742 10800545 7746659 6047566 10023130
41473 10023130 18869496 25934272 24862949 16081873 5810159 -1239948 -5806947 -9640031
41465 -9640031 -10495684 -5782880 571520 1176123 -3827348 -5246388 2316046 11911396
41457 11911396 13531553 6957806 -610492 -4879233 -4759406 3143712 19818937 35286544
$$ packed form
41514c354874J733422M912753R462843P249604k923632j1250011p904449L322707
41506A248363R158617M829176q57039q22302K58521k791501m506316J551757R657059
41497A7726335R642436K522625l011435n500720r381655j1326232k836351J1812735
41489I647738J4983663l52627j7415195j5594617L432851J8944190J6735087K656233
41481C3037323q389058r162222l820311k7990q37197l053886j699093L975564
41473A0023130Q846366P064776j071323q781076j0271714p050107m566999l833084
41465i640031q55653M712804O354400O04603n003471j419040P562434R595350
41457A1911396J620157o573747p568298m268741J19827P903118J6675225J5467607
$$ plain form
41449 35286544 36116744 22754963 9076985 3068429 -638965 -5809592 -5573116 3891785
41441 3891785 12568085 10807268 5428133 8665811 17499329 18767272 11878282 10785328
41433 10785328 22058568 35265107 39407465 36539315 32839093 26993708 16107594 5518684
41425 5518684 3319482 9090807 15445387 17578788 15242013 8971942 806658 -4576685
41417 -4576685 -5713415 -7704522 -13224720 -15101119 -6859852 3798967 3860508 -5135847
41409 -5135847 -9784343 -7003066 -7394383 -13203731 -11269343 2792752 11243051 639642
41401 639642 -13059334 -6724975 12001810 13534087 -9345934 -31201656 -32227172 -23235077
41393 -23235077 -22373493 -27119103 -24193659 -12888711 -2797120 2266799 4529798 4193558
$$ packed form
41449C5286544Q30200j3361781j3677978o008556l707394n170627K36476R464901
41441C891785Q676300j760817n379135L237678Q833518J267943o888990j092954
41433A0785328J1273240J3206539M142358k868150l700222n845385j0886114j0588910
41425E518684k199202N771325O354580K133401k336775o270071q165284n383343
41417d576685j136730j991107n520198j876399Q241267J0658819O1541q996355
41409e135847m648496K781277l91317n809348J934388J4062095Q450299j0603409
41401F39642j3698976O334359J8726785J532277k2880021k1855722j025516Q992095
41393b3235077Q61584m745610K925444J1304948J0091591N063919K262999l36240
$$ plain form
41385 4193558 2861579 7139322 17626676 23033422 16902962 10051958 12570538 14703598
41377 14703598 3741565 -10062772 -7227443 7244264 9607800 -3537820 -8413152
41370 -8413152 8054416 28167844 31694307 22931821 16376053 13254224 7656919 2273008
41362 2273008 2329402 3598279 127929 -4105490 -2734813 2229144 7537336 16478590
41354 16478590 27869267 28526324 11847539 -5433028 -2454194 15959413 26558962
41347 26558962 21207184 14807998 19679175 29331985 31548731 23636865 9633297 -6609799
41339 -6609799 -20018059 -24024688 -16934341 -4496867 5392877 7317920 48000 -10703091
41331 -10703091 -14299441 -6909552 2129240 2977984 -726896 -108971 2659423 -425461
$$ packed form
41385D193558j331979M277743J0487354N406746o130460o851004K518580K133060
41377A4703598j0962033j3804337K835329J4471707K363536j3145620m875332
41370h413152J6467568K0113428L526463q762486o555768l121829n597305n383911
41362B273008N6394J268877l470350m233419J370677M963957N308192Q941254
41354A6478590J1390677O57057j6678785j7280567K978834J8413607J0599549
41347B6558962n351778o399186M871177R652810K216746p911866j4003568j6243096
41339f609799j3408260m006629P090347J2437474R889744J925043p269920j0751091
41331a0703091l596350P389889R038792Q48744l704880O17925K768394l084884
$$ plain form
41323 -425461 -5841422 -2291088 9252320 15918891 14825537 17286599 26653806 29313310
41315 29313310 16531824 663799 -1610895 8461145 16889609 15842595 7580387 -2924437
41307 -2924437 -9801528 -7288989 2182689 6899910 733819 -7834419 -9799098 -10330681
41299 -10330681 -18125399 -27317533 -24392815 -10059893 13419 -3330240 -12806737 -17959762
41291 -17959762 -17120813 -12668304 -4237396 7681363 17849563 21422485 19392418 15594039
41283 15594039 11417361 5781927 -2326222 -12240082 -19463719 -15799864 2452818 25162030
41275 25162030 34097640 22356496 3152680 -5863946 -3107383 -1466470 -8514427 -16459892
41267 -16459892 -13806557 -433123 13930237 22796824 28462136 34621787 38876030 35424655
$$ packed form
41323d25461n415961L550334J1543408O666571j093354K461062R367207K659504
41315B9313310j2781486j5868025k274694J0072040Q428464j047014q262208j0504824
41307b924437o877091K512539R471678M717221o166091q568238j964679n31583
41299a0330681p794718r192134K924718J4332922J0073312l343659r476497n153025
41291a7959762Q38949M452509Q430908J1918759J0168200L572922k030067l798379
41283A5594039m176678n635434q108149r913860p223637L663855J8252682K2709212
41275B5162030Q935610j1741144j9203816r016626K756563J640913p047957p945465
41267a6459892K653335J3373434J4363360Q866587N665312O159651M254243l451375
$$ plain form
41259 35424655 22676122 5376479 -9842704 -19064332 -22033498 -20458715 -15488949 -6410263
41251 -6410263 7294090 22528926 33616821 38024473 38682772 38893699 37622546 32245983
41243 32245983 23252810 13288299 4149905 -2359148 -4051499 -2594757 -4030769 -10075861
41235 -10075861 -13554569 -9277605 -4438730 -8445440 -16171953 -13870072 -850041 8537415
41227 8537415 6456145 692390 -2270815 -7652821 -16678668 -15215300 7091911 35816881
41219 35816881 46251959 34290378 17667378 9035637 3622736 -5372683 -14221340 -16471949
41211 -16471949 -12004711 -2984557 9885495 21994081 24772597 17465837 11329569 14940152
41203 14940152 21865238 21072216 14063477 11448482 14964283 14026543 1952473 -13801357
$$ packed form
41259C5424655j2748533j7299643j5219183r221628k969166J574783M969766R078686
41251f410263J3704353J5234836J1087895M407652O58299K10927j271153n376563
41243C2245983q993173r964511r138394o509053j692351J456742j436012o045092
41235a0075861l478708M276964M838875m006710p726513K301881J3020031R387456
41227H537415k081270n763755k963205n382006r025847J463368K2307211K8724970
41219C5816881J0435078j1961581j6623000q631741n412901q995419q848657k250609
41211a6471949M467238R020154J2870052J2108586K778516p306760o136268L610583
41203A4940152O925086p93022p008739k614995L515801r37740j2074070j5753830
$$ plain form
41195 -13801357 -22252109 -22792801 -22215250 -22708069 -21109840 -18639490 -21930579 -31033301
41187 -31033301 -34183184 -21790874 -1630223 8575219 3295578 -4621505 -2412606 5901877
41179 5901877 7080397 -2474967 -13028692 -14749002 -7466458 3224721 13376134 21532102
41171 21532102 26095837 25382449 19603430 11566759 5843032 6551663 13435404 19601073
41163 19601073 16194413 1874020 -13751344 -19105165 -13128802 -5849344 -5183017 -6600505
41155 -6600505 -221343 13351367 20739336 11576711 -8781720 -26168038 -32395891 -28116507
41147 -28116507 -16107220 -44916 12546026 15323858 11085467 6795375 1556867 -10583516
41139 -10583516 -25789797 -31041413 -23542989 -17026296 -21401131 -27299815 -20796009 -4486594
$$ packed form
41195a3801357q450752n40692N77551m92819J598229K470350l291089r102722
41187c1033301l149883J2392310K0160651J0205442n279641p917083K208899Q314483
41179E901877J178520r555364j0553725j720310P282544J0691179J0151413Q155968
41171B1532102M563735p13388n779019q036671n723727P08631O883741O165669
41163A9601073l406660j4320393j5625364n353821N976363P279458O66327j417488
41155f600505O379162J3572710P387969r162625k0358431j7386318o227853M279384
41147b8116507J2009287J6062304J2590942K777832m238391m290092n238508j2140383
41139a0583516j5206281n251616P498424O516693m374835n898684O503806J6309415
$$ plain form
41131 -4486594 7646034 9962973 8002805 6288942 5179219 6851264 12789750 16862575
41123 16862575 11656180 616230 -6245774 -7181052 -8495867 -11301979 -10928102 -8899778
41115 -8899778 -11390673 -14227792 -4874845 15601032 27532305 18070047 -1237053 -12428871
41107 -12428871 -15053362 -19415849 -25580424 -25093898 -18822935 -16494314 -18695066 -14994327
41099 -14994327 -3706432 774883 -11246273 -27053940 -26172497 -8087648 6456713
41092 6456713 2327480 -12070155 -18360085 -12023144 -4307247 -3576439 -5095293 -2021838
41084 -2021838 2361820 667324 -5510535 -7677072 -4269111 -3182202 -8689990 -14136956
41076 -14136956 -11975752 -4562921 817986 2997144 6262965 11370929 14438620 14556265
$$ packed form
41131d486594J2132628K316939j960168j713863j109723J672045N938486M072825
41123A6862575n206395j1039950o862004r35278j314815k806112L73877K028324
41115h899778k490895k837119R352947K0475877J1931273r462258j9307100j1191818
41107a2428871k624491m362487o164575M86526O270963K328621k200752L700739
41099a4994327J1287895M481315j2021156j5807667Q81443J8084849J4544361
41092F456713m129233j4397635o289930O336941P715897P30808j518854L073455
41084b021838M383658j694496o177859k166537L407961J086909n507788n446966
41076a4136956K161204P412831N380907K179158L265821N107964L067691J17645
$$ plain form
41068 14556265 15773357 19545007 20529902 13364698 146336 -12679902 -22379720 -29962466
41060 -29962466 -33181074 -26109717 -8771433 7866182 12304546 5917940 28250 241307
41052 241307 571057 -5199633 -13408785 -16474300 -14087499 -12664155 -15926313 -20821684
41044 -20821684 -21637131 -14996134 -2620169 8220488 9822018 2666065 -4153380 -4057582
41036 -4057582 -550231 -350223 -4125945 -8702112 -12950216 -15751704 -14034266 -9681125
41028 -9681125 -11700477 -22729915 -30440281 -23768620 -11063336 -7702814 -11059674 -5783025
41020 -5783025 8080627 12998086 3164623 -4881573 961583 9513497 5897914 -5713710
41012 -5713710 -12723312 -14553150 -17281827 -18086750 -11385575 -3469943 -4626657 -10855417
$$ packed form
41068A4556265J217092L771650R84895p165204j3218362j2826238r699818p582746
41060b9962466l218608P071357J7338284J6637615M438364o386606n889690K13057
41052B41307L29750n770690q209152l065515K386801J423344l262158m895371
41044b0821684q15447O640997J2375965J0840657J601530p155953o819445R5798
41036d057582L507351K00008l775722m576167m248104k801488J717438M353141
41028i681125k019352j1029438p710366O671661J2705284L360522l356860N276649
41020e783025J3863652M917459r833463q046196N843156Q551914l615583j1611624
41012e713710p009602j829838k728677q04923O701175P915632j156714o228760
$$ plain form
41004 -10855417 -9278721 -96973 1877073 -11104316 -28743015 -35825365 -27469669 -10509810
40996 -10509810 2198354 -629076 -17935896 -33398343 -32049329 -19314613 -13911256
40989 -13911256 -22012157 -29724654 -23669503 -8105959 3658955 6421755 5287594 6372158
40981 6372158 11313427 18114137 23370754 25244071 25495424 26089482 24268773 15853230
40973 15853230 3550326 -4333222 -5225240 -5864117 -11258635 -16249466 -13457357 -5259146
40965 -5259146 -1010866 -3586570 -5099473 2185313 14949312 22247470 18122447 6963468
40957 6963468 -3938204 -12492178 -19099085 -20145531 -11604302 1639101 8653689 7107802
40949 7107802 6744208 13727255 20038713 15918912 5348746 -1128303 -3676535 -10903709
$$ packed form
41004a0855417J576696R181748J974046j2981389j7638699p082350Q355696J6959859
40996a0509810J2708164k827430j7306820j5462447J349014J2734716N403357
40989a3911256q100901p712497O055151J5563544J1764914K762800j134161J084564
40981F372158M941269O800710N256617J873317K51353N94058j820709q415543
40973A5853230j2302904p883548q92018o38877n394518m990831K792109Q198211
40965e259146M248280k575704j512903P284786J2763999P298158m125023j1158979
40957F963468j0901672q553974o606907j046446Q541229J3243403P014588j545887
40949G107802l63594O983047O311458m119801j0570166o477049k548232p227174
$$ plain form
40941 -10903709 -22568335 -27917701 -22904100 -16551805 -15547803 -13674828 -4301187 5275787
40933 5275787 2621880 -10428017 -17911895 -10479941 2384346 5253832 -3615576 -12374775
40925 -12374775 -13520008 -13220171 -19248602 -27138585 -26565578 -17261018 -8016250 -1249398
40917 -1249398 8889875 21147488 24082411 14949220 8315894 15502772 26953582 28038803
40909 28038803 22571002 24753267 34434241 37736035 29368956 17764152 8904357 569971
40901 569971 -7473834 -12596658 -18397811 -29195087 -36164968 -27188186 -11429245 -12857937
40893 -12857937 -33966011 -47880659 -36691812 -16806228 -11712954 -18080787 -17705234 -8867566
40885 -8867566 -3946602 -3879809 3114826 19051900 30631131 27964655 15710690 4111855
$$ packed form
40941a0903709j1664626n349366N013601O352295J004002J872975R373641R576974
40933E275787k653907j3049897p483878P431954J2864287K869486q869408q759199
40925a2374775j145233K99837o028431p889983N73007R304560R244768O766852
40917a249398J0139273J2257613K934923r133191o633326P186878J1450810J085221
40909B8038803n467801K182265R680974L301794q367079j1604804q859795q334386
40901E69971q043805n122824n801153j0797276o969881Q976782J5758941j428692
40893a2857937k1108074j3914648J1188847J9885584N093274o367833L75553Q837668
40885h867566M920964O6793O994635J5937074J1579231k666476j2253965j1598835
$$ plain form
40877 4111855 -675022 2939165 11590010 16845169 13618613 8108564 10046120 18939657
40869 18939657 25872292 26732073 24996574 22908889 18774251 12896483 8659243 7365641
40861 7365641 7312110 6695506 3132704 -5820165 -16354507 -18316122 -8816843 159208
40853 159208 -3031706 -12917527 -16341649 -12918719 -12673305 -17220991 -18239750 -13274308
40845 -13274308 -8198674 -3950322 4086032 12165150 9470020 -2917612 -9485079 -2515667
40837 -2515667 6924786 7005043 1157914 -1973185 -2779703 -5427444 -7905143 -6527812 -2553667
40828 -2553667 3191967 13659113 26225791 30178085 22732127 17204031 23706466 31462075
40820 31462075 24672877 8410809 1978792 10292884 19127839 18761514 15594582 16552242
$$ packed form
40877D111855m786877L614187Q650845N255159l226556n510049J937556Q893537
40869A8939657O932635Q59781j735499k087685m134638n877768m237240j293602
40861G365641n3531o16604l562802q952869j0534342j961615R499279Q976051
40853A59208l190914r885821l424122L422930K45414m547686j018759M965442
40845a3274308N075634M248352Q036354Q079118k695130j2387632o567467O969412
40837b515667R440453Q0257n847129l131099q06518k647741k477699J377331L974145
40828b553667N745634J0467146J2566678L952294p445958n528096O502435P755609
40820C1462075o789198j6262068o432017Q314092Q834955l66325l166932R57660
$$ plain form
40812 16552242 16946143 11302209 5298126 7995178 18346973 26586077 25374809 14970044
40804 14970044 935025 -9546106 -12508389 -11534133 -14176291 -21980370 -28003762 -26568032
40796 -26568032 -21061917 -18834485 -22227952 -28299339 -34121772 -38379779 -40046928 -39223954
40788 -39223954 -37822742 -36653022 -33566042 -27077186 -19959788 -16533725 -17887144 -21787320
40780 -21787320 -25014716 -23570889 -13971300 1617768 14076365 16092977 10968404 7977401
40772 7977401 10062095 11591292 8106076 2055398 -2733340 -6513357 -10670534 -14146105
40764 -14146105 -16217027 -18629619 -21264636 -19969959 -13468146 -8349318 -10750525 -15838249
40756 -15838249 -13325616 -2801732 4478620 484894 -10417653 -19794596 -25064596 -26451359
$$ packed form
40812A6552242L93901n643934o004083K697052J0351795Q239104j211268j0404765
40804A4970044j4035019j0481131k962283R74256k642158p804079o023392J435730
40796b6568032N506115K227432l393467o071387n822433m258007j667149Q22974
40788c9223954J401212J169720L086980O488856P117398L426063j353419l900176
40780b1787320l227396J443827R599589J5589068J2458597K016612n124573k991003
40772G977401K084694J529197l485216o050678m788738l780017m157177l475571
40764a4146105k070922k412592k635017J294677O501813N118828k401207n087724
40756a5838249K512633J0523884P280352l993726j0902547r376943n270000j386763
$$ plain form
40748 -26451359 -21118624 -8016741 5367327 9337556 4098905 -1161474 -823571 2139196
40740 2139196 3794889 4384996 3362214 -3558638 -17007741 -28146620 -26976502 -15553126
40732 -15553126 -7432080 -12634348 -26358442 -34140357 -26323716 -6116407 15069501 27772468
40724 27772468 29540616 22425746 9391882 -5236036 -15070263 -16144725 -12080365 -10415915
40716 -10415915 -12478457 -11285964 -2230971 8628251 11898685 7291406 2149653 -909167
40708 -909167 -6442146 -14655439 -16580834 -6909679 5153294 6766046 -363508 -2584518
40700 -2584518 5682188 15176508 17388743 16186006 17744443 18127112 10666867 47484
40692 47484 -2427818 3891938 7271832 635203 -8955506 -11452888 -7168009 -4225649
$$ packed form
40748b6451359N332735J3101883J3384068L970229n238651n260379L37903K962767
40740B139196J655693N90107j022782o920852j3449103j1138879J170118J1423376
40732a5553126Q121046n202268j3724094p781915P816641K0207309K1185908J2702967
40724B7772468J768148p114870j3033864j4627918r834227j074462M064360J664450
40716a0415915k062542J192493R054993J0859222L270434m607279n141753l058820
40708i09167n532979q213293j925395R671155J2062973J612752p129554k221010
40700b584518Q266706R494320K212235j202737J558437L82669p460245j0619383
40692D7484k475302O319756L379894o636629r590709k497382M284879K942360
$$ plain form
40684 -4225649 -7626098 -15320831 -21801734 -21877947 -13610472 -903748 8539276 10240978
40676 10240978 6774609 3913412 5210873 10633250 17186170 19991461 16035183 7918678
40668 7918678 1301525 -1172951 -407260 2737368 6279212 4451387 -6112604 -18354742
40660 -18354742 -21857382 -17801012 -16251727 -17791574 -11663562 3108766 9638100 -3932752
40652 -3932752 -25388306 -34009709 -25779084 -11373869 1713441 11558740 14378824 9923015
40644 9923015 8615074 18337675 29175436 26953074 16917196 15807212 23429071 22458669
40636 22458669 7245900 -7530343 -10902414 -9278166 -10266366 -10800131 -8738667 -9469787
40628 -9469787 -12722227 -9114662 1229162 3446130 -7922395 -16541715 -9472695 1581265
$$ packed form
40684d225649l400449p694733o480903p6213Q267475J2706724R443024J701702
40676A0240978l466369k861197J297461N422377O552920K805291l956278q116505
40668G918678o617153k474476P65691L144628L541844j827825j0563991j2242138
40660a8354742l502640M056370J549285j539847O128012J4772328O529334j3570852
40652c932752k1455554q621403Q230625J4405215J3087310R845299K820084m455809
40644I923015j307941R722601J0837761k222362j0035878j109984P621859r70402
40636B2458669j5212769j4776243l372071J624248r88200n33765K061464p31120
40628i469787l252440L607565J0343824K216968j1368525q619320P069020J1053960
$$ plain form
40620 1581265 593418 -6149132 -3442638 4839504 3679649 -4841922 -4963091 4093848
40612 4093848 6359156 -2371282 -6207869 4591380 17450796 16337663 3046171 -9093883
40604 -9093883 -12419359 -8450209 -2803895 -2629880 -11344354 -21347125 -20449839 -9834040
40596 -9834040 -5663889 -16646153 -29927598 -28046615 -11921282 3059159 7970556 6517859
40588 6517859 3615689 -1017110 -7658170 -13992297 -19320571 -24365060 -25535380 -16679142
40580 -16679142 393244 13679211 14284454 7295067 3397312 2968051 -3540879 -19426458
40572 -19426458 -34417892 -37546848 -31099567 -25878243 -26853131 -30351408 -32421998 -31664351
40564 -31664351 -24884978 -9411464 8523098 16516241 10807006 1204400 -2164018 548998
$$ packed form
40620A581265r87847o742550K706494Q282142j159855q521571j21169R056939
40612D093848K265308q730438l836587J0799249J2859416j113133j3291492j2140054
40604i093883l325476L969150N646314J74015q714474j0002771Q97286J0615799
40596i834040M170151j0982264j3281445J880983J6125333J4980441M911397j452697
40588F517859k902170m632799o641060o334127n328274n044489j170320Q856238
40580a6679142J7072386J3285967O05243o989387l897755m29261o508930j5885579
40572a9426458j4991434l128956O447281N221324r74888l498277k070590P57647
40564c1664351O779373J5473514J7934562P993143n709235r602606l368418K713016
$$ plain form
40556 548998 5335412 12262122 20401795 23121882 17064720 9476348 7879362 8508643
40548 8508643 4482894 -818386 -273639 2159298 -2882980 -11956466 -11236224 1775386
40540 1775386 13290672 13682259 9808766 11060290 14501641 11825148 2763742 -6334508
40532 -6334508 -11291842 -10672216 -3026800 9399573 18146944 16481098 7857146 1380227
40524 1380227 251130 -1368461 -10663351 -27253026 -40996572 -39128161 -19025805 6219574
40516 6219574 19359953 16246122 6895650 393514 -3857473 -9169634 -14454492 -17291533
40508 -17291533 -17178312 -13055263 -4772679 1081725 -3524871 -13258254 -11317367 6599522
40500 6599522 21400371 14701500 -5077759 -14399108 -6553794 3678605 5568666 6044434
$$ packed form
40556E48998M786414O926710Q139673K720087o057162p588372j596986O29281
40548H508643m025749n301280N44747K432937n042278r073486P20242J3011610
40540A775386J1515286L91587l873493J251524L441351k676493r061406r098250
40532f334508m957334O19626P645416J2426373Q747371j665846q623952o476919
40524A380227j129097j619591r294890j6589675j3743546J868411K0102356K5245379
40516F219574J3140379l113831r350472o502136m250987n312161n284858k837041
40508a7291533J13221M123049Q282584N854404m606596r733383J940887J7916889
40500F599522J4800849o698871j9779259r321349P845314J0232399J890061M75768
$$ plain form
40492 6044434 13594421 22492857 21943906 12710232 5160611 4382143 5437159 2846738
40484 2846738 -2011495 -5218796 -7536491 -12773015 -19814420 -21418140 -13958490 -4666261
40476 -4666261 -3482214 -9290620 -11737543 -7657648 -6784992 -16241752 -27307048 -26061389
40468 -26061389 -12610947 -533659 991649 -4071480 -7379003 -5513724 586021 7927794
40460 7927794 10597776 2954647 -12630951 -25688244 -28635417 -24417281 -20591882 -19731830
40452 -19731830 -19393569 -18565795 -19418123 -23309541 -28467546 -31620854 -29755373 -21094134
40444 -21094134 -7507188 3901476 5266266 -3790811 -14674781 -19229345 -18683846 -19385009
40436 -19385009 -21217424 -17028293 -5580694 2274523 -3089167 -15025652 -17252913 -4291560
$$ packed form
40492F044434P549987Q898436n48951r233674p549621p78468J055016k590421
40484B846738m858233l207301k317695n236524p041405j603720P459650R292229
40476d666261J184047n808406k446923M079895Q72656r456760j1065296J245659
40468b6061389J3450442J2077288J525308n063129l307523J865279O099745P341773
40460G927794K669982p643129j5585598j3057293k947173M218136L825399Q60052
40452a9731830L38261Q27774q52328l891418n158005l153308J865481Q661239
40444b1094134J3586946J1408664J364790r057077j0883970m554564N45499p01163
40436a9385009j832415M189131J1447599P855217n363690j1936485k227261J2961353
$$ plain form
40428 -4291560 12731544 20894093 18079748 9557799 778261 -2787141 3287094 15751987
40420 15751987 23999158 22384340 16959712 15013043 14459757 10750158 8328724 15359613
40412 15359613 29542775 38660783 35550528 25523484 18502407 19369411 25810095 30477199
40404 30477199 26078819 13507486 3460294 4226736 9902165 8054957 -2392035 -10017998
40396 -10017998 -8126473 -3239080 -2999623 -4740881 -2405881 1888024 1446008 -2868597
40388 -2868597 -2305301 7056775 17154780 16926306 6177437 -3126562 -185389 12421595
40380 12421595 22315100 21829034 14989834 9815618 8867606 9944322 10914740 9292313
40372 9292313 1399242 -12022748 -22339836 -21512276 -12061167 -2506216 4745575 13523398
$$ packed form
40428d291560J7023104Q162549k814345q521949q779538l565402O074235J2464893
40420A5751987Q247171j614818n424628j946669n53286l709599k421434P030889
40412A5359613J4183162R118008l110255j0027044p021077Q67004O440684M667104
40404C0477199m398380j2571333j0047192P66442N675429j847208j0446992p625963
40396a0017998J891525M887393K39457j741258K335000M293905m42016m314605
40388b868597N63296R362076J0098005k28474j0748869r303999K941173J2606984
40380A2421595R893505m86066o839200n174216r48012J076716R70418j622427
40372I292313p893071j3421990j0317088Q27560R451109R554951P251791Q777823
$$ plain form
40364 13523398 23476620 28454934 26458225 23376157 24343056 27545448 28711628 25903976
40356 25903976 17890273 3863772 -12362216 -23099349 -24702415 -20754746 -15806536 -10800901
40348 -10800901 -6337830 -4908388 -7102480 -10056892 -11855455 -13214296 -13571110 -10830081
40340 -10830081 -6529217 -5496467 -8638157 -12118679 -14958239 -19698804 -23536407 -18797682
40332 -18797682 -7356161 -4298010 -18249525 -35753235 -36174885 -17954134 522166
40325 522166 4230853 -3851846 -10675600 -6835283 8192362 26743078 37148780 33021152
40317 33021152 19841653 8202803 1053099 -7044139 -18548631 -27412639 -26286000 -14273488
40309 -14273488 3396444 18844873 24698823 19711301 12268067 12308480 18185385 17971482
$$ packed form
40364A3523398R953222M978314j996709l082068R66899L202392J166180k807652
40356B5903976q013703j4026501j6225988j0737133j603066L947669M948210N005635
40348a0800901M463071J429442k194092k954412j798563j358841l56814K741029
40340a0830081M300864J032750l141690l480522k839560m740565l837603M738725
40332a8797682J1441521L058151j3951515j7503710m21650J8220751J8476300
40325E22166L708687q082699o823754L840317J5027645J8550716J0405702m127628
40317C3021152j3179499j1638850p149704q097238j1504492q864008J126639J2012512
40309a4273488J7669932J5448429N853950m987522p443234M0413N876905k13903
$$ plain form
40301 17971482 6300474 -7244701 -11187599 -6968671 -3887561 -4643790 -5350499 -7447613
40293 -7447613 -17964979 -34903204 -42497573 -28895197 -3327682 12683343 9336419
40286 9336419 -3602927 -11832707 -10772586 -3467160 6297713 13288686 10599346 -1948259
40278 -1948259 -13632812 -15299913 -12892341 -19318914 -34314631 -42993155 -36133173 -21851816
40270 -21851816 -12970952 -11616162 -12255586 -12457390 -12807363 -11173585 -5322938 1307762
40262 1307762 3711883 3594066 6775576 13100726 15569834 10053062 -5936 -9895946
40254 -9895946 -19222124 -28468756 -34141079 -31651396 -22088849 -12691625 -9287873 -9760332
40246 -9760332 -7214239 250422 5929715 3062703 -5705356 -11929283 -12985154 -14056582
$$ packed form
40301A7971482j1671008j3545175l942898M218928L081110p56229p06709k097114
40293g447613j0517366j6938225p594369J3602376K5567515J6011025l346924
40286I336419j2939346q229780J060121P305426R764873O990973k689340j2547605
40278a948259j1684553j667101K407572o426573j4995717q678524O859982J4281357
40270b1851816Q880864J354790o39424k01804l49973J633778N850647O630700
40262A307762K404121j17817L181510O325150K469108n516772j0058998r890010
40254i895946r326178r246632n672323K489683R562547R397224L403752m72459
40246i760332K546093P464661N679293k867012q768059o223927j055871j071428
$$ plain form
40238 -14056582 -18163915 -21067043 -18864573 -14580261 -12904517 -12996317 -10953161 -5737349
40230 -5737349 1403698 9847859 18117531 23341847 26034995 30856742 37850977 37806271
40222 37806271 22979356 -721000 -18962066 -24729128 -23467841 -24335255 -31067372 -39408771
40214 -39408771 -39757425 -26130745 -6675765 712544 -10075397 -22669930 -18521700 -2096496
40206 -2096496 6700326 1669616 -3225268 2823536 13017399 16767508 14703265 12086462
40198 12086462 7622201 -1772843 -11997008 -16660133 -16454096 -15589654 -12303270 -1145649
40190 -1145649 16198651 29275332 29341737 17862309 3868921 -4969961 -8279902 -10989877
40182 -10989877 -16017839 -20735755 -22309648 -23205055 -26320457 -27344945 -20177329 -9786286
$$ packed form
40238a4056582m107333k903128K202470M284312J675744r1800K043156N215812
40230e737349P141047Q444161Q269672N224316K693148M821747O994235m4706
40222C7806271j4826915k3700356j8241066n767062J261287q67414o732117q341399
40214c9408771l48654J3626680J9454980P388309j0787941j2594533M148230J6425204
40206b096496Q796822n030710m894884O048804J0193863L750109k064243k616803
40198A2086462m464261r395044j0224165m663125K06037Q64442L286384J1157621
40190a145649J7344300J3076681O6405j1479428j3993388q838882l309941k709975
40182a0989877n027962m717916j573893q95407l115402j024488P167616J0391043
$$ plain form
40174 -9786286 -9631335 -22627790 -34090161 -30338476 -16911555 -9750438 -13484730 -18398954
40166 -18398954 -16775428 -12002626 -10027114 -10346227 -9465402 -7205992 -4195522 3276481
40158 3276481 19231974 38753114 48786674 41693102 24405064 9455775 -323087
40151 -323087 -10917796 -21658644 -21260523 -4937415 13291027 15160354 599196 -13754876
40143 -13754876 -15176735 -4313509 12654170 29011175 35281925 25238368 6963999
40136 6963999 -3350231 -1660483 1075384 -855932 1493737 14243390 26697466 25107292
40128 25107292 11387928 -1695929 -6861745 -5311399 -761529 911992 -6814997 -21431116
40120 -21431116 -30279515 -26952957 -20164250 -18026506 -15052498 -6633675 -3575524 -14616713
$$ packed form
40174i786286J54951j2996455j1462371L751685J3426921P161117l734292m914224
40166a8398954J623526M772802J975512l19113Q80825K259410L010470P472003
40158C276481J5955493J9521140J0033560p093572j7288038j4949289r778862
40151c23087j0594709j0740848L98121J6323108J8228442J869327j4561158j4354072
40143a3754876j421859J0863226J6967679J6357005O270750j0043557j8274369
40136F963999j0314230J689748K735867j931316K349669J2749653J2454076j590174
40128B5107292j3719364j3083857n165816J550346M549870J673521p726989j4616119
40120b1431116q848399L326558O788707K137744K974008Q418823L058151j1041189
$$ plain form
40112 -14616713 -24900825 -14111032 9440910 17113613 1925319 -12271939 -7880351
40105 -7880351 4200558 8528077 8995237 14659633 20018515 16687237 11404073 14503519
40097 14503519 20167276 16137845 6059375 3580764 8327896 7083990 -1325786 -1769414
40089 -1769414 11773661 23699519 18857108 4233098 -2505119 3064040 11755862 18184025
40081 18184025 24730218 29542078 24508456 9626942 -1176309 3673187 17525051 24149001
40073 24149001 18618049 10646120 8178843 7401354 1944296 -6175051 -10556090 -10285644
40065 -10285644 -9721647 -11174191 -13079508 -13801180 -12839449 -9497468 -3969236 1340039
40057 1340039 4036288 3437722 -1088624 -8994126 -13847729 -7058795 8605935 17092041
$$ packed form
40112a4616713j0284112J0789793K3551942P672703j5188294j4197258M391588
40105g880351J2080909M327519M67160N664396N358882l331278n283164L099446
40097A4503519N663757m029431j0078470k478611M747132j243906q409776m43628
40089a769414J3543075J1925858m842411j4624010o738217N569159Q691822O428163
40081A8184025O546193M811860n033622j4881514j0803251M849496J3851864O623950
40073B4149001n530952p971929k467277p77489n457058q119347m381039K70446
40065a0285644N63997j452544j905317p21672R61731L341981N528232N309275
40057A340039K696249n98566m526346p905502m853603O788934J5664730Q486106
$$ plain form
40049 17092041 8806406 -5140566 -9446257 -8461100 -18038285 -36768864 -44086948 -30455508
40041 -30455508 -11883102 -5856243 -7198746 81814 16813611 28162273 24810805 13009162
40033 13009162 4246918 3381118 7757961 12423595 14292348 12672274 6394222 -6795838
40025 -6795838 -23811520 -32396164 -22749431 -2964560 7473674 1673393 -8108684 -10837432
40017 -10837432 -10240701 -11547052 -9052927 1454388 9423729 3122823 -11139382 -17654685
40009 -17654685 -13596881 -8626485 -6707074 -2992465 3573390 8767281 13038956 19416248
40001 19416248 22465059 13870520 -244207 -2622121 10818782 23212913 18570665 791176
39993 791176 -13958247 -14844708 -2811627 11714598 14910445 2532735 -11457499 -9521357
$$ packed form
40049A7092041q285635j3946972m305691R85157r577185j8730579p318084J3631440
40041c0455508J8572406O026859j342503P280560J6731797J1348662l351468j1801643
40033A3009162q762244q65800M376843M665634J868753j620074o278052j3190060
40025f795838j7015682q584644R646733J9784871J0438234n800281r782077k728748
40017a0837432N96731j306351K494125J0507315P969341o300906j4262205o515303
40009a7654685M057804M970396J919411L714609O565855N193891M271675O377292
40001A9416248L048811q594539j4114727k377914J3440903J2394131m642248j7779489
39993G91176j4749423q86461J2033081J4526225L195847j2377710j3990234J936142
$$ plain form
39985 -9521357 5430372 13799701 8711578 4663326 10879104 14694315 3587793 -12599786
39977 -12599786 -17683670 -14281983 -14023820 -12638170 2780401 25967416 34531627 23053528
39969 23053528 11577707 13920570 16473609 649902 -27546160 -45217802 -42285977
39962 -42285977 -29960409 -23279902 -27061153 -37718329 -48067732 -49242955 -37082596
39955 -37082596 -19522828 -10681543 -14478467 -20105130 -17139280 -9025578 -6149963 -10327109
39947 -10327109 -13430328 -9489001 -1172898 5441532 6145724 -1516275 -16558711 -31127992
39939 -31127992 -35871503 -31604319 -28656000 -31105785 -29855779 -17272270 -359241 9438322
39931 9438322 12371360 15354606 16818918 10433405 838301 -33205 6787999 6156687
$$ packed form
39985i521357J4951729Q369329n088123m048252O215778L815211j1106522j6187579
39977a2599786n083884L401687K58163J385650J5418571K3187015Q564211j1478099
39969B3053528j1475821K342863K553039j5823707k8196062j7671642K931825
39962d2285977J2325568O680507l781251j0657176j0349403j175223J2160359
39955c7082596J7559768Q841285l796924n626663K965850Q113702K875615m177146
39947a0327109l103219L941327Q316103O614430P04192p661999j5042436j4569281
39939c1127992m743511M267184K948319k449785J250006J2583509J6913029R797563
39931I438322K933038K983246J464312o385513r595104q71506O821204o31312
$$ plain form
39923 6156687 -8091465 -23165580 -26498399 -21671434 -17494053 -13898832 -8973864 -8988705
39915 -8988705 -18665850 -29142148 -28689356 -20447414 -16906026 -19834670 -18206908 -5922049
39907 -5922049 9057307 15403170 11439667 5664871 7476952 16543055 20324736 7429570
39899 7429570 -14560214 -23598287 -10710252 7643850 13194587 10047604 12322509 18755497
39891 18755497 17775295 10982924 11067138 18425436 19870559 11465701 3415649 -405516
39883 -405516 -8418703 -21734864 -27539132 -20127935 -11661799 -12605830 -16880522 -16509591
39875 -16509591 -15957288 -19871440 -20083833 -8423788 8347867 19297717 24832781 28791207
$$ packed form
39923F156687j4248152j5074115l332819M826965M177381L595221M924968j4841
39915h988705r677145j0476298M52792Q241942L541388k928644J627762J2284859
39907e922049J4979356O345863l963503n774796J812081R066103L781681j2895166
39899G429570k1989784r038073J2888035J8354102N550737l146983K274905O432988
39891A8755497r80202o792371Q4214P358298J445123q404858q050052l821165
39883d05516q013187j3316161n804268P411197Q466136r44031m274692L70931
39875a6509591N52303l914152k12393J1660045J6771655J0949850N535064L958426
$$ [...]
##END NTUPLES=NMR SPECTRUM
##END=
