##TITLE=31Pdec_LR-731-C1B
 CDCl3, 24 sc
 17.12.2020
##JCAMPDX= 6.0         $$ Bruker NMR JCAMP-DX V2.0
##DATA TYPE= NMR SPECTRUM
##DATA CLASS= NTUPLES
##ORIGIN= UXNMR, Bruker Analytische Messtechnik GmbH
##OWNER= root
$$ XWIN-NMR		Version 3.5
$$ Thu Dec 17 10:16:28 2020 Russian Standard Time (UT+4h)  she@DPX200
##.OBSERVE FREQUENCY= 81.013821
##.OBSERVE NUCLEUS= ^31P
##.ACQUISITION MODE= SIMULTANEOUS
##.ACQUISITION SCHEME= undefined
##.AVERAGES= 24
##.DIGITISER RES= 17
##SPECTROMETER/DATA SYSTEM= spect
##.PULSE SEQUENCE= zgpg30
##.SOLVENT NAME= DMSO
##.SHIFT REFERENCE= (INTERNAL, DMSO, 0, 182.463)
##AUDIT TRAIL= $$ (NUMBER, WHEN, WHO, WHERE, WHAT)
$$ ##TITLE= Audit trail, XWIN-NMR		Version 3.5
$$ ##JCAMPDX= 5.01
$$ ##ORIGIN= Bruker BioSpin GmbH
$$ ##OWNER= she
$$ F:/spectra/data/she/nmr/P31/1/pdata/1/auditp.txt
$$ ##AUDIT TRAIL=  $$ (NUMBER, WHEN, WHO, WHERE, WHAT)
(   1,<2020-12-17 10:15:33.15 +0400>,<she>,<DPX200>,
      <created by zg, POWCHK disabled, PULCHK disabled
       configuration hash MD5:
       00 E9 B6 7A A2 85 ED C7 34 08 36 98 17 FE 4E 26
       data hash MD5: 32K
       EF 0C 9C 14 30 25 AA 61 B1 F2 5F 4D D0 8A FD 60>)
(   2,<2020-12-17 10:15:35.53 +0400>,<she>,<DPX200>,
      <Start of raw data processing
       efp BC_mod = 2 LB = 1 FT_mod = 6 PKNL = 1 PHC0 = -2273.679 PHC1 = -428.5992 SI = 64K 
       data hash MD5: 64K
       54 C5 92 58 68 2F EF 64 BE 01 DD E5 F2 E2 82 42>)
(   3,<2020-12-17 10:15:57.23 +0400>,<she>,<DPX200>,
      <pk PHC0 = -5.67152 PHC1 = 0 
       data hash MD5: 64K
       4B 41 BF 0C 91 5A BE 96 A0 10 C1 85 B9 A0 AB 84>)
(   4,<2020-12-17 10:16:00.93 +0400>,<she>,<DPX200>,
      <abs ABSG = 5 
       data hash MD5: 64K
       54 79 09 10 D8 41 56 01 44 9D D1 4D 26 24 0F BD>)
$$ ##END=
$$ 
$$ hash MD5
$$ 43 14 5E C5 4E 3E 70 C2 A5 E3 66 65 2A 77 68 E9
##$RELAX= 
##$RELAX= 
##$RELAX= 
##$RELAX= 
##$RELAX= 
##$RELAX= 
##$RELAX= 
##$RELAX= 
$$ Bruker specific parameters
$$ --------------------------
##$DU= <F:/spectra>
##$EXPNO= 1
##$NAME= <P31>
##$PROCNO= 1
##$TYPE= <nmr>
##$USER= <she>
##$AMP= (0..31)
100 100 100 100 100 100 100 100 100 100 100 100 100 100 100 100 100 100 
100 100 100 100 100 100 100 100 100 100 100 100 100 100 
##$AQSEQ= 0
##$AQ_mod= 1
##$AUNM= <au_zg>
##$AUTOPOS= <>
##$BF1= 81.014009
##$BF2= 200.13
##$BF3= 200.13
##$BF4= 200.13
##$BF5= 200.13
##$BF6= 200.13
##$BF7= 200.13
##$BF8= 200.13
##$BYTORDA= 1
##$CFDGTYP= 0
##$CFRGTYP= 5
##$CHEMSTR= <none>
##$CNST= (0..31)
1 1 145 1 1 1 1 1 1 1 1 1 1 1 1 1 1 1 1 1 1 1 1 1 1 1 1 1 1 1 1 1 
##$CPDPRG= <waltz16>
##$CPDPRG1= <>
##$CPDPRG2= <waltz16>
##$CPDPRG3= <>
##$CPDPRG4= <mlev>
##$CPDPRG5= <mlev>
##$CPDPRG6= <mlev>
##$CPDPRG7= <mlev>
##$CPDPRG8= <mlev>
##$CPDPRGB= <>
##$CPDPRGT= <>
##$D= (0..31)
0 1 0 0 0 0 0 0 0 0 0 0.03 2e-05 3e-06 0 0 0 0 0 0 0 0 0 0 0 0 0 0 0 0 
0 0 
##$DATE= 1608185732
##$DBL= (0..7)
120 120 120 11 120 120 24 19 
##$DBP= (0..7)
150 150 150 150 150 150 150 150 
##$DBP07= 0
##$DBPNAM0= <>
##$DBPNAM1= <>
##$DBPNAM2= <>
$$ [...]
##$SUBNAM3= <"">
##$SUBNAM4= <"">
##$SUBNAM5= <"">
##$SUBNAM6= <"">
##$SUBNAM7= <"">
##$SUBNAM8= <"">
##$SUBNAM9= <"">
##$SW= 369.568048894756
##$SWIBOX= (0..15)
0 1 3 0 0 0 0 0 0 0 0 0 0 0 0 0 
##$SW_h= 29940.119760479
##$TD= 32768
##$TD0= 1
##$TE= 0
##$TE2= 300
##$TE3= 300
##$TEG= 300
##$TL= (0..7)
0 120 53 12 22 120 120 120 
##$TP= (0..7)
150 150 150 150 150 150 150 150 
##$TP07= 0
##$TPNAME0= <>
##$TPNAME1= <>
##$TPNAME2= <>
##$TPNAME3= <>
##$TPNAME4= <>
##$TPNAME5= <>
##$TPNAME6= <>
##$TPNAME7= <>
##$TPOAL= (0..7)
0.5 0.5 0.5 0.5 0.5 0.5 0.5 0.5 
##$TPOFFS= (0..7)
0 0 0 0 0 0 0 0 
##$TUNHIN= 0
##$TUNHOUT= 0
##$TUNXOUT= 0
##$USERA1= <user>
##$USERA2= <user>
##$USERA3= <user>
##$USERA4= <user>
##$USERA5= <user>
##$V9= 5
##$VALIST= <valist>
##$VCLIST= <CCCCCCCCCCCCCCC>
##$VD= 0
##$VDLIST= <DDDDDDDDDDDDDDD>
##$VPLIST= <PPPPPPPPPPPPPPP>
##$VTLIST= <TTTTTTTTTTTTTTT>
##$WBST= 1024
##$WBSW= 4
##$XGAIN= (0..3)
0 0 0 0 
##$XL= 0
##$YL= 0
##$YMAX_a= 15101
##$YMIN_a= -11407
##$ZGOPTNS= <>
##$ZL1= 120
##$ZL2= 120
##$ZL3= 120
##$ZL4= 120
##$ABSF1= 182.463
##$ABSF2= -187.1042
##$ABSG= 5
##$ABSL= 3
##$ALPHA= 0
##$AQORDER= 0
##$ASSFAC= 0
##$ASSFACI= 0
##$ASSFACX= 0
##$ASSWID= 0
##$AUNMP= <proc_1d>
##$AZFE= 0.1
##$AZFW= 0.5
##$BCFW= 0
##$BC_mod= 2
##$BYTORDP= 0
##$COROFFS= 0
##$CY= -3
##$DATMOD= 1
##$DC= 0
##$DFILT= <>
##$DTYPP= 0
##$F1P= 0
##$F2P= 0
##$FCOR= 1
##$FTSIZE= 65536
##$FT_mod= 6
##$GAMMA= 0
##$GB= 0
##$INTBC= 1
##$INTSCL= 5.30512e-09
##$ISEN= 30
##$LB= 1
##$LEV0= 0
##$LPBIN= 0
##$MAXI= 10000
##$MC2= 0
##$MEAN= 0
##$ME_mod= 0
##$MI= 50
##$NCOEF= 0
##$NC_proc= -9
##$NLEV= 6
##$NOISF1= 182.463
##$NOISF2= 159.3651
##$NSP= 0
##$NTH_PI= 0
##$NZP= 0
##$OFFSET= 182.463
##$PC= 4
##$PHC0= -2279.351
##$PHC1= -428.5992
##$PH_mod= 1
##$PKNL= yes
##$PPARMOD= 0
##$PSCAL= 0
##$PSIGN= 0
##$REVERSE= no
##$SF= 81.014009
##$SI= 65536
##$SIGF1= 159.3651
##$SIGF2= -187.1042
##$SINO= 113.3802
##$SIOLD= 16384
##$SREGLST= <1H.CDCl3>
##$SSB= 0
##$STSI= 65536
##$STSR= 0
##$SW_p= 29940.119760479
##$SYMM= 0
##$S_DEV= 0
##$TDeff= 32768
##$TDoff= 0
##$TI= <>
##$TILT= no
##$TM1= 0
##$TM2= 0
##$TOPLEV= 0
##$USERP1= <user>
##$USERP2= <user>
##$USERP3= <user>
##$USERP4= <user>
##$USERP5= <user>
##$WDW= 1
##$XDIM= 65536
##$YMAX_p= 411994438
##$YMIN_p= -62352358
$$ End of Bruker specific parameters
$$ ---------------------------------
##NTUPLES= NMR SPECTRUM
##VAR_NAME=  FREQUENCY,     SPECTRUM/REAL,   SPECTRUM/IMAG
##SYMBOL=    X,             R,               I
##VAR_TYPE=  INDEPENDENT,   DEPENDENT,       DEPENDENT
##VAR_FORM=  AFFN,          ASDF,            ASDF
##VAR_DIM=   65536,         65536,           65536
##UNITS=     HZ,            ARBITRARY UNITS, ARBITRARY UNITS
##FACTOR=    0.456856943014862, 1,           1
##FIRST=     14782.0589164895, 0,            0
##LAST=      -15158.0608439895, 0,           0
##MIN=       -15158.0608439895, -62352358,   0
##MAX=       14782.0589164895, 411994438,    0
$$ Real data points
##PAGE= N=1
##DATA TABLE= (X++(R..R)), XYDATA
$$ [...]
44966A1714265j2158337n351425R763495J7173149R271526l878420r760854q253308
$$ 11714265 -444072 -5795497 3967998 21141147 30412673 26534253 16773399 8520091
44958H520091n953775m714847k945768j476705j079298M91573L168181K184096
$$ 8520091 2566316 -2148531 -5094299 -6571004 -7650302 -7158729 -3990548 -1806452
44950a806452l145622n097655O02204N298471p27592j1954247j3959388l474845
$$ -1806452 -4952074 -10049729 -9447525 -4149054 -4876646 -16830893 -30790281 -34265126
44942c4265126Q533481J2972432J1317059P369647R33769o425041q144651j524225
$$ -34265126 -25731645 -12759213 -1442154 5927493 6861262 436221 -7708430 -9232655
44934i232655N669872M204669l706360p005954j069312N805488M026080l779358
$$ -9232655 -3562783 641886 -3064474 -10070428 -11139740 -5334252 -1308172 -5087530
44926e087530o684226j451127K915083q07336o826407n491551J850536N922265
$$ -5087530 -11771756 -13222883 -10307800 -11115136 -17941543 -23433094 -21582558 -15660293
44918a5660293M149613K270218K753751K308883J008808K591548M375744r18019
$$ -15660293 -11510680 -9240462 -6486711 -4177828 -3169020 -577472 3798272 2880253
44910B880253j0537973j2022109k711558M905637L940557M335890J3367030J9469201
$$ 2880253 -7657720 -19679829 -22391387 -17485750 -13545193 -9209303 4157727 23626928
44902B3626928R799366p254657j3027216m446249N936054R413401O366257j677525
$$ 23626928 33426294 26171637 13144421 8698172 14634226 24047627 30413884 28736359
44894B8736359j0500303r743149L455867J3103370L565085j4823382j8119873
$$ 28736359 18236056 8492907 11948774 25052144 28617229 13793847 -4326026
44887d326026l610532P892120M044397n420221r339796r088957o971241L66102
$$ -4326026 -7936558 -44438 3999959 -1420262 -10760058 -19849015 -26820256 -26454154
44879b6454154R886966J0391138N88146n898274q60327P315621R473005P946453
$$ -26454154 -16567188 -6176050 -5587904 -11486178 -12346505 -5030884 4442121 12388574
44871A2388574N700814j482640j2723912j6126830n658677P856159J1911110P249305
$$ 12388574 18089388 16606748 3882836 -12243994 -17902671 -10046512 1864598 9113903
44863I113903Q2669p478812j1216139l905727R443032J0839570m513228j7000686
$$ 9113903 9196572 1717760 -9498379 -13404106 -3961074 6878496 2365268 -14635418
44855a4635418j1095373J263494K386174k302588J925468J0140259P268342k632018
$$ -14635418 -25730791 -24467297 -22081123 -24383711 -22458243 -12317984 -5049642 -7681660
44847g681660k766102N501913M582108p204740j1642125k482618L659554l452778
$$ -7681660 -10447762 -4945849 -363741 -7568481 -19210606 -21693224 -18033670 -21486448
44839b1486448r694309j55618J6697168K2672949J5321530N680451r79178q258521
$$ -21486448 -31180757 -31336375 -14639207 8033742 23355272 29035723 28056545 19798024
44831A9798024j6265964j8100320r674754L501183J1065625P537309k193315p080017
$$ 19798024 3532060 -14568260 -24243014 -20741831 -9676206 -2138897 -4332212 -11412229
44823a1412229j778770O531739O704013k098870r518973p151998K350006R880941
$$ -11412229 -13190999 -6659260 44753 -2054117 -11573090 -18725088 -16375082 -6494141
44815f494141R614199L526967j298875k10305L384977K870658p67847L15545O827415
$$ -6494141 3120058 6647025 5348150 5137845 8522822 11393480 10625633 10941178 17768593
44806A7768593Q290876r42864j0898328r919676j161883M702165N209491L564916
$$ 17768593 26059469 25116605 14218277 4298601 3136718 7838883 13048374 16613290
44798A6613290j383606r872726j3522996o602621K400413M459351N955093J4192221
$$ 16613290 15229684 5356958 -8166038 -14768659 -12368246 -7908895 -1953802 12238419
44790A2238419J7811453L900392j4217261j2985704K947085P900094j266240j903972
$$ 12238419 30049872 33950264 19733003 6747299 9694384 17594478 16328238 14424266
44782A4424266J0722558J2037399q472664k6218549k0657962n317672Q07664L305041
$$ 14424266 25146824 37184223 28711559 2493010 -18164952 -23482624 -22674960 -19369919
44774a9369919J0866907J0740139o532452k0370416q821652J3468811J6964638
$$ -19369919 -8503012 2237127 -4295325 -24665741 -33487393 -20018582 -3053944
44767c053944K754122n159909j541831r86047n045540j578756O746073N351268
$$ -3053944 -299822 -5459731 -7001562 -7987609 -13033149 -14611905 -7865832 -2514564
44759b514564k167974J842265J4570471J4125789j517751r068663L8666N732581
$$ -2514564 -4682538 -2840273 11730198 25855987 24338236 15269573 15308239 21040820
44751B1040820m141182j3233658o706278M885792P638557O362454P845065M133948
$$ 21040820 16899638 3665980 -3040298 1845494 9484051 15846505 23691570 27825518
44743B7825518r233401j7915556j0591181R89009J835503l021020l164324l240283
$$ 27825518 18592117 676561 -9914620 -8925611 -7090108 -10111128 -13275452 -16515735
44735a6515735q426922o695223J0481933K4585077J4149333q722782j4344911
$$ -16515735 -24942657 -31637880 -21155947 3429130 17578463 8855681 -5489230
44728e489230l05829R164128M486251L07219K979919j4421j1060657j2097000
$$ -5489230 -5795059 3369069 7855320 8162539 11142458 11128037 67380 -12029620
44720a2029620M138541J7425365J0372772m907126p716511K21272L306402r68827
$$ -12029620 -7891079 9534286 19907058 14999932 7283421 7504693 10811095 9842268
44712I842268l010720j117311j986954n232907l585971K994700O894074N495402
$$ 9842268 6831548 5714237 3727283 -1505624 -5091595 -2096895 4797179 10292581
44704A0292581K516224j701604r063402j3826806p142689O755589J1728824J692764
$$ 10292581 12808805 11107201 2043799 -11783007 -18925696 -12170107 -441283 1251481
44696A251481r519049o792503O304051J3979194Q905369j650943p580174o490823
$$ 1251481 -8267568 -15060071 -8756020 5223174 14128543 12477600 4897426 -1593397
44688a593397k547380K53004K116242O032524J2118097J4080430N128803j1436153
$$ -1593397 -4140777 -3887773 -1771531 4260993 16379090 30459520 35588323 24152170
44680B4152170k2475057j9191064o803967L791813Q992113J1263689J0235750
$$ 24152170 1677113 -17513951 -24317918 -20526105 -11533992 -270303 9965447
44673I965447M414213r02555J149509N386286j214248j7512731k3660667q082083
$$ 9965447 14379660 13477105 14626614 20012900 18798652 1285921 -22374746 -30456829
44665c0456829J2113434J2139083n457248j4080510r26808J6279192J6367727
$$ -30456829 -18343395 -6204312 -11661560 -25742070 -26668878 -10389686 5978041
44658E978041L117960m749800j252108L545128K881769J160846J969162J107973
$$ 5978041 9096001 4346201 3094093 6639221 9520990 10681836 12650998 13758971
44650A3758971l948705p334417m066511O41616j022605o530814o151901J752986
$$ 13758971 9810266 2475849 -1590662 -949046 -1971651 -8502465 -14654366 -12901380
44642a2901380P083684K500428n334602m754522M864470J3288203J4062053J0695323
$$ -12901380 -5817696 -3317268 -8651870 -13406392 -8541922 4746281 18808334 29503657
44634B9503657P012313M79167r453555j4276693o956154M949632P507383L19746
$$ 29503657 36515970 36995137 27541582 13264889 6308735 11258367 18765750 19085496
44626A9085496l334707K284217O293655j090774j2596503j4816657p505969j368005
$$ 19085496 15750789 18035006 24328661 23237887 10641384 -4175273 -11681242 -13049247
44618a3049247j143740j905757k57918J603913L302945P424395J1029837N992573
$$ -13049247 -14192987 -16098744 -16356662 -14752749 -11449804 -4025409 7004428 12997001
44610A2997001p322235j5253263p272324Q267901J3600910M614480m559190j435955
$$ 12997001 5674766 -9578497 -16850821 -8582920 5017990 9632470 5073280 3637325
44602C637325Q567212J1209139L388782m488123n316479m709857q799235j1050305
$$ 3637325 12204537 23413676 26802458 22314335 16997856 12287999 3488764 -7561541
44594g561541j760867J2947453J5198260J085367j0799652m634119R623229J0967821
$$ -7561541 -9322408 3625045 18823305 19908672 9109020 4474901 14098130 25065951
44586B5065951j732055r213188j226263R422648P092645n499055j4701497j4897902
$$ 25065951 23333896 14120708 12894445 22317093 29409738 23910683 9209186 -5688716
44578e688716r636973l07089J3736958K5149822K1159043O16716j9606002k1854080
$$ -5688716 -15325689 -15632778 -1895820 23254002 44413045 45029761 25423759 3569679
44570C569679p651653N316236M312821o269129j3958327j3136773p454039j871482
$$ 3569679 -4081974 1234262 5547083 -722046 -14680373 -27817146 -35271185 -37142667
44562c7142667J837521L040902J658890N16035L337024Q679609J0271576N468681
$$ -37142667 -35305146 -32264244 -30605354 -30089319 -26752295 -18072686 -7801110 -2332429
44554b332429j037110m463033o049411q298365q911334m607646K555347P856193
$$ -2332429 -3369539 -7832572 -13881983 -22180348 -31091682 -35699328 -33143981 -25287788
44546b5287788R826176Q660560K801901o460438j0780494l398590R910010J6681806
$$ -25287788 -15461612 -6801052 -3999151 -10459589 -21240083 -24638673 -14728663 1953143
44538A953143J3338768O652614R70088n827311j2765561j3168786n812298L26766
$$ 1953143 15291911 21944525 22914613 17087302 4321741 -8847045 -14659343 -14332577
44530a4332577j843667p388395o993723K70252P155270P755680K794565j974019
$$ -14332577 -16176244 -23564639 -30558362 -30288110 -23132840 -15377160 -12582595 -14556614
44522a4556614n15427P101238J2371977P304794l786624q006016p96409Q300165
$$ -14556614 -15072041 -7970803 4401174 11705968 7919344 -86672 -883081 7417084
44514G417084R168313K489932n537434j1228554j1749451m428085O171207Q945021
$$ 7417084 16585397 19075329 13537895 2309341 -9440110 -13868195 -7696988 1248033
44506A248033J148329n477229j441880N836212L943367n307436j0180769o995830
$$ 1248033 2396362 -3080867 -4522747 1313465 5256832 -50604 -10231373 -17227203
44498a7227203j377277M305996J1162989J3590638L712439j2374964j6665984
$$ -17227203 -18604480 -14298484 -3135495 10455143 14167582 1792618 -14873366
44491a4873366k609231J4424287J6310982L739734p851470q048258n90300M369214
$$ -14873366 -17482597 -3058310 13252672 16992406 9140936 1092678 502378 4871592
44483D871592J992345l044503k682513L792999P325654Q89574r188396j0566446
$$ 4871592 6863937 3819434 1136921 4929920 12255574 13145148 3956752 -6609694
44475f609694k442855K998462j335243o768134j864046J0108340J4538908M661289
$$ -6609694 -9052549 -6054087 -7389330 -14157464 -16021510 -5913170 8625738 13287027
44467A3287027r396672j2780808l385505O728317P149640J705546J059486N946205
$$ 13287027 3890355 -8890453 -12275958 -5547641 1601999 3307545 4367031 10313236
44459A0313236O269428j958605q809554n500145J640472J670545l331313l093991
$$ 10313236 16582664 14624059 5814505 314360 1954832 3625377 294064 -2799927
44451b799927K431003L133667l066930n571588J998363J1377242J1282305J356920
$$ -2799927 -368924 2764743 -302187 -5873775 -3875412 7501830 18784135 20141055
44443B0141055j0065522j5485537j1878488j158894R348937J2103496P565576
$$ 20141055 10075533 -5410004 -17288492 -18447386 -9098449 3005047 10570623
44436A0570623K685294R83907O16996J861288P264329J2840768R262191m348820
$$ 10570623 13255917 14239824 14856820 16718108 23982437 36823205 46085396 41736576
44428D1736576j6702438j8419976j1429150j158256J0212453J7814606J3130893
$$ 41736576 25034138 6614162 -4814988 -5973244 4239209 22053815 35184708
44421C5184708k456371j2965203p066638N445831P337653j933642p869588l430071
$$ 35184708 32728337 19763134 12696496 18142327 25479980 23546338 15676750 12246679
44413A2246679K622512P06968o244396q139654j170279P339079O535588n411621
$$ 12246679 14869191 15576159 9331763 1192109 21830 7360909 13896497 8484876
44405H484876j6856317j4471453J39151J1524885R723718J043117l725688l064164
$$ 8484876 -8371441 -22842894 -22703743 -11178858 -1455140 -412023 -4137711 -7201875
44397g201875q09077K898415Q253620J0028421M434890l004106m888821k682218
$$ -7201875 -8010952 -5112537 3141083 13169504 17604394 14600288 9711467 7029249
44389G029249j909299j870779O57410K479159q90392n222337l634229P01827m56196
$$ 7029249 5119950 3249171 3906581 6385740 5495348 273011 -3361218 -2659391 -3115587
44380c115587n256346m272889K640276N299093M83355k579558K147927P729724
$$ -3115587 -8371933 -12644822 -10004546 -4705453 -4222098 -6801656 -4653729 3075995
44372C075995N599829k322485q566836r893072o842263q5007P008954P467986
$$ 3075995 8675824 6353339 -2213497 -12106569 -18948832 -19033839 -12024885 -4556899
44364d556899j294089j1646843j3452545o275855N23277q7775m018879j553285
$$ -4556899 -5850988 -17497831 -30950376 -37226231 -36702954 -36790729 -40809608 -42362893
44356d2362893R126644J7430566J2785675o61806q243149l742444M147329O655308
$$ -42362893 -33236249 -15805683 -3020008 -3681814 -11924963 -15667407 -11520078 -4864770
44348d864770O061665O409044M072955k777876n200125L269560J2299666Q569181
$$ -4864770 1196895 7605939 11678894 8901018 3700893 6970453 19270119 27839300
44340B7839300k122582l283854N540952Q916529J530446n226116m935380n039599
$$ 27839300 25716718 22432864 27973816 36890345 38420791 33194675 28259295 23219696
44332B3219696q828881p610026O53825K824013p515796j5254525n372025J2642986
$$ 23219696 14390815 6780789 7434614 10258627 2742831 -12511694 -17883719 -5240733
44324e240733J7611668N589431r027776j5236902j3585453o699569L542554J0390257
$$ -5240733 12370935 17960366 8932590 -6304312 -19889765 -26589334 -23046780 -12656523
44316a2656523P107234j278152k276747N954371J1045834M623909n106652n485398
$$ -12656523 -5549289 -6827441 -9104188 -3149817 7896017 12519926 7413274 1927876
44308A927876K053805M373960l517341j0058493l547284R125232J0085484l713754
$$ 1927876 3981681 8355641 4838300 -5220193 -8767477 357755 10443239 6729485
44300F729485j4344930q093986M837521O722252j106060l344396L548928Q632094
$$ 6729485 -7615445 -15709431 -10871910 -4149658 -5255718 -8600114 -5051186 3580908
44292C580908P339146O073235N214693k337574j1991075q339983P057415J0671585
$$ 3580908 10920054 16993289 22207982 19870408 7879333 -460650 6596765 17268350
44284A7268350p602649k4360948j5154909R701913K1589257J3143109O58256l909805
$$ 17268350 9665701 -14695247 -29850156 -20148243 1441014 14584123 15242379 11332574
44276A1332574k531384J637331P042604O908865l147216j3120577r607536M101706
$$ 11332574 8801190 10438521 17481125 24389990 21242774 8122197 -1485339 2616367
44268B616367J3181165J2224530O467750k008417j2300822j4612733j811023J2628900
$$ 2616367 15797532 28022062 34489812 32481395 20180573 5567840 3756817 16385717
44260A6385717R196969o831553j1106446K781001J4820198J0591258p84594o934787
$$ 16385717 25582686 18751133 7644687 10425688 25245886 35837144 35052550 28117763
44252B8117763r004971r667634m360811N230414O947851j788761o616378q9237
$$ 28117763 19112792 9445158 5084347 10314761 17262612 15473851 8857473 8768236
44244H768236M107210n813940j8127280j4830026J424054J3120001J1719205K475666
$$ 8768236 12875446 7061506 -11065774 -25895800 -24471746 -11351745 367460 2843126
44236B843126o285451p241608L533735J7526936J7423464N63339j3390803j0352295
$$ 2843126 -3442325 -10683933 -7150198 10376738 27800202 28363541 14972738 4620443
44228D620443k892974p260746j4275155n516547J2170705J4505504j949881j4766049
$$ 4620443 1727469 -5533277 -19808432 -25324979 -13154274 1351230 -598651 -15364700
44220a5364700r719004L124007J0716242J3132740J2782016O859764j963395l930791
$$ -15364700 -25083704 -21959697 -11243455 1889285 14671301 21531065 19567670 15636879
44212A5636879J260217J535575o911079j1734697n472701J525866N1183j216585
$$ 15636879 16897096 18432671 11521592 -213105 -5685806 -4159940 -4108757 -5325342
44204e325342Q041705J9117749J6301801J716020q206901o996934l852185o110434
$$ -5325342 2716363 21834112 38135913 39851933 31645032 24648098 20795913 14685479
44196A4685479r120677n562146M066177J2434108J2203112K732071o945625o349899
$$ 14685479 5564802 2656 4068833 16502941 28706053 31438124 24492499 18142600
44188A8142600J536973J664067j0229844j7010582m608630J3182481J2550853
$$ 18142600 19679573 21343640 11113796 -5896786 -10505416 2677065 15227918
44181A5227918l873582j0567326J331929J2129366P479731L08269N156188J1031938
$$ 15227918 11354336 787010 2118939 14248305 21728036 22036305 27192493 38224431
44173C8224431J32728j9662869k3921409p682692Q948387J0745619M131793J131331
$$ 38224431 38357159 18694290 -5227119 -12909811 -3961424 6784195 10915988 12047319
44165A2047319K652863L454764J789801j705268o141745p794338l319378K687437
$$ 12047319 14700182 18154946 19944747 18239479 12097734 4303396 984018 3671455
44157C671455K296025k515553j835109N285185Q006695J070167p558857j0760392
$$ 3671455 5967480 3451927 1616818 6902003 14908698 15978865 8420008 -2340384
44149b340384j0652993p560915L987357J9486967K0840027J951644j6129005j2249340
$$ -2340384 -12993377 -20554292 -16566935 2920032 23760059 25711703 9582698 -2666642
44141b666642M118177Q075259l505799j1293326n611340K717396M094552K678392
$$ -2666642 1451535 9526794 6020995 -5272331 -10883671 -8166275 -4071723 -1393331
44133a393331L553242M297350L864168N514637P291873L181026l721612l651388
$$ -1393331 2159911 6457261 10321429 15836066 23127939 26308965 22587353 18935965
44125A8935965J923197Q95469p694329j0221518k409137K046511m435412r101020
$$ 18935965 20859162 21754631 14060302 3838784 1429647 3476158 -959254 -10060274
44117a0060274j016330R147879O429085m784543j0033872o765856j842917L207199
$$ -10060274 -11076604 -1928725 4500360 -284183 -10318055 -17083911 -18926828 -15719629
44109a5719629R411106J1585769O916368L520070O217757M442092q877352j7987182
$$ -15719629 -6308523 5277246 12193614 15713684 21931441 26373533 17496181 -491001
44101d91001n568681J5644170J7880413L54753j0987408n486108n00775o432205
$$ -491001 -6059682 9584488 27464901 27819654 16832246 11346138 10845363 4413158
44093D413158q338330L978410J3122533J422168j7382053j6656240L697369J8553254
$$ 4413158 -3925172 53238 13175771 14597939 -2784114 -19440354 -15742985 2810269
44085B810269J3722152R15456l717753M37349M019446J797557m142702r092924
$$ 2810269 16532421 17447877 13730124 14167473 18186919 19984476 15841774 6748850
44077F748850r724393o265681k092701R5779O13294M40075k13424M15551M641058
$$ 6748850 -2975543 -9241224 -11333925 -11238146 -10624852 -10184777 -10398201 -9982650 -5341592
44068e341592R612970Q353246J46909o285424m811133n91045n41055j729951K185699
$$ -5341592 4271378 12624624 12771533 6486109 1674976 1083931 542876 -1187075 998624
44059I98624Q172916P644890M16487n145509n055702l553867l883099l910924
$$ 998624 9171540 16816430 17232917 12087408 7031706 3477839 -405260 -4316184
44051d316184k118965l65220O96577K310669L104734O79812k278436j249536R81758
$$ -4316184 -6435149 -6800369 -6103792 -3793123 -688389 -8577 -2287013 -3536549 -2554791
44042b554791j998346p006772l853840N930602P246822m361369j1315374M07451
$$ -2554791 -4553137 -11559909 -15413749 -9483147 -2236325 -6597694 -17913068 -17505617
44034a7505617J6934053J5639570J34070n876126K905410N730695p919009j8745067
$$ -17505617 -571564 15068006 15202076 9325950 12231360 17962055 10043046 -8702021
44026h702021q405640R781936J1273855j502678n330965M913101R079361l411249
$$ -8702021 -17107661 -7325725 3948130 2445452 -2885513 2027588 11106949 7695700
44018G695700j5060762p837080Q400371J0975617k270861j1766071n228070P272958
$$ 7695700 -7365062 -15202142 -6801771 4173846 1902985 -9863086 -15091156 -7818198
44010g818198R888148J689287n020438j516125Q111845J3407692R431011Q20283
$$ -7818198 2069950 3759237 -1261201 -2777326 5334519 18742211 28173222 28993505
44002B8993505m807238n171486l680733l375716l778042l463342k409784j122089
$$ 28993505 24186267 19014781 15334048 11958332 8180290 4716948 2307164 1185075
43994A185075Q0517O67854Q78976K162955M113582L203887j565081m911306k864236
$$ 1185075 1265592 1933446 2812422 4975377 9088959 12292846 10727765 5816459 2952223
43985B952223l59849l041333n265839J883761J2462535J0577055m515149j4423380
$$ 2952223 2592374 -448959 -5714798 -3831037 8631498 19208553 14693404 270024
43977B70024q706617K74887o79080m353618K012934J3203474J4619159O291548
$$ 270024 -8436593 -8161706 -8840786 -13194404 -11181470 2022004 16641163 22932711
43969B2932711P40743J607285J423073j704384j761774P66484k318629j1245779
$$ 22932711 23673454 25280739 26703812 24999428 23237654 24004138 21685509 10439730
43961A0439730j4750060o488029N164088Q068096L50949r031151r447540J146005
$$ 10439730 -4310330 -10798359 -5634271 2433825 2784774 -6246377 -15693917 -14547912
43953a4547912J1964019R926832j910635n555974N560207J4227840N741655p412987
$$ -14547912 -2583893 7342939 5432304 -123670 5436537 19664377 25406032 17993045
43945A7993045n789155M408754L219085p157569o922707M232311N562779o953242
$$ 17993045 12203890 16612644 19831729 12674160 5751453 9983764 15546543 8593301
43937H593301j2654827l234621L195606l221466n504836P493186J7820824Q842992
$$ 8593301 -4061526 -7296147 -4100541 -7322007 -12826843 -5333657 12487167 21330159
43929B1330159n398710m934788K852734L19167p567042m814350M507680M555830
$$ 21330159 15931449 10996661 13849395 14168562 6601520 1787170 6294850 10850680
43921A0850680k405262j367019O779626P750296N77025k506844M15712P26411
$$ 10850680 8445418 7078399 13858025 21608321 22185346 19678502 20094214 20820625
43913B0820625n33018M456475R754682K175202j2572005j4803054k904333M052157
$$ 20820625 20287607 24744082 34498764 36673966 24101961 9298907 6394574 10446731
43905A0446731j623326o343237k408501m12312o352887r257269k138671M887828
$$ 10446731 8823405 2480168 71667 -340645 -6693532 -15950801 -18089472 -13201644
43897a3201644L454590N34947K202133J470517n896521j0217302n097406j2811
$$ -13201644 -9747054 -9212107 -7009974 -5539457 -11435978 -21653280 -26750686 -26763497
43889b6763497k455370k814621P902622J9000434J5514870J987062n987764n668752
$$ -26763497 -29218867 -32033488 -24130866 -5130432 10384438 12371500 6383736 714984
43881G14984o142247r512244r264043m338235q85314j170385j538153j26911J898839
$$ 714984 -5427263 -14939507 -24203550 -28541785 -29427099 -30597484 -32135637 -32262548 -30363709
43872c0363709M637404Q030981R402048Q005137P181013P222982L310632m209990
$$ -30363709 -25726305 -17695324 -8293276 -288139 6892874 14115856 17426488 13216498
43864A3216498o748169j272744L297279J406933O87623O548425R851633K648311
$$ 13216498 6468329 5195585 8492864 9899797 10587420 17135845 26987478 29635789
43856B9635789o629137q561220j0017346j8048517k0102681l490213J6416291
$$ 29635789 23006652 14445432 4428086 -13620431 -33723112 -37213325 -20797034
43849b0797034J5046112j056013l516090J0151217J1959376p823861k1664465
$$ -20797034 -5750922 -6806935 -10323025 -171808 11787568 3963707 -17700758
43842a7700758q875729J1498367J2627503M18989k171714O770433J1487065P888392
$$ -17700758 -26576487 -15078120 -2450617 -2031628 -4203342 2567091 14054156 21942548
43834B1942548M427344J272598p606228j5907947j1175433J874954N211127m319343
$$ 21942548 26369892 27642490 20036262 4128315 -7047118 -5172164 38963 -4280380
43826d280380r899850q48156J3229415J8549107J2939834J880894q135997r743339
$$ -4280380 -14180230 -15028386 -1798971 16750136 29689970 31570864 23434867 13691528
43818A3691528j143399O350559J267965p933430l904068P935038K841854k1441708
$$ 13691528 12548129 18898688 20166653 12233223 8329155 16264193 19106047 -2335661
43810b335661l3456994j4302402J0249073P838843j0863048j1492559Q164274
$$ -2335661 -35792655 -50095057 -39845984 -32007141 -42870189 -54362748 -46198474
43803d6198474J7444739N143225l847568P721119K1233447J4142782m515014j1095192
$$ -46198474 -28753735 -23610510 -27458078 -19736959 1496488 15639270 11124256 29064
43795B9064l142418K810290q63758o466420p271982m444199m34816K726437J951822
$$ 29064 -3113354 -303064 -1166822 -7633242 -14905224 -19349423 -19784239 -17057802 -15105980
43786a5105980p85139K966563J3408857J5009764k250740k1905084j9327072K702443
$$ -15105980 -15891119 -12924556 484301 15494065 13243325 -8661759 -27988831 -25286388
43778b5286388J6451052Q121431n376446m445744N925549P837063k392038j1243360
$$ -25286388 -8835336 -713905 -6090351 -10536095 -4610546 3226517 834479 -10408881
43770a0408881p216744O042877J4567951Q279444p788805j6570440p828447P788605
$$ -10408881 -17625625 -11582748 2985203 11264647 3475842 -13094598 -20923045 -13134440
43762a3134440J1355314P17470q166097n258608J747077L494082K684745M105691
$$ -13134440 -1779126 -1061656 -9227753 -14486361 -12739284 -9245202 -6560457 -2454766
43754b454766L716048j849141n247345L54568Q265895Q638823M729970N452426
$$ -2454766 1261282 -587859 -5835204 -5480636 2785259 11424082 16154052 21606478
43746B1606478P457768K28981j3147254j6565419m608411Q552848R195552J232216
$$ 21606478 29064246 29293227 16145973 -419446 -5027857 3524991 12720543 13952759
43738A3952759l700586l686520m574652o517948l333335N357803J0575182N963686
$$ 13952759 10252173 6565653 1991001 -4526947 -7860282 -2502479 8072703 14036389
43730A4036389k528793m307459J311044M830998J318134k190094J147151N149815
$$ 14036389 11507596 7200137 8511181 13342179 14660313 12470219 13617370 18767185
43722A8767185n37766j2042428j4072534k721290P251332M044115l683628j102828
$$ 18767185 18229419 6186991 -7885543 -10606833 -3355501 688614 -2995014 -4097842
43714d097842R341406J1935270J825901q056276n826798L908047P855982J046967
$$ -4097842 5243564 17178834 19004735 10948459 5121661 9029708 16885690 17932657
43706A7932657q737766j1056347m042220M605482P037507L987611J828467K647995
$$ 17932657 9194891 -1861456 -5903676 -1298194 5739313 9726924 11555391 14203386
43698A4203386K570995l43719l578455o363845r805903r214059K069541J6681584
$$ 14203386 16774381 16430662 12852207 6488362 -3317541 -12531600 -10462059 6219525
43690F219525J5221598o038916k3099158j4392966Q247512J6628691N684988m854162
$$ 6219525 21441123 15402207 -7696951 -22089917 -13842405 2786286 8471274 3617112
43682C617112l452472J570995L401463O473267J0075450M085659j0420342j5934825
$$ 3617112 164640 1735635 5137098 11610365 21685815 25771474 15351132 -583693
43674e83693m818997O681455L325565o361198p119878k294972m020774q837067
$$ -583693 -5402690 1278765 4604330 -1756868 -8876746 -11171718 -15192492 -24029559
43666b4029559l562735R624777J3905786L658546p324403o588429J479507N699983
$$ -24029559 -27592294 -17967517 -4061731 -403185 -7727588 -14316017 -12836510 -7136527
43658g136527L565386P72925J118008K036669j018504p281614q895333j67487
$$ -7136527 -3571141 -2798216 -1680208 356461 -662043 -7943657 -16838990 -17006477
43650a7006477J1452228J1595197n74926q205605k83466J1171868Q913916l546115
$$ -17006477 -5554249 6040948 5466022 -2739583 -3023049 8148819 17062735 13516620
43642A3516620q902655l208221J127774k372549o264241m967654k481751r56317
$$ 13516620 4613965 1405744 2533518 160969 -6103272 -11070926 -13552677 -14508994
43634a4508994L363512Q271969M659158o263324r409740J952281J3802078J1430256
$$ -14508994 -11145482 -2873513 1785645 -4477679 -13887419 -11935138 1866940 13297196
43626A3297196k28846p970433j0546318j3167827j1331335K173300J8735853K0630012
$$ 13297196 13068350 5097917 -5448401 -18616228 -29947563 -27774263 -9038410 11591602
43618A1591602O657206m980335k662976M133480K244060n501679p133874l27729
$$ 11591602 18248808 13268473 10605497 14738977 16983037 11481358 4347484 4019755
43610D019755N647654L945162j972315m839300k709601N11814J338146P24423
$$ 4019755 9667409 13612571 11640256 6800956 4091355 4603169 5941315 6665738
43602F665738R88812R59168k043199n855862m878177M46738K614805m79868n58924
$$ 6665738 7654550 8613718 6570519 714657 -4163520 -3716782 -1101977 -1581845 -2140769
43593b140769O171918Q462554l186644j6642417j2361676N657674J3314978K650125
$$ -2140769 4031149 12493703 9307059 -7335358 -19697034 -14039360 -724382 1925743
43585A925743p072020k025955M440793k973310j3960764j0453845K230222N485972
$$ 1925743 -5146277 -7172232 -2731439 -5704749 -19665513 -30119358 -27889136 -22403164
43577b2403164m82660K48850Q583776R058907n8008j670328R359350J5464205
$$ -22403164 -22885824 -22636974 -14053198 -4994291 -5052299 -6722627 2636723 18100928
43569A8100928O517257k835293K2904L526358n019934j3751568o779472M886743
$$ 18100928 24618185 21782892 21805796 25332154 20312220 6560652 -218820 4667923
43561D667923J45570j4131328j1898521P855302J6675239J644687j4206925q862130
$$ 4667923 4813493 -9317835 -21216356 -13361054 3314185 4958872 -9248053 -18110183
43553a8110183O110225P850313j952099n088003J508758M863526J182991L51867
$$ -18110183 -11999958 -4149645 -6101744 -11189747 -9680989 -4817463 -3634472 -3282605
43545c282605N329887O434061L63608j764725O577887J3246281L548387j6846175
$$ -3282605 2047282 8481343 8844951 7080226 13658113 26904394 30452781 13606606
43537A3606606k6640592j4661202Q004584K2178751K0050619Q255466k987302
$$ 13606606 -13033986 -27695188 -19690604 2488147 22538766 30794232 27806930
43530B7806930q740546q861587m155823L649950R796543Q533806q75488j1965286
$$ 27806930 19066384 10204797 6048974 9698924 19495467 28029273 27153785 15188499
43522A5188499j6699308j2540605l122975O117245J0926692Q892261J128385o395655
$$ 15188499 -1510809 -14051414 -17174389 -11057144 -130452 8761809 9890194 3494539
43514C494539o812983M42084Q441695J0472901O994170K752495p34281n394208
$$ 3494539 -3318444 -2876360 5565335 16038236 23032406 25784901 25050620 19656412
43506A9656412r638576p109296L973783J4464454J3475246K637648n423713l659370
$$ 19656412 10017836 2908540 6882323 21346777 34822023 37459671 32035958 28376588
43498B8376588J292384N94115m082157n357741k636853j823564m654587o297713
$$ 28376588 29668972 30263087 26180930 20823189 18186336 16362772 11708185 5410472
43490E410472l804953q6599J810428K602116L363895L117991J247555j668082
$$ 5410472 1605519 1518920 3329348 5931464 9295359 12413350 13660905 11992823
43482A1992823n448651q163908m022184Q902898J9351012J1881327j1337866k7889437
$$ 11992823 6544172 -1619736 -5641920 3260978 22611990 34493317 23155451 -4733986
43474d733986k0743045J356158J6126916J3359501O67610r713818j0758239k263177
$$ -4733986 -25477031 -24120873 -7993957 5365544 6033154 -3680664 -14438903 -16702080
43466a6702080P981486Q330569k690109j0613411k775937J2618893J6768830O400289
$$ -16702080 -8720594 -390025 -3080134 -13693545 -16469482 -3850589 12918241 19318530
43458A9318530l663010l058954K990879O478395O822113N205508J592765P53850
$$ 19318530 15655520 12596566 15587445 22065840 28887953 34093461 35686226 36440076
43450C6440076P833778J4322522M451097j8036279k7531869j2229540N718409
$$ 36440076 44273854 58596376 63047473 45011194 17479325 5249785 10968194
43443A0968194K118653j3295823j4592459j033989N841194M50721o93807P642425
$$ 10968194 13086847 -208976 -14801435 -15835424 -9994230 -9543509 -10237316 -2594891
43435b594891Q895188m086200j3494407n840207N596448M486900j595737J884968
$$ -2594891 6300297 2214097 -11280310 -17120517 -11524069 -7037169 -8632906 -6747938
43427f747938Q167308J442614j2707160j3891938L16318J1523258R861129M335671
$$ -6747938 1419370 2861984 -9845176 -23737114 -23420796 -11897538 -2036409 2299262
43419B299262J776567l299663j2119270j4142506m774904N057197N990400L152409
$$ 2299262 4075829 776166 -11343104 -25485610 -30260514 -25203317 -19212917 -16060508
43411a6060508L274075K611338j787214j645805Q640682J7695240J1069877o686192
$$ -16060508 -12786433 -10175095 -11962309 -13608114 -4967432 12727808 23797685 17111493
43403A7111493j6938368j0267735N679163J7824993J7688633M373052j2495718
$$ 17111493 173125 -10094610 -4415447 13409546 31098179 35471231 22975513
43396B2975513j7021450m278090J0596597J0331210k156603j0417102q503912
$$ 22975513 5954063 1675973 12272570 22603780 20447177 10030075 1526163
43389A526163m619922l478965m19167N701054P928840L462319r43165r4060K549701
$$ 1526163 -3093759 -6572724 -6991891 -1290837 6638003 10100322 9157157 9063097 11612798
43380A1612798K469804J01107l553421q421533r900441j639001J2654440J9986779
$$ 11612798 14082602 14183709 10630288 2208755 -7691686 -9330687 3323753 23310532
43372B3310532J5165275P432039M760932J952878p501388j6848662j4542000k317934
$$ 23310532 38475807 45907846 50668778 52621656 45120268 28271606 13729606 11411672
43364A1411672O332868M405591j431204k764308m83754m82891l715948n854421
$$ 11411672 17744540 22150131 20718927 17954619 17470865 16987974 13272026 7417605
43356G417605n292172n914459r541808j0089010j293248J1449895J5164950O546685
$$ 7417605 2125433 -3789026 -13330834 -23419844 -24713092 -13263197 1901753 8448438
43348H448438l771897p387538q044492r588662o431555L596495R079086K197237
$$ 8448438 4676541 -2710997 -10755489 -20344151 -26775706 -23179211 -14100125 -11902888
43340a1902888m928543J042723R884489M264136p292450k177406J4773570J4320413
$$ -11902888 -16831431 -15788708 -5904219 -1640083 -8932533 -11109939 3663631 17984044
43332A7984044q164564k0878690n361805J4410024J2116152j111341k303029L040996
$$ 17984044 9819480 -11059210 -16421015 -2010991 10105161 8993820 6690791 9731787
43324I731787l075439j3514531p965578Q718756J3295634L417183j548960L273235
$$ 9731787 6656348 -6858183 -14823761 -6105005 7190629 10607812 9058852 12332087
43316A2332087K455912p450462r948851P61001Q665441M872703K688866J1568653
$$ 12332087 14787999 7337537 -2611314 -1850313 6815128 11687831 14376697 25945350
43308B5945350J8287033R328330o069648j1779285r372946r744037j1204114m436755
$$ 25945350 44232383 53560713 47491065 35711780 26338834 16594797 5390683 953928
43300I53928O579850O807571o387170j6529876r411177Q154373J7431199J1289262
$$ 953928 7533778 14341349 7954179 -8575697 -17986874 -9832501 7598698 18887960
43292A8887960J329995M79779N328330L165571o628958j0513009l076534K437544
$$ 18887960 20217955 20697734 26026064 29191635 22562677 12049668 8973134 11410678
43284A1410678m684862j3534584q456737M360230N804059n218106r657860K408068
$$ 11410678 6725816 -6808768 -15265505 -10905275 -5101216 -10319322 -19977182 -17569114
43276a7569114J8635885K3895204J7229019N443745n973336j1354882p296648
$$ -17569114 1066771 24961975 42190994 47634739 41661403 30306521 23009873
43269B3009873m13288q75925o624811p226947l490403o088649j2818083p719522
$$ 23009873 22596585 21720660 15095849 7868902 4378499 -1710150 -14528233 -22247755
43261b2247755J0621555K0583345Q446320j0218164j3487256j988850R419776
$$ -22247755 -11626200 8957145 17403465 7185301 -6301955 -8290805 1128971
43254A128971J4927408J6635692J1524964k768110j5932229j4884300k303935
$$ 1128971 16056379 32692071 44217035 41448925 25516696 10632396 8328461
43247H328461P193369O107964r56090p171867q743796m433521J631429J244660
$$ 8328461 15521830 21629794 20673704 13501837 4758041 324520 1955949 3200609
43239C200609o357705j0269743k897325P764788R462669K438828m286153o785069
$$ 3200609 -3157096 -13426839 -16324164 -8559376 903293 3342121 -944032 -7729101
43231g729101o801973m414760L71645L764888M015512N270441Q475554O556909
$$ -7729101 -14531074 -18945834 -18574189 -14809301 -10793789 -5523348 2952206 9509115
43223I509115k806150q966443l815123L408537m7574q995773p368890P216303
$$ 9509115 6702965 -2263478 -6078601 -2670064 -2717638 -11713411 -19082301 -11865998
43215a1865998J9697738J7067680J166281j6170703k2321406j1811372O798648
$$ -11865998 7831740 24899420 26065701 9894998 -12426408 -24237780 -17439132
43208a7439132J6267313J0035589n8820k136609l73217l035329o008580k340472
$$ -17439132 -1171819 8863770 8804950 6668341 6295124 3259795 -2748785 -5089257
43200e089257J745383k929740r739119n475880O613201J0687707K488541o578911
$$ -5089257 -3343874 -6273614 -16012733 -21488613 -14875412 -4187705 -1699164 -8278075
43192h278075p639288k144331N716151J0627921M846546r927540j5687205o28985
$$ -8278075 -15917363 -18061694 -12345543 -1717622 3128924 -6798616 -22485821 -23114806
43184b3114806J8084205J5126010m458406j2056255N79107J1007981L729030q189406
$$ -23114806 -5030601 10095409 5637003 -6419252 -5840145 5167836 8896866 707460
43176G07460q438862j377233K045431L492343Q299030J1427202N810573m861036
$$ 707460 -7731402 -9108635 -7063204 -3570861 4728169 16155371 21965944 17104908
43168A7104908j1749293j1495886n225199M140700R435498M335908n864031r308918
$$ 17104908 5355615 -6140271 -11365470 -7224770 2210728 6546636 682605 -8626313
43160h626313m717036p24013J522570Q223549J4661849P709002r211890j5624235
$$ -8626313 -13343349 -14067362 -12544792 -4321243 10340606 18049608 8837718 -6786517
43152f786517n791718J262978o545554j5267839j0553870m64701L001824M402519
$$ -6786517 -12578235 -11315257 -17860811 -33128650 -43682520 -44147221 -41145397 -36742878
43144c6742878R323822Q593304k135903o587760N817086J6595097O966125p612527
$$ -36742878 -27419056 -18825752 -20961655 -27549415 -21732329 -5137232 1828893 -5783634
43136e783634k067326J3803567J0931302p938096j2055872L547687Q833209q619721
$$ -5783634 -7850960 5952607 16883909 8945813 -3110059 437628 9270837 651116
43128F51116k0829858o661171J2037099O703988j1331554j0629098R910104K1553956
$$ 651116 -20178742 -26839913 -14802814 -8098826 -19430380 -30059478 -20149374 1404582
43120A404582J0542703o005141j0001026m075116K314552Q275192J3440709J0307395
$$ 1404582 11947285 5942144 -4058882 -8133998 -5819446 2455746 15896455 26203850
43112B6203850l121932j3989965j0909791j783575j206109o001313j192042J0750683
$$ 26203850 23081918 9091953 -1817838 -3601413 -4807522 -10808835 -12000877 -1250194
43104a250194Q298351j3605245k7362934r592096K1043939K6777880L878871j4396830
$$ -1250194 7048157 -6557088 -33920022 -43512118 -22468179 4309701 8188572 -6208258
43096f208258q223867M248479K149284n289300K88233J2788371J2759407L36012
$$ -6208258 -14432125 -10183646 -8034362 -13323662 -13035429 -247058 12512349 12848361
43088A2848361o778490l047756p73144o551518j1268935o493230M037735J2416224
$$ 12848361 6069871 3022115 2248971 -4302547 -15571482 -22064712 -18026977 -5610753
43080e610753J4218182O822101q080315j9075543j4251543J893989J1880163P716894
$$ -5610753 8607429 15429530 7349215 -11726328 -25977871 -24083882 -12203719 -4486825
43072d486825j051056l866711j774199K81585K138750L839336K485385l40901
$$ -4486825 -5537881 -9404592 -11178791 -10897206 -8758456 -4919120 -2433735 -2774636
43064b774636K493038J0606216J1394949k453933j8082044j6309464K889571J9480575
$$ -2774636 -281598 10324618 21719567 19265634 1183590 -15125874 -12236303 7244272
43056G244272J8046149M205555o279811p267122n290033o659342q928820o676606
$$ 7244272 25290421 29495976 23216165 15949043 10659010 3999668 -4929152 -11605758
43048a1605758m46060M290884M483142J284636l762278q865414r269560j347275
$$ -11605758 -12051818 -7760934 -3277792 -1993156 -5755434 -14620848 -23890408 -25237683
43040b5237683R675236J3307823P441994J299981J744926M376676K772694j133442
$$ -25237683 -15562447 -2254624 5187370 6487351 8232277 12608953 15381647 14248205
43032A4248205k131853p27941l65995p77588O459J591409L419435N447930M047023
$$ 14248205 12116352 11388411 11022416 10244828 10251287 11842696 15262131 20710061 24757084
43023B4757084m176912j1870278o738602P225277R975421m361795j5130424o524598
$$ 24757084 20580172 8709894 1971292 9196569 19171990 14810195 -320229 -6844827
43015f844827P138676O597558J76891N526876J3618023K995074j8174200j9664072
$$ -6844827 293849 6891407 7068298 12595174 26213197 29208271 11034071 -8630001
43007h630001J697455J5651152O756823m987586k355601K921656j806392n462796
$$ -8630001 -6932546 8718606 15475429 10487843 8132242 11053898 9247506 3784710
42999C784710K799548R943855K186718q854140o606747J672393P46378l723387
$$ 3784710 6584258 16528113 18714831 9860691 3253944 4926337 5672715 1949328
42991A949328J963775J0617327N464772q553123j2231813m918590k375862n241289
$$ 1949328 3913103 14530430 19995202 11442079 -789734 -5708324 -8084186 -13325475
42983a3325475J592009J6967251J9621757L109524j1372401p790345J657360K7338
$$ -13325475 -11733466 5233785 24855542 27965066 16592665 8802320 10459680 10487018
42975A0487018o901505l772065P143365J0286409J760067o195578m060957L683564
$$ 10487018 3585513 -186552 6956813 17243222 19003289 12807711 8746754 12430318
42967A2430318P100324K924167l436771m407066J641595Q136334Q147134L608612
$$ 12430318 19530642 22454809 19018038 14610972 16252567 24388901 32536035 36144647
42959C6144647J795449L398833J954465l793255o689575m334311n231767j4125053
$$ 36144647 37940096 41338929 43293394 39500139 32810564 28476253 23244486 9119433
42951I119433k0014962j0124612R037826J7270479P210704o243755o626701L255118
$$ 9119433 -10895529 -21020141 -11982315 5288164 12498868 6255113 -371588 2883530
42943B883530P844686N96705r123869j0080149k762693M023204N460063M455154
$$ 2883530 10728216 11324921 2201052 -7879097 -10641790 -6618586 -1158523 3296631
42935C296631M530037M644514K883339R77422J655675L919813M350905J436586
$$ 3296631 7826668 12471182 15354521 16331943 17987618 21907431 26258336 27694922
42927B7694922m140248j0784098j3959427p042311Q929151J9532201J1256355
$$ 27694922 23554674 12770576 -1188851 -8231162 697989 20230190 31486545
42920C1486545q174444j5454334j828794J4274839J2836409r43040q437315p089555
$$ 31486545 23312101 7857767 6028973 20303812 33140221 32197181 23759866 16670311
42912A6670311r491509j6190383j1479077Q171955K2029211J4049890k195798
$$ 16670311 7178802 -9011581 -20490658 -12318703 9710508 23760398 21564600
42905B1564600m227394N631037P167266m058536j1943998p601183m93851J351519
$$ 21564600 17337206 22968243 30135509 26076973 14132975 6531792 6037941 7389460
42897G389460K198301L632548j757614j2518762j2728467L254026J7379101J4304452
$$ 7389460 9587761 13220309 11462695 -1056067 -13784534 -10530508 6848593 21153045
42889B1153045N413663Q101664J5130086P449119j1800963k1040198j3841829
$$ 21153045 26566708 34668372 49798458 57247577 45446614 24406416 10564587
42882A0564587m343423r759O313336J4274657J0526282o721217j8908186j3307125
$$ 10564587 6221164 6211405 12524741 26799398 37325680 30604463 11696277 -1610848
42874a610848m38921M878807L496712K062482j192571q098403j1134551n266059
$$ -1610848 -2049769 2829038 6325750 8388232 7195661 -902742 -12037293 -17303352
42866a7303352J794707K690749K648093P153886R291699K502600n180715m059203
$$ -17303352 -15508645 -12817896 -10169803 -3015917 6275782 8778382 3597667 -461536
42858d61536K32089j974249n485715J99926R937407R895548O61840m877232l758346
$$ -461536 -229447 -2203696 -7689411 -7489485 2447922 12343470 13005310 8128078 4369732
42849D369732m588030p955998m024960Q031335J5495820J1555427M233991P95016
$$ 4369732 -218298 -8174296 -12199256 -4167921 11327899 22883326 27117317 27912333
42841B7912333k419056p920341q418584L55008Q781732O133506k995435o026080
$$ 27912333 25493277 17572936 9154352 9509360 18291092 24424598 21429163 15403083
42833A5403083j751851q22257p290583j0776777k023823J1207580J2691753L70226
$$ 15403083 13651232 12828975 5538392 -5238385 -7262208 3945372 16637125 17007351
42825A7007351r636911n467509L494756J338024r665521j3070162m468998K876729
$$ 17007351 7370440 1902931 5397687 6735711 -2929810 -15999972 -20468970 -17592241
42817a7592241J011628j399190K376580M123715k674278q199403k471230O488687
$$ -17592241 -16580613 -17979803 -15603223 -11479508 -14153786 -22353189 -24824419 -18335732
42809a8335732O577343K821238O888454J4141968J0750351j757695q642665n613906
$$ -18335732 -11758389 -8937151 -2048697 12093271 22843622 21085927 12443262 6829356
42801F829356j504190O41299N778033J0458208M207361r764595j3810392j311269
$$ 6829356 5325166 5966465 11744498 22202706 26410067 16645472 2835080 1523811
42793A523811J2664854J2142410j059128j4095940j7289601q543435N578978J1904006
$$ 1523811 14188665 26331075 25271947 11176007 -6113594 -14657029 -9078051 2825955
42785B825955M681326l745849P32160J0558610P265084o702647r581483L932915
$$ 2825955 7507281 3761432 4493592 15052202 22317286 15614639 6033156 9966071
42777I966071J2931347M023886q562997q562701k371713l187744q014501o975067
$$ 9966071 22897418 26921304 18358307 9795606 7423893 4236149 -3778352 -10753419
42769a0753419j776060R61619L309761Q400178R920410L322136k616007P15864
$$ -10753419 -12529479 -11567860 -8258099 142079 10062489 13384625 10768618 11484482
42761A1484482O439712M203661k084465l057466j430579n190651j0670917q468508
$$ 11484482 17924194 22127855 20043390 16985924 15555345 10364694 -306223 -8774731
42753h774731r90195J337518k119868k375948L387914Q666104Q790827N046756
$$ -8774731 -9764926 -8427408 -10547276 -12923224 -9535310 -869206 7921621 12968377
42745A2968377l53354m997682n321985k154793j989337n928283n125357M634243
$$ 12968377 12615023 7617341 2295356 140563 -1848774 -7777057 -12902414 -8268171
42737h268171J3137990J0600236K635153j116756l150742r291400j3465271o986978
$$ -8268171 4869819 15470055 18105208 16988452 13837710 4546310 -8918961 -15905939
42729a5905939M665849R900526Q583819O551349J518253q294253j0930591L285852
$$ -15905939 -11240090 -1339564 7244255 13795604 15313857 7019604 -3910987 -625135
42721f25135K0200301J8792790L558632m236603k339461o686431j6874096j3809285
$$ -625135 19575166 38367956 41926588 37689985 35350524 28664093 11789997 -2019288
42713b019288L839254J2184123J234920p717530J733661J4193411J0048441l006220
$$ -2019288 1819966 14004089 15239009 7521479 9255140 23448551 33496992 30490772
42705C0490772o981456l152087k463580k232613M274024P846016k444838j4388152
$$ 30490772 23509316 20357229 17893649 15661036 19935060 27781076 25336238 10948086
42697A0948086p673116J1487547J6774689J933756j1146733q446005l236902r619364
$$ 10948086 3274970 14762517 31537206 33470962 22324229 13878224 10641322 1021958
42689A021958j7750538j1091233N712626J3799682Q109459J940236M732464R783190
$$ 1021958 -16728580 -27819813 -22107187 -8307505 -198046 1742190 6474654 16257844
42681A6257844Q039341L114313M299647J0146239R109288k872856j4374281j3198837
$$ 16257844 24297185 27411498 31711145 41857384 50966672 48093816 33719535 20520698
42673B0520698k762290M180592M144048M472330P001517L417433q181351j4768156
$$ 20520698 17758408 21939000 26083048 30555378 37556895 40974328 32792977 18024821
42665A8024821o554403N911831O219405k447371k582545Q149600J0813821n312108
$$ 18024821 11470418 17382249 23601654 21154283 18571738 26721338 37535159 32223051
42657C2223051k2926314j8924826L140017J7774531J1471420k559298n589309
$$ 32223051 9296737 -9628089 -6488072 11286459 22757879 20198581 14609272
42650A4609272L030998R711330N833136m578019j2068766r895608K398648J7428578
$$ 14609272 17640270 27351600 33184736 28606717 16537951 6642343 9040991 26469569
42642B6469569K3596438J5771237J342941q648260j1752881j1943130r269083
$$ 26469569 50066007 65837244 67180185 58531925 46779044 34835914 25566831
42635B5566831j405305N891040K140907j0777434j6439273n552777R648523J1763726
$$ 25566831 24161526 30052566 32193473 21416039 4976766 -576011 9072512 20836238
42627B0836238J915643l714968K655176J1604248J1420113K578868n843943q509301
$$ 20836238 22751881 19036913 21692089 33296337 44716450 47295318 41451375 32942074
42619C2942074q365435j0356955j3482657j1417910j934017P757243R579118N433335
$$ 32942074 24576639 14219684 737027 -10680883 -12614900 -4857657 4721461 10154796
42611A0154796K379208K11972n133441p724845L117532K1241013K5245258R172963
$$ 10154796 12534004 12745976 7612535 -112310 3005222 24246235 49491493 58664456
42603E8664456o031197k708174R296250J2502008Q173336N391738J594065m533898
$$ 58664456 52633259 49925085 59221335 71723343 79896679 85288417 86882482 82348584
42595H2348584J146306K2881347L4150890J7360411P486948M7357543J04885586
$$ 82348584 83494890 106376237 140527127 157887538 165374486 212732029 317617615
42588C17617615R4376823l532237r9469858j06712684m9244263j3023329k4278034
$$ 317617615 411994438 408462201 308992343 202279659 153035396 140012067 115734033
42581A15734033l4879460j4276732P098010k596232k4336339k2646267n74140
$$ 115734033 80854573 66577841 73675851 71079619 46743280 24097013 23522873
42574B3522873J0458576j97730j1882423p343973M936089Q024117R85631l737955
$$ 23522873 33981449 33783719 21901296 14557323 19493412 27517529 28503160 24765205
42566B4765205n97203K582442q42144n047627j700843N350845N679258m42168
$$ 24765205 24168002 26750444 25908300 20860673 19159830 24510675 30189933 29747765
42558B9747765k620194J646446K861441l389988q619097o216244j198891J621337
$$ 29747765 27127571 28774017 31635458 28245470 19626373 13410129 12211238 13832575
42550A3832575O036770J2466448J1171641j250124j1081368o507645L459259L535028
$$ 13832575 19869345 32335793 43507434 42257310 31175942 24668297 28127556 31662584
42542C1662584l937133n318183J727931P977913R269823Q150648L908936m393505
$$ 31662584 27725451 22407268 24135199 32113112 41382935 49533583 53442519 49049014
42534D9049014r779542o537437k269410o272694j2018127p207203M742882J0771977
$$ 49049014 39269472 32732035 30462625 24189931 12171804 4964601 9707483 20479460
42526B0479460J0142459J1383330J2432385M953538n281444n482380j321573r793625
$$ 20479460 30621919 42005249 54437634 59391172 54109728 48627348 47305775 37512150
42518C7512150k5668833k3145842K608796K3422196J9172265N157822K932667
$$ 37512150 11843317 -11302525 -8693729 14728467 33900732 39058554 41991221
42511D1991221P414590L510142l502696J389719J3415241J3277201k494915j6810030
$$ 41991221 49405811 52915953 49413257 50802976 64218217 77495418 75000503 58190473
42503E8190473j7130127r182317m203686n012210p522461p814624n004964r25908
$$ 58190473 41060346 31878029 27674343 22662133 15139672 7325048 2320084 1394176
42495A394176K634663O935681J2947048J5297299P286395o454935j1926832m027720
$$ 1394176 4028839 10964520 23911568 39208867 46495262 40040327 28113495 24085775
42487B4085775O865345J0593140Q585559M776751k065628r665734q962842R89785
$$ 24085775 30951120 41544260 50129819 54906570 52840942 43175208 34212366 35202151
42479C5202151P308484L006583p19579N158196Q628691m227109k2088770k1544275
$$ 35202151 42510635 45517218 44797639 49955835 58584526 54357417 32268647 10724372
42471A0724372k010540J3424103J0890044J72100n343096n443590n146325m278258
$$ 10724372 8713832 22137935 33027979 33200079 27856983 22413393 17267068 12988810
42463A2988810j171128K739541N859199O783897J722380r584633j6758324q993339
$$ 12988810 11817682 14557223 20416422 27200319 28922699 19338066 2579742 -6413597
42455f413597P694008J5567588Q727794o37677j638203K307139L657752J926250
$$ -6413597 1280411 16847999 25575793 24938116 23299913 25607052 29264804 31191054
42447C1191054p07824m450551o806604j978310Q560054J3550790O450398n095709
$$ 31191054 30483230 26032679 19226075 17247765 25807819 39358609 45809007 40713298
42439D0713298j0414628r248034p564506o614603l653623R72178M357665N956802
$$ 40713298 30298670 21050636 13486130 6871527 3217904 4190082 8547747 14504549
42431A4504549P069955P853695Q064616P868290O042411J474469k406698m77448
$$ 14504549 21574504 29428199 37492815 45361105 51403516 52877985 50471287 49993839
42423D9993839N219922O316354J26626o612063q710093q737862q636700m857393
$$ 49993839 55213761 61530115 61656741 55044678 46334585 37596723 28960023 24102630
42415B4102630K384917M873755p30720m964503p685O434642L158331n642557o717748
$$ 24102630 26487547 31361302 30630582 25666079 25658394 32093036 35251367 29608810 22891062
42406B2891062J510205Q200576P715593M544934J456285l851505r418805r292321
$$ 22891062 24401267 32601843 40317436 44862370 46318655 42467150 33048345 23756024
42398B3756024n133402n071484q435816m962989O460983J2303362M972776m278466
$$ 23756024 18622622 13551138 5115322 152333 6613316 18916678 23889454 19610988
42390A9610988l172819K468177K50327p162983p084167J544071P049546M349375
$$ 19610988 16438169 18906346 19156673 11993690 4909523 6453594 13503140 17852515
42382A7852515Q30555J393581J053702l240940m886565J732385J1239757J4871447
$$ 17852515 18683070 20076651 21130353 17889413 13002848 14735233 25974990 40846437
42374D0846437J2266876R273379Q300698O883857L054169k853624r669857j4788011
$$ 40846437 53113313 62386692 70687390 77571247 80625416 77771792 68101935 53313924
42366E3313924j4469795q541759k523564j280893k689523j681010J213514K28748
$$ 53313924 38844129 30302370 27778806 26497913 23808390 22127380 23340894 23569642
42358B3569642o738055j3708124j2724281k647368R273191J4337229J0722963
$$ 23569642 16831587 3123463 -9600818 -12248186 -2974995 11362234 22085197
42351B2085197M433537J545776J454673K76626j458961j3344L147685J198177
$$ 22085197 26518734 28064510 29519183 29795809 28336848 28323504 31471189 32669366
42343C2669366p237005j3320376q506859M219968J3627203J1915145Q49918r988975
$$ 32669366 25432361 12111985 3605126 7825094 21452297 33367442 34217360 24228385
42335B4228385r690139L500990J6325379J2908306l717036j2235947j305845J3613582
$$ 24228385 14538246 18039236 34364615 47272921 43555885 31319938 30014093 43627675
42327D3627675J1822868l902684j3822298r513124p726O372861R747175R270005
$$ 43627675 55450543 51547859 37725561 28212437 28204711 34577572 44324747 53594752
42319E3594752K510657m350356j296093Q148531R827029K140651p87164N852038
$$ 53594752 56105409 51755053 50458960 58607491 68434520 70575171 69788007 75640045
42311G5640045Q216747j260800q462673j277606P885297J773956j2210166j3785096
$$ 75640045 83856792 82595992 74133319 72855713 80741010 82514966 70304800 56519704
42303E6519704l233799M19080p329529q843103N204099J8913525J5410423K225210
$$ 56519704 53285905 53704985 46375456 37532353 42736452 61649977 77060400 79285610
42295G9285610j356759P716768J5761511J5259043J3616270J7889271K3096508
$$ 79285610 77928851 85645619 101407130 116666173 130282443 148171714 171268222
42288A71268222K1826484J7457316J8932239K5417848K5672552J4319908O07268
$$ 171268222 193094706 210552022 229484261 254902109 280574661 294894569 295501837
42281B95501837l817504J21320K125884m089930j7178002l2970804m4448714m1522608
$$ 295501837 291684333 291805653 293931537 289841607 272663605 239692801 195244087 153721479
42273A53721479k2084906q99455M650049l393778q486386n211835l938217q886382
$$ 153721479 131636573 130737118 135387167 131993389 123507003 118295168 114356951 105470569
42265A05470569j0600404n814333n247186j2113735j2282673P27497R582394k57455
$$ 105470569 94870165 89055832 83808646 71694911 59412238 60139735 69722129 69464674
42257F9464674j3937425q710045J0167965J8392335R281131k250054p353244j0904704
$$ 69464674 55527249 46817204 56985169 75377504 84658635 82408581 75055337 64150633
42249F4150633j3146916o979379M678655R467810O042903N192912Q878241P475111
$$ 64150633 51003717 44024338 48702993 58170803 64213706 69406618 78284859 85759970
42241H5759970J0943l063108n69090l135435j0334153p393866P531378J4800270
$$ 85759970 85770913 82707805 82138715 79003280 68669127 61275261 68806639 83606909
42233H3606909L170710j1656061j1495494r31880N987311Q042534J0420253J0234395
$$ 83606909 86777619 75121558 63626064 62694184 68681495 76724029 87144282 97378677
42225I7378677M670468J771595P376294J1841406N045775n569079p580563m305294
$$ 97378677 102049145 103820740 111197034 123038440 128084215 122515136 114934573 110629279
42217A10629279o068816r543061m326890N898235P579171m33587o131671m208764
$$ 110629279 104560463 95017402 90690512 96588747 104167918 103734331 97602660 93393896
42209I3393896o10569J782089O336550J1174945R212247J188647m464660o088529
$$ 93393896 92783327 94565416 100901966 112076911 121289158 122477805 118013145 111924616
42201A11924616j0230804j6953462j6968297p072507L514829P027989O963068
$$ 111924616 101693812 84740350 67772053 60699546 64214375 71242364 78205432
42194G8205432Q598347Q975728L388425m402598n735429J615309J0688553J3617177
$$ 78205432 86803779 95779507 99167932 94765334 89029905 90645214 101333767 114950944
42186A14950944J0343400Q310576J2983955J9800090J9278881J0247221J888198
$$ 114950944 125294344 133604920 146588875 166388965 185667846 195915067 197803265
42179A97803265O65447K735321L182361M108206P339490P912894K999911j029800
$$ 197803265 198468712 201204033 204386394 208494600 215834090 223746984 226746895 225717095
42171B25717095L83589O07588o106435j2636182j1783323j1045385j8589850k4108151
$$ 225717095 226100684 226708272 220601837 207965655 196182332 185136947 166547097 142438946
42163A42438946j3981446J703114J527584j1107588j1440867M800702J1980857
$$ 142438946 128457500 130160614 131688198 120580610 109139743 113940445 125921302
42156A25921302l513799j9573824j3283830L615763N992582n092655q981451j465186
$$ 125921302 122407503 102833679 89549849 93165612 99158194 94065539 85084088 83618902
42148H3618902J525643o216007j0969955k613352R782465J2725460N771275k883735
$$ 83618902 85144545 78928538 67958583 65345231 75127696 87853156 93624431 90740696
42140I0740696q506459r870062m204289Q935955K1096211K0293629N219136j0599135
$$ 90740696 82234237 72364175 68159886 77095841 98192052 118485681 123704817 113105682
42132A13105682j3115843m440489N41450m952240r957544k943056Q716344Q058824
$$ 113105682 99989839 95549350 96090800 91138560 81181016 78237960 86954304 95013128
42124I5013128n604317j4238830o731590O526189J0616775N697407R54688j313293
$$ 95013128 89408811 75169981 68438391 74964580 85581355 91278762 92233450 90920157
42116I0920157m850860q942531r208558n420314l75959N315663J0064243Q007366
$$ 90920157 86069297 77126766 67918208 62497894 62121935 67437598 77501841 85509207
42108H5509207k193939r856309m178601R000789J3532665N464034k082549J463030
$$ 85509207 83315268 73458959 69280358 78281147 91813812 97277846 95195297 96658327
42100I6658327J0032961J1365995L912888l200631l436710j75408p32279o158096
$$ 96658327 106691288 118057283 121970171 118769540 115332830 115157422 114425143 108267047
42092A08267047r250755l889334N288164P322570J34489n331611p07278O805080
$$ 108267047 99016292 95126958 100415122 107737692 107872181 102540570 101833292 108638372
42084A08638372N103033m387494r903707q346072p842815r979589l993183J3889113
$$ 108638372 113741405 109353911 99450204 91104132 83261317 73281728 69288545 83177658
42076H3177658K7370696J8871210m694106j8409557j0828953L353946N234043
$$ 83177658 110548354 129419564 124725458 106315901 95486948 98840894 104074937
42069A04074937m318230r848744l923553M845756N320652k195590p793535l907366
$$ 104074937 99756707 89907963 85984410 90830166 96150818 93955228 86161693 82254327
42061H2254327O532348J2325041M744689j1623142k0386333j0104155J1335909
$$ 82254327 88786675 101111716 105856405 94233263 73846930 63742775 75078684
42054G5078684K4680188K1303708R997963J129013n824360j3973814j8370197
$$ 75078684 99758872 121062580 131060543 132189556 126365196 112391382 94021185
42047I4021185j3005102j799718P240612J3581132J9831579K1471902J3297704
$$ 94021185 81016083 79216365 86456977 100038109 119869688 141341590 154639294
42040A54639294J935340k051488j519286o315609j1593506k644822J6017177J9004810
$$ 154639294 156574634 154523146 153003860 146688251 135094745 132449923 148467100 167471910
42032A67471910k618880k2943096j5702518R204489K2407666J5959702O399009
$$ 167471910 164853030 141909934 126207416 135411905 157819571 173779273 180178282
42025A80178282M545203M980162M371111R044893J9957401K6477524K1132373
$$ 180178282 184723485 189703647 194074758 203119651 223077052 249554576 270686949
42018B70686949Q732951l354880j3050555j8277442j5420902p796515m951815
$$ 270686949 279419900 276065020 263014465 244737023 229316121 221519606 216567791
42011B16567791q204715p310387K087261Q207954m92406j6905821k4070319j7494860
$$ 216567791 208363076 201052689 203139950 211347904 210855498 193949677 169879358 152384498
42003A52384498q055369n140062p262782r232883q958929n163352L065360J0802081
$$ 152384498 144329129 139189067 131926285 122693402 113734473 108571121 111636481 122438562
41995A22438562R127857j948119r125404k394231R140423Q983968j601928m677753
$$ 122438562 131566419 129618300 120492896 118098665 127239088 136223056 134621128 129943375
41987A29943375N132914R115211o570729k4786825j9379875M559068J5739301
$$ 129943375 135076289 144191500 137620771 112833946 93454071 98013139 113752440
41980A13752440K002202j3656811r874277L216857N422103j271865j859989L449975
$$ 113752440 115754642 102097831 92223554 95440411 100862514 99590649 97730660 101180635
41972A01180635K950466j462329L818850J7815940K2148607R117350n050813k735905
$$ 101180635 104131101 102668772 106487622 124303562 146452169 155569519 150518706 147782801
41964A47782801J2013126K0967203J3728440m168129j9072107k0580865r517493
$$ 147782801 159795927 180763130 194491570 190323441 171251334 150670469 141152976
41957A41152976L129670Q351177Q469294R426396Q568485j26335j2185283j6685228
$$ 141152976 144282646 152633823 161103117 170529513 179097998 178971663 166786380 150101152
41949A50101152j3316548j2122880j5379791j3954977n080938N34749m105154
$$ 150101152 136784604 124661724 109281933 95326956 90246018 90780767 86675613
41942H6675613j0105291n898861O394226J5588692J5524275Q291167n47770n092026
$$ 86675613 76570322 70671461 77065687 92654379 108178654 116469821 115922051 110830025
41934A10830025l217466o99370m809956j2432902j3347837o607691k209626l713731
$$ 110830025 107612559 106913189 102103233 89670331 76322494 69714803 67505177 63791446
41926F3791446k651894M345744P198228n4432o692326j992827O549968M869672
$$ 63791446 61139552 65485296 72683524 72629092 65936766 63943939 70493907 75363579
41918G5363579o037552j3332342j1215583m405360K271240O375663M553317k416951
$$ 75363579 69326027 55993685 44778102 40372742 42643982 49019645 53572962 51156011
41910E1156011n882614j118053K753230l497796j1492595o153712R192016J5398569
$$ 51156011 45273397 44155344 46908574 43410778 31918183 25764471 34956487 50355056
41902E0355056N813250m265684r23956R636858J3079172O872630p52996m805062
$$ 50355056 56168306 51902622 50978666 60615524 73694696 80567326 79814330 75009268
41894G5009268o996991q056232n002979K561889Q623903O807670r31589n375047
$$ 75009268 68012277 59956045 54953066 57514955 66138858 72946528 72014939 66639892
41886F6639892j466575M885505N760669L550221O155505J1049364N764576j1769802
$$ 66639892 65173317 70058822 75819491 79369712 85525217 96574581 102339157 90569355
41878I0569355k4785676j7996887J682937J4162375J0474169p08240o584152k178935
$$ 90569355 65783679 47786792 49469729 63632104 74106273 73398033 66813881 64634946
41870F4634946P767370J2202528K962525j3983511k2093054j4367501k182247
$$ 64634946 72402316 84604844 87567369 73583858 51490804 37123303 34941056
41863C4941056K207551J737214M001917O068689K807869O2039L817269N341542
$$ 34941056 37148607 38885821 42887738 48956427 51764296 51826335 55643604 60985146
41855F0985146m631815j4566262o489540J2563700J7029276R95724j3548158j0714046
$$ 60985146 56353331 41787069 35297529 47861229 64890505 65886229 52338071 41624025
41847D1624025m15570L353452K797674L923353K035490o903755j4173937j0883165
$$ 41624025 41208455 44561907 47359581 51282934 53318424 46414669 32240732 21357567
41839B1357567k467417Q60976n44568j18929K867829M562877L454135l35886n801590
$$ 21357567 18890150 19751126 19206558 19087629 21955458 26518335 29972470 29636584 23834994
41830B3834994p212437J102118J2900544J5005690P707795N197904J0552898Q826691
$$ 23834994 16622557 17724675 30625219 45630909 53338704 58536608 69089506 77916197
41822G7916197n538289j4521262m744722Q615092N452551p348173r859507k459441
$$ 77916197 72377908 57856646 53111924 61727016 67179567 59831394 49971887 47512446
41814D7512446o79082n589974n228526m52658l152273j0643510q114159K813351
$$ 47512446 46833364 41243390 36014864 35562206 32409933 21766423 13652264 16465615
41806A6465615M785149k747046R9073J6832954K2800675M449724j5677638j2936299
$$ 16465615 21250764 18503718 18602791 35435745 58236420 62686144 47008506 34072207
41798C4072207K065447L727696p346559r878890J300967J0828987J1312150J1047864
$$ 34072207 36137654 39865350 32518791 22639901 23940868 34769855 46082005 57129869
41790E7129869J2512589O320208q374672j7130708j1176840O00979P302475Q983353
$$ 57129869 69642458 75962666 67587994 50457286 39280446 39881425 47183900 56167253
41782E6167253P395658p76746j2350333j4053389k156665P351703J545690q649189
$$ 56167253 63562911 62786165 50435832 36382443 34225778 41577481 43123171 34473982
41774C4473982o559965K000911j070735j3817606j4939818K467822J9181407J7350312
$$ 34473982 27914017 29914928 28844193 15026587 86769 2554591 21735998 39086310
41766C9086310K082103j1344827j6199499j2655811k313961O752335L203687r903661
$$ 39086310 41168413 29823586 13624087 968276 -1345685 5406650 8610337 -1293324
41758a293324j4055290j584679J1476395J0203278K348095K88600j604724j1316075
$$ -1293324 -15348614 -16933293 -5456898 4746380 7094475 7383075 5778351 -5537724
41750e537724j6305616k174472J6716477J4606026l780709j0145779L30363L144787
$$ -5537724 -21843340 -24017812 -7301335 7304691 3523982 -6621797 -6291434 -3146647
41742c146647r671611j3777360M068567K0333566J3302052j115202J830987J3806603
$$ -3146647 -12818258 -26595618 -22527051 -2193485 11108567 9993365 11824352 25630955
41734B5630955J0138912o996120j3381704k909072O393685M254809K894R68813
$$ 25630955 35769867 28773747 15392043 12482971 18876656 23131465 23134359 24103172
41726B4103172J478773k547400o132904o512243o946054o490642J17599R964507
$$ 24103172 25581945 23034545 16901641 10389398 3443344 -3047298 -2929699 7034808
41718G034808J2603570N817293j120891j767091J169363M557210P922765O988817
$$ 7034808 19638378 25455671 24334780 22567689 23737052 28294262 36217027 43205844
41710D3205844l150043j6415210j9592852j0552781j283530j36753k341106j236083
$$ 43205844 40055801 23640591 4047739 -6505042 -7788572 -7925325 -10266431 -11502514
41702a1502514K290792N709947J0036445J4342581J3462673N699201l522756q490709
$$ -11502514 -9211722 -3501775 6534670 20877251 34339924 40039125 36516369 28025660
41694B8025660q295107m557149N9389J862828O41205J472986N608222N279454
$$ 28025660 19730553 15173404 15232793 17095621 17736826 19209812 24818034 30097488
41686C0097488l206166q989619k703203M957728j275768j3503008j0876621M965404
$$ 30097488 26891322 17901703 15198500 20156228 18880460 5377452 -5499169 -533765
41678e33765J0139572l199577j4816814r932375K88855K828776L699548J0227052
$$ -533765 9605807 6406230 -8410584 -18342959 -18054104 -15225328 -11525780 -1298728
41670a298728J3797462P330970J471560N192332O990723m859876j8072008j3923810
$$ -1298728 12498734 19829704 21301264 26493596 33484319 28624443 10552435 -3371375
41662c371375K468684J1395942R169207P361615P868961J530730j0415487j4379174
$$ -3371375 -902691 10493251 19662458 27024073 34893034 36423764 26008277 11629103
41654A1629103n478868N705300Q892068L732739n546727j2846250r675278N293931
$$ 11629103 6150235 11855535 20747603 24480342 18933615 6087365 -3587913 1706018
41646A706018J8347388J5004493k13784j0449526r369825m221752p6966L927949
$$ 1706018 20053406 35057899 34844115 24394589 15024764 10803012 10726046 14653995
41638A4653995N083008p73690q371771q208136j757179J430968m84849k148921
$$ 14653995 19737003 18963313 10591542 2383406 626227 2057195 1572346 -576575
41630e76575l615401p362019o976531L808254J4727086J1287660J60618j94615
$$ -576575 -4191976 -11553995 -18530526 -14722272 4814 11292474 11453092 11258477
41622A1258477P810107M220644j0696939j2141811P262829K1554052J2636330
$$ 11258477 19068584 23289228 12592289 450478 7713307 29267359 41903689
41615D1903689j131737J218915O616415o539404k5723834k1244967L567437J4221765
$$ 41903689 40771952 41990867 48607282 42067878 16344044 -4900923 -1333486 12888279
41607A2888279k135607j7998941r063742J0217087J1403665n740895j6482562
$$ 12888279 10752672 -7246269 -16310011 -6092924 5310741 -430154 -16912716
41600a6912716q532073M002700N397596M70169K773827J0502368Q485942o550217
$$ -16912716 -25444789 -21442089 -16044493 -15574324 -12800497 -2298129 6187813 -362404
41592c62404j7373289j0048266N348431J0161883M828508M341478J0282474Q008593
$$ -362404 -17735693 -27783959 -22435528 -12273645 -7445137 -3103659 7178815 15187408
41584A5187408n799061j3932324n787864N165491M081935j395179L275049J2826307
$$ 15187408 9388347 -4543977 -10331841 -5166350 -1084415 -2479594 795455 13621762
41576A3621762J0917579j864373q971842m295293J067517q54604m613641m669602
$$ 13621762 24539341 22674968 13703126 9407833 10475350 9620746 5007105 337503
41568C37503m343900n971896m019984M890020J3361791J1792502J098705q332293
$$ 337503 -4006397 -9978293 -13998277 -9108257 4253534 16046036 17144741 8812448
41560H812448q249609l91889O057189M338030k042080l621095J832651N703079
$$ 8812448 562839 170950 6228139 10566169 8524089 4902994 6735645 12438724
41552A2438724J535007n051502n909546l251556l840663n688288k002154M549621
$$ 12438724 13973731 8922229 3012683 -238873 -4079536 -9767824 -11769978 -7220357
41544g220357M001570m524476j0288506o627227J148887O111681Q357506R777073
$$ -7220357 -3218787 -7743263 -18031769 -24658996 -23510109 -17398428 -9040922 736151
41536G36151Q774265M677846P60624j070680k859925m705960k320297N405539
$$ 736151 9510416 14188262 14948886 13878206 11018281 6312321 3992024 9397563
41528I397563J1294927P282821n112465j4976847j2519158P34100J1785016Q481595
$$ 9397563 20692490 27975311 22862846 7885999 -4633159 -3899059 7885957 16367552
41520A6367552o210425j5896563r663077N643946J6231827J7643643J3248995
$$ 16367552 10157127 -5739436 -15402513 -9758567 6473260 24116903 37365898
41513C7365898M174894q053067j4379517p302335N336101Q875281K704979r41193
$$ 37365898 41540792 33487725 19108208 11805873 17141974 26017255 28722234 27781041
41505B7781041K002392K838627k487459p045170o971095o859856p618587m372567
$$ 27781041 29783433 32622060 30134601 23089431 16118336 9258480 1639893 -2732674
41497b732674n10968o742918j9963950k1160485l718187J3725149J4351475O090411
$$ -2732674 -3243642 -9986560 -29950510 -51110995 -54829182 -41104033 -26752558 -20662147
41489b0662147L591882M077465j178264n903514k69726P503065L070964p776489
$$ -20662147 -17070265 -12992800 -14171064 -20074578 -20344304 -12841239 -9770275 -17546764
41481a7546764p103437N268563J2126897P557172L255550M931635L818030l758336
$$ -17546764 -24650201 -19381638 -7254741 302431 3557981 8489616 12307646 8549310
41473H549310p742263k143332N035393O969202Q280269J2239694J1266099l77516
$$ 8549310 807047 -1336285 3699108 10668310 18948579 31188273 42454372 42076856
41465D2076856j4778398k0014423j3948654k448714Q196991J2361580P284178
$$ 42076856 27298458 7284035 -6664619 -9113333 -916342 11445238 18729416
41458A8729416j266306m045691k021888m578140j1406876j0002302L056972J3169936
$$ 18729416 17463110 13417419 11395531 6817391 -4589485 -14591787 -11534815 1635121
41450A635121R479519J890343M129299J1519652J0163036k18381p746418p353305
$$ 1635121 11114640 13004983 17134282 28653934 38816970 38598589 30852171 23498866
41442B3498866m240004j971172r5286j061102p221376j2539432q620345K114934
$$ 23498866 19258862 17287690 17192404 16131302 8909926 -3629506 -12249851 -10134917
41434a0134917R623965J0902892J0683421R174740J477517r985572j4460527p795427
$$ -10134917 -510952 10391940 21075361 30250101 31727618 21742046 7281519 -513908
41426e13908Q89952J497636m844780r251630n994022K178165O845290K603358
$$ -513908 376044 1873680 -2971100 -12222730 -18216752 -16038587 -9193297 -6589939
41418f589939n159746n595491J372870K665045o958278j2539391r81785J4711751
$$ -6589939 -11749685 -17345176 -15972306 -13307261 -20265539 -32804930 -33786715 -19074964
41410a9074964J2889806j406595l006854J1837911J7737673J477898j5553942
$$ -19074964 -6185158 -7591753 -10598607 1239304 18976977 20454875 4900933
41403D900933j1366489K844419L602305p085214r036245R81439O144065j317390
$$ 4900933 -6465556 -3621137 -18832 -7104046 -16140291 -15158852 -9014787 -10332177
41395a0332177r628968p746693J025693Q579174J1661373R630735L774464K2251
$$ -10332177 -19961145 -27707838 -26682145 -18102971 -6441598 3189137 6963601 6985852
41387F985852K420781M900601K53909n368975n35125J0759464J2562426J788352
$$ 6985852 9406633 14307234 14561143 9192168 8657043 19416507 31978933 33767285
41379C3767285p612304q291544q935614j3640950j0830959N499824J9704275J5166396
$$ 33767285 26154981 17863437 8927823 -4713127 -15544086 -10044262 9660013 24826409
41371B4826409o36737q206135m619292k609939o211652n879147J901841O923135
$$ 24826409 24189672 15983537 11364245 8754306 2542654 -3336493 -1434652 5488483
41363E488483J849166o064007o133059J506279Q755559J0387977O498741j214007
$$ 5488483 7337649 1273642 -4859417 -3353138 5402421 15790398 22289139 21075132
41355B1075132r779340j3694012q654943K525901J0531480Q360056n10545n072581
$$ 21075132 11295792 -2398220 -11053163 -8527262 2004218 10364274 9853729 4781148
41347D781148K59697Q150739Q038333J193840j321624L957129P059467K57518
$$ 4781148 5040845 13191584 21229917 22423757 21102133 25059262 32118729 32376247
41339C2376247r643287j2189987r217199j0411806j7278629k0960363j4271709
$$ 32376247 22732960 10542973 1325774 -9086032 -26364661 -47325024 -61596733
41332f1596733J135876J7304697K4063661J5405034j212805p891529K499135J4696522
$$ -61596733 -60460857 -43156160 -19092499 -3687465 -4900270 -12791799 -10292664 4403858
41324D403858J1579480j234613o437609l978296q397741j9211481j8033854o16568
$$ 4403858 15983338 14748725 8311116 4332820 -4064921 -23276402 -41310256 -41926824
41316d1926824J1710638M319996p401147l290548R542265R939925l016166j0587084
$$ -41926824 -30216186 -25896190 -33297337 -36587885 -27045620 -17105695 -20121861 -30708945
41308c0708945m464075M046735M906169J876668J165201J829559K143413M493238
$$ -30708945 -35173020 -31126285 -26220116 -24343448 -23178247 -21348688 -19205275 -14712037
41300a4712037R034395J0783103P213527K226186n46447k570872n903095q871749
$$ -14712037 -5677642 5105461 12318988 14545174 13998727 11427855 5524760 -3346989
41292c346989q675790m736861J454212O646813O610742N17320o457183q851077
$$ -3346989 -12022779 -16759640 -15305428 -8658615 -2047873 -1530553 -7987736 -16838813
41284a6838813p465733o003007m075283Q42261P159633J0948890J1474506R300419
$$ -16838813 -24304546 -30307553 -34382836 -33540575 -26380942 -15432052 -3957546 5342873
41276E342873K929696n736468p911019M21607Q171937K569692j0381100j2719546
$$ 5342873 8272569 2536101 -5374918 -4953311 3218626 5788318 -4592782 -17312328
41268a7312328m96289J1954134J4425313J1883911R998936N487641k955004q241678
$$ -17312328 -17808617 -5854483 8570830 20454741 30453677 35941318 32986314 24744636
41260B4744636o932356n517320p751290p927323l627812j853690m410450j559944
$$ 24744636 17812280 12294960 4543670 -3383653 -7011465 -8865155 -13275605 -14835549
41252a4835549R526408J4786046M828316p535271o826328J108738K616590J443133
$$ -14835549 -5309141 9476905 14305221 6769950 -56378 1052360 3668950 5112083
41244E112083Q392658J5059493L870363j8737441k5677541q734684R282730Q597017
$$ 5112083 13504741 28564234 32434597 13697156 -11980385 -20715069 -11432339 -2835322
41236b835322k682473p157059l033495J369570L567279N286151N262725L325955
$$ -2835322 -5517795 -12674854 -15708349 -14338779 -10771500 -5485349 -222624 3103331
41228C103331K913311L046554j744758q171525m472337Q761943J3547421J142613
$$ 3103331 6016642 9063196 7318438 -853087 -5325424 3436519 16983940 18126553
41220A8126553j1636340p084958O393365R456457K160962j410358l72619n797833
$$ 18126553 6490213 -594745 5798620 15255077 17416039 16005681 15633062 9835229
41212I835229j5707740j4775847p83332R848700P540036J386319l71761k771704
$$ 9835229 -5872511 -20648358 -21431690 -11582990 -4042954 -2656635 -3028396 -5800100
41204e800100q390790p418223M138056J1963721M315790p165647m730883O808045
$$ -5800100 -14190890 -21609113 -17471057 -5507336 -1191546 -8357193 -13088076 -6280031
41196f280031Q093399l183275r580235l351696J826016m776624j2246210n488086
$$ -6280031 1813368 -1369907 -10950142 -14301838 -12475822 -17252446 -29498656 -34986742
41188c4986742J0499664J7746254J0446440m91143n609293o648197o787572k977429
$$ -34986742 -24487078 -6740824 3705616 3214473 -2394820 -9043017 -15830589 -18808018
41180a8808018O428853J4567290J3854672O482402O66998n30124k23020J29570
$$ -18808018 -12379165 2188125 16042797 22525199 23192197 22662073 22439053 22568623
41172B2568623K007045L563727j127p782969j2093993r465520n836327n949072
$$ 22568623 24575668 28139395 28138268 20355299 8261306 -1204214 -7040541 -12989613
41164a2989613m815555K452305Q514475K964722q907968r831778M730173J8321793
$$ -12989613 -17805168 -15352863 -6838388 -3873666 -12781634 -22613412 -17883239 438554
41156D38554J6160223M911472K31879L475806L864161j058492k376381K315188
$$ 438554 16598777 21510249 21742128 25217934 29082095 28023603 25647222 27962410
41148B7962410K730206o928781j6594826j4622887m701179J314793J131446J506603
$$ 27962410 30692616 23763835 7169009 -7453878 -12155057 -10840264 -9708818 -8202215
41140h202215L728356J779426n022889q892190n744613r45812O92830J678687
$$ -8202215 -4473859 -2694433 -7717322 -16609512 -22354125 -23299937 -22607107 -20928420
41132b0928420L851835K507567m510746r299859m106400O293268J1245120Q880027
$$ -20928420 -17076585 -14569018 -19079764 -28379623 -32486023 -26192755 -14947635 -6067608
41124f067608M855695N48676o302374j1538888q001980N09151J799510n256551
$$ -6067608 -1211913 -663237 -6965611 -18504499 -26506479 -25997328 -24197818 -29454369
41116b9454369p038959L287523J3435593J0312517l47508m438969j008931N73253
$$ -29454369 -36493328 -33205805 -19770212 -9457695 -9805203 -14244172 -15253103 -14679850
41108a4679850n72870L412816J1594651J1930876M6033j2353420j3499574n990124
$$ -14679850 -15252720 -11839904 -245253 11685623 11731656 -621764 -14121338 -20111462
41100b0111462R82404M765473O687637L826757o275438j6097036j3787590J010017
$$ -20111462 -19129058 -14363585 -7675948 -3849191 -10124629 -26221665 -40009255 -38999238
41092c8999238J4937719J6624740Q469205J63986l632533m421269k992411J465772
$$ -38999238 -24061519 -7436779 1032426 1196412 -2436121 -6857390 -9849801 -8384029
41084h384029N897043L998357m701471j1283453p472774L750631J2391413J3941633
$$ -8384029 -2486986 1511371 -3190100 -14473553 -21946327 -18195696 -5804283 8137350
41076H137350J1732673Q230413J666907p321067j3098955j2400281q257648l388188
$$ 8137350 19870023 28100436 29767343 22446276 9347321 -3052960 -11310608 -14698796
41068a4698796L607108J1139996J1409850J481654q669073q024229j1961L196741
$$ -14698796 -11091688 48308 11458158 12939812 4270739 -3753490 -3765451 -568710
41060e68710j466913o013868n520430l566762l296092k879547j274690J34815
$$ -568710 -2035623 -8049491 -13569921 -17136683 -20432775 -23312322 -24587012 -24452197
41052b4452197K681322Q572725J3372030J0143382K126483j18193L353729R9395
$$ -24452197 -21770875 -13198150 173880 10317262 12443745 12325552 15679281 15778676
41044A5778676j2684108j8262000l701428J7404209K0238804J993102j4752278
$$ 15778676 3094568 -15167432 -18868860 -1464651 18774153 20767255 6014977
41037F014977j2006713K686457R332678Q05982j1454539j3548306m528729N785941
$$ 6014977 -5991736 -3305279 6027399 6833381 -4621158 -18169464 -22698193 -16912252
41029a6912252J0482253J1495889J1278388O008005o235226j6072168j2350765
$$ -16912252 -6429999 5065890 16344278 22352283 16117057 44889 -12305876
41022a2305876O74933P323814K141321m628215n063630l311967k975260O35884
$$ -12305876 -11630943 -4307129 -2165808 -6794023 -11857653 -15169620 -18144880 -17508996
41014a7508996Q202412J0341858L295759k696377j185390j299307q797135j1036437
$$ -17508996 -9306584 1035274 4331033 1634656 449266 -850041 -9647176 -20683613
41006b0683613J172330J1310194L28316j8455556j5361846R312196K4431614J5261712
$$ -20683613 -19511283 -8201089 -7872773 -26328329 -41690175 -32377979 -7946365 7315347
40998G315347K194548M062431J0189396M022488p333843o381168O071657J3749765
$$ 7315347 9509895 13572326 23761722 27784210 20450367 14069199 20140856 33890621
40990C3890621Q363549m117704j4599804j7166208j0128416R9931K180037o002710
$$ 33890621 42254170 38136466 23536662 6370454 -3757962 -3658031 -1477994 -7480704
40982g480704j3734402j3681514j1173232j0300234l992176J0858392K0902111
$$ -7480704 -21215106 -34896620 -46069852 -56370086 -60362262 -49503870 -28601759
40975b8601759J3581990k555453r786653n581271k9056L293961O925532O348354
$$ -28601759 -15019769 -17575222 -27361875 -32943146 -32972202 -29678241 -22752709 -16404355
40967a6404355l700017j3006556n661599J3925301K3605342J4161620o06536p686286
$$ -16404355 -20104372 -33110928 -38772527 -24847226 -1241884 12919736 12313200 4626914
40959D626914r939690j1239785n541042Q178148J5941542P781293m938633n899020
$$ 4626914 -5312776 -16552561 -22093603 -13915455 2026087 9807380 4868747 -1030273
40951a030273J355999R25245q613462j2197324l051308O654076N094455j839493
$$ -1030273 325726 1250971 -7362491 -19559815 -22611123 -15957047 -10862592 -12702085
40943a2702085j260009O582880R694015L183411m203460m744144l169494o211576
$$ -12702085 -13962094 -7379214 2314801 5498212 1294752 -3449392 -6618886 -12830462
40935a2830462p962589J993494J7586193J8697482L90803j4535710m750845J8026819
$$ -12830462 -20793051 -18799557 -1213364 17484118 17874921 3339211 -1411634 16615185
40927A6615185K3681064N281478j3213508j2257124n28321L990216j22459l466799
$$ 16615185 40296249 45577727 32364219 20107095 19578774 23568990 23446531 19979732
40919A9979732n277870j1337045j8233390j5043273n03715J3114418J5104437
$$ 19979732 14701862 3364817 -14868573 -29911846 -30415561 -17301143 -2196706
40912b196706P202281j947492o395081n433008j972176m5133p46869r83079J052904
$$ -2196706 5005575 3058083 -3336998 -8770006 -10742182 -10787315 -11534184 -12517263 -11464359
40903a1464359K086032M9968Q0396O513375J2051224N580126r391879j6136363
$$ -11464359 -9378327 -9328359 -9247963 -2734588 9316636 14896762 5504883 -10631480
40895a0631480p906099K208494J367144m399880k503391M282647L158326n595281
$$ -10631480 -18537579 -16329085 -14961941 -19361821 -21865212 -17582565 -14424239 -20019520
40887b0019520p671143J613715R000888M942730j027082K801392R972615O969119
$$ -20019520 -27690663 -26076948 -17076060 -12133330 -13160412 -10359020 -386405 6582714
40879F582714l135434n271681K102836M115545n251020j2068344m373255Q619787
$$ 6582714 3447280 -1824401 278435 4393980 -857040 -12925384 -17298639 -8678852
40871h678852J0098516r84953j1358441j1952033m713552M198900Q428417K895511
$$ -8678852 1419664 434711 -10923730 -22875763 -27589315 -23390415 -14961998 -12066487
40863a2066487r345158j5600158q125606L916058O937963K735377L828095J2420583
$$ -12066487 -21411645 -37011803 -45137409 -41221351 -34283388 -31548011 -27719916 -15299333
40855a5299333J7720391J3337512L912834n659526j3904363j5193669l978287
$$ -15299333 2421058 15758570 19671404 14011878 107515 -15086154 -19064441
40848a9064441J0703917J1233252k744682j0748357j448230J0141511O488667
$$ -19064441 -8360524 2872728 128046 -10620311 -12068541 -1927030 4561637
40841D561637o589679j2164169p842193k956234L36754N735390Q951566K739792
$$ 4561637 -2028042 -14192211 -22034404 -24990638 -24653884 -18918494 -9966928 -7227136
40833g227136p464265r078249j786033L490673L387299M479793P441236M934496
$$ -7227136 -14691401 -23769650 -25555683 -22065010 -18677711 -14197918 -6756682 -1822186
40825a822186k843067n890360j300100J569537k791915p809602p543466n107380
$$ -1822186 -4665253 -10555613 -11855713 -10286176 -13078091 -20887693 -28431159 -33538539
40817c3538539l010999K537949J1248273J4306312P510869j613807o299250q852477
$$ -33538539 -36549538 -34011589 -22763316 -8457004 -946135 -2559942 -8859192 -17711669
40809a7711669r750317j786400J4750562K3967760J4915344k95388l980529M51243
$$ -17711669 -27461986 -29248386 -14497824 9469936 24385280 24089892 20109363 20560606
40801B0560606l152576j4689461j7223103n204516N766919K543744p144853p646749
$$ 20560606 17408030 2718569 -14504534 -19709050 -13942131 -11398387 -18543240 -26189989
40793b6189989L158532J3017818J0670026k577395j3646141r627120P220699J8952611
$$ -26189989 -23031457 -10013639 656387 -1921008 -15567149 -25194269 -17973570 979041
40785I79041J2566266l110836j0231877o246217j838071R61312R477377J8898659
$$ 979041 13545307 10434471 202594 -6043623 -7881694 -6920382 2556995 21455654
40777B1455654J2546774q904259k0210908o973221J0737892P866142q494729j3242977
$$ 21455654 34002428 25098169 4887261 -2085960 8651932 16518074 8023345 -5219632
40769e219632k953962L521242j516961o247836m408608m239256p774132l751086
$$ -5219632 -8173594 -4652352 -6169313 -12417149 -16825757 -21065013 -28839145 -32590231
40761c2590231J0393776J9188849J2638635K203909J234775M523160J029961o238256
$$ -32590231 -22196455 -3007606 9631029 11834938 13069713 17592873 18622834 12384578
40753A2384578q503089q447340j2396940j3863210l301139J1062951J1678195
$$ 12384578 3881489 -4565851 -16962791 -30826001 -34127140 -23064189 -11385994
40746a1385994l39336m950931O235640J7129868J1845184k905753j0265262o926324
$$ -11385994 -11725330 -16676261 -10440621 6689247 18534431 15628678 5363416 -1562908
40738a562908k309788o98962K788611R165401R736568j689973j6347914j7592256
$$ -1562908 -3872696 -4571658 -1783047 7382354 17118922 15428949 -918965 -18511221
40730a8511221j512762J5211621J3921345k009868j0693030o99163J4372103J6586284
$$ -18511221 -20023983 -4812362 9108983 7099115 -3593915 -4293078 10079025 26665309
40722B6665309P737326R64689k438213j0718710k0378023j7160030p12095J0642380
$$ 26665309 34402635 35367324 32929111 22210401 1832378 -15327652 -16039747 -5397367
40714e397367O671384k64562K494560O964796L22241j0846854j0339887M41163
$$ -5397367 1274017 1009455 3504015 10468811 10791052 -55802 -10395689 -9954526
40706i954526M279386m080579j0217021l818468N814759O152272R84338K159788
$$ -9954526 -5675140 -9755719 -19972740 -23791208 -17976449 -11824177 -10839839 -8680051
40698h680051R208997J0483452L037662j584336M336430J0936576M382248j1534484
$$ -8680051 528946 11012398 14050060 12465724 16802154 27738730 32120978 20586494
40690B0586494j9165731j1783591k237340k755213p842462n804360K360266P213127
$$ 20586494 1420763 -10362828 -12600168 -15355381 -23197843 -29002203 -26641937 -19428810
40682a9428810P036537O500761M231254l390169r085374k041171J1881724J4721086
$$ -19428810 -12392273 -5891512 -1660258 -5050427 -14135801 -16176972 -4295248 10425838
40674A0425838L326298o023317l850601K56276k098458m794672l045958l245911
$$ 10425838 13752136 7728819 3878218 4134494 2036036 -2758636 -5804594 -9050505
40666i050505n872066J163601J7621162K0551641j393021k2807473j5526507Q266051
$$ -9050505 -14922571 -13758970 3862192 24413833 23020812 213339 -15313168 -7047117
40658g047117J5464755K585581m948850K405763P761681K173560k523821m51746
$$ -7047117 8417638 11003219 6054369 8460132 16221813 18395373 15871552 15419806
40650A5419806k116330j0063452j0556133P51672Q936119N580385J261943K202120
$$ 15419806 13303476 3240024 -7316109 -6564437 2371682 7952067 9214010 11416130
40642A1416130j422279j1639827j1834473M540765J7610211J1622331R8953K32511
$$ 11416130 9993851 -1645976 -13480449 -8939684 8670527 20292858 20391811 20624322
40634B0624322L376787m806292j3786484o254233P349738L251779j4896329k0438026
$$ 20624322 24001109 19194817 5408333 -845900 6503838 9755617 -5140712 -25578738
40626b5578738n914295Q371283R024424N441783O420921N906822J82132j891046
$$ -25578738 -31493033 -23121750 -14097326 -8655543 -2234622 3672200 3854332 1963286
40618A963286M347643R361940N703094n6250n12576J83489l988117r481122r810820
$$ 1963286 6310929 15672869 21375963 21319713 20807137 20990626 17002509 7521387 -2289433
40609b289433n266850M90477N912804Q749828N621060j313101m896849l386231
$$ -2289433 -7556283 -7065806 -1153002 7596826 13217886 11904785 7007936 3621705
40601C621705k081940k176417K039122J1006150J5038833P255910o468282j5244499
$$ 3621705 1539765 -636652 1402470 12408620 27447453 34703363 28235081 12990582
40593A2990582j4362427o298226K106152K543473n688921r811593J362996J7013299
$$ 12990582 -1371845 -7670071 -5563919 -3020446 -8709367 -18520960 -17157964 -144665
40585a44665J5374063k505715j0430761L368282J5856189L884259j9353144k4051560
$$ -144665 15229398 12723683 2292922 5661204 21517393 25401652 6048508 -18003052
40577a8003052p337929P092349O497082J754461K974094N282198L663633K952986
$$ -18003052 -25340981 -18248632 -11751550 -9997089 -7022995 -1740797 1922836 4875822
40569D875822N646414M877325k483395q192555o088816k377148m190080p307193
$$ 4875822 10522236 15399561 12916166 4723611 -1365205 -3742353 -7932433 -15239626
40561a5239626m304619K443098M935484J426734l580398o439324m658091M347831
$$ -15239626 -19544245 -17101147 -12165663 -10738929 -14319327 -20758651 -25416742 -21068911
40553b1068911J6987830K1231442R785304q131019j7236197j4926821r689080
$$ -21068911 -4081081 17150361 26935665 18804646 1568449 -13358372 -23047452
40546b3047452m661750L690691J1229267O558269r121529j7278747o541332J0017694
$$ -23047452 -27709202 -24018511 -12789244 -6230975 -15352504 -32631251 -39172583 -29154889
40538b9154889J3871610P318460N929687J1787657J2281461L687442k966974k780724
$$ -29154889 -15283279 -7964819 -2035132 9752525 22033986 25721428 22754454 19973730
40530A9973730n448193j4924949j7259878j828560J7495673J8376685O57123j4419148
$$ 19973730 14525537 -399412 -17659290 -19487850 -1992177 16384508 17041631 2622483
40522B622483j2727734r55973P631368Q192832L414293j714073j878298L409474
$$ 2622483 -10105251 -11061224 -3429856 4762976 8177269 6463196 4584898 7994372
40514G994372N745435k578794j4955171j6591046n243670N340447N297415K27361
$$ 7994372 13739807 11161013 -3794158 -20385204 -25628874 -20288427 -14991012 -14763651
40506a4763651j759430k647262o232024p270128L89274J0745986J1495991J097106
$$ -14763651 -16523081 -19170343 -25402367 -32672495 -32283221 -21537235 -10041244 -8944138
40498h944138q265283n125611Q503861J8989037J4182656l446935j6954219j2788230
$$ -8944138 -17209421 -22335032 -13831171 5157866 19340522 15893587 -1060632 -13848862
40490a3848862J942451P707783j230508r495984l761161Q199938J0259599Q46706
$$ -13848862 -11906411 -4198628 -5429136 -14925120 -18686281 -10486343 -226744 619962
40482F19962p460989n716056L689814J3076134J5130649O846230m882458p121285
$$ 619962 -6841027 -12557083 -8867269 4208865 19339514 26185744 21303286 14182001
40474A4182001K082827P700569j926424j6873284k0008862j1849720n683256l878549
$$ 14182001 16264828 23965397 22038973 5165689 -14843173 -26692893 -32376149 -36254698
40466c6254698K488313J2703359J4767159O431723n58185r18079k525756p551336
$$ -36254698 -33766385 -21063026 -6295867 135856 -422329 -1340408 -3866164 -11417500
40458a1417500n572523O273347J4220739R654049L032012L527647J865122j0266904
$$ -11417500 -16990023 -10716676 3504063 13158112 16190124 19717771 21582893 11315989
40450A1315989j9662557j1312464L740187M231209n972868m900574Q726634J2625570
$$ 11315989 -8346568 -19659032 -15918845 -11687636 -17660504 -22561078 -13834444 -1208874
40442a208874k0717p786473K308491J2096889L325034j1035999r073303L097472
$$ -1208874 -1229591 -9016064 -6707573 5389316 8714350 -2321649 -11394952 -8297480
40434h297480L177189q052318q104438P748128J6447101L710564j3191501j2137964
$$ -8297480 -5120291 -13172609 -21277047 -13528919 2918182 6628746 -6562755 -18700719
40426a8700719K371782J0234118N707239n80266k098592k167982k239137N81212
$$ -18700719 -16328937 -6094819 -387580 -967846 -3066438 -5234420 -7473557 -6892345
40418f892345M303899L059438j587340j837780K013869l5206j1080666j9509884
$$ -6892345 -2588446 470992 -1116348 -2954128 -940259 -975465 -12056131 -31566015
40410c1566015j3883673K028710J5039473J7475719J1328081L081989o89475K447132
$$ -31566015 -45449688 -43420978 -28381505 -10905786 422295 3504284 2814809 5261941
40402E261941O752465L592444n994914j0804608n509173J204331O13525k865243
$$ 5261941 12014406 15606850 9611936 -1192672 -6701845 -5497514 -4883989 -7749232
40394g749232j157453L045570K319948j547190j808862L5128j947926n191827
$$ -7749232 -8906685 -5861115 -3541167 -5088357 -6897219 -6862091 -8810017 -14001844
40386a4001844l090481J182429L40147o49949Q266165J9802472J5107734m832220
$$ -14001844 -17092325 -15909896 -15569749 -16219698 -7953533 11848939 26956673 22124453
40378B2124453j5954913p178095K887418k038541r475594k621747Q318794M029174
$$ 22124453 6169540 -1008555 1878863 -159678 -9635272 -12257019 -3938225 90949
40370I0949q620955p428066O524099J0650729j27885n659612L563834J0765086
$$ 90949 -8530006 -15958072 -9433973 1216756 1088871 -4570741 -1006907 9758179
40362I758179L232277o555948m466987J689404p07001n518749o84003Q199572
$$ 9758179 12990456 6434508 1967521 3656925 2949924 -2568825 -3252828 4946744
40354D946744P078865k479411p545780o031442o242613q563830n739872R07105
$$ 4946744 12025609 9546198 2000418 -4031024 -10273637 -18837467 -24577339 -23670234
40346b3670234K983165J461703M406749R033921M535460o093134o797974M851164
$$ -23670234 -20687069 -19225366 -14818617 -5784696 -1249236 -7342370 -14140344 -9289180
40338i289180J1627386M341975m263109l495085k641604j0120104j3267830O04133
$$ -9289180 2338206 6680181 2417072 -1078013 -3719617 -13839721 -27107551 -26503418
40330b6503418J7138927J3473637m117877p528758R450296K0978057Q646293j2285768
$$ -26503418 -9364491 4109146 -8731 -7537489 1912807 22890864 31537157 19251389
40322A9251389j8081697r684173m818367q751003j0187863j834569R508357J3600820
$$ 19251389 1169692 -8514481 -13332848 -22083851 -32271714 -34106283 -24597926 -10997106
40314a0997106P808036l140051j1457876j0307106L88133J1587859J3287620N300966
$$ -10997106 -3189070 -6329121 -17786997 -28094103 -27705970 -16118111 -2830491 2470475
40306B470475l680389o841865m686864n78957L542739N820118L980223o90542
$$ 2470475 -1209914 -8051779 -12738643 -13317600 -9774861 -3954743 25480 -665062
40298f65062k234246L060582J0049800R476793p299q801949q051836p70000L433456
$$ -665062 -2899308 161274 10211074 19687867 19680568 10878619 2826783 2056783 5490239
40289E490239J892827j54037j126968n465467j1697783r798669J982290Q800350
$$ 5490239 7383066 7229029 6102061 636594 -11061189 -20859858 -18877568 -10077218
40281a0077218j78223j2192489q198060O729686J0674961O23960k702944R528111
$$ -10077218 -10255441 -22447930 -30645990 -23916304 -13241343 -12617383 -15320327 -5792216
40273e792216J8157392P660085p865394q292018M20179k27707q039313n429295
$$ -5792216 12365176 20025261 12159867 3867849 4288028 4060321 -3978992 -9408287
40265i408287Q099399J4062714N633473k706321q4586O066540O197912K265390
$$ -9408287 -1308888 12753826 18387299 15680978 15596392 21662932 27860844 30126234
40257C0126234j632295o773413j0881393o357286M826753Q710093M06020o668652
$$ 30126234 28493939 21720526 10839133 4481847 9308600 18018693 18424713 11756061
40249A1756061k702477J996456m283973j2800364q308416M779164R351509L488958
$$ 11756061 9053584 11050040 6766067 -6034297 -14342713 -9563549 -212040 3276918
40241C276918J672678Q748778J1707577J833412j0705876j2015814l178723M011186
$$ 3276918 4949596 13698374 25405951 27239363 16533487 4517673 1338950 5350136
40233E350136K601964m664254j0519154q411797K167819J1820167Q733728n618058
$$ 5350136 7952100 3287846 -7231308 -15643105 -13475286 -1655119 7078609 1460551
40225A460551j4835237p616781O702102J0719860K486825l931828j19893O129173
$$ 1460551 -13374686 -20991467 -14289365 -3569505 -1082680 -5014508 -5134401 994772
$$ [...]
##END NTUPLES=NMR SPECTRUM
##END=
