##TITLE=31Pdec_LR-731-C1A
 CDCl3, 24 sc
 17.12.2020
##JCAMPDX= 6.0         $$ Bruker NMR JCAMP-DX V2.0
##DATA TYPE= NMR SPECTRUM
##DATA CLASS= NTUPLES
##ORIGIN= UXNMR, Bruker Analytische Messtechnik GmbH
##OWNER= root
$$ XWIN-NMR		Version 3.5
$$ Thu Dec 17 10:33:46 2020 Russian Standard Time (UT+4h)  she@DPX200
##.OBSERVE FREQUENCY= 81.013821
##.OBSERVE NUCLEUS= ^31P
##.ACQUISITION MODE= SIMULTANEOUS
##.ACQUISITION SCHEME= undefined
##.AVERAGES= 24
##.DIGITISER RES= 17
##SPECTROMETER/DATA SYSTEM= spect
##.PULSE SEQUENCE= zgpg30
##.SOLVENT NAME= DMSO
##.SHIFT REFERENCE= (INTERNAL, DMSO, 0, 182.463)
##AUDIT TRAIL= $$ (NUMBER, WHEN, WHO, WHERE, WHAT)
$$ ##TITLE= Audit trail, XWIN-NMR		Version 3.5
$$ ##JCAMPDX= 5.01
$$ ##ORIGIN= Bruker BioSpin GmbH
$$ ##OWNER= she
$$ F:/spectra/data/she/nmr/P31/1/pdata/1/auditp.txt
$$ ##AUDIT TRAIL=  $$ (NUMBER, WHEN, WHO, WHERE, WHAT)
(   1,<2020-12-17 10:32:43.12 +0400>,<she>,<DPX200>,
      <created by zg, POWCHK disabled, PULCHK disabled
       configuration hash MD5:
       00 E9 B6 7A A2 85 ED C7 34 08 36 98 17 FE 4E 26
       data hash MD5: 32K
       83 12 76 21 C0 F9 81 53 84 2E B7 F6 65 0C 78 DA>)
(   2,<2020-12-17 10:32:45.50 +0400>,<she>,<DPX200>,
      <Start of raw data processing
       efp BC_mod = 2 LB = 1 FT_mod = 6 PKNL = 1 PHC0 = -2278.565 PHC1 = -428.5992 SI = 64K 
       data hash MD5: 64K
       5B 69 14 09 5C 1C B9 12 F6 C1 48 0E 66 F3 29 EC>)
(   3,<2020-12-17 10:33:07.45 +0400>,<she>,<DPX200>,
      <pk PHC0 = -180.4165 PHC1 = 494.4 
       data hash MD5: 64K
       B6 92 A8 BA F5 00 32 5B 0D D8 D7 87 AB 44 96 6A>)
$$ ##END=
$$ 
$$ hash MD5
$$ D5 4A 92 D3 A8 E7 02 5C 6C 0B 19 04 B0 7C C7 75
##$RELAX= 
##$RELAX= 
##$RELAX= 
##$RELAX= 
##$RELAX= 
##$RELAX= 
##$RELAX= 
##$RELAX= 
$$ Bruker specific parameters
$$ --------------------------
##$DU= <F:/spectra>
##$EXPNO= 1
##$NAME= <P31>
##$PROCNO= 1
##$TYPE= <nmr>
##$USER= <she>
##$AMP= (0..31)
100 100 100 100 100 100 100 100 100 100 100 100 100 100 100 100 100 100 
100 100 100 100 100 100 100 100 100 100 100 100 100 100 
##$AQSEQ= 0
##$AQ_mod= 1
##$AUNM= <au_zg>
##$AUTOPOS= <>
##$BF1= 81.014009
##$BF2= 200.13
##$BF3= 200.13
##$BF4= 200.13
##$BF5= 200.13
##$BF6= 200.13
##$BF7= 200.13
##$BF8= 200.13
##$BYTORDA= 1
##$CFDGTYP= 0
##$CFRGTYP= 5
##$CHEMSTR= <none>
##$CNST= (0..31)
1 1 145 1 1 1 1 1 1 1 1 1 1 1 1 1 1 1 1 1 1 1 1 1 1 1 1 1 1 1 1 1 
##$CPDPRG= <waltz16>
##$CPDPRG1= <>
##$CPDPRG2= <waltz16>
##$CPDPRG3= <>
##$CPDPRG4= <mlev>
##$CPDPRG5= <mlev>
##$CPDPRG6= <mlev>
##$CPDPRG7= <mlev>
##$CPDPRG8= <mlev>
##$CPDPRGB= <>
##$CPDPRGT= <>
##$D= (0..31)
0 1 0 0 0 0 0 0 0 0 0 0.03 2e-05 3e-06 0 0 0 0 0 0 0 0 0 0 0 0 0 0 0 0 
0 0 
##$DATE= 1608186762
##$DBL= (0..7)
120 120 120 11 120 120 24 19 
##$DBP= (0..7)
150 150 150 150 150 150 150 150 
##$DBP07= 0
##$DBPNAM0= <>
##$DBPNAM1= <>
##$DBPNAM2= <>
##$DBPNAM3= <>
##$DBPNAM4= <>
##$DBPNAM5= <>
##$DBPNAM6= <>
##$DBPNAM7= <>
##$DBPOAL= (0..7)
0.5 0.5 0.5 0.5 0.5 0.5 0.5 0.5 
##$DBPOFFS= (0..7)
$$ [...]
##$SUBNAM2= <"">
##$SUBNAM3= <"">
##$SUBNAM4= <"">
##$SUBNAM5= <"">
##$SUBNAM6= <"">
##$SUBNAM7= <"">
##$SUBNAM8= <"">
##$SUBNAM9= <"">
##$SW= 369.568048894756
##$SWIBOX= (0..15)
0 1 3 0 0 0 0 0 0 0 0 0 0 0 0 0 
##$SW_h= 29940.119760479
##$TD= 32768
##$TD0= 1
##$TE= 0
##$TE2= 300
##$TE3= 300
##$TEG= 300
##$TL= (0..7)
0 120 53 12 22 120 120 120 
##$TP= (0..7)
150 150 150 150 150 150 150 150 
##$TP07= 0
##$TPNAME0= <>
##$TPNAME1= <>
##$TPNAME2= <>
##$TPNAME3= <>
##$TPNAME4= <>
##$TPNAME5= <>
##$TPNAME6= <>
##$TPNAME7= <>
##$TPOAL= (0..7)
0.5 0.5 0.5 0.5 0.5 0.5 0.5 0.5 
##$TPOFFS= (0..7)
0 0 0 0 0 0 0 0 
##$TUNHIN= 0
##$TUNHOUT= 0
##$TUNXOUT= 0
##$USERA1= <user>
##$USERA2= <user>
##$USERA3= <user>
##$USERA4= <user>
##$USERA5= <user>
##$V9= 5
##$VALIST= <valist>
##$VCLIST= <CCCCCCCCCCCCCCC>
##$VD= 0
##$VDLIST= <DDDDDDDDDDDDDDD>
##$VPLIST= <PPPPPPPPPPPPPPP>
##$VTLIST= <TTTTTTTTTTTTTTT>
##$WBST= 1024
##$WBSW= 4
##$XGAIN= (0..3)
0 0 0 0 
##$XL= 0
##$YL= 0
##$YMAX_a= 8681
##$YMIN_a= -17525
##$ZGOPTNS= <>
##$ZL1= 120
##$ZL2= 120
##$ZL3= 120
##$ZL4= 120
##$ABSF1= 0
##$ABSF2= 0
##$ABSG= 0
##$ABSL= 0
##$ALPHA= 0
##$AQORDER= 0
##$ASSFAC= 0
##$ASSFACI= 0
##$ASSFACX= 0
##$ASSWID= 0
##$AUNMP= <proc_1d>
##$AZFE= 0.1
##$AZFW= 0.5
##$BCFW= 0
##$BC_mod= 2
##$BYTORDP= 0
##$COROFFS= 0
##$CY= -3
##$DATMOD= 1
##$DC= 0
##$DFILT= <>
##$DTYPP= 0
##$F1P= 0
##$F2P= 0
##$FCOR= 1
##$FTSIZE= 65536
##$FT_mod= 6
##$GAMMA= 0
##$GB= 0
##$INTBC= 1
##$INTSCL= 5.30512e-09
##$ISEN= 30
##$LB= 1
##$LEV0= 0
##$LPBIN= 0
##$MAXI= 10000
##$MC2= 0
##$MEAN= 0
##$ME_mod= 0
##$MI= 50
##$NCOEF= 0
##$NC_proc= -9
##$NLEV= 6
##$NOISF1= 182.463
##$NOISF2= 159.3651
##$NSP= 0
##$NTH_PI= 0
##$NZP= 0
##$OFFSET= 182.463
##$PC= 4
##$PHC0= -2458.981
##$PHC1= 65.80078
##$PH_mod= 1
##$PKNL= yes
##$PPARMOD= 0
##$PSCAL= 0
##$PSIGN= 0
##$REVERSE= no
##$SF= 81.014009
##$SI= 65536
##$SIGF1= 159.3651
##$SIGF2= -187.1042
##$SINO= 113.3802
##$SIOLD= 16384
##$SREGLST= <1H.CDCl3>
##$SSB= 0
##$STSI= 65536
##$STSR= 0
##$SW_p= 29940.119760479
##$SYMM= 0
##$S_DEV= 0
##$TDeff= 32768
##$TDoff= 0
##$TI= <>
##$TILT= no
##$TM1= 0
##$TM2= 0
##$TOPLEV= 0
##$USERP1= <user>
##$USERP2= <user>
##$USERP3= <user>
##$USERP4= <user>
##$USERP5= <user>
##$WDW= 1
##$XDIM= 65536
##$YMAX_p= 338037454
##$YMIN_p= -112014542
$$ End of Bruker specific parameters
$$ ---------------------------------
##NTUPLES= NMR SPECTRUM
##VAR_NAME=  FREQUENCY,     SPECTRUM/REAL,   SPECTRUM/IMAG
##SYMBOL=    X,             R,               I
##VAR_TYPE=  INDEPENDENT,   DEPENDENT,       DEPENDENT
##VAR_FORM=  AFFN,          ASDF,            ASDF
##VAR_DIM=   65536,         65536,           65536
##UNITS=     HZ,            ARBITRARY UNITS, ARBITRARY UNITS
##FACTOR=    0.456856943014862, 1,           1
##FIRST=     14782.0589164895, 0,            0
##LAST=      -15158.0608439895, 0,           0
##MIN=       -15158.0608439895, -112014542,  0
##MAX=       14782.0589164895, 338037454,    0
$$ Real data points
##PAGE= N=1
##DATA TABLE= (X++(R..R)), XYDATA
$$ [...]
46634 -14032280 -19454250 -18667513 -11179265 -4974112 -5376558 -6733572 -3741157 -3580526
46626 -3580526 -14885675 -30499967 -35175077 -27007736 -17026118 -10223212 -3077466 1179907
46618 1179907 -6141786 -18898540 -16236444 7869768 31248855 31723491 15793426 5514328
46610 5514328 7303643 10154394 8664524 9998371 17924404 25182576 25615489 22538340
46602 22538340 20226816 16297166 8689690 3421855 7930553 19657095 27631723 25110030
46594 25110030 16373011 10442892 11135517 14893606 16809647 16051299 14021732 9117227
46586 9117227 -2275555 -17794842 -26560425 -20186681 -4848875 4420470 2771512 1808115
46578 1808115 12530532 28377593 33099660 22299865 7908579 1190787 481514 -1506429
46570 -1506429 -6676789 -12736752 -18343593 -21165753 -16733217 -5496077 4524662 8506909
46562 8506909 11599448 17096825 16267593 2413902 -12000517 -9135707 6427989 12671092
46554 12671092 3748214 -1918133 7115047 16601792 10466095 -4583539 -13414783 -16913348
46546 -16913348 -24344619 -31752879 -27091742 -11658136 450876 1423912 -5467070 -16030485
46538 -16030485 -26131762 -26797287 -13466847 2679412 7248110 3605073 6205788 16073815
46530 16073815 20292847 15041997 10923052 13430369 15270233 11470754 6296784 1717728
46522 1717728 -5359199 -10941506 -5572189 7134416 10041726 -3375990 -19956608 -27464850
46514 -27464850 -27837363 -24126982 -13157188 160190 919676 -11226970 -14436108 3747284
46506 3747284 25118845 28387928 21032465 22891963 32589049 34413817 28073470 25401871
46498 25401871 23296643 6992627 -19915709 -34097675 -25426706 -9516393 -1454501
46491 -1454501 2773546 10179723 14438497 7934186 -2886484 -6950250 -5133931 -6434031
46483 -6434031 -13081903 -19154797 -21196844 -22338791 -25930177 -29587228 -26789618 -14261597
46475 -14261597 1882840 9903047 5254379 -3558157 -6490704 -5374115 -9001484 -18293462
46467 -18293462 -25187091 -24609541 -18483126 -8726485 4071649 14754214 16241402 9863192
46459 9863192 4322630 2567170 -1674391 -12203837 -24050753 -31851038 -36210721 -38118733
46451 -38118733 -34855003 -25963587 -16815007 -11692123 -8395094 -3187521 3731495 10437444
46443 10437444 15812181 17127401 10430269 -2961647 -14172074 -14452976 -3606874 10000195
46435 10000195 16234179 11765414 4844173 8167085 22286073 30801104 19436923 -4623906
46427 -4623906 -21789202 -24117497 -18981870 -12826029 -5991302 -2296437 -7342572 -15431060
46419 -15431060 -14124895 -4949987 -2999211 -11351735 -13875739 -1366260 12865610 14394354
46411 14394354 8432189 6597067 8333734 10080589 18171686 34862539 43868135 30017427
46403 30017427 4839543 -7436151 -2971051 2465491 1693638 1661654 3428981 -600956
46395 -600956 -8019041 -6228416 5599220 14294511 16389788 22946796 34146566 31593548
46387 31593548 8330835 -13552950 -12223014 2598983 6724240 -1772509 -4351952 5442909
46379 5442909 13147343 7952618 -2237496 -5303687 -837695 4541429 7768968 8962882
46371 8962882 7516678 4203386 2588365 4382762 6999058 7954870 7540245 5522746
46363 5522746 532674 -4837852 -4136752 3762962 10721058 9688158 4806282 5062033
46355 5062033 10921212 14542624 12227332 8944472 9234736 10931512 11280994 12803901
46347 12803901 17484979 19965834 14163170 4771310 3662805 13019990 19505238 10351158
46339 10351158 -9200262 -21002750 -15471262 -2023836 3317756 -4017084 -14886810
46332 -14886810 -19198520 -15812004 -9652782 -4061758 662433 3928339 4575400 3559072
46324 3559072 3234298 3789282 3675026 3210536 3227759 253201 -10214285 -23464269 -26491085
46315 -26491085 -14711746 -970604 -24559 -9365874 -14923475 -11824128 -8010165 -8728198
46307 -8728198 -10079371 -9709141 -11564265 -15415806 -12663452 410069 13511252 14012275
46299 14012275 2224197 -10745439 -15080498 -7648211 8142512 22502051 25585889
46292 25585889 18878051 13633464 13563609 8705991 -6296510 -18814119 -14926297 -960004
46284 -960004 5641333 1039262 -4366761 -5990215 -9225848 -14289007 -13464449 -6216364
46276 -6216364 -2265367 -5288790 -6918633 -2002125 3171190 4117266 6668865 13792891
46268 13792891 16022836 6329368 -5112987 -4187769 5697969 9572584 4997541 5097314
46260 5097314 15886701 24392224 16523479 -1849397 -10919409 -1327768 15328884 21601854
46252 21601854 14105746 4075989 736228 758455 -3452869 -10750708 -12740520 -5873999
46244 -5873999 4904723 14390002 21998728 27234436 27711169 25186582 27023088 36388642
46236 36388642 45715872 45598279 36897291 28328581 24301064 20994671 13699015 2758550
46228 2758550 -8252368 -16259719 -19663705 -18370203 -13852098 -7882907 -1335595 4817944
46220 4817944 8648206 9205867 8037104 6655831 3835449 -1824576 -7529453 -8047461
46212 -8047461 -2551748 3289711 3965059 949998 209208 3457350 5318126 937583
46204 937583 -6210005 -7615131 193744 12682608 23815514 30535626 30587476 22780317
46196 22780317 12118683 7465049 9504546 8620566 1193112 -1004258 11340252 25750241
46188 25750241 22515855 5138525 -2230537 10613928 26884119 30623461 28750174 33445443
46180 33445443 38969578 33305626 21980499 20684699 29081761 30894019 19440208 5569462
46172 5569462 -2343646 -9843192 -21528367 -28565319 -20819595 -2876089 11382106 14867146
46164 14867146 10042747 -210408 -16034022 -35699409 -53395494 -62703581 -59804531
46157 -59804531 -44998785 -24315022 -7515061 -116262 1789221 5111545 9720255 10094195
46149 10094195 6465429 6892816 14753011 20637554 13740732 -1961269 -11231295 -7007090
46141 -7007090 2000656 4868558 891952 -5524326 -13142080 -19669239 -17632992 -5170118
46133 -5170118 5148722 1071602 -9594892 -8454177 5949337 16512564 14851249 12014095
46125 12014095 16268453 18846224 12641529 8097011 15169930 23165519 16639150 1345478
46117 1345478 -5195746 -1987268 -2545376 -8456308 -7131785 3469417 9844066 7448442
46109 7448442 9747866 24410668 38555626 38884116 31344605 28025092 27245095 21118187
46101 21118187 13079885 12062693 15073447 11086616 46855 -6022587 -1308833 6409293
46093 6409293 8994262 8622899 11068235 15091821 13387630 1628310 -15505142 -26363816
46085 -26363816 -21632083 -4168237 11952917 14960990 5959492 -6139525 -15408717 -19486543
46077 -19486543 -14587663 581311 16919800 20542935 8958481 -5043731 -8182051
46070 -8182051 559416 14126151 27074167 36018510 36290943 25884274 11304575 3380212
46062 3380212 6555714 15653869 22655601 23156007 17059697 7764474 1404671 2455020
46054 2455020 8535238 13507257 16845957 24011528 34083480 34378550 16236126 -7784529
46046 -7784529 -14413967 1107844 17509374 14385459 -3091366 -14364118 -10296182 1324729
46038 1324729 12146649 21775187 29868302 32083455 27955466 23776169 22998199 21080344
46030 21080344 14551594 8280317 7697199 9190659 5260111 -3655569 -8871335 -4104180
46022 -4104180 7986477 19291595 23158236 18615244 10156862 3010445 -1596094 -4574824
46014 -4574824 -3867148 3013959 10899982 9650480 -967820 -7139961 1000652 13756721
46006 13756721 13888299 167124 -12112954 -12911557 -8153417 -6821376 -8550946 -9418182
45998 -9418182 -10962202 -15638803 -19323909 -16866909 -11489354 -9832336 -9439542 -1091296
45990 -1091296 15027227 25702084 22874850 17132927 23588474 38925787 44394993 31919732
45982 31919732 15084333 9130540 10752561 7053075 -3131400 -9359058 -8010750 -7458207
45974 -7458207 -13157941 -18817183 -16880907 -9403831 -3476237 -2240404 -4841987 -9548972
45966 -9548972 -12992402 -11923546 -9035350 -10664255 -15694042 -15081797 -6859886 -1592047
45958 -1592047 -5585988 -9302646 -3666815 1708317 -7666650 -24668663 -26251145 -6153044
45950 -6153044 15067163 17330710 4028191 -8911986 -14306613 -14794419 -11944237 -4964515
45942 -4964515 4125675 11956968 17483251 19284640 14101160 3537062 -3276306 -656182
45934 -656182 4547585 2347660 -5661880 -9166390 -4098190 3960075 10217483 15664248
45926 15664248 20998114 23903369 24508410 26185983 28005423 23424802 10928639 -39730
45918 -39730 213022 8767192 14118373 10980876 4955442 2989128 5232129 7931060 9670692
45909 9670692 11789958 15200869 19445516 23510303 25725063 24197020 19091733 13227379
45901 13227379 8708508 4544863 -38133 -1683209 3520967 12409165 15458347 8126069
45893 8126069 -1529862 -1011285 11284958 23219990 23229133 14157207 8830579 12964951
45885 12964951 18011036 13664159 2621314 -3574340 -1478172 213428 -4291611 -8169807
45877 -8169807 -4145749 1610830 -918752 -6440063 740432 21366979 35399982 28116111
45869 28116111 9896877 177500 1353844 1345336 -4181221 -7060087 -2836994 2412558
45861 2412558 4338258 7789673 17010105 27192931 31434624 29422979 24195749 16704926
45853 16704926 9274485 8185054 15082032 19988903 11767520 -5612187 -15638458 -9404491
45845 -9404491 3875460 9388377 3725564 -5336397 -11332863 -14082325 -13366627 -5952627
45837 -5952627 7554855 18962860 21536881 19121537 19250438 19741356 11817171 -2743898
45829 -2743898 -9077445 22389 10498943 4452930 -14595999 -25813915 -18628900 -4273750
45821 -4273750 1986418 -638954 -2828415 -180488 3085942 2037234 -2973729 -7724203
45813 -7724203 -8879142 -7005491 -4582096 -920835 7433537 18380604 21415678 10061925
45805 10061925 -6346809 -12334964 -5907389 1589457 4033613 6154904 9046501 4963833
45797 4963833 -6784670 -12378902 -2453229 11826019 13456895 2485873 -7992155 -12144551
45789 -12144551 -14299850 -15943135 -13845053 -9327066 -6085017 405656 17547122 38742588
45781 38742588 46019086 33391577 15102373 5596538 3120732 -467317 -5068826 -6171148
45773 -6171148 -3893184 1072206 12196554 27560802 33397996 19979961 -1159944 -9755803
45765 -9755803 -3982118 -410469 -6855510 -11611732 -4914627 4108897 2273590 -6899499
45757 -6899499 -9896429 -3983465 1692311 2194915 1108200 -140467 -4308907 -8174585
45749 -8174585 -3051566 10230281 18591770 15379437 10606307 13306199 14008816 -1381567
45741 -1381567 -26217018 -37808991 -27602016 -11980037 -8763287 -15225737 -16882125 -9255090
45733 -9255090 -1374290 -1342369 -6726346 -9827709 -8152316 -7641878 -14972105 -26712445
45725 -26712445 -30225768 -19694462 -6690886 -6146403 -14898216 -16729984 -8809858 -7175610
45717 -7175610 -19906658 -30893535 -22608492 -2559968 8602474 6632098 3735150 4509841
45709 4509841 1710396 -4207669 -1420098 12140525 21701908 18439414 14008081 20500581
45701 20500581 28746890 22235098 4694130 -3997895 2186139 6583202 -4501263 -20967339
45693 -20967339 -22994327 -8061944 6779363 7497560 -1485397 -6462074 -1915191 6398541
45685 6398541 12195125 15553242 18191807 17671989 10531784 -1341689 -11765557 -16951579
45677 -16951579 -17725541 -15832801 -12148651 -8862302 -9148037 -13006777 -16924499 -19599663
45669 -19599663 -24337338 -32473935 -37537794 -31159083 -14292918 2544112 11816282 17313159
45661 17313159 26362982 36927047 38672861 27609883 13851065 10782841 19636113 29307144
45653 29307144 29768506 20915931 8920099 -842153 -6191722 -7817985 -8182093 -8072649
45645 -8072649 -4395492 5125309 16303670 23002390 26124277 30476392 32902304 23880302
45637 23880302 3915820 -12624280 -16032861 -13270644 -13554376 -12528677 -2235243 12088909
45629 12088909 19760921 23507491 34431464 50141641 54273333 39787736 18610931
45622 18610931 4715193 256598 2229140 9872268 19202760 21323655 13831127 5703230
45614 5703230 4680359 7977374 11398651 18194976 30066893 36875654 26342335 1612673
45606 1612673 -19121240 -20518253 -3819903 15288133 19877120 6253214 -12017942
45599 -12017942 -17657623 -8017165 4902395 11826920 14448222 15023668 9720686 -1765798
45591 -1765798 -10699035 -11678537 -11623765 -17420717 -22765984 -17583431 -3922723 8057674
45583 8057674 14238469 16002948 11338228 -816204 -10735310 -5800382 11695020 25515890
45575 25515890 25103414 15590614 8497105 10713219 21856202 34093525 35639825 23095695
45567 23095695 9107502 8851318 20553578 29297989 28305893 24535808 23490198 21777126
45559 21777126 17405919 15116474 17079883 18878014 18861921 20980960 24016677 19608786
45551 19608786 7399194 753215 8400916 19930001 20237729 11199153 7162808 13234859
45543 13234859 20210258 20433443 17982153 20339071 26911753 29578175 21868332 5767457
45535 5767457 -9828036 -17802194 -20056267 -23568994 -29006676 -28260955 -16063112 914355
45527 914355 11228829 11570853 7813304 5868793 6361792 6605762 3289465 -5758079 -18583292
45518 -18583292 -28666008 -30638659 -25647211 -18766436 -13006313 -8590558 -5704309 -4035047
45510 -4035047 -1119992 4808564 10972866 12611045 9322510 6007367 7207189 12292045
45502 12292045 16135198 13483197 3620985 -8025291 -13870306 -10782923 -2173324 5842757
45494 5842757 8199593 2238839 -9639341 -18120688 -13689180 2018132 16352947 19883136
45486 19883136 15337461 9449504 2789523 -6423607 -14384793 -15665568 -11693551 -7647378
45478 -7647378 -3742560 2332588 6654549 2209973 -9167239 -16764112 -14212085 -5248344
45470 -5248344 4460282 12744959 16480411 11163302 -781338 -9340826 -9515810 -7173902
45462 -7173902 -7253187 -4721633 4965117 14444183 14233481 8338240 7849543 12467542 12370770
45453 12370770 7765246 10695463 23409679 30734499 23070564 13353997 17779875 29757199
45445 29757199 29764429 15963375 6793581 12769333 23054243 24865036 20892212 19361922
45437 19361922 19565059 17699909 17294598 22161970 25903082 20409604 10651639 9810665
45429 9810665 21843157 38152314 49222728 50970079 42907582 29795931 22198637 24998306
45421 24998306 28068174 19531062 5250760 1510775 9871832 15160103 9981073 4855014
45413 4855014 9479443 19640246 29153797 39328459 48101591 45225967 29809874 18736953
45405 18736953 23713347 31892045 25084916 8043117 -642189 1389487 -152582 -8817525
45397 -8817525 -10538744 1730565 13805608 9006575 -10080720 -26677900 -29816076 -22990790
45389 -22990790 -17093166 -19147070 -26089256 -28256623 -20234348 -6485052 5700002 14112013
45381 14112013 18235352 14400890 2318996 -8400140 -7446654 3694000 16345168 26558239
45373 26558239 32951906 29369007 13217714 -3544455 -7080972 -2556919 -6289978 -19202904
45365 -19202904 -26578018 -24265247 -24271263 -30352328 -29678220 -16971488 -6077562 -5607481
45357 -5607481 -2639284 13526777 28534292 23573753 6314467 -181171 8030114 13676651
45349 13676651 7667345 316023 1605904 7321773 9494352 8009751 6638840 6346405
45341 6346405 6761700 8370261 11100180 15051456 21989413 31199458 35912947 29975305
45333 29975305 16405964 3835550 -2971353 -3771282 1410981 9993165 14699721 11850084
45325 11850084 7609088 7648660 6119146 -4158280 -15565918 -13743830 31695 8901995
45317 8901995 3987799 -5295060 -7235934 -2179958 3189308 5779499 5741693 3952119
45309 3952119 2993208 4098488 2571104 -5817087 -14577309 -13087179 -3570251 391589
45301 391589 -6257665 -14419395 -17759729 -21427098 -28903117 -33761649 -31498417 -27058183
45293 -27058183 -22930236 -12242542 7238282 24418466 30802195 33564690 40626003 43928272
45285 43928272 32646612 14117995 4361543 3196228 -3262043 -17308275 -24893430 -18492400
45277 -18492400 -8935632 -8732495 -15457517 -18359374 -13152840 -4033733 3581518 7516339
45269 7516339 9225058 11946248 15997163 16753056 11577223 6779463 10914662 21728367
45261 21728367 27017478 19289565 3382605 -10845167 -17177571 -14628376 -7802421 -6340756
45253 -6340756 -16220993 -29898783 -32676991 -21257295 -8487028 -6542089 -12882754 -17391485
45245 -17391485 -16514817 -13884344 -11477805 -7356917 -1193340 3051370 1047441 -6656107
45237 -6656107 -13345779 -10980960 1552384 16099749 24359987 27741246 33104092 39887476
45229 39887476 38633629 23872725 2281218 -14457420 -20100092 -15774640 -7259526 -2488050
45221 -2488050 -6009990 -12965316 -13218189 -3648289 8432216 15459079 17342300 17549674
45213 17549674 18310926 21732744 28063274 30336166 19777024 775242 -9208184 -1153836
45205 -1153836 13057741 17291341 11269986 4578935 -691599 -8661276 -16798433 -18049155
45197 -18049155 -13340353 -9543428 -6511493 1631075 12887197 17554845 13096442 7341556
45189 7341556 5252495 3672056 1015919 294112 -355489 -7559119 -18643271 -20749302
45181 -20749302 -10868960 -3681911 -9296697 -15145737 -4191745 17068647 25445851 13120136
45173 13120136 -3167919 -6518454 976693 8710208 14926487 24173948 34541568 38436427
45165 38436427 35005472 32773040 37011429 40507271 32421421 14152386 -21995 143777
45157 143777 8657603 12292341 7660800 2566496 2386523 3819250 3517924 4286627 8350952
45148 8350952 11367678 8625258 1930927 -4747727 -10798259 -14169353 -7463075 12243285
45140 12243285 33692527 41273362 32903990 19746010 10480151 5740106 6237796 13541959
45132 13541959 20759668 15371340 -2740413 -16770064 -14278827 -4295004 -3752705 -13321756
45124 -13321756 -17760202 -7667646 9588571 21281217 23303273 20144399 16562144 12973494
45116 12973494 7335679 -384268 -6295451 -6583451 -3157541 -1495265 -1754354 2576604
45108 2576604 13991031 24801027 26885205 22139919 16644367 10076809 83737 -7293987
45100 -7293987 -3258969 9087601 17471262 17927641 17292734 17038298 9176495 -6461613
45092 -6461613 -15412232 -8672521 2469539 3728689 -21486 5619352 19735253 27184116
45084 27184116 21705639 12003544 4740496 -2910557 -10876294 -11297175 -2240881 5853052
45076 5853052 4652098 -1301682 -5368166 -10046232 -18418725 -23665679 -18577690 -9057908
45068 -9057908 -5847709 -6756304 -27258 15416390 25491930 19367077 2990728 -9123248
45060 -9123248 -8541256 3101214 17479254 23611045 15358876 -346806 -7981318 -1076338
45052 -1076338 8953673 7309884 -4211257 -9134240 1781921 17705900 20822809 8115875
45044 8115875 -6091646 -9037015 -4096309 -2361275 -5415021 -5418008 -710778 385426
45036 385426 -4488826 -3426527 12244931 30375845 31653862 17506098 9303976 18323226
45028 18323226 31250017 31387768 21069064 13117061 10301556 6718074 4350450 13245020
45020 13245020 33626377 49798240 47652531 31445571 17321279 14219020 17131388
45013 17131388 17524979 14028266 10838160 10122535 10603055 12239299 17166190 24825486
45005 24825486 30749136 32644322 33174752 33081193 26788307 11185201 -5700567 -13679918
44997 -13679918 -15451557 -21978826 -33089783 -34997085 -20796362 -2059401 6197088 2449101
44989 2449101 -6244415 -16212857 -24920224 -25391088 -14784411 -3156900 -1939725 -7480367
44981 -7480367 -7670252 -1504483 1413118 -383859 3052879 14735053 23042667 18913970
44973 18913970 9752825 7977878 13882258 18918085 20493566 23980482 32208664 41234128
44965 41234128 46697861 48128266 45864470 38814314 27728609 17524582 13094451 13556012
44957 13556012 13426507 10208184 8192052 12166761 19268708 21665756 17308679 12630218
44949 12630218 12964915 16071682 18122176 19831344 22003680 21405803 17391918 16266397
44941 16266397 20928539 22469819 12784050 393498 390459 11378298 17638678 14574700
44933 14574700 15418815 27777823 39223168 35617793 21840318 13079273 13415152 13821266
44925 13821266 6675989 -6594030 -19100999 -23471199 -17104449 -7160395 -4862430 -10546065
44917 -10546065 -12010155 -3314880 4331627 -758678 -12500325 -17462096 -16253540 -20095899
44909 -20095899 -30126953 -35417126 -31006163 -23430857 -16792093 -7551445 2625236 2431349
44901 2431349 -12557856 -28688515 -29082041 -14246286 240080 3086305 -2827260 -7736222
44893 -7736222 -5515809 2739667 10513702 10765341 2902369 -4511211 -1647930 10285427
44885 10285427 17640062 8511689 -12794318 -29375842 -30315576 -21140975 -13372330 -9401451
44877 -9401451 -4495138 293650 -1785002 -9147331 -9149527 5003050 23127050 30687110
44869 30687110 25562778 14971865 2954138 -9123127 -15122288 -9717696 -53274 223721
44861 223721 -9390353 -12673325 2808310 28446713 42782587 33437752 7690499 -16383650
44853 -16383650 -26632421 -25119604 -21040272 -18003208 -12439905 -3543567 3410452 6796055
44845 6796055 12800739 23379387 28513257 19885099 5311087 -1584672 -520306 -1086062
44837 -1086062 -4762516 -4495550 383910 3881410 7412879 18509314 33761592 38836116
44829 38836116 29903845 20577596 21629783 27141630 27752896 25160578 24976058 25697979
44821 25697979 23537904 19708827 15604568 9349138 3864579 8573775 24722841 37948630
44813 37948630 34599404 18047706 674318 -12163807 -21085618 -23680279 -17319358 -5626853
44805 -5626853 6855992 21011125 36062729 42992360 34720530 17452617 3087144
44798 3087144 -3979296 -4628044 1943237 12202475 13627363 -126516 -15049560 -12175542
44790 -12175542 6309294 20260519 18416175 8124439 -357303 -4967698 -6378226 -4399062
44782 -4399062 -2208251 -3952749 -7071003 -6258832 -3938009 -5838179 -7808941 -608354
44774 -608354 11744878 13007881 -2521177 -21418197 -29694105 -27811825 -22511880 -16127170
44766 -16127170 -10839377 -12609835 -22488822 -31749704 -32416226 -25602003 -14253645 3460722
44758 3460722 26205836 42911696 43532922 32251508 22441398 21100872 23699653 21907551
44750 21907551 12209694 -880524 -7800838 -3262532 6319083 9277604 3046197 -4192824
44742 -4192824 -6674934 -7415990 -9128476 -8021808 -1380928 6413676 10450786 11146701
44734 11146701 9351715 2933735 -7109338 -14245588 -14546928 -10084173 -1044251 15638262
44726 15638262 34881444 42292683 32772666 19982779 17581671 21082219 20071337 18683622
44718 18683622 28137847 44432310 50331796 39127933 22417432 13103540 12666859 16962673
44710 16962673 23329001 28479274 28183105 22734385 16662998 11596054 5693593 601352
44702 601352 1374581 7697053 12116885 9723550 4161744 1438174 1931360 953758 -5054844
44693 -5054844 -13929776 -18878646 -16450034 -14166830 -24215258 -45630686 -60227238 -53936563
44685 -53936563 -35580892 -24288550 -24049429 -23921219 -19883875 -20137524 -26948316 -29090154
44677 -29090154 -19178967 -6551190 -3977576 -9156867 -8033986 7129482 28953724 42332332
44669 42332332 38045802 21477085 8385615 8651556 15225478 14030743 2502316 -9058554
44661 -9058554 -12521988 -9027377 -2324098 4153874 3822852 -7019461 -18240430 -14346796
44653 -14346796 2726853 13164727 6650780 -4401900 -6524543 -5180683 -11820330 -23605331
44645 -23605331 -29446343 -26802601 -19622560 -8293581 4939129 8721298 -4168291 -22051958
44637 -22051958 -27331293 -19402596 -10683358 -5579005 250552 4237351 -578467 -8550904
44629 -8550904 -6241077 3881917 3558943 -12483006 -25723427 -19750296 -1904992 9740791
44621 9740791 7978246 -3570075 -19125072 -29229593 -22387055 -150391 18623708
44614 18623708 20030944 13088483 13808952 20423187 19510727 10550770 6835222 12708061
44606 12708061 16242041 8403723 -3172859 -5421238 3744951 15653330 21448096 18074204
44598 18074204 8498080 -110583 -1723549 2125477 3602237 -2313015 -12422766 -19596896
44590 -19596896 -19533180 -12923243 -4304840 497291 -978957 -4779213 -4835242 -747551 1934112
44581 1934112 60804 -1952211 2406279 13072091 22765230 24958315 20893550 17475099
44573 17475099 18622687 21249013 21348314 20384259 20564225 16718920 1826163 -18864930
44565 -18864930 -29705603 -24846278 -16418058 -15992058 -18350812 -13571896 -5310504 -3205594
44557 -3205594 -4377248 1122056 10592373 12249010 7221338 9051005 19368759 23849272
44549 23849272 17788597 15421873 24035834 28515511 16373601 1029774 1272141 10834731
44541 10834731 10510502 1910726 4422691 20469682 28360931 14916812 -5454083 -13591357
44533 -13591357 -11171210 -11399269 -15591787 -12894535 1391275 18702771 28190943 27632593
44525 27632593 22321298 17074926 11424582 2903208 -5775797 -6713332 2923571 14704192
44517 14704192 18764620 16555117 16272715 18226366 14660580 4210569 -3760616 -2131930
44509 -2131930 4954098 9271173 7858414 2695674 -2481676 -3343298 444414 1240082
44501 1240082 -8005885 -21101538 -24410163 -15925864 -6858565 -2690915 3073163 12137835
44493 12137835 14431792 6081186 -943458 1906682 5275436 -255815 -6210251 -2549560
44485 -2549560 1593845 -5360568 -10401666 8576727 43781494 60495393 42398027 10790881
44477 10790881 -7664004 -11022866 -10678643 -9550322 -5160677 -440150 1894000 5720070
44469 5720070 11685376 11210434 696478 -8747912 -7292343 -2198125 -4897754 -11356467
44461 -11356467 -9906301 -1503619 3707137 5213089 10868927 19221412 20436023 15724764
44453 15724764 18700242 32777240 42637959 35913276 20966540 13929871 17753238 24070215
44445 24070215 28300667 31675313 32511730 26925696 18140841 16033739 24938762 37200170
44437 37200170 40901704 30992831 12404735 -4539601 -11217477 -6319726 3862955 11120006
44429 11120006 10847069 2277519 -12715065 -27857187 -33537204 -26203431 -15557955 -15029894
44421 -15029894 -23899219 -26619702 -13781473 3819451 9584864 4401533 4876651 18774283
44413 18774283 33435611 33525306 21680724 13271805 15408478 20692362 20813956 16764423
44405 16764423 12785385 8440171 2911982 1904440 11763524 27440932 34224382 24485364
44397 24485364 7352186 -2681593 -3138086 -3888653 -11832105 -22137996 -26172494 -21774677
44389 -21774677 -11935013 1160784 14632508 21200764 14923135 80338 -12596021
44382 -12596021 -18582029 -21379993 -21948576 -16322124 -6818402 -4493808 -12591676 -16734209
44374 -16734209 -3112436 19077985 26834057 14064214 -79519 2839699 17054323
44367 17054323 22044932 8969495 -10441041 -19867300 -16838190 -12447022 -14866236 -18252090
44359 -18252090 -12422566 -448706 3438420 -3836333 -6003337 9051772 27944398 28660573
44351 28660573 12352257 620800 3500677 9917167 12082867 18040262 31426638 38235187
44343 38235187 27609106 11020425 5168469 7289643 4057239 -4080456 -5855563 -1179051
44335 -1179051 -1356364 -8123244 -9558426 435431 12371852 14771188 7032314 -4217266
44327 -4217266 -12582484 -13522516 -6752350 1208270 3667994 2450857 2647115 1617604
44319 1617604 -6145356 -15715231 -16989940 -13009508 -17444269 -30957140 -36686441 -26288836
44311 -26288836 -14741323 -18150079 -29754411 -31841524 -22399478 -14809019 -16014479 -19851264
44303 -19851264 -20918846 -21583934 -22728077 -18156012 -3375966 15950006 29095229 31632926
44295 31632926 29040894 29337699 33248046 33435885 25325364 15854603 15219130 20618160
44287 20618160 17423116 -207005 -19120202 -23890655 -15845680 -7535850 -5366322 -7447983
44279 -7447983 -12666060 -19776509 -20769191 -8230250 10772379 20481367 17792454 15687240
44271 15687240 21665583 25116666 14020576 -5178493 -14654602 -7207029 8269488 20577348
44263 20577348 26085187 24935645 16550383 3044034 -8127605 -10260280 -5198775 -1774439
44255 -1774439 -5917759 -13901471 -16353047 -8544376 4278015 12185943 10274834 1839230
44247 1839230 -7581764 -16638682 -26712357 -35616530 -36724902 -26525064 -10996356 -881205
44239 -881205 -172171 -2256129 1198472 10436381 18881919 21157746 16274232 5620029
44231 5620029 -6842989 -13852711 -10956959 -3927888 -3535728 -11202965 -16623668 -12684505
44223 -12684505 -5596953 -4889452 -9595661 -11747437 -9381137 -7687156 -8756470 -7980797
44215 -7980797 -1443071 8491707 15723562 15207967 6504868 -3684527 -5116527 4710282
44207 4710282 15811459 18821604 19344797 29221489 44681240 46249692 25196400 -1090754
44199 -1090754 -9205609 1454451 10029738 1673602 -16201298 -26664115 -24504778 -19527858
44191 -19527858 -21503556 -27577902 -27069588 -16300199 -4051041 -919722 -7211417 -14629610
44183 -14629610 -16435655 -11061053 1062641 16773155 27325989 24875529 13524651
44176 13524651 6055392 6682537 4883403 -8705172 -27233678 -35505613 -28648334 -15945212
44168 -15945212 -8062353 -6309086 -4134802 4286254 16379300 21061729 9857088 -10473425
44160 -10473425 -22326461 -17762579 -7861308 -5992144 -9042860 -4385171 9830546 22753168
44152 22753168 27145395 26127150 23103457 15986832 4650333 -4819566 -7578636 -5250096
44144 -5250096 -714443 5913902 13474942 18646707 21322777 23948562 22947499 10161637
44136 10161637 -11807063 -25269506 -17404144 2295475 14330305 13657026 10913122 12944608
44128 12944608 15131593 13441639 11525130 11656669 8644788 -1230532 -12422546 -17315278
44120 -17315278 -15614904 -10777072 -2514502 9760184 19812283 19679077 11328097 5338259
44112 5338259 6594911 8459557 4369372 -1379747 -788399 3534144 -402814 -16911064
44104 -16911064 -33533093 -34331108 -19433173 -5207954 -4534821 -12600813 -15501320 -8448379
44096 -8448379 460008 2989633 278810 -2416124 -4567351 -9032848 -15014563 -18330122
44088 -18330122 -18527176 -20280851 -25570694 -28622395 -22761398 -10727481 -3535464 -7687491
44080 -7687491 -16723347 -18559802 -9886103 718152 4725528 4152911 6100463 9848331
44072 9848331 6630065 -6213407 -17842405 -16400715 -4950121 2578447 672526 -577687
44064 -577687 9352473 25595183 33240042 25429686 10016061 -861825 -1920655 5109388
44056 5109388 16131956 25609695 26806370 16832566 1671097 -7430681 -4125515 7579335
44048 7579335 18108584 21008906 16647230 9281154 2297193 -3624653 -8615628 -11084764
44040 -11084764 -8429681 -875585 6705941 8775670 5039849 985051 2215512 9213183
44032 9213183 17382998 20652289 15358244 3280398 -8279493 -11926936 -7257695 -724856
44024 -724856 2329190 2344019 839779 -3782003 -10869515 -12516466 -2614405 9908812
44016 9908812 6992364 -15337724 -37666525 -38004303 -16973683 5180826 13337630 10465150
44008 10465150 6608690 4738722 1804091 -2554564 -4523970 -1379777 5716665 13077471
44000 13077471 16185623 11938245 2415518 -4743007 -3242084 4490369 9586226 6734532
43992 6734532 -677866 -5909427 -6050686 -1741307 7174559 20868621 34589540 39943086
43984 39943086 34465038 26510294 25739992 30239131 28863514 17024408 4141862 2334971
43976 2334971 12368837 24724891 30496126 26426001 13241595 -3831887 -14758725
43969 -14758725 -12886267 -4111060 -754874 -4877045 -5282708 5518817 18994348 21594436
43961 21594436 12863966 4672226 4589301 8078707 7986101 4598861 2437703 1577168 -2087842
43952 -2087842 -8442140 -10418153 -3000899 8028603 12183671 9314391 11157151 23333092
43944 23333092 33176101 25356503 5598556 -4423186 3543429 14695633 16215004 16545257
43936 16545257 27686604 40819580 37607394 20032331 9364334 14709201 20933680
43929 20933680 13570934 84065 -2843039 8582379 25630335 39644683 43732496
43922 43732496 30918824 4020057 -18052469 -17899962 -1631765 9528473 8566126 9460517
43914 9460517 22623923 38322591 41720258 32813498 21853250 13499197 6362549 2442726
43906 2442726 4962188 8937336 5144569 -6097074 -14783996 -15971795 -14939072 -15162372
43898 -15162372 -11630437 -2026014 4658758 -23109 -9087677 -7455515 7597435 22580544
43890 22580544 24771227 15193667 3358925 -3437741 -2652892 5143770 15695243 22560928
43882 22560928 23190764 21107370 19482127 15989252 7957247 21528 1190710 13457260
43874 13457260 26902893 28924647 18111492 6648930 6549478 14458482 15038565 1384167
43866 1384167 -14250660 -16221006 -6679239 -1256694 -6223500 -12112904 -10988414 -6882138
43858 -6882138 -4463016 -252015 6940108 8692685 959066 -4832251 1905123 11612270
43850 11612270 7641896 -6237166 -9298074 5488165 21806565 24563406 18014470 12802107
43842 12802107 9230874 3149159 -2389698 -2368131 310941 -38850 -2369045 -3568568
43834 -3568568 -7398949 -18282551 -29126838 -26701742 -10359658 3729478 737217 -16183715
43826 -16183715 -31276550 -34281625 -28413622 -21592258 -15430533 -6697389 3011180 6049843
43818 6049843 -448584 -8867188 -11720468 -12463115 -17387394 -21176023 -12608137 5919257
43810 5919257 18009559 15885855 10597410 13311248 18741235 17079995 11948679 13078444
43802 13078444 17574905 13427001 141179 -8039016 -1978342 10320846 15900153 12618897
43794 12618897 7099202 2715757 -3440348 -13173623 -22451105 -25971978 -23898370 -20982496
43786 -20982496 -19279091 -15760211 -9321381 -5125685 -6140350 -4799048 7195678 22768026
43778 22768026 25697799 14432492 5651355 8808341 11922062 2653682 -10322167 -11861860
43770 -11861860 -6052591 -9403140 -23252506 -31012169 -22839307 -7692355 1176393 170451
43762 170451 -7050819 -14669281 -15801693 -8731710 -2707489 -7387738 -17338680 -19122879
43754 -19122879 -12977433 -12491203 -21002152 -24618409 -14162180 1053967 9106830 11734328
43746 11734328 15597012 18863290 16756538 11617704 8152792 6024623 4319977 4835000
43738 4835000 4341594 -5647774 -23055498 -30966558 -20047853 -3618133 2898706 5899356
43730 5899356 19561810 37142545 38149307 21339736 8551924 12483165 19825913 13357307
43722 13357307 -4666271 -19717676 -23578143 -16971266 -3161479 12151281 21206511
43715 21206511 22000651 20742841 21528548 20234791 14153022 9641204 11905622 14167341
43707 14167341 8026345 443025 7192408 28322396 42370494 31287628 3368051
43700 3368051 -16412134 -14782693 -1034949 8490847 7463212 -886190 -11822798 -19390020
43692 -19390020 -14841054 4296783 24646057 27700829 13194829 1627494 7644186
43685 7644186 20282617 19035973 2572798 -10664977 -7624127 5953307 17849135
43678 17849135 23764053 26033529 27068230 28804616 32430801 35163311 32947227 28403123
43670 28403123 28633873 32285400 28283356 13749768 3877385 13172689 32379719 37086072
43662 37086072 19104683 -2641615 -6377988 6823160 18355250 17119852 10519361
43655 10519361 11360350 21676867 33287269 40113325 44003198 48075415 49655867 44002312
43647 44002312 32857001 24039769 21597512 20531097 13882954 2511895 -5232688 -2826345
43639 -2826345 7430510 16558144 17290273 10799514 4938701 4860344 6928152 5010071
43631 5010071 1057322 3107035 11855218 16960632 11262443 1830531 -229062 4523057
43623 4523057 7578861 7958109 11949013 17727422 13794296 -2325970 -15683635 -12812688
43615 -12812688 -203578 6469819 4937785 5743515 12663652 17791197 17130482 17637185
43607 17637185 23690983 27739713 22071700 11593763 6122632 5880435 3917461 -1107411
43599 -1107411 -4476383 -5851562 -9983425 -16049583 -15395841 -3287996 13601548 25093073
43591 25093073 28260170 27525192 28344722 33543795 41889133 47223669 42351587 27024452
43583 27024452 10014105 1107129 2663236 9498378 14061852 11576427 4411509 1854673
43575 1854673 10099187 21600720 21708619 8738059 -883273 6609828 23746985 32192419
43567 32192419 26291923 16924012 15148965 21575277 30373194 34575076 28086472 11813478
43559 11813478 -2033193 -1492733 8006924 8380694 -6187965 -19811835 -16471144 -1637000
43551 -1637000 6382853 343505 -10228805 -13968201 -9553935 -3595876 -3379656 -11191115
43543 -11191115 -20564330 -19500649 -3031835 18475759 29096605 24427985 13381654
43536 13381654 4673576 -821391 -4285721 -4380993 -1545028 460163 1600511 7885495
43528 7885495 21302086 32820303 32275201 21881822 12757320 9743273 7257058 626978
43520 626978 -5901910 -5909873 -673882 2295192 -1149177 -7318933 -10033308 -8141669 -5894376
43511 -5894376 -5754466 -3473989 5840388 17444470 19468287 9265312 400054 5642382
43503 5642382 18103399 20381996 10383258 4194866 10603428 17380121 11267061 -964320
43495 -964320 -4488996 -1160281 -6417971 -23940964 -38786720 -38528459 -29102953 -24494799
43487 -24494799 -29150559 -35930952 -35821813 -25564676 -9913530 1113322 1266509 -4273218
43479 -4273218 -4702212 2557102 9633582 10505955 8445890 8781563 10678992 9492472 2648966
43470 2648966 -8702545 -19133160 -19696412 -6146748 12491305 21312300 17263335 11214329
43462 11214329 10492535 9687257 3023912 -4943080 -7975365 -8187489 -9336332 -8024535
43454 -8024535 -429856 8445086 10748090 6121779 -708037 -7099183 -11184744 -10308951
43446 -10308951 -7030138 -8447648 -12835642 -7698256 9189055 18685413 4555356 -20463391
43438 -20463391 -29414255 -15701833 3748895 14969323 18766173 18661951 15037442 11435452
43430 11435452 10816628 5987789 -10262847 -26965537 -25656887 -9529976 -1027454 -7057392
43422 -7057392 -9107803 3981880 15765728 8724302 -7025214 -9138025 4656237 16888609
43414 16888609 16087763 7270649 494464 824613 7567135 14920998 15473359 8521547
43406 8521547 1291492 -1605241 -3681495 -8154257 -12295406 -14506249 -17771634 -21159401
43398 -21159401 -18320630 -10264859 -7779320 -13546374 -14754249 -3730905 7172796 4830023
43390 4830023 -2318858 2121300 15273550 20115218 13302646 8992404 15033891 22255043
43382 22255043 20462448 11401619 1641978 -6397334 -11681885 -11456507 -5874370 -306939
43374 -306939 643550 -1538996 -1382956 4910306 15121129 21279409 17663436 9983350
43366 9983350 10850451 23071904 34099748 31187095 15085678 -5088776 -21367700 -26343662
43358 -26343662 -14860563 5180273 15035824 8377408 983229 5884482 12278440 5048408
43350 5048408 -7604978 -6965521 4801986 9393405 3632908 1918596 8624160 12162445
43342 12162445 8908743 9711911 17047678 17553126 5667672 -4762981 -2530710 4163170
43334 4163170 3582147 -1771367 -4248226 -4861599 -6688097 -5417025 2399110 10173730
43326 10173730 9819530 2486826 -5657097 -10201719 -6218263 9928082 30290259 38433033
43318 38433033 30386967 21295448 23359560 29385739 27941456 22499762 22916401 27802409
43310 27802409 28843032 25174560 20744708 14091581 3660047 -2487201 4058214 16432797
43302 16432797 18768795 6347246 -11157713 -24438311 -31897059 -33620743 -28725970 -19753677
43294 -19753677 -12017392 -8070822 -8240588 -14382290 -26137161 -35501276 -32986978 -19026546
43286 -19026546 -3188640 7427996 13839954 20391031 29393899 39736715 46993941 46418231
43278 46418231 38774798 30611478 26314959 23960475 21441874 20742969 22402099 22642843
43270 22642843 21145407 24181801 33027292 36576788 24741975 3900224 -10581107 -13335990
43262 -13335990 -11142464 -9247794 -5541585 2289261 11864488 18642627 18371468 9166102
43254 9166102 -3862502 -9758306 -3674188 5910294 8056411 3020026 -1939930 -5253110
43246 -5253110 -10289652 -15379054 -14558657 -7280158 978208 7284808 13483927 20562097
43238 20562097 26519870 28548998 23209714 8401335 -9882030 -18571062 -12446158 -2502729
43230 -2502729 -1412443 -6460162 -6316522 837227 6933141 7628303 5393189 2470767
43222 2470767 1093232 6422731 18080583 23714465 14318257 1757774 5612832 24423027
43214 24423027 36034008 27145564 7480189 -6914213 -9798678 -2200482 11043551
43207 11043551 18150462 7888280 -14263452 -28991600 -26398324 -15331977 -7070489
43200 -7070489 -3033096 -2360758 -6905696 -12126467 -6697630 10712257 26222559 30217834
43192 30217834 30147780 34945998 38425761 29766153 11918767 -2133924 -5909866 -2585844
43184 -2585844 3503252 9834907 13756294 14295420 12861722 8662420 -698370 -10822139
43176 -10822139 -11234177 178435 12036199 15157506 14746693 19321614 25850138 25456987
43168 25456987 17977566 11433218 10673932 14000679 18162998 21355847 24223096 30412629
43160 30412629 40952997 47457717 40341994 25682456 21337358 31594163 39636953 32603825
43152 32603825 19230999 12060163 7308527 -2928517 -11753344 -8500604 1143483 4324563
43144 4324563 2525454 5168508 8383066 904403 -12229515 -13266276 244910 10363595
43136 10363595 4660611 -9521824 -19871439 -22534542 -17134441 -3228615 13426824
43129 13426824 23359395 25639603 26772635 27116302 21976964 15981155 19360330 27863622
43121 27863622 25042727 9306167 -908143 3240779 6364259 -4117408 -15258120
43114 -15258120 -9652679 5640270 10428479 1804093 -5582933 -3367579 4100547 13192927
43106 13192927 23983818 31276243 27856855 17058881 9471552 7287847 3889988 -1504275
43098 -1504275 -1610325 5424310 12480935 15655866 18667439 22226464 20083787 10217956
43090 10217956 596675 -1275621 2902787 7828514 11348928 11878385 7195782 579820
43082 579820 223954 6782716 9124549 -307961 -12604350 -13651877 -3649536 4280486
43074 4280486 3021508 -302383 4165690 16552036 28587609 32980432 29801218 25948521
43066 25948521 27923366 33064044 30784312 16630005 1286320 -1749523 4987070 6376614
43058 6376614 -2558974 -9089112 -2947799 7056871 6552408 -1934143 -3177326 6621884
43050 6621884 13761218 7863256 -3274759 -6609653 -2999942 -3940972 -13424193 -22965882
43042 -22965882 -24742154 -21390164 -19696220 -20073014 -16970565 -7853474 2070024 4910818
43034 4910818 -1266499 -9956917 -13257612 -10952748 -9868057 -12975432 -13457295 -4686647
43026 -4686647 6828527 7006379 -6053872 -17065403 -13987012 -5740620 -9890846 -26930653
43018 -26930653 -38949962 -34386893 -21987322 -15463671 -15045143 -12592467 -6959476 -3550122
43010 -3550122 -3112067 -1814782 -71462 -507341 1369633 12337374 26724170 29785555
43002 29785555 19534921 12054595 18383356 28581633 28341494 20272077 16240573 17307404
42994 17307404 15620610 10272060 6047658 171687 -13459049 -27950008 -28242223 -14577005
42986 -14577005 -5187615 -10816085 -21222353 -23338483 -18440311 -12329172 -1794478 16404928
42978 16404928 32010446 30328441 11173557 -11142824 -23757622 -23690183 -14751256 -4288843
42970 -4288843 163969 -1908755 -3188180 -179635 -59182 -8965735 -19823431 -21147866
42962 -21147866 -13042220 -4235646 2967953 13437672 26400737 33006925 28232837 17402126
42954 17402126 9602094 9817843 16297693 20473799 12799038 -4710736 -15819453 -7791238
42946 -7791238 12771888 30539431 41459087 49706663 51105655 37786792 18026170
42939 18026170 11164171 18283629 17398135 -2829064 -22062461 -15324923 11355973 28912751
42931 28912751 22246569 3458452 -9432239 -12080728 -9672329 -4616999 5049812 19043419
42923 19043419 31337738 34359416 27267526 18896504 18230223 21484149 15177432 -4702965
42915 -4702965 -23700743 -25541141 -12578824 -1503712 -1531919 -5773097 -4395470 2017000
42907 2017000 5871634 4276303 2435583 6035321 13319514 16754413 12683394 6892406
42899 6892406 7607650 14342890 18624890 16230567 12764751 14307603 18145436 17732015
42891 17732015 12996501 10071924 12818069 19718301 27867790 35049158 38313782 35350857
42883 35350857 28234341 22463644 21202931 22539503 22592155 19039548 11479760 1129626
42875 1129626 -8436386 -12116448 -7080344 4036350 14773930 20390039 21523350 21825795
42867 21825795 22597873 21369660 15781313 6793111 -2280540 -7315377 -3844106 9246973
42859 9246973 24399558 29443051 21626375 12641993 13774490 21075001 23073434 18189518
42851 18189518 13539676 9687529 665830 -9951353 -8207624 8861846 23810470 20152260
42843 20152260 4227918 -4015181 4312348 20698791 32096227 30888512 16726809
42836 16726809 -1213990 -6481436 9199161 32225717 38393906 20565741 -2224080
42829 -2224080 -7003889 7380251 21864666 21624104 12366123 9738409 16940869 20572987
42821 20572987 10843459 -2406031 -2608088 9486505 17468065 14788327 13517069 21609283
42813 21609283 26006544 11339094 -13501007 -23000640 -6826340 19361192 35488863
42806 35488863 37949683 36161471 38157159 45046904 53688290 58999456 56054347 44142378
42798 44142378 28673902 17392583 14332737 17094356 19466187 17265040 12039712 8545117
42790 8545117 9495321 14670230 23365046 33422244 38950574 35153692 26020182 20743265
42782 20743265 21068448 19091443 9695607 -2398630 -10977937 -15636170 -16704496 -11395295
42774 -11395295 -579659 8485496 12313231 16398248 24060807 28581142 24104529 16121452
42766 16121452 12523739 12200677 11381666 12424139 15832660 12892548 -887018 -13613440
42758 -13613440 -12964591 -6257684 -7498505 -11371159 -903178 21995480 36215760 33453228
42750 33453228 28494806 31718366 32408084 20154070 5272272 3726540 13708315 21278909
42742 21278909 21378695 20248416 21749862 22806833 20831792 17356607 14586627 13226351
42734 13226351 12890953 12310212 11297873 13074515 20092649 26994174 24198390 10642595
42726 10642595 -3246053 -7677058 -2600551 7059097 17717342 25139358 23405937 11628366
42718 11628366 -2242098 -8715636 -6016042 -770062 -1708010 -11436238 -20867123 -15432094
42710 -15432094 6536567 26101295 24708542 9443891 3832919 14766187 25121012
42703 25121012 22124228 15098441 16246499 19187050 9823021 -10976038 -28399355 -32211664
42695 -32211664 -24478111 -13055404 -5500012 -5998119 -11900142 -15941160 -15109233 -12655249
42687 -12655249 -9739945 -3076524 6245328 10885357 8355502 4640681 2843662 -735867
42679 -735867 -4526233 904742 15665596 24504425 18655823 10959945 16177242 27739131
42671 27739131 29570801 22043760 19090396 24946272 30366960 29406035 25185614 20278622
42663 20278622 14365754 10447917 11758716 13942684 11172154 7546592 10847852 17628091
42655 17628091 17232276 9013178 2497912 1259579 200614 -783114 5055424 16293622
42647 16293622 19971657 9462036 -4409442 -6843494 3460487 16237646 23619105
42640 23619105 26183237 27611721 28271102 25410177 18900270 13993062 14232031 13454603
42632 13454603 3540827 -8761275 -4897129 19591817 44759317 51594669 45278728 40043058
42624 40043058 33733759 16988310 -883291 983603 22940533 41610168 41715432 32115434
42616 32115434 25847653 22638923 18400571 15838111 16181225 12893792 2941218 -5252960
42608 -5252960 -3162776 6080237 13399767 14506413 10563332 4853174 2059952 4615057
42600 4615057 8268976 7519713 4127550 2259649 -844647 -7410048 -7102582 10373272
42592 10373272 32882489 36800382 21996570 13357472 21942166 28774193 18170021 3535638
42584 3535638 3403770 12112131 14558425 13695224 20597537 29229517 25353565 13795884
42576 13795884 13447194 27486205 39447485 38772669 31330262 23198666 11985075 -1782420
42568 -1782420 -10160295 -10332905 -9545803 -12297197 -12826315 -5362808 6762759 16913120
42560 16913120 22868209 24778882 21918217 15745528 11469640 13003783 19459253 28167133
42552 28167133 37381769 44321153 44159373 33934034 16953737 2212850 -2037647 3639679
42544 3639679 9157120 6248185 -558016 -871310 4341452 2978555 -7889169 -14251562
42536 -14251562 -5296708 9690197 15062741 10285110 5350817 2228593 -4784082 -14472225
42528 -14472225 -18755550 -15733942 -10290005 -3234842 7913367 18696098 21236937 18124673
42520 18124673 20326927 30292104 38891678 39989761 35744021 26282809 8089716 -13369121
42512 -13369121 -22805009 -13604965 3114371 13926568 17832776 19621694 18712395 12939733
42504 12939733 5733915 1137433 -2466520 -6183592 -3895049 9821151 28528641 38428836
42496 38428836 32649507 16126073 -1082192 -10345483 -7503544 4110015 14354998
42489 14354998 15118098 8834901 4993308 8420363 14112108 14046818 6781513 -1018788
42481 -1018788 -2094722 3598704 9938575 13007724 15259352 19958555 25239648 26776174
42473 26776174 23028565 14623336 3021293 -5809648 -2470800 13615677 28482694 29761474
42465 29761474 23639502 23771588 27893568 22056825 7555407 4026740 19597786 36037991
42457 36037991 34553089 21297330 13652869 13981501 13855267 15012171 26124496 42052031
42449 42052031 46241545 36102859 28480973 33746293 39427648 29481813 8911171 -3088775
42441 -3088775 1170454 11088821 15102808 13594888 12090026 10742058 6745326 2262461
42433 2262461 2866370 9273126 16531993 21639190 26099826 29207472 25156225 11821447
42425 11821447 -1825703 -3681122 7123144 18973827 20638792 11438732 -354192
42418 -354192 -4820831 2896950 18134816 28994990 27234660 16363773 5633934 -896523
42410 -896523 -3677039 -144400 12554216 28578039 37573988 38855973 41425103 48293326
42402 48293326 51800817 47688001 41967746 38265095 30375495 16074702 7511087 15948213
42394 15948213 33269165 41028450 33893107 22783595 17374163 16582216 15735203 13081602
42386 13081602 8221019 2217722 457415 8488982 23726264 36829702 41966541 40831854
42378 40831854 37010356 32308020 29097050 30404919 35687081 40174730 39711698 34119023
42370 34119023 26434576 21284223 22163423 26814408 27169715 18074501 4830706 -1665731
42362 -1665731 4084023 19122393 37004729 51174451 56001053 50476099 40543252 33551963
42354 33551963 31082482 30371915 30584959 33548749 40138058 49631551 60407426 68139302
42346 68139302 67076692 57347899 47098617 42963352 42941797 43171978 45202755 49801529
42338 49801529 50589804 43227222 35083836 35231779 40146942 41382758 42521443 53729627
42330 53729627 71809127 81742036 78945943 74535979 75961858 78084556 78222774 84192366
42322 84192366 98841100 110074937 107637691 100747503 107724763 133076007 163748794
42315 163748794 185149069 194788543 202207729 218365539 242862214 263042748 271338191
42308 271338191 278994249 300475506 327473561 336691607 325387699 317808281 328025153
42301 328025153 338037454 327246178 303801155 286485485 271542866 242521760 203289876
42294 203289876 174411999 159859474 143098979 118185862 100693480 100678675 104727216
42287 104727216 95228965 73479387 53984690 45891612 47629478 52019061 51449457 44809598
42279 44809598 41189225 48302948 57561828 52915052 35497062 24631944 30630149 42353482
42271 42353482 48041003 51856450 59755727 64871298 61080048 58108544 66506659 77118754
42263 77118754 73451467 58380112 49911165 52834467 53342371 43616133 34348385 36898863
42255 36898863 47148099 55340290 61085148 68622620 74420562 70759073 59818804 54792775
42247 54792775 64665723 83346502 97352078 101447123 102152567 105720946 108192103 102130732
42239 102130732 89741149 81162822 79502241 76797471 68567497 62972357 67876397 76339434
42231 76339434 75546859 66070375 61031405 67226127 77606523 83377286 84049908 83219146
42223 83219146 82566390 83161997 86213353 89838341 90560244 89316037 89781284 89969263 83459538
42214 83459538 71139080 63196768 65725879 73752299 82344164 95368757 115193475 131597115
42206 131597115 132397443 121911100 117842799 129723470 149680632 166158218 178114371
42199 178114371 191390961 207590991 223183899 237192942 253271240 272628034 288967021
42192 288967021 294030053 287059450 275108656 263573510 250841782 235033013 221381922
42185 221381922 216733956 218576674 216414661 204404157 186669713 169603616 155273468
42178 155273468 143481447 133471039 121802111 105541102 89396978 81636797 80707709
42171 80707709 75956697 65578426 61691985 69883424 76256188 67104081 51046559 46171253
42163 46171253 52882316 57417866 57728730 65451568 81563552 90266107 82633626 69225345
42155 69225345 62048944 59480529 57244762 59075135 65743813 67192388 58119429 49510740
42147 49510740 51134455 53855787 45385518 33889223 36442377 49379883 50986598 33552419
42139 33552419 13588158 7342979 13714909 26108102 44025200 64803081 78633151
42132 78633151 81944010 84027597 90509759 91528931 77874365 58777613 49823235 50495486
42124 50495486 48686481 42852960 43566775 53780577 63091074 64516481 63556327 65580067
42116 65580067 65746079 58420307 47912339 42482317 43957937 49625032 58303677 67577322
42108 67577322 70460638 63116409 52614210 49181343 53099232 57108713 59792416 66979489
42100 66979489 78981677 85997199 80622917 68169888 59288610 57339688 58898406 62899863
42092 62899863 71610577 82962498 89288331 86746711 81279648 80951253 85126430 86434158
42084 86434158 82681893 80390040 83558233 84492124 72647270 50934728 35563088 37594224
42076 37594224 50716108 60755081 62014058 59292119 57943004 58379359 58952863 59154087
42068 59154087 60582296 67497635 82945375 100414170 105280273 92672457 78971547
42061 78971547 83958176 103653229 114498801 105689669 92561477 92635334 102923875 110622177
42053 110622177 113907881 118878332 124341909 124623305 123626111 132035666 150813481 168650215
42045 168650215 176338938 174896881 170388045 169936882 181573829 207213364 235069302 249245666
42037 249245666 248579695 246776191 252546394 259661762 259254021 251859336 242891483 234704906
42029 234704906 227738362 222134203 214226688 198865381 179232505 166663690 166072511 168862944
42021 168862944 165054245 154930829 143395820 130837679 116957842 107122511 106430052
42014 106430052 111208457 113312880 109949081 104081869 99078988 98286636 105571557 119967683
42006 119967683 132777731 135716959 130019875 123645976 122178997 125437080 129377674 128718379
41998 128718379 121945299 115350681 116188804 120785941 117991752 106262191 96285167 93329280
41990 93329280 90839078 87814712 95860954 116857295 130012723 119517447 102676310
41983 102676310 108648097 136980167 160592080 165985025 165765098 170494144 172976769 166735798
41975 166735798 158075701 150566038 136717785 115811688 102461328 104506131 107579285
41968 107579285 96494035 79529375 74848840 81544965 81910549 68840887 54656071
41961 54656071 51771372 57410149 61224320 59634452 57662663 59802301 62746192 58774996
41953 58774996 46993578 37639435 39684733 46885739 45385011 34489428 28028412 32992293
41945 32992293 40335903 42246606 44161288 50615971 53166779 45466906 38628602 45511180
41937 45511180 58175394 58660115 47075032 40411343 45003603 48977042 44612514 40626989
41929 40626989 45399801 51894819 48257425 34197160 18876748 9135996 6190394 8269215
41921 8269215 10697979 7963658 604932 -3727871 521845 10831788 22357852 33777966
41913 33777966 43465014 45944848 38162770 25112182 13258297 1830979 -12583795
41906 -12583795 -24989630 -23705339 -4974506 20012323 36480870 41641875 45084054
41899 45084054 54294496 63778138 61365916 44034099 23393484 13499473 16171550 22116616
41891 22116616 24820191 27575831 35160971 43752443 44179345 34063739 22302870 19898030
41883 19898030 28246088 38138259 39718104 32186243 23810349 23596510 33381678 46928489
41875 46928489 55527457 54781760 46916313 36817467 26548622 15497025 5574074 2014507
41867 2014507 6152610 11182998 10167265 5691911 5022943 7088481 3001163 -8648592
41859 -8648592 -15983522 -8925737 6199337 14235451 10100092 3427997 5293385 15508963
41851 15508963 23700122 20563599 8364289 740928 9116700 28160965 39445583 32405225
41843 32405225 16485917 7880548 9435727 10940940 6068074 -88460 -957048 2173474
41835 2173474 4703779 7486144 15264102 27169315 33938202 27888542 13517647 2956909
41827 2956909 116870 -4089019 -16680128 -30400713 -35389413 -36361447 -43983500 -51996642
41819 -51996642 -41330645 -10995952 13512145 12746193 -1004872 -3728580 7187327
41812 7187327 15708721 14000041 9104123 7253617 7567325 9770936 14689017 18237228
41804 18237228 16566284 14846502 19519485 25589552 24476517 20034896 21172772 21990919
41796 21990919 8008447 -17482105 -32624173 -26902296 -14351063 -10521579 -12278477
41789 -12278477 -8918560 356429 9649752 16375532 19508059 16761666 10406538 7279997
41781 7279997 7583156 3267840 -7371405 -14466967 -11880182 -6301569 -4283246 -2075743
41773 -2075743 3676500 7416249 6477691 9223688 19812084 26354101 18122629 4746622
41765 4746622 2567073 9490777 10788162 5287514 6814336 18960878 26240572 16414753
41757 16414753 -1392552 -9152642 -2680463 6107538 6130380 -462410 -3252078 3115970
41749 3115970 13728529 21105291 23518720 22191386 15225345 2403470 -7054822 -2999567
41741 -2999567 9379081 14783991 11630755 15460530 32287010 44692012 36267019 16281784
41733 16281784 4840713 3799386 -301108 -10823930 -16641543 -11377014 -1220716 7401189
41725 7401189 15224473 23581757 30440492 34150519 33685891 26437422 13087706 1644863
41717 1644863 -1407216 99223 554189 3754486 14239688 23606085 19935538 7157239
41709 7157239 -229790 527523 -408019 -4574918 -964861 14122553 28684374 31810414
41701 31810414 26046736 18157906 9486861 530638 -5553465 -8494954 -10476582 -8016446
41693 -8016446 4161259 18726619 18816710 733611 -18714015 -23259448 -14111339 -1019975
41685 -1019975 10302400 15031850 7203345 -9370687 -19485657 -15975467 -10551235 -14988270
41677 -14988270 -21840169 -16407500 136059 12945041 13769801 7058169 -257930 -3986415
41669 -3986415 -1026604 6635922 8491332 -3662860 -22406326 -31115118 -23143630 -7046422
41661 -7046422 6142534 13023866 15682894 16938335 18960279 21829495 23111499 21653944
41653 21653944 19535511 16939124 9159285 -6033726 -21817474 -29382385 -28669956 -25819455
41645 -25819455 -22877279 -17250528 -9476312 -3932138 -1971503 -614328 1828330 4077651
41637 4077651 5514028 6486947 5496944 1045191 -4101755 -5486196 -3784231 -4224684 -8502497
41628 -8502497 -11404933 -6923163 4647425 16410712 20400122 13963892 1892103 -8501891
41620 -8501891 -14387933 -17430802 -17986455 -14729378 -10815826 -13359375 -23131740 -30896072
41612 -30896072 -28527146 -18372014 -7369249 1439397 5959378 1350828 -11879199 -21788862
41604 -21788862 -17037874 -1619804 11500589 17658507 21229416 22941781 19502643 14952271
41596 14952271 18057034 25468668 21355724 643835 -19088255 -18984933 -4141928 4395788
41588 4395788 -932420 -5518634 4685479 22292360 27482984 13084340 -7456783 -17213063
41580 -17213063 -13892823 -7475110 -5294209 -6030420 -6296748 -5763100 -4897574 -3664780 -3771935
41571 -3771935 -6694568 -8897850 -5917096 -1866129 -5490721 -13998853 -12175619 5641861
41563 5641861 23388702 22934925 7282473 -7083986 -13280356 -15956069 -15890729 -8488650
41555 -8488650 3703486 11545115 13122704 14240427 14755121 8435221 -1378711 -803325
41547 -803325 14150741 28824700 28863364 17480120 6521579 340207 -2558894 -483197
41539 -483197 7753402 14923974 11751618 -123340 -9330650 -8498799 -942465 5973173
41531 5973173 8897793 8974980 7739853 4805311 -161713 -4225306 -3232071 974801 50624
41522 50624 -8788677 -15063822 -8769301 1262465 -4083675 -25810374 -41257853 -33819226
41514 -33819226 -16251642 -13733240 -31167460 -48592639 -45982374 -23683015 529282
41507 529282 8524760 -2638092 -17981811 -19725480 -7465130 2055619 -1851400 -9667567
41499 -9667567 -7827777 -267005 -1845976 -14636944 -23925014 -18426577 -3937176 5702040
41491 5702040 3417943 -7888378 -20567447 -27690154 -27571932 -24981301 -25298009 -27676783
41483 -27676783 -27252466 -22827618 -17690521 -13536341 -8690738 -2415456 3716566 8843720
41475 8843720 12731151 12816769 6401966 -3522481 -9452063 -7928230 -3348377 -2009960
41467 -2009960 -5299491 -9528113 -9819082 -3741885 6502580 15496282 20105303 22430731
41459 22430731 25110752 26247803 22949429 17553975 15046454 15594424 15233111 13261639
41451 13261639 13052124 15410989 16890438 15245776 11118456 4021444 -7140134 -18667610
41443 -18667610 -23883660 -22143296 -19307284 -16997528 -9191181 6207651 20338626 25053663
41435 25053663 25439720 31479764 40721719 39919763 24500700 6567276 -494352 2226513
41427 2226513 4954333 5243342 9090351 16783125 17361964 2667619 -18592224 -28539710
41419 -28539710 -20813047 -6668895 285492 -1632982 -5962488 -8845677 -9906255 -7545164
41411 -7545164 -1113563 4699881 5041420 3016143 5338838 10951179 12277447 8114036
41403 8114036 6399920 12053374 20566215 26878735 31971790 35841292 32546478 19737972
41395 19737972 6707690 4462791 11727545 18470513 19858978 18564075 15622972 7904053
41387 7904053 -5063824 -18671861 -28454058 -32795731 -31076011 -24308323 -16608343 -10746540
41379 -10746540 -4079400 4984264 9445296 1895948 -10826411 -12380792 1147826 14561083
41371 14561083 13777419 3580330 -1775107 1564772 5036164 1481479 -6864692 -12922237
41363 -12922237 -12050939 -5683634 -526612 -2024367 -7294525 -8986912 -7181084 -9667856
41355 -9667856 -17099147 -18078743 -6999741 2585969 -5636151 -26918161 -40876358 -37047946
41347 -37047946 -21961973 -3788611 14406436 25907429 21900452 7021532 -1326951
41340 -1326951 3180854 5267383 -9320015 -31387936 -39852454 -28797215 -12356413 -6779710
41332 -6779710 -15999504 -31253159 -38107695 -27823544 -7335831 7055112 9971126 12185699
41324 12185699 19820233 20991743 5485764 -13417277 -14304037 1435905 12811817 10732889
41316 10732889 6795439 9621934 12249238 8610738 4676507 4576881 1172223 -8797618
41308 -8797618 -13379151 -1987355 16607248 26272910 26400427 29038004 37267520 40321300
41300 40321300 30480297 13727912 1103755 -2747668 301799 7214530 15383494 21384399
41292 21384399 21460513 14442203 4010173 -3994804 -8256577 -12884677 -17888280 -13837654
41284 -13837654 5119026 26502786 31060747 19573942 12945415 21070631 28033753 17904772
41276 17904772 -203482 -7347719 -2865441 -5202 -2041657 -1662436 776576 -1914252
41268 -1914252 -6010529 572807 16063983 23716535 17391774 10539411 12558528 13255977
41260 13255977 1800364 -13232827 -16868115 -10770066 -8080886 -10931945 -8418560 3857661
41252 3857661 15654212 16854497 11085011 9396407 15249836 20894036 17762096 7141963
41244 7141963 -1368150 -1412643 3334540 6024495 6316146 7665272 8054812 2459377 -5513251
41235 -5513251 -5129737 4747045 10997072 5173129 -2217369 3830233 20824052 32662219
41227 32662219 31506694 23661919 15287042 5517064 -3915232 -4910051 4546346 13470859
41219 13470859 11750332 4618722 4262574 11040316 13395829 5980041 -2434264 -2433469 3216012
41210 3216012 6371637 6839923 10236555 15346811 13555349 2509908 -8198324 -9401473
41202 -9401473 -3890201 13471 971332 3275773 6493199 5435389 115639 -2952837
41194 -2952837 -1635886 -2901781 -12507757 -25352475 -30876917 -24513512 -9507555 9192447
41186 9192447 27213272 38474133 37060288 23815321 7998150 -516173 -408408 971675
41178 971675 -3361687 -12151933 -18118921 -17079203 -12050575 -7382714 -2314072 5846675
41170 5846675 13757339 12386591 -2872142 -25017170 -40421585 -40687272 -29483401 -18239391
41162 -18239391 -14670277 -15409254 -11554904 -1380135 6571200 5285817 -337206 440426
41154 440426 10744780 23686929 30859951 28063829 15592839 -350323 -8738715 -4444994
41146 -4444994 2464019 -3611799 -23762206 -41698917 -42565450 -27844176 -10424540 -2351504
41138 -2351504 -8809681 -25348949 -37580555 -31945225 -11731775 4240272 3176492 -8106270
41130 -8106270 -14948771 -11958654 -2612173 9696599 21370603 25506215 19332128 12040331
41122 12040331 15877173 29843002 39825416 35719728 22623161 13586702 15198799 22273664
41114 22273664 25605298 23847768 25635844 37290642 50983427 51841380 36997144 19866825
41106 19866825 13355743 16525497 21022225 22511626 21025908 17480242 15056774 17279760
41098 17279760 20570165 16916200 8056628 6186043 14188071 17728331 7185851 -4786027
41090 -4786027 -1475643 12208679 18533745 13963699 9685533 9834915 7849102 3251941
41082 3251941 4002599 10446519 12936181 8205018 3809990 3483418 1694873 -4084064
41074 -4084064 -8419297 -7965083 -4447044 3521859 17998372 30306512 28042660 15469862
41066 15469862 9101815 9563757 -1165753 -26663621 -42478431 -29667398 -2750954
41059 -2750954 13048471 15917740 18812668 20860560 11647147 -3775306 -8906795 -2968715
41051 -2968715 -1886028 -10903520 -16620708 -10535435 -2327641 -2675886 -7500656 -7396755
41043 -7396755 -1654338 4503576 7905603 6721452 -285234 -8807944 -10955257 -6354602
41035 -6354602 -3154612 -4017479 -856996 10636426 21452296 22960412 21247596 26483120
41027 26483120 34455244 32293004 20207346 13344375 19522035 27443349 23258597 9769451
41019 9769451 907308 2822532 9664116 15613746 21357414 27266239 28757124 23119551
41011 23119551 15220649 10781869 8018174 2525671 -2278475 1878989 14133339 21964919
41003 21964919 16731866 5240419 14518 2622322 4029981 -338240 -3936391 605031
40995 605031 10454248 15814298 11224948 -122587 -11801706 -19748691 -22214944 -18579700
40987 -18579700 -11504884 -7714066 -11569996 -17939210 -16872743 -7073231 1275140 701790
40979 701790 -3480129 -4407046 -8258017 -25260440 -48390650 -56057876 -40155056 -18369714
40971 -18369714 -10977843 -16468817 -20394651 -18854466 -18919629 -20504290 -13885624 2911679
40963 2911679 17504961 19457229 13918116 12393794 16432182 17999078 12521592 3730820
40955 3730820 -4259095 -12681558 -22796670 -29541070 -26285705 -15279228 -7560184 -10001392
40947 -10001392 -16977165 -18857254 -14707619 -10855277 -10298339 -11292684 -14287397 -20593570
40939 -20593570 -24353006 -17066289 -2840690 2235521 -8824435 -24047534 -30303711 -30246525
40931 -30246525 -32767806 -37006320 -37404625 -36024798 -36558728 -32984205 -18945876 -3535570
40923 -3535570 -1620829 -10570736 -12966595 -2884482 6667263 5275747 -1501823 -5504594
40915 -5504594 -8477739 -13708313 -17025581 -15041777 -13518024 -18764436 -26882306 -28832777
40907 -28832777 -21498624 -8460013 5297896 15001394 17318065 13813252 9144168 4590524
40899 4590524 -954770 -4292587 -1758162 -124003 -11017286 -30959353 -40690638 -31143883
40891 -31143883 -16828893 -14236015 -19699884 -20549763 -16802735 -17186481 -21980187 -25091982
40883 -25091982 -27325458 -32621316 -35765762 -29166663 -18601908 -16572225 -21900281 -22070873
40875 -22070873 -15272655 -12775679 -17355321 -17324037 -7728610 -394695 -3560066 -6489555
40867 -6489555 3018396 17294762 19847087 10908255 6596625 14435763 23562977 21740576
40859 21740576 11383690 3294221 916729 -2647465 -13448995 -27353926 -33941682 -28487680
40851 -28487680 -17388884 -10354714 -9712967 -10846648 -11351397 -14119738 -20769191 -27655544
40843 -27655544 -30597802 -28731710 -21413704 -7096621 10373265 19605708 12569135 -4663293
40835 -4663293 -18320314 -22920885 -24588074 -28667799 -31620260 -28488289 -22161130 -18812822
40827 -18812822 -16960261 -8538272 8223360 23668499 28041859 22636430 14333380 3973513
40819 3973513 -10982606 -24485540 -24465359 -10307333 3489964 7414206 9955147 20664559
40811 20664559 30073377 21632760 -1221574 -16892273 -14596102 -5331069 -882348 1817735
40803 1817735 8392895 14054385 13610240 12628453 16324006 16776423 5139449 -10135033
40795 -10135033 -12424114 -1104664 8171584 6966754 3641877 6921335 12458607 11113022
40787 11113022 1634559 -10089304 -17865200 -17606486 -9281192 341883 3195037 980098
40779 980098 3681276 13644648 19353924 11161783 -3700667 -9825781 -3041474 6918345
40771 6918345 10766221 8769743 5756857 4018057 3195674 2927842 3325800 4578306 6797073
40762 6797073 9247285 10345199 9629916 8642075 8650616 8980527 8610756 7405567 4956801
40753 4956801 1140222 -1380072 490456 3981623 2360602 -3957072 -5505016 1435184
40745 1435184 6165849 -680002 -9324066 -2361483 18586044 33146424 30747400 23098984
40737 23098984 22252342 21654117 10525527 -4736092 -8707998 -274055 7259721 6892304
40729 6892304 4376875 3635928 -311902 -9986189 -18553313 -19961546 -17039576 -13880245
40721 -13880245 -8540819 -362565 2635135 -7161239 -24060967 -33644981 -29022831 -15985802
40713 -15985802 -3051294 6824551 13971505 17596319 16710691 12669705 8338778 5368697
40705 5368697 3104305 204178 -2426947 -1142922 6002052 14983788 19682426 20333666
40697 20333666 23200785 29996075 33106146 25237377 9581521 -3743523 -7891776 -2834745
40689 -2834745 6316171 10775088 4162921 -7607996 -9738552 1106824 8422848 -1434246
40681 -1434246 -16626596 -15458359 936926 10811242 5780786 1188404 7641371 13542575
40673 13542575 7093102 -2587787 -1758523 4295009 1177846 -10452667 -17906285 -17390569
40665 -17390569 -15371685 -13399093 -8018912 -3514662 -8640520 -20651767 -26918307 -22964412
40657 -22964412 -15835630 -10004380 -4178368 -1956579 -9349857 -19371234 -15966545 1638862
40649 1638862 14805695 12702110 7512952 12402544 19301287 12843293 -3906341 -12920736
40641 -12920736 -5541941 8840942 15937581 10033506 -2627824 -8355265 755428 13678212
40633 13678212 9458010 -14463809 -34267741 -29687211 -9933511 3614465 8773321
40626 8773321 17641117 28041503 23203793 897338 -17890942 -15972449 -476692 10809644
40618 10809644 11536235 7562588 4870080 4785445 6380982 8219599 9998327 13379989
40610 13379989 18027230 19001073 13664587 7705850 6534065 5035677 -3430968 -11888366
40602 -11888366 -7458156 7571041 17781333 18017486 18192728 22131914 19281220 3913374
40594 3913374 -13583526 -23057895 -27920289 -33258383 -34488889 -27912002 -19705105 -13880074
40586 -13880074 -4033073 11400993 18752271 8109483 -8509334 -13439945 -8615954 -8539502
40578 -8539502 -15747132 -20372156 -19267505 -18961269 -21873007 -23975805 -24378609 -24620105 -20959035
40569 -20959035 -9459512 4278879 12073264 15656529 20331922 21801514 13175889 -421136
40561 -421136 -9462116 -16635147 -28861187 -38153434 -30489935 -10943211 1058299 616660
40553 616660 -30051 2405404 -2320727 -13322721 -14577669 -2944595 3959248 -2101761
40545 -2101761 -5499335 4701772 14321740 8534344 -3537980 -7538884 -9437256 -21215695
40537 -21215695 -35341434 -36204258 -27066006 -23526894 -26806698 -24288874 -12494308 -695329
40529 -695329 5608365 8272390 6603393 -578670 -6179436 -2855352 4053922 5681011
40521 5681011 5600393 10604005 13096470 3213953 -7167612 2950208 28075574 39115272
40513 39115272 25839918 10930208 12911515 19302711 10816356 -7808147 -18683891
40506 -18683891 -17816214 -13298807 -7107619 3093239 10330592 4033529 -12199664 -22361407
40498 -22361407 -17766666 -4761594 6625076 12101755 11459812 6921359 4577433 9794965
40490 9794965 19160342 23218095 19248939 15352643 18382332 22705899 16614982 -1632290
40482 -1632290 -20136932 -27499395 -25322077 -21537272 -15639085 -802299 18465893 23546628
40474 23546628 5067137 -20322694 -28721765 -18912987 -9964820 -12270178 -17024248 -15642209
40466 -15642209 -13048620 -15229028 -17193839 -12518537 -5135409 -2494296 -4206495 -5612413
40458 -5612413 -6400206 -8105109 -8639852 -6427958 -4760046 -5442831 -3617759 4198557 12262741
40449 12262741 13037626 7787847 3100384 1970385 4845375 12817534 21243966 17252272
40441 17252272 -4589360 -28601599 -32975826 -16730262 886337 7374377 9406303
40434 9406303 15504944 20544442 15790935 4521704 -2755309 -3656961 -4662947 -8027718
40426 -8027718 -6909915 3991944 18722210 25540763 20541737 12032038 10501944 16932542
40418 16932542 23373082 23271766 17446987 10356092 5353035 4905751 10208942 17277849
40410 17277849 17998475 9652496 -135738 -3054660 -1569652 -4414461 -12586317 -17559991
40402 -17559991 -14371060 -9179263 -9900542 -14166710 -12193158 -451726 12436814 15340287
40394 15340287 7506422 -1568713 -4922847 -6417864 -13126871 -22860823 -25516342 -16776157
40386 -16776157 -4132985 3046630 4264698 5407401 9732664 15285593 18614431 17766349
40378 17766349 13456415 9185836 7954958 8173438 6497439 4826518 8448363 15999791
40370 15999791 19100793 15359992 13112637 17214559 18537792 6688757 -12750038 -23712593
40362 -23712593 -18870524 -4307392 11481898 23108782 25141279 14877268 -711206
40355 -711206 -10148251 -11234813 -11867463 -16305945 -19392344 -16732779 -12125676 -10605429
40347 -10605429 -10566571 -7470912 -812269 6793301 14035040 20475202 23711133 20661681
40339 20661681 12255037 5515119 8699826 21376451 30214811 20945128 -3018339 -21027808
40331 -21027808 -19481309 -8253852 -4903246 -9971191 -10412086 -3280129 -786883 -10492125
40323 -10492125 -23868579 -29010026 -24555684 -16505064 -9829575 -7550345 -10321513 -12530797
40315 -12530797 -5657638 10368757 25000305 29216033 24025595 15122012 6328774 756947
40307 756947 820049 3813615 4131949 2071928 3251685 8168529 11522156 13309081 19132054
40298 19132054 26504626 24347633 12261159 6389364 16535968 30214006 31592328 24891908
40290 24891908 24211851 29474261 29907808 25597241 26597340 32070212 29192400 15848205
40282 15848205 7295870 13407394 23184206 21145427 8968471 653810 2604119 8400543
40274 8400543 10291785 7459357 3585033 2385180 5556288 10547332 10585139 1519537
40266 1519537 -10746304 -14328141 -5287155 6259500 8177946 2322004 2465285 15527181
40258 15527181 31673645 37473805 33103859 29053709 29401341 27997132 20702946 11245098
40250 11245098 2887290 -5634308 -11816896 -7313893 8630422 22183391 20687584 9553589
40242 9553589 3801385 7312864 11292813 11005484 12094211 18354122 23191968 18308719
40234 18308719 5193152 -6774476 -10831991 -8092172 -3935937 -2172309 -3415306 -7769731
40226 -7769731 -16107656 -26340061 -31080126 -24632225 -11906703 -3638219 -1750609 2392355
40218 2392355 12337052 18873210 14642266 7715922 10734676 22066170 28408041 23321241
40210 23321241 13101497 5187703 -20356 -4895910 -9310207 -11334927 -9376683 -4040300
40202 -4040300 -191249 -3348286 -10437507 -10096544 1800407 13389550 11807511 840158
40194 840158 -6449882 -7179371 -8282967 -9998832 -3569282 13719533 32189360 40036983
40186 40036983 32472321 12726402 -7389308 -12272254 466714 12216120 6686978
40179 6686978 -3785605 5870364 33111235 46290448 28264703 -983965 -15130940
40172 -15130940 -14389932 -13682111 -15572401 -12974001 -7147716 -5171965 -6397887 -6078362
40164 -6078362 -6128776 -8911066 -7162586 5541398 19927592 21310635 10643807 1267666
40156 1267666 -1382357 -2016831 -907169 6046811 13113275 7977023 -7454547 -15080391
40148 -15080391 -5180689 10258547 15478988 10476441 4793359 2094565 316341 -619883
40140 -619883 -1254266 -7327830 -21912299 -35788403 -35628539 -21544245 -7918666 -5194691
40132 -5194691 -8098363 -5248645 5299642 15372192 18664427 17572968 17575467 19280528
40124 19280528 18694614 13298897 5231967 -873476 -1544068 3001187 8216604 8603339
40116 8603339 4107846 1470972 5913292 13234595 14926603 10236297 7245189 11208241
40108 11208241 17730109 19555739 14827347 6174201 -3093113 -8719578 -6568979 1833387
40100 1833387 8656165 8593245 5153789 4878096 8670957 12057111 10730091 3210502 -8071107
40091 -8071107 -15912825 -13598761 -4075546 1770195 -492967 -3089131 292891 3240475
40083 3240475 -2337927 -10593453 -8861347 2439662 9215016 3992504 -3952481 -2820216
40075 -2820216 5371380 8716403 1745775 -8097517 -10526858 -5563336 -3730062 -12538622
40067 -12538622 -25903545 -31188730 -25308874 -17652143 -16554866 -19863342 -20814670 -15902967
40059 -15902967 -4218779 12694001 26376360 26015626 13127912 2472903 1712569 471674
40051 471674 -11479429 -26082449 -29427034 -23164028 -18923570 -18156033 -13116014 -3444954
40043 -3444954 3692733 6963659 9578510 7981646 -2433032 -13328140 -12558717 -5619562
40035 -5619562 -9202472 -23291322 -29805707 -21731595 -13051837 -14426784 -19399857 -22122889
40027 -22122889 -27916443 -35655666 -30314317 -8006980 9400931 2597888 -16269054 -21816149
40019 -21816149 -11288121 -1997847 -832426 1788081 9427222 11434965 1315934 -11188713
40011 -11188713 -12415358 -1068009 11679820 13883387 3740280 -8390758 -10709159
40004 -10709159 -4355134 -1645166 -7668798 -12752073 -8748563 -2390423 -3268993 -7943668
39996 -7943668 -7375238 -2393351 474904 1830702 5039804 4900008 -5346487 -19897691
39988 -19897691 -27186620 -27429797 -29451666 -32864011 -28229619 -13971510 886756 10382695
39980 10382695 14770961 11328715 -3301729 -21589931 -30765167 -30910517 -32996368 -38436368
39972 -38436368 -36723679 -25130687 -13449360 -5745246 4104138 13007937 4900674 -22880563
39964 -22880563 -47425447 -48811724 -36708298 -33174003 -40636544 -43741275 -34738994 -20075256
39956 -20075256 -6672127 2663786 3320087 -6443363 -15726347 -9900281 9127294 22981245
39948 22981245 19388025 5170587 -5598182 -7702273 -5366706 -3257988 -1652705 1599585
39940 1599585 6548436 8843419 3857535 -6355546 -14638476 -19093124 -25372239 -34680020
39932 -34680020 -37621246 -27692109 -13694862 -8291415 -9428752 -5258034 5488731 11390741
39924 11390741 6634311 -1501661 -5888853 -8341552 -10835921 -8751617 544656 10314337
39916 10314337 12376619 6866373 -1321084 -10655845 -22230700 -34992603 -46196468 -53267759
39908 -53267759 -52702396 -42238048 -26846274 -16050343 -11563171 -5317083 4871794 7169018
39900 7169018 -6864515 -24632445 -26463570 -13902963 -8229727 -18940692 -29343622
39893 -29343622 -20904092 690862 15086210 14837525 10374039 10343703 9899079 1273226
39885 1273226 -12655224 -19960996 -11299063 11308063 33870267 39700557 25478928 8181805
39877 8181805 8639641 26659859 40728745 35559419 20258507 12464564 14097734 14387113
39869 14387113 10506349 9959604 13071953 8609655 -7905829 -23903157 -26248545 -19372869
39861 -19372869 -17130291 -22081130 -23904697 -17312113 -11165683 -15808133 -27176314 -29588821
39853 -29588821 -14631028 6394767 13108126 -39187 -15944509 -16481031 -6899273 -7318696
39845 -7318696 -20838551 -26026580 -8539269 14574975 16960040 93326 -9907498
39838 -9907498 470092 16995154 22248755 17428698 12221892 8149212 3177667 1481193
39830 1481193 5503107 6098870 -5565921 -21021401 -23545312 -12316674 -3375598 -5612575
39822 -5612575 -9888135 -6222574 1255437 3891340 2263888 1088632 -1092025 -6570716
39814 -6570716 -9622076 -5019647 -445792 -6504686 -16788305 -13929695 2699535 12140664
39806 12140664 1477780 -15105361 -17902146 -9139123 -4100389 -5004719 -2389577 2399916
39798 2399916 -3276272 -19725315 -29665352 -22880442 -10565721 -6892004 -10057366 -12052310
39790 -12052310 -15086600 -24451772 -32742140 -26252738 -5241933 14034926 18162757 9482214
39782 9482214 113990 -845923 5420771 8830870 885010 -13707718 -20979121 -16332692
39774 -16332692 -10741334 -12379221 -12775254 -2260709 10492595 9769068 -2468785 -10159894
39766 -10159894 -8446040 -7788304 -13203975 -17352727 -16699601 -17165558 -19214510 -13865330
39758 -13865330 595878 13634269 20145464 26358711 30962714 19690539 -9064185
39751 -9064185 -31676638 -29218579 -14853544 -12102079 -18464050 -13454945 4977737 16700927
39743 16700927 10888003 -665112 -4317248 -231110 6515943 14091896 18276808 12717775
39735 12717775 -21628 -9228596 -11096929 -11325450 -10918448 -3708052 8245805 12071162
39727 12071162 3512664 -5031008 -3657451 1251743 1395828 1418127 7878561 14934996
39719 14934996 14382945 10757720 12214572 13684919 4581579 -11074893 -17819555 -10862204
39711 -10862204 -1081286 2327319 977435 -2593526 -10849211 -22567342 -28892734 -24604159
39703 -24604159 -16143944 -12502645 -13530555 -12819796 -8019949 -2652749 50477 36989
39695 36989 -2330840 -7674789 -14502378 -16842963 -8501279 8694860 23771149 28274741
39687 28274741 27721959 34493384 48513500 54206720 41488239 20632644 8005765 5082098
39679 5082098 2809433 144835 3527708 10921816 12737467 9573639 12407960 20757540
39671 20757540 17820140 -2969999 -21552730 -16046108 5772526 16410212 6042197
39664 6042197 -6331423 -433490 20332817 36990032 38671270 30606702 22705813 17772818
39656 17772818 12740232 8019440 10590988 24613903 41506169 46000463 33648970 16259593
39648 16259593 7177457 7673713 11763912 16201487 17949471 9194573 -13323909 -37315913
39640 -37315913 -45552644 -37469141 -29009695 -29643766 -31054108 -22687148 -7890718 2439203
39632 2439203 4729957 3534604 2184761 -254640 -5121819 -12467632 -21371667 -28472408
39624 -28472408 -28949878 -22290071 -14016731 -8678635 -4935455 -819765 1194804 -619747
39616 -619747 -1847846 1604205 5226135 1530114 -8414994 -16797424 -20581825 -22434037
39608 -22434037 -21066583 -11700251 1257511 3575383 -9451055 -22094426 -17159012 -288589
39600 -288589 7185180 -1900455 -11790807 -8763471 -1284150 -4768422 -15661835 -16471923
39592 -16471923 -4643193 711853 -12934403 -30645872 -29442504 -9818074 6964125
39585 6964125 9345601 6982779 10309078 15298731 16556206 21461014 37586247 54348599
39577 54348599 53281443 34826683 19943788 22006155 29636441 24136175 4883000 -11540129
39569 -11540129 -12802415 -2452932 8925546 16305048 21292604 25440400 27102051 24530454
39561 24530454 18920377 12734639 6597927 365049 -3443299 -1267356 5035556 7653375
39553 7653375 2427121 -4247897 -3088118 5670648 13393531 15454533 15523290 16603404
39545 16603404 15220910 8215709 -462399 -4794364 -4758628 -4188633 -2983661 3120854
39537 3120854 15319832 28266071 34282431 28976080 13770229 -4119317 -15051468
39530 -15051468 -14337849 -7424262 -4877710 -10505639 -16531955 -12927980 -373382 9419955
39522 9419955 7306270 -2492655 -8396791 -6324447 -3183718 -5018201 -8283586 -7096893
39514 -7096893 -3547479 -3725051 -6633854 -5298785 1770868 8306744 10355362 11048026
39506 11048026 13602143 16913572 20284858 24851251 27475526 21728028 9350981 2044956
39498 2044956 5659232 10912315 7513255 -462769 -2749656 800100 3401869 4852899
39490 4852899 8679327 10079127 2083143 -7486081 -2054470 17401115 27904772 13567969
39482 13567969 -13625127 -30647549 -30179753 -20849949 -10376303 -913253 4196319 1570294
39474 1570294 -5127750 -8085672 -5018633 268468 5092056 9211320 10945523 8642207
39466 8642207 4539317 1245022 -3177275 -9954694 -12726718 -5193634 5731896 4994441
39458 4994441 -10698292 -27523804 -32191454 -26294537 -18996716 -13927509 -9644711 -6494938
39450 -6494938 -5667700 -5744148 -6697709 -13056716 -25753679 -34744581 -29323928 -14673362
39442 -14673362 -7914405 -15581431 -24568012 -20541418 -7230396 809953 -391320 -330659
39434 -330659 8902357 21439001 26960144 23655612 16408576 7889028 -1119378 -6340511
39426 -6340511 -4473184 -2512234 -12149362 -31453033 -42093264 -32253062 -14468250 -9949579
39418 -9949579 -19621693 -23656173 -9732588 11559147 23800063 24930610 22006364 15774305
39410 15774305 2983341 -10649408 -13141235 -2716242 8529302 9601261 1348725
39403 1348725 -9317279 -17423758 -19255804 -12279104 -887701 4513663 -427267 -8539801
39395 -8539801 -12158377 -12138624 -9702915 1354157 22817488 39189457 32348230 8184440
39387 8184440 -6816087 1204000 17955469 24840170 24388334 30688843 44396411 51617167
39379 51617167 43938460 26771788 8410860 -7752955 -18354229 -17802816 -6333882
39372 -6333882 5581029 6513849 -3809077 -14275093 -13539549 -879935 13296631 18323443
39364 18323443 14678125 11458371 11949138 8412584 -4121255 -16311010 -16207804 -7792244
39356 -7792244 -5818908 -13454929 -17958708 -10623003 1747726 10266081 17047524 27090295
39348 27090295 36894131 40962963 42516385 47290168 51694304 47960081 38080412 31724336
39340 31724336 31310704 29972103 25377610 24800563 32203309 39067022 34723222 20381587
39332 20381587 5977987 -3573254 -11230821 -17578886 -16522845 -5918670 3737291 251135
39324 251135 -11632708 -12785974 4932393 25495853 29760346 21639241 19239264 24050326
39316 24050326 17868541 -5827850 -26518822 -24322083 -8459022 -2162197 -8749734 -11021683
39308 -11021683 -414040 11832330 14258712 10096079 7475098 6824565 4493660 632014
39300 632014 -2193695 -2473053 1554414 10795803 20209698 20931995 10462837 -4281933
39292 -4281933 -15630470 -21371767 -21893656 -18432109 -15543570 -17530378 -20375796 -15253407
39284 -15253407 -2335670 7785705 9604247 9783284 13791030 15667693 8995462 -337060
39276 -337060 -1978905 3734534 7670400 5344028 232396 -3947206 -7164664 -10761329
39268 -10761329 -16203983 -23847698 -29440627 -26464607 -16100238 -8672045 -9532154 -10555973
39260 -10555973 -3261613 6920743 9499686 5626939 3798969 3645028 -1882847 -10255826
39252 -10255826 -10477039 -1669085 3944900 239485 -4244539 -2396667 -127156 -3745654
39244 -3745654 -7190760 -2506589 5352062 5874875 -187278 -2747885 2158756 9933174
39236 9933174 18529816 30150534 40899426 40620645 27947490 16178282 16980002 24553269
39228 24553269 24111932 12314071 390035 -2157417 1931868 5582692 7855829 11346033
39220 11346033 14477727 13025040 7069271 769747 -3474673 -5560934 -4091796 1523511
39212 1523511 6335084 4549007 -555797 739249 10115038 17511082 15239219 7345491
39204 7345491 -170116 -9569522 -23643847 -35144202 -34848904 -26589005 -23568271 -30441085
39196 -30441085 -37771590 -34448213 -18840677 1570174 15439455 14591375 2917109 -4307062
39188 -4307062 2311752 13320702 14225356 7591874 7575522 14849797 14603517 2399399
39180 2399399 -6106678 420320 10620624 8461544 -2560367 -7018887 -736188 7789118
39172 7789118 13437427 17991725 20583314 17607126 11576967 9351429 11779329 14180565
39164 14180565 15712212 18508619 18968864 11125633 -1083490 -6524475 -3883115 -4401566
39156 -4401566 -13417039 -20179781 -13122385 3221179 14868976 16099531 11907391 6439909
39148 6439909 -1669931 -12051281 -18070827 -13220928 744758 15181452 24070113 30032915
39140 30032915 38541624 47079851 45660465 31527794 17416522 17089332 25888437 26298987
39132 26298987 12766478 -1104582 -3486657 220497 357214 -473783 4139690 8332516
39124 8332516 1814115 -10165317 -10992779 2536619 14828831 14573918 9038636 8622072
39116 8622072 9939165 4441073 -5392667 -9952234 -6956803 -1525218 4120571 11062261
39108 11062261 17019339 19129677 20814946 25916088 28456966 19625048 3827740 -4694424
39100 -4694424 -2169292 540609 -3432953 -7524497 -5780666 -3067260 -3922198 -3768109
39092 -3768109 -672075 -3914334 -18572436 -31535542 -27131810 -9358366 5853173 13576131
39084 13576131 18637133 17667146 3509639 -13248098 -9845739 15631821 37004175 35594925
39076 35594925 25107429 27363030 38623918 38656265 24223880 12912333 14702296 17817318
39068 17817318 7948167 -10891119 -22248129 -17540423 -3983320 5410448 5399240 1790355
39060 1790355 2601435 7575095 9065402 3768272 -703534 5361784 20642214 32587917
39052 32587917 30298025 15506126 996998 -1080527 9674955 22146067 25961038
39045 25961038 21715900 15965698 9487512 -1599807 -13555563 -14264021 570441 18471583
39037 18471583 24016268 16421690 7247719 4627963 5813452 3108618 -7214292 -20469546
39029 -20469546 -26473195 -20134619 -9066847 -4602466 -5728192 -1822558 7242094 7112729
39021 7112729 -8803097 -26392537 -29946472 -22502513 -15600805 -10430274 -4138747 -4853825
39013 -4853825 -21474624 -43355408 -48664411 -31651406 -5943662 16539606 32460559
39006 32460559 35253271 18063305 -7954176 -18725794 -8435574 1621443 -5754040
38999 -5754040 -19821469 -20848307 -9205549 -1336789 -5262894 -13315809 -14593386 -4705753
38991 -4705753 12892374 27526898 27655417 13359728 -1979049 -7792123 -7997015 -10975295
38983 -10975295 -15548005 -14997990 -8856634 -2031135 3179416 6604747 6858631 6311629
38975 6311629 13610411 31420882 46280314 42270269 23112054 9194623 11741741 20527696
38967 20527696 20620733 12171978 7019988 10631630 14938045 9446383 -5284577 -18382682
38959 -18382682 -21627091 -17854390 -14838410 -14829865 -15023432 -15777181 -20832634 -28662889 -31042002
38950 -31042002 -23530027 -11924243 -4718503 -3392389 -3409247 -1354653 1673668 1387487
38942 1387487 -5638920 -16123417 -19593067 -9462969 6435155 13868615 10343439 6189883
38934 6189883 6907939 5331448 -4972520 -18490393 -25213756 -21648762 -10744811 1179526
38926 1179526 5139478 -2805690 -11836194 -6201591 11587289 21010312 12173744 -1275807
38918 -1275807 -5632308 -6485199 -12578408 -16786168 -9675590 932868 1929602 -3530729
38910 -3530729 -3998601 -181641 662406 2306918 11927442 21672922 18302000 6248201
38902 6248201 524341 893041 -4984114 -15275524 -14336531 -86139 11539757 12129922
38894 12129922 9309476 6836315 -1130573 -10647429 -5942902 14532483 30970379 31103863
38886 31103863 26560208 29447971 32194582 24482893 13088196 9492619 11624765 12367218
38878 12367218 13571771 17695489 17834936 10401336 6042090 13268267 22342575 20581207
38870 20581207 12630708 9005142 5082989 -9281294 -27066681 -31438152 -21579504 -11801212
38862 -11801212 -7202637 639925 13751512 22086999 20583015 15897599 12804759 8649258
38854 8649258 4983212 9622152 21138382 25232832 14863709 2416557 2138924 9872494
38846 9872494 11799302 7315352 10105655 26772406 45604030 51086297 42779655 33382401
38838 33382401 30826424 29567431 21280372 8061434 -49319 2674869 13268023 25049195
38830 25049195 30593731 23130593 4537271 -9766395 -5968380 7287616 7162877 -10446819
38822 -10446819 -22203470 -10625108 9306302 11626550 -3910796 -14669830 -8499248
38815 -8499248 4386575 11540468 12845838 12220218 9397630 5398905 5528672 11211354
38807 11211354 16139841 14811395 9125701 3544400 -866492 -4553298 -5822448 -2212859
38799 -2212859 5675203 12394851 10342422 -2254361 -15635209 -17282993 -8749085 -5191631
38791 -5191631 -13725686 -22966727 -21953996 -17440396 -19739366 -22356587 -12889998 3165794
38783 3165794 8658958 979044 -7069204 -10189458 -14085184 -16734617 -8815497 3960497
38775 3960497 2390110 -14720273 -23365038 -10428598 4327216 -1506922 -19052084 -24313686
38767 -24313686 -14535358 -6298213 -5936521 -4770540 -727817 -2631225 -10657525 -11828529
38759 -11828529 -1492919 5973759 -2858594 -20402097 -28155653 -20751183 -9879365 -6382351
38751 -6382351 -7979477 -7417811 -5680639 -9821575 -19178901 -22188146 -11362166 4333718
38743 4333718 9230725 -27315 -13134270 -21635150 -25821868 -25980807 -18457700 -5128765
38735 -5128765 2886148 -1854604 -12495086 -16269192 -8945158 3695086 13995036 17580865
38727 17580865 14502681 8641260 2549579 -7174693 -22642853 -33720003 -26230509 -4095395
38719 -4095395 10201384 4178774 -8534903 -10102257 -3719101 -3935943 -12507338 -19917176
38711 -19917176 -23974356 -30003133 -35827734 -32535192 -19677569 -6338802 2318795 7267673
38703 7267673 6261214 -3686678 -14961428 -15250116 -6301710 -2653260 -9278263 -14899382
38695 -14899382 -11402756 -5329237 -3868028 -2886818 3133113 10882819 16403481 22891251
38687 22891251 31354533 33462896 23978290 11799118 7783381 9001044 6561820 2289939
38679 2289939 4196874 9862988 9007056 1497782 -1500448 3858422 7667552 2961122
38671 2961122 -2766306 307951 9579713 15432738 14710928 9822443 -731728 -19673450
38663 -19673450 -39064817 -42534384 -25192602 -4210389 -811484 -13686739 -19463701
38656 -19463701 -2544431 23310727 30795937 12772626 -9736716 -14554414 -3454548
38649 -3454548 5837746 4824971 782374 1074468 3069619 2516398 1928641 4283264 5390288
38640 5390288 738906 -3966476 1698115 16770774 26013559 16130612 -9202345 -32708737
38632 -32708737 -39322651 -27900275 -10315740 -219671 -916617 -4501409 -4192490 -3706601
38624 -3706601 -9111183 -15448222 -11883660 -185148 4289025 -5247722 -15699734 -13498824
38616 -13498824 -5058334 -5816036 -16196445 -22801042 -19880362 -14606209 -11332284 -5735774
38608 -5735774 2088964 2527743 -8966594 -22613056 -26878588 -22545491 -17706043 -15561591
38600 -15561591 -13965667 -11844677 -9666918 -6982882 -4061410 -2779961 -3023828 -2126481
38592 -2126481 306666 1976515 3248260 6358260 8498715 4292497 -3079763 -3163841
38584 -3163841 6416035 16521969 21609770 25335464 26184408 13552943 -11587599 -27446760
38576 -27446760 -17781423 4209566 14493513 10699925 8115791 11454526 11454769 6153797
38568 6153797 4823362 9736158 11877462 7350951 2778810 2229032 3127262 6698306
38560 6698306 17411789 29544207 29416072 14985094 -493282 -7943201 -12031708 -18004140
38552 -18004140 -23321879 -26410704 -29181080 -26816561 -11231007 9772610 14596507 -1900448
38544 -1900448 -17222027 -11914183 4076129 9293797 1072912 -7777586 -11326922 -12713866
38536 -12713866 -11962752 -7807911 -6002894 -11084481 -14945035 -7849373 3948355 6257798
38528 6257798 -1095674 -5236168 -860551 4820211 6998338 8908831 11561714 10548279
38520 10548279 5172799 429499 -1309026 -1506800 795409 6412415 8886388 1837249
38512 1837249 -7490522 -5164660 8598194 19176991 19265811 16038066 14129758 8133318
38504 8133318 -2098000 -5692319 42218 679076 -11751160 -20537175 -7421892 15949733
38496 15949733 20532459 439510 -19152187 -16456499 2317902 17852512 21591159
38489 21591159 16715295 8014627 1084157 2922838 13401121 22351503 23320135 22922740
38481 22922740 27141145 26815663 10897592 -11260223 -18078730 -5874534 6405938 5770902
38473 5770902 1074216 3029676 5257786 -2253148 -14085865 -18766617 -17504301 -18155148
38465 -18155148 -18510689 -12402431 -6168531 -10174784 -17254977 -9779515 11378890 24813799
38457 24813799 18956078 5921794 50754 765102 3388653 8831166 13447421 6443229
38449 6443229 -11693114 -23811188 -20382470 -13544524 -14846250 -15778570 -5520126 8463930
38441 8463930 15626748 22426346 35976528 42271440 26608026 4797276 4636722 22070346
38433 22070346 26851970 11062898 -445280 6624316 14547528 7990944 610410 8098094
38425 8098094 18196833 11144839 -6281602 -11971897 -4019710 -798997 -9341114 -16277518
38417 -16277518 -12184290 -5681796 -6847321 -10825558 -6638508 6681842 21245291 31947234
38409 31947234 38488149 38440826 27596669 9559898 -2492220 -134101 8159944 7674482
38401 7674482 -996469 -2105335 10603779 22113891 18009962 7030647 7407954 17513491
38393 17513491 17687474 625520 -16844189 -16418713 172129 17058152 21252351 10231027
38385 10231027 -7134156 -13687207 1389352 26892463 38717656 28761380 14032564
38378 14032564 12216202 19836226 22116821 14477903 5259891 3878186 13497009 29637015
38370 29637015 40682172 36144397 18910412 2479690 -6750327 -14798043 -24226088 -25736347
38362 -25736347 -13699578 999233 4104626 -3729801 -11129651 -11705667 -7113890 -1023727
38354 -1023727 1849217 -3001434 -12113616 -14076636 -4210982 7910632 12067971 10028394
38346 10028394 7694114 4626144 91561 -637999 3725132 4028361 -4576767 -11335602
38338 -11335602 -6238171 1680461 -2476632 -14880476 -17334064 -2401360 19452079 34545531
38330 34545531 36052373 23959159 6759113 -1672836 2081525 4790476 -2893170 -9944271
38322 -9944271 -3983549 4432442 -2885643 -20256014 -25802472 -16933994 -13067208 -21999722
38314 -21999722 -28128708 -19695254 -6255201 -1267860 -5237952 -13612422 -25145790 -35027132
38306 -35027132 -34485439 -24229504 -15093214 -10375541 -1703179 13057783 23317972 22889482
38298 22889482 18598750 16312196 13569291 10971775 13852076 16906798 6150921 -15873264
38290 -15873264 -26815953 -17091537 -5585511 -9259874 -17119627 -12254568 -2038320 -4645824
38282 -4645824 -18284926 -26408536 -25383183 -25471790 -28982263 -27213428 -17597226 -7510891
38274 -7510891 -1358727 3684762 10547526 20254352 32268139 38458219 26283882 -203821
38266 -203821 -14095595 2837181 32016413 40986075 26610555 13129381 12425067 12135008
38258 12135008 4330325 58101 7271651 15534457 14034883 9029641 11938874 21804397
38250 21804397 29630795 30898457 25442500 13297296 -1607098 -10718397 -10603935 -7472508
38242 -7472508 -6918062 -5694272 964364 9695506 12418577 6095190 -4230442 -9698039
38234 -9698039 -4740093 6505036 12915385 10635921 9895878 18625096 25176082 12543102
38226 12543102 -12560668 -23807632 -11729851 3182197 1871633 -7372133 -7391466 -521758
38218 -521758 -712485 -7746530 -8548297 592372 10822662 17962314 26263487 34173644
38210 34173644 32448085 20707176 11769811 12681893 13419306 3674923 -8817711 -8966015
38202 -8966015 2112433 8144435 2341772 -2670316 4810283 16664639 17213155 7650328
38194 7650328 4050694 11542843 15304370 3059278 -15892262 -24144435 -19718617 -13736903
38186 -13736903 -10228744 -2615512 10578912 20234763 20092044 15531224 15264136 22073668
38178 22073668 33878173 45477837 47101436 31035876 4115235 -14981117 -15975125
38171 -15975125 -7241911 -1741808 -1424702 -1497462 -1400395 -2853845 -3077415 1014201 5655534
38162 5655534 5282017 1666276 185025 -791894 -8371611 -22554201 -32093352 -25961762
38154 -25961762 -6363861 11545817 13201765 -1093072 -15895306 -17210507 -8597375
38147 -8597375 -6305892 -18718905 -36888515 -46837791 -44652705 -36686566 -30811173 -30503806
38139 -30503806 -32453238 -28233042 -14099263 785434 4525263 945223 5241608 18332177
38131 18332177 21366703 4204362 -16192573 -19044717 -8223238 -1292922 -1568770 -980625
38123 -980625 -2404879 -15059172 -29661889 -23316356 5704108 30205455 30221437 17632112
38115 17632112 12852180 14897903 11780649 7256038 15325169 32961505 39875217 28268112
38107 28268112 14921913 15873426 22974880 17742163 138303 -11186160 -5986170 4266452
38099 4266452 4750627 -2224031 -4056901 1941323 6498255 3962200 -1194107 -3857044
38091 -3857044 -4145502 -2202016 2947038 6914241 2821298 -5975892 -7655743 -1331266
38083 -1331266 -1270371 -13513924 -22583695 -14631864 -1211361 -2332949 -14419195 -15422907
38075 -15422907 1197635 17259265 15869347 86297 -16918573 -25924263 -23421871
38068 -23421871 -12744311 -5823024 -11300940 -19749954 -14178707 4272197 16947192 15581795
38060 15581795 11535527 12734793 10768926 -158938 -9149420 -5479792 4704761 10467986
38052 10467986 11913568 12016751 5430704 -10826868 -26099805 -29113205 -23172709 -16156319
38044 -16156319 -5848018 10821762 24161670 23344639 13525700 5731358 -1890452 -15347921
38036 -15347921 -25373048 -17454635 2710583 14567812 12303067 9083027 11547550 10910402
38028 10910402 3043894 -2386729 643770 5175402 6575952 11236382 21703986 27973791
38020 27973791 23245607 15297148 12020283 7746082 -4578858 -18022944 -21159451 -15367717
38012 -15367717 -10525884 -9259074 -7258116 -5021690 -7591406 -14380315 -19035075 -18491763
38004 -18491763 -14291909 -6751546 3678925 10231432 4026049 -13750147 -30429134 -34994167
37996 -34994167 -28500645 -20240452 -17346984 -19602089 -21782377 -19568010 -13788089 -8605077
37988 -8605077 -5507149 -1602526 4836039 10474016 11479998 9116875 6744312 3113615
37980 3113615 -6283981 -20556658 -30247781 -25978877 -9771182 4698466 5292247 -5526867
37972 -5526867 -14090129 -13237200 -11635833 -20172538 -33073094 -31893000 -9078871 21164872
37964 21164872 39097177 39481254 30766520 20601591 9393583 -4125804 -17350788
$$ [...]
##END NTUPLES=NMR SPECTRUM
##END=
