##TITLE=31Pdec_LR-729B-R2-1
 d6, 24 sc
 14.12.2020
##JCAMPDX= 6.0         $$ Bruker NMR JCAMP-DX V2.0
##DATA TYPE= NMR SPECTRUM
##DATA CLASS= NTUPLES
##ORIGIN= UXNMR, Bruker Analytische Messtechnik GmbH
##OWNER= root
$$ XWIN-NMR		Version 3.5
$$ Mon Dec 14 10:43:01 2020 Russian Standard Time (UT+4h)  she@DPX200
##.OBSERVE FREQUENCY= 81.013821
##.OBSERVE NUCLEUS= ^31P
##.ACQUISITION MODE= SIMULTANEOUS
##.ACQUISITION SCHEME= undefined
##.AVERAGES= 24
##.DIGITISER RES= 17
##SPECTROMETER/DATA SYSTEM= spect
##.PULSE SEQUENCE= zgpg30
##.SOLVENT NAME= D2O
##.SHIFT REFERENCE= (INTERNAL, D2O, 0, 182.463)
##AUDIT TRAIL= $$ (NUMBER, WHEN, WHO, WHERE, WHAT)
$$ ##TITLE= Audit trail, XWIN-NMR		Version 3.5
$$ ##JCAMPDX= 5.01
$$ ##ORIGIN= Bruker BioSpin GmbH
$$ ##OWNER= she
$$ F:/spectra/data/she/nmr/P31/1/pdata/1/auditp.txt
$$ ##AUDIT TRAIL=  $$ (NUMBER, WHEN, WHO, WHERE, WHAT)
(   1,<2020-12-14 10:39:50.07 +0400>,<she>,<DPX200>,
      <created by zg, POWCHK disabled, PULCHK disabled
       configuration hash MD5:
       00 E9 B6 7A A2 85 ED C7 34 08 36 98 17 FE 4E 26
       data hash MD5: 32K
       B5 89 36 12 0C 68 B5 B2 39 D7 D2 C6 3C E6 40 DC>)
(   2,<2020-12-14 10:42:05.37 +0400>,<she>,<DPX200>,
      <Start of raw data processing
       efp BC_mod = 2 LB = 1 FT_mod = 6 PKNL = 1 PHC0 = -2442.236 PHC1 = 22.4007 SI = 64K 
       data hash MD5: 64K
       13 22 77 FA C1 DF 81 13 BA 67 A6 13 C9 84 5B 02>)
(   3,<2020-12-14 10:42:22.56 +0400>,<she>,<DPX200>,
      <pk PHC0 = -6.291798 PHC1 = 0 
       data hash MD5: 64K
       93 6D 42 B5 B6 05 43 06 6A 4C 83 A7 5C 90 FE 09>)
(   4,<2020-12-14 10:42:25.81 +0400>,<she>,<DPX200>,
      <abs ABSG = 5 
       data hash MD5: 64K
       94 A3 32 1E EC C1 6C 7E 6E 31 5A 64 88 E1 6B DF>)
$$ ##END=
$$ 
$$ hash MD5
$$ BB C9 A0 AA 0B 0E 88 B0 35 3C 29 56 4D FC 4E 87
##$RELAX= 
##$RELAX= 
##$RELAX= 
##$RELAX= 
##$RELAX= 
##$RELAX= 
##$RELAX= 
##$RELAX= 
$$ Bruker specific parameters
$$ --------------------------
##$DU= <F:/spectra>
##$EXPNO= 1
##$NAME= <P31>
##$PROCNO= 1
##$TYPE= <nmr>
##$USER= <she>
##$AMP= (0..31)
100 100 100 100 100 100 100 100 100 100 100 100 100 100 100 100 100 100 
100 100 100 100 100 100 100 100 100 100 100 100 100 100 
##$AQSEQ= 0
##$AQ_mod= 1
##$AUNM= <au_zg>
##$AUTOPOS= <>
##$BF1= 81.014009
##$BF2= 200.13
##$BF3= 200.13
##$BF4= 200.13
##$BF5= 200.13
##$BF6= 200.13
##$BF7= 200.13
##$BF8= 200.13
##$BYTORDA= 1
##$CFDGTYP= 0
##$CFRGTYP= 5
##$CHEMSTR= <none>
##$CNST= (0..31)
1 1 145 1 1 1 1 1 1 1 1 1 1 1 1 1 1 1 1 1 1 1 1 1 1 1 1 1 1 1 1 1 
##$CPDPRG= <waltz16>
##$CPDPRG1= <>
##$CPDPRG2= <waltz16>
##$CPDPRG3= <>
##$CPDPRG4= <mlev>
##$CPDPRG5= <mlev>
##$CPDPRG6= <mlev>
##$CPDPRG7= <mlev>
##$CPDPRG8= <mlev>
##$CPDPRGB= <>
##$CPDPRGT= <>
##$D= (0..31)
0 1 0 0 0 0 0 0 0 0 0 0.03 2e-05 3e-06 0 0 0 0 0 0 0 0 0 0 0 0 0 0 0 0 
0 0 
##$DATE= 1607927989
##$DBL= (0..7)
120 120 120 11 120 120 24 19 
##$DBP= (0..7)
150 150 150 150 150 150 150 150 
##$DBP07= 0
##$DBPNAM0= <>
##$DBPNAM1= <>
##$DBPNAM2= <>
$$ [...]
##$SUBNAM3= <"">
##$SUBNAM4= <"">
##$SUBNAM5= <"">
##$SUBNAM6= <"">
##$SUBNAM7= <"">
##$SUBNAM8= <"">
##$SUBNAM9= <"">
##$SW= 369.568048894756
##$SWIBOX= (0..15)
0 1 3 0 0 0 0 0 0 0 0 0 0 0 0 0 
##$SW_h= 29940.119760479
##$TD= 32768
##$TD0= 1
##$TE= 0
##$TE2= 300
##$TE3= 300
##$TEG= 300
##$TL= (0..7)
0 120 53 12 22 120 120 120 
##$TP= (0..7)
150 150 150 150 150 150 150 150 
##$TP07= 0
##$TPNAME0= <>
##$TPNAME1= <>
##$TPNAME2= <>
##$TPNAME3= <>
##$TPNAME4= <>
##$TPNAME5= <>
##$TPNAME6= <>
##$TPNAME7= <>
##$TPOAL= (0..7)
0.5 0.5 0.5 0.5 0.5 0.5 0.5 0.5 
##$TPOFFS= (0..7)
0 0 0 0 0 0 0 0 
##$TUNHIN= 0
##$TUNHOUT= 0
##$TUNXOUT= 0
##$USERA1= <user>
##$USERA2= <user>
##$USERA3= <user>
##$USERA4= <user>
##$USERA5= <user>
##$V9= 5
##$VALIST= <valist>
##$VCLIST= <CCCCCCCCCCCCCCC>
##$VD= 0
##$VDLIST= <DDDDDDDDDDDDDDD>
##$VPLIST= <PPPPPPPPPPPPPPP>
##$VTLIST= <TTTTTTTTTTTTTTT>
##$WBST= 1024
##$WBSW= 4
##$XGAIN= (0..3)
0 0 0 0 
##$XL= 0
##$YL= 0
##$YMAX_a= 10820
##$YMIN_a= -13621
##$ZGOPTNS= <>
##$ZL1= 120
##$ZL2= 120
##$ZL3= 120
##$ZL4= 120
##$ABSF1= 182.463
##$ABSF2= -187.1042
##$ABSG= 5
##$ABSL= 3
##$ALPHA= 0
##$AQORDER= 0
##$ASSFAC= 0
##$ASSFACI= 0
##$ASSFACX= 0
##$ASSWID= 0
##$AUNMP= <proc_1d>
##$AZFE= 0.1
##$AZFW= 0.5
##$BCFW= 0
##$BC_mod= 2
##$BYTORDP= 0
##$COROFFS= 0
##$CY= -3
##$DATMOD= 1
##$DC= 0
##$DFILT= <>
##$DTYPP= 0
##$F1P= 0
##$F2P= 0
##$FCOR= 1
##$FTSIZE= 65536
##$FT_mod= 6
##$GAMMA= 0
##$GB= 0
##$INTBC= 1
##$INTSCL= 5.30512e-09
##$ISEN= 30
##$LB= 1
##$LEV0= 0
##$LPBIN= 0
##$MAXI= 10000
##$MC2= 0
##$MEAN= 0
##$ME_mod= 0
##$MI= 50
##$NCOEF= 0
##$NC_proc= -7
##$NLEV= 6
##$NOISF1= 182.463
##$NOISF2= 159.3651
##$NSP= 0
##$NTH_PI= 0
##$NZP= 0
##$OFFSET= 182.463
##$PC= 4
##$PHC0= -2448.528
##$PHC1= 22.4007
##$PH_mod= 1
##$PKNL= yes
##$PPARMOD= 0
##$PSCAL= 0
##$PSIGN= 0
##$REVERSE= no
##$SF= 81.014009
##$SI= 65536
##$SIGF1= 159.3651
##$SIGF2= -187.1042
##$SINO= 113.3802
##$SIOLD= 16384
##$SREGLST= <1H.CDCl3>
##$SSB= 0
##$STSI= 65536
##$STSR= 0
##$SW_p= 29940.119760479
##$SYMM= 0
##$S_DEV= 0
##$TDeff= 32768
##$TDoff= 0
##$TI= <>
##$TILT= no
##$TM1= 0
##$TM2= 0
##$TOPLEV= 0
##$USERP1= <user>
##$USERP2= <user>
##$USERP3= <user>
##$USERP4= <user>
##$USERP5= <user>
##$WDW= 1
##$XDIM= 65536
##$YMAX_p= 319357769
##$YMIN_p= -20980855
$$ End of Bruker specific parameters
$$ ---------------------------------
##NTUPLES= NMR SPECTRUM
##VAR_NAME=  FREQUENCY,     SPECTRUM/REAL,   SPECTRUM/IMAG
##SYMBOL=    X,             R,               I
##VAR_TYPE=  INDEPENDENT,   DEPENDENT,       DEPENDENT
##VAR_FORM=  AFFN,          ASDF,            ASDF
##VAR_DIM=   65536,         65536,           65536
##UNITS=     HZ,            ARBITRARY UNITS, ARBITRARY UNITS
##FACTOR=    0.456856943014862, 1,           1
##FIRST=     14782.0589164895, 0,            0
##LAST=      -15158.0608439895, 0,           0
##MIN=       -15158.0608439895, -20980855,   0
##MAX=       14782.0589164895, 319357769,    0
$$ Real data points
##PAGE= N=1
##DATA TABLE= (X++(R..R)), XYDATA
$$ [...]
46263 -1277396 -418350 1687131 2816819 2291925 2038716 3826585 5963601 4938256 614117
46254 614117 -2785521 -2175089 291390 783375 -465045 -12725 3099079 5909782 6145133
46245 6145133 5253998 5570099 6697275 6528249 4565655 2411118 1412457 1296715 1249492
46236 1249492 1337958 2258515 3866382 4596739 3091163 452499 -206886 2634141 6528549
46227 6528549 7608196 5186421 2425418 2445554 5204065 8498252 10599872 11155467 10601837
46218 10601837 9724930 9298637 9375365 9122001 7761887 5473027 3161041 1631955 1086441
46209 1086441 1065279 795566 -75360 -1045082 -1328931 -767100 151601 954026 1483845 1824349
46199 1824349 2343368 3402848 4490640 4182792 1764877 -1533400 -3780518 -4477367 -4647303
46190 -4647303 -5214991 -6122477 -6539545 -5133530 -1014275 4370813 7350205 5929065 2847114
46181 2847114 2478264 5072080 6719885 5159305 2617331 1874834 2383808 2281257 2127418
46172 2127418 4056891 8092829 11474101 11520101 7940273 2766129 -920694 -919177 1977334
46163 1977334 4116196 2563143 -1498885 -4006990 -2668816 573979 1959799 109948
46155 109948 -2605998 -2766595 339250 4022760 5376551 4392697 3110978 2467729 1697286
46146 1697286 718300 944175 2808174 4232881 3088403 256074 -1144287 800621
46138 800621 5011891 8669310 9552246 7508944 4161384 1110324 -1283113 -2838933
46130 -2838933 -2338040 774451 4070187 4240467 1686113 -61375 -154263 -1857861 -6378878
46121 -6378878 -9496459 -7913556 -5328831 -7096060 -11229628 -10883308 -5097652 -475595
46113 -475595 -918043 -2040470 1051901 5793800 6669152 4018044 2828920 4451088 4976840
46104 4976840 1945285 -2045473 -3678831 -3245048 -2812965 -2771631 -2336102 -1763204 -1931499
46095 -1931499 -2566753 -2554677 -1587023 -363049 354015 -18065 -1848594 -4451745 -6032417
46086 -6032417 -5750452 -5167767 -6116421 -7676074 -7210686 -4321445 -1609785 -1002015 -1423177
46077 -1423177 -1131496 -381233 -266859 -648132 -1097185 -2404500 -4837919 -6109909 -3936279
46068 -3936279 -65152 1394691 -160095 -901956 1488099 4148031 3340192 -67612
46060 -67612 -2135293 -1380117 44421 129361 -612193 -774565 -129215 523307 393137 -830324
46050 -830324 -2781338 -4489766 -5156374 -4781952 -3688837 -1942143 177354 1806170 2462697
46041 2462697 2810813 3573912 4296986 4219028 3788068 4040041 4746412 4373742 1884869
46032 1884869 -2168887 -6037860 -7566168 -5349032 -334646 4175271 5395145 3710678
46024 3710678 1530062 175413 -668627 -1064199 -390860 1106984 2122558 2042366 1455552
46015 1455552 578160 -1283793 -4034361 -5899136 -5229506 -2469504 376751 1708437
46007 1708437 1312317 -75949 -1718206 -3520659 -5687652 -7583175 -7664511 -5442781 -2898437
45998 -2898437 -2593546 -4595670 -6632517 -7123771 -6420883 -4921285 -1898315 2803696 7228249
45989 7228249 8723001 6493100 2188762 -1586952 -3086272 -2391824 -965122 110731
45981 110731 1298917 3435107 5842815 6807781 5820296 4106156 2904589 2444504 2603248
45972 2603248 3162601 3319355 2463046 1616953 2446167 4544549 5575431 4646611 3497810
45963 3497810 3411262 3110349 1285039 -715703 -849833 292941 550824 -94197 566725
45954 566725 3078852 4612148 2341533 -2718500 -6702145 -7389600 -6368407 -6235719 -6881852
45945 -6881852 -6209451 -4181307 -3572157 -5450039 -6471758 -3489913 938853 1605927 -1421823
45936 -1421823 -2612928 475034 3401815 2099083 -593262 279314 3797382 5105597
45928 5105597 3609732 3746641 7509000 11143902 10731521 7294053 4429480 3556159 3425856
45919 3425856 2500160 259006 -2458486 -3465766 -1169171 2742104 4486532 3042998
45911 3042998 1633655 2946227 5207928 5291299 3839063 4249959 7396434 10471288 11189170
45902 11189170 10313014 9278605 7887331 5828076 4479167 5143082 6601490 6495302
45894 6495302 4620716 2848662 1929825 624410 -1403976 -2030437 471755 4511881
45886 4511881 6994079 7142359 6540948 5963361 4568422 2415431 1302530 2029121 2765249
45877 2765249 1627842 -533823 -1544202 -1066111 -621217 -997272 -1299598 -511529 1259053
45868 1259053 3094266 3915720 3045006 1020913 -499221 -660421 -782699 -2530794 -5035451
45859 -5035451 -5469131 -2755931 706403 1642608 -737163 -4438379 -6800524 -6305110 -3131349
45850 -3131349 1075678 4127489 4697672 3173597 1217836 531804 1772210 4214198
45842 4214198 6387864 7283407 6977813 6020802 4463676 1836889 -1913910 -5628133 -7236076
45833 -7236076 -5399682 -1397084 1162161 -265591 -4072572 -6189167 -5042665 -3110234
45825 -3110234 -2949672 -3838525 -3879958 -3468479 -4256716 -5931597 -6765714 -6779220 -7443105 -8178818
45815 -8178818 -6169450 -703818 4680619 5911414 2693906 -2093513 -5800961 -7385248
45807 -7385248 -6702366 -4298909 -1498416 727199 2821738 5529240 7987819 8216917
45799 8216917 5732780 2606283 1233232 1595781 1542532 -291394 -2683296 -3399690 -1975451
45790 -1975451 -55337 854769 989022 1497039 2906818 4715466 5740221 4738655 1709938
45781 1709938 -1259210 -1820918 -422242 80920 -1558769 -3388749 -3771482 -4114605 -6064082
45772 -6064082 -8068957 -7540236 -5086739 -3654677 -4222618 -5136600 -5151929 -4410868 -2904992
45763 -2904992 -766298 328347 -1066111 -3323467 -3626838 -2226267 -1520277 -1411766 318912
45754 318912 2902971 2454993 -1858824 -5792974 -5922439 -3786791 -2325595 -1912311 -2001824
45745 -2001824 -3091125 -4751358 -5132141 -4522397 -5594879 -7919322 -6895937 -1376289
45737 -1376289 2612004 322798 -4077285 -3985997 -524381 518355 -1122376 -885349 1127567
45728 1127567 -288973 -5768249 -9085990 -6794712 -3473570 -4308495 -8061596 -10880602
45720 -10880602 -12211316 -12963929 -11788130 -7528167 -2694302 -539768 -582275 -341431 296121
45711 296121 -239413 -1603760 -1987751 -1490549 -2120175 -4442652 -6319768 -5256392 -1070703
45702 -1070703 3484369 4510974 621927 -4876914 -7289818 -6371458 -6236134 -8651033
45694 -8651033 -10011200 -7233155 -3158023 -2411431 -4351657 -4522757 -1935715 -424357
45686 -424357 -2615401 -6341976 -7952118 -6345604 -2776894 1061306 3760677 4719517
45678 4719517 4754852 5022627 5167608 3924746 1560990 107205 913236 3280671 5541996
45669 5541996 6236241 4519618 990869 -2134951 -3334736 -3926338 -6062392 -9072803
45661 -9072803 -10258230 -9190150 -8335820 -8891448 -8985955 -7246579 -5339977 -5103973 -5514037
45652 -5514037 -4778893 -3568453 -3545283 -4012677 -2928253 -715625 -147666 -2063108 -3690749
45643 -3690749 -2344543 908351 2666598 1447005 -725723 -814976 1949620 5432068
45635 5432068 6836302 5330177 2437666 100027 -1134468 -1770604 -1812437 -493332 2141363
45626 2141363 4057230 2680375 -1998329 -6384780 -6468832 -2237108 2200038 3502879
45618 3502879 2879830 3652147 6156645 7369097 5479875 2323849 380879 -445880 -1493911
45609 -1493911 -2428827 -1681809 947117 3829808 5332372 4959475 3305658 2001341 2814758
45600 2814758 5360641 6625486 4538188 1085973 -371149 -107367 -1392466 -4939305
45592 -4939305 -7389657 -6318690 -3559321 -1828472 -960675 142214 452513 -1127050
45584 -1127050 -2603601 -1461544 813470 751390 -1146739 -958576 1753496 2489649 -843155
45575 -843155 -3841048 -2308754 838321 168283 -3401326 -4226823 -1642476 -1621739 -7165540
45566 -7165540 -12802370 -12275151 -7486523 -5072326 -6658506 -7883544 -6322072 -4892302
45558 -4892302 -6143034 -7783279 -6638737 -3846603 -2648886 -2802466 -916448 3929524
45550 3929524 8240624 8659837 5986597 3212278 1332622 -929251 -4044153 -6387368
45542 -6387368 -6321602 -4207286 -1723633 -58885 548153 149135 -1047458 -2308142 -2758640
45533 -2758640 -2310306 -1564167 -682189 788818 2557980 3074871 1470581 -566464 -361183
45524 -361183 2141887 3743472 1751721 -2498080 -4868520 -2860127 1879588 5375463
45516 5375463 5236696 2869941 1934174 4312849 7800312 8665256 6431300 4479085 5221643
45507 5221643 6690090 5783413 3278293 2644351 4414950 5161922 2879963 272328 809893
45498 809893 3826550 5824134 5051912 2416929 -902394 -4059854 -5486304 -4189701
45490 -4189701 -2203118 -2914356 -6163416 -7503637 -3767784 2515776 5977174 4429365
45482 4429365 344707 -2819175 -3856187 -3483201 -2544890 -1421802 -516754 -351190 -895426
45473 -895426 -1236441 -629787 30037 -1203188 -4517223 -7133281 -6371818 -3299555 -1455597
45464 -1455597 -2191365 -3505512 -3778740 -4134113 -5944972 -8182716 -8851335 -7406746 -4306501
45455 -4306501 31080 4108181 5173019 2542968 -516346 -941386 -497902 -3043401
45447 -3043401 -8136421 -11199208 -10070733 -7561203 -6590375 -6368222 -5087794 -3350037
45439 -3350037 -2595934 -2304264 -1108137 772459 2295312 3619685 5414846 6976874
45431 6976874 6758995 4316401 644385 -2694338 -4086258 -2902277 -993556 -1437434
45423 -1437434 -4408747 -6163900 -3957481 23194 2125496 2717052 4702686 7635051
45415 7635051 7539363 3158900 -1342152 -1527918 2104152 5849429 7707864 8531211 9417312
45406 9417312 9965523 9152457 6996146 5003002 4666793 5279173 4246690 763750 -2072002
45397 -2072002 -1082966 1946283 2302666 -631787 -2315657 -166282 2410755 1720246 -264013
45388 -264013 323187 2249461 1161317 -2526204 -3334149 816495 4956256 4354790 1428572
45379 1428572 1765607 5848722 8962460 8421120 6716768 6774021 7523623 6183361 2811542
45370 2811542 79693 -740039 -1217198 -2891974 -4771817 -4704288 -2225234 1113704 3778345
45361 3778345 5470758 6377990 6248620 4609631 1417314 -2613152 -5890855 -6445598 -3602324
45352 -3602324 649256 3011563 2069435 -738592 -3596322 -6348605 -9200489 -10896013
45344 -10896013 -10011500 -7408718 -5525907 -5283083 -5347630 -4670109 -4060255 -4448974 -4854697
45335 -4854697 -3346081 313448 3971653 5372030 4820386 4921380 7064464 8718717
45327 8718717 5993247 -522772 -4661101 -1541385 5876825 10017075 7953016 4158560
45319 4158560 3590172 5599059 6523162 5314793 3698023 2538610 1246944 203110
45311 203110 964321 3778540 6840059 8400760 8292544 7245665 5890349 4531681 3058524
45302 3058524 1271357 -104291 319011 2214479 2744369 90222 -3283595 -3498391 -847366
45293 -847366 594644 -816465 -1913326 -30607 2347072 963222 -3890634 -7443886
45285 -7443886 -6570243 -3412975 -2225136 -4113451 -6145260 -5402823 -2787596 -1736696
45277 -1736696 -3329731 -4515294 -2533938 599771 753263 -1981286 -3175626 -791398
45269 -791398 1806675 1447750 296235 2189187 6161521 7455121 4096737 -976203
45261 -976203 -4198863 -4786445 -3656946 -1717667 13743 672167 734044 1436330 2621499
45252 2621499 2702564 1089697 -911466 -1977377 -2068389 -1586817 -785457 -369176 -1159249
45243 -1159249 -2704865 -3561372 -3196285 -2208433 -646844 1970934 4669687 5292851 3675777
45234 3675777 2418936 3083963 3451240 516565 -4855167 -8314881 -6960233 -2536809
45226 -2536809 531841 -299161 -3354119 -4999425 -4121400 -3349687 -5053560 -7585389 -7602664
45217 -7602664 -5114983 -3216900 -3031778 -2460879 -636932 171192 -1185852 -2157109 -707912
45208 -707912 1032935 462767 -924428 -350713 1195291 1067978 420812 2428869 5531288
45199 5531288 3938641 -3824292 -11552086 -12833639 -8335127 -3091037 392929 3077639
45191 3077639 5469928 6492430 5975871 5409286 5625613 5533128 3851272 998323 -1469111
45182 -1469111 -2748612 -3453716 -4386862 -5140045 -4480975 -2187572 184582 840155 -481089
45173 -481089 -2731194 -4793191 -5786475 -5101396 -3332794 -2409395 -3398080 -4838534 -4760163
45164 -4760163 -3596663 -3208138 -3650980 -3249976 -1640960 -221356 556310 1690441 2929911
45155 2929911 2367782 -130580 -1681666 -242535 2346116 2996166 1403525 -381239
45147 -381239 -1073057 -1022122 -927498 -1266695 -2264156 -3244755 -2938268 -1449486 -697263 -1705332
45137 -1705332 -2805104 -1953294 471029 2724901 4183857 4917948 4083371 1112485 -2099583
45128 -2099583 -2522457 416392 4183400 6059672 5431513 3428760 1561055 560066
45120 560066 -291671 -2177939 -4484104 -4806821 -2394555 -59312 -882610 -4318438 -7514474
45111 -7514474 -9083531 -9139525 -7013680 -2260162 2572805 3612377 554300 -2747132
45103 -2747132 -2894180 238461 5197814 10474568 13950585 13882660 11341852 9103626 7566223
45094 7566223 4739612 896157 -523809 1675662 3745732 2305534 -583748 -674507
45086 -674507 2398656 5430056 6299354 5210754 2598169 -1066848 -4114864 -5099004 -4880090
45077 -4880090 -5024330 -4969099 -3178195 -142459 2443384 4560110 6952782 8226556 6412754
45068 6412754 3113666 2188710 3860744 4042996 715509 -2844034 -3262278 -2172324 -3175427
45059 -3175427 -5943075 -6632658 -3365779 1324666 3482896 1605597 -2351800 -4918598
45051 -4918598 -4414250 -2709352 -2797791 -4516206 -4532600 -1265172 2507285 3486653 2187459
45042 2187459 1355929 1873885 2722037 3630707 5027138 6222428 6310985 6211525 7183517
45033 7183517 7973786 6373478 3190433 1427894 1573267 1286898 247774 1304586 5237097
45024 5237097 8174270 6876553 3609475 2625126 4049875 4737547 3648998 2591894
45016 2591894 2179101 778628 -2080081 -4441001 -5131897 -5758035 -8135241 -11544089 -13885095
45007 -13885095 -14220322 -12941720 -10552410 -7606102 -5129161 -3866460 -3430516 -3029046
44999 -3029046 -2596702 -2362619 -1817463 -367988 1014768 219613 -3141867 -6271911 -5974911
44990 -5974911 -2704559 -241616 -811274 -2240161 -1498768 395498 -280079 -4131081 -7495287
44981 -7495287 -8032722 -8062241 -9957208 -11115677 -7384561 -201388 3941954 1606373 -3458390
44972 -3458390 -5420285 -2928874 787307 2209412 393615 -2828136 -4156204 -1638081
44964 -1638081 2817199 5141258 4095190 2616755 3037261 3382920 745722 -3602590
44956 -3602590 -5679536 -4606889 -3632156 -5004309 -6807366 -6178325 -3472575 -1434159
44948 -1434159 -1505785 -2768478 -3915651 -4533041 -4487787 -3724418 -3223667 -4661933 -7783608
44939 -7783608 -9051904 -4947817 3202840 9676956 10691373 8639302 8264298 9935642
44931 9935642 9467391 4594441 -1196985 -2709036 771907 4980619 5666148 2683562
44923 2683562 -840454 -2407557 -2482670 -2768634 -2944680 -896406 3214482 5381905 2482611
44914 2482611 -3056612 -6398779 -7081066 -8812618 -12693645 -15208498 -14235981 -12628675
44906 -12628675 -13314124 -14559785 -13262913 -9920972 -6844624 -3920285 30443 3488289
44898 3488289 3741406 1094123 -1833291 -3990541 -5836106 -6584359 -5112244 -2743241
44890 -2743241 -1536461 -637405 1898759 4585146 4310018 2298792 3241594 7808781 11008184
44881 11008184 9586192 6489541 5665484 6448347 5996850 4095975 2430227 1440063 811661
44872 811661 1322648 3561430 6039250 6655951 5059645 2257067 -669049 -2387380 -1832040
44863 -1832040 -151545 10029 -1491185 -1586517 943060 2528786 -355079 -5679794 -8282905
44854 -8282905 -6309637 -2383946 367857 612182 -1808022 -5789169 -8675399 -8499831
44846 -8499831 -6202781 -3771264 -1193038 2386201 5500978 5367828 1899774 -1917797
44838 -1917797 -3839518 -4298075 -4323763 -3690727 -1780593 1137742 3923632 5058494 3559015
44829 3559015 518455 -1001477 857293 4272653 5901191 4744065 2307292 23267
44821 23267 -1362595 -836542 1767934 4123422 3595559 1060553 -66138 1212784 2184161
44812 2184161 705339 -1788028 -2715593 -1804151 -788860 -985162 -2188642 -3099488 -2345029
44803 -2345029 35159 2076918 2008837 674225 298251 1115190 1331344 532785 597559
44794 597559 2337818 3614893 2396827 -43964 -849431 544721 2030087 1882467 672650
44785 672650 28860 495282 1013063 207276 -2061542 -4495896 -5626798 -4993138 -3139351
44776 -3139351 -1156507 -384467 -1506061 -3360598 -3731888 -1985897 355584 2328195
44768 2328195 4769439 7432976 7348949 2846326 -2646287 -4290550 -2198379 -397656
44760 -397656 -241110 749575 3295390 4367538 2350709 65721 219528 1140861 -78268
44751 -78268 -2617109 -3173675 -859346 1729217 1778999 -982568 -4184293 -4576445 -952751
44742 -952751 4033678 6302521 4933594 2466204 515411 -1904094 -4704545 -4889526
44734 -4889526 -754186 4769486 7628863 7445423 6368377 5293091 3950058 2833454
44726 2833454 2186564 851249 -1000401 -86509 5375013 11018437 10710138 4847771 -147841
44717 -147841 -592646 663557 -82468 -2309343 -3679711 -3876260 -3556146 -2124485 775356
44708 775356 3207354 2821382 -58032 -2975126 -4222454 -3706615 -1706572 1554218 5173147
44699 5173147 7577472 7559412 5035429 1074095 -2513037 -4074533 -3229798 -1174311 186344
44690 186344 -468580 -2879783 -5101249 -5018267 -2716603 -767553 -1215640 -2839754 -2595938
44681 -2595938 618380 4912770 7746145 7856484 5094406 139223 -5157207 -8457219
44673 -8457219 -8602483 -6093559 -2246039 1148343 2015432 -302017 -3632544 -5072994
44665 -5072994 -4502486 -4061923 -4169509 -2705337 1026712 4210103 4095808 1673071 -59079
44656 -59079 225699 2115228 5245417 8551343 9095074 4937513 -1044165 -3391357 -747794
44647 -747794 2467006 2152004 -385996 -1340733 -171261 412760 -780479 -1795708 -999593
44638 -999593 421730 587283 -317688 -904352 -974877 -1424086 -2399973 -3099460 -3186862 -3174508
44628 -3174508 -3461023 -3926968 -4242093 -3752661 -1755131 889998 1374849 -1762629 -5563204
44619 -5563204 -5619261 -2277235 -738203 -3837141 -7860838 -7798618 -4158450 -1411321 -1258962
44610 -1258962 -1094411 1063773 3405268 2998576 -562019 -5234473 -8836673 -10328626
44602 -10328626 -9663550 -7278414 -3818553 -384339 1295468 154494 -2286034 -2743877
44594 -2743877 27267 3624947 5332305 5367400 5172883 4435109 2376967 495988 900200
44585 900200 2765915 3525544 2904427 2534513 2173051 117436 -2704706 -3225504 -1394542
44576 -1394542 -543073 -1380210 -185021 4674278 8700349 7274042 2462775 -213329
44568 -213329 409930 860362 -569482 -1425336 579830 4053384 5720719 3942089 -84522
44559 -84522 -3497846 -4152254 -2602908 -1159718 -487624 1164346 4147435 5185451 1631079
44550 1631079 -3733692 -5573005 -2955659 115674 1109477 2039956 4851079 7124601
44542 7124601 5084436 -792701 -5867826 -6797003 -4967444 -4000571 -5046358 -5748541 -3923580
44533 -3923580 -1050347 -662989 -3521204 -6432047 -6755945 -5993965 -6921958 -8763197 -8075469
44524 -8075469 -3931504 684220 2941846 3028363 2254706 828735 -1102874 -2190885 -1480991
44515 -1480991 -111334 186354 -488072 -631164 470144 2303646 4383101 6496423 7831707
44506 7831707 7264082 4942462 2670219 2125221 3175581 4417472 4999943 5298321 5863672
44497 5863672 6429796 6363727 5609224 4546899 3237888 1648468 415216 150186 -201288
44488 -201288 -2761744 -7537350 -11110779 -9966107 -4451636 1803475 5639507 6087764
44480 6087764 3352830 -1443788 -5420312 -5338599 -1072645 3733304 5427764 3622606
44472 3622606 81883 -3951586 -7875995 -10483573 -10611218 -8710702 -6156005 -3156710
44464 -3156710 960615 5239316 6777723 4047382 -705961 -3807480 -4239133 -3853765
44456 -3853765 -3820454 -2841386 339798 4313143 6482635 6413350 6038407 6696625 7533461
44447 7533461 7130819 5407824 3373386 1963044 1546237 1701811 1212934 -673408 -2723074
44438 -2723074 -2723906 -441016 1864312 2488766 2280504 2703680 3668640 4631661 6109281
44429 6109281 8216243 9165380 7523478 4943533 4176760 5008312 4815156 2970998 1895910
44420 1895910 3157972 4957428 4605114 1864809 -1163492 -2345350 -1092275 1309682
44412 1309682 2605468 1803423 494506 745832 2011629 1948418 181330 -1027241 -330432
44403 -330432 789547 653314 -98658 70170 1255798 2486017 3071424 2446323 60224
44394 60224 -3307745 -5393871 -4940213 -3294318 -2357905 -2078895 -1272831 150517 1268569
44385 1268569 1669160 1464888 314604 -2277878 -5875302 -9075842 -10332964 -8689613
44377 -8689613 -4647586 -520857 1400594 1376344 1379956 1655768 599458 -1295660 -780675
44368 -780675 2769860 4625237 831457 -5318873 -7193657 -3856149 -626685 -949563
44360 -949563 -2423098 -1851758 64486 1079981 1100722 1128973 887377 -184590 -1265471
44351 -1265471 -1456172 -1279078 -1157048 31185 2957842 5837977 6578359 5846464 5717470
44342 5717470 6053932 4789301 1694772 -653722 -332196 1475456 2492166 2286209 1794612
44333 1794612 883322 -1694536 -5579985 -7609258 -4906831 974632 4638866 2556680
44325 2556680 -2878431 -6480733 -6697841 -6691759 -8905243 -11204555 -10038887 -5685621 -2141646
44316 -2141646 -2338368 -5207345 -7405633 -6701577 -3667508 -886099 -371511 -1314900 -983109
44307 -983109 1731323 4868194 6300603 6390698 6214659 5029735 2132931 -208292 744934
44298 744934 3241949 2586473 -1727087 -4472684 -2036335 2388969 3637339 1533554
44290 1533554 -356153 -589010 -472519 -158641 1662271 4344792 5420399 4647809 4508965
44281 4508965 5832495 6242491 4372767 2572685 3345149 5465388 5971622 4267694 1913306
44272 1913306 -279856 -2413467 -3587969 -2455362 217839 1594136 -7975 -3033225
44264 -3033225 -4170699 -1331307 4553987 9877973 10911431 7157245 2165424 242144
44256 242144 2425351 6197756 8614249 8803197 7736965 6575155 5432001 3512710
44248 3512710 647639 -1551832 -1233804 827437 1629947 34820 -1472498 -593873 1210835
44239 1210835 1300013 346113 1137330 3730199 5275866 4750359 4383639 5436425 5755390
44230 5755390 3325634 -247198 -2078430 -2121004 -2434565 -3185723 -2016102 2114154 6323302
44221 6323302 6497973 2208963 -2385488 -3232491 -1051153 217494 -816716 -1316962 882070
44212 882070 3594726 3743304 2078489 1305018 1315905 55728 -2060246 -2756574 -2271125
44203 -2271125 -2641004 -2905737 -152574 4137563 4428221 -510310 -5133232 -5474191 -4258441
44194 -4258441 -4207206 -2252997 4104252 9686364 7944965 1375959 -1654708 1002626
44186 1002626 3528365 2121341 -378772 -967223 -1091640 -2413995 -3172721 -1686726 396198
44177 396198 1005122 669025 427595 -343546 -1885952 -2508557 -1190728 498107 773243
44168 773243 -255675 -2105881 -4906053 -7480426 -7418505 -4825927 -3015576 -3508521 -3675689
44159 -3675689 -1923431 -1592840 -5733869 -10804368 -10526648 -4790284 116311 47491 -2666443
44150 -2666443 -4183752 -4412117 -5414269 -7371205 -8489054 -7679481 -5659071 -3859402
44142 -3859402 -3003309 -2371091 -456709 2900918 5445416 4998312 2793344 2301607 4336966
44133 4336966 5589725 3355449 -193572 -628625 2798243 6197860 5981543 2602048
44125 2602048 -1191071 -3789851 -5102370 -5118026 -4130715 -3605856 -4645598 -5790415 -4559252
44116 -4559252 -1313613 896451 956790 1278993 3263305 4204488 1510335 -2411113 -3160788
44107 -3160788 -759130 1004627 895926 1474052 3765237 5160110 3875488 1519746
44099 1519746 -451525 -2964532 -5851606 -6054813 -2467031 726721 -568358 -4041853
44091 -4041853 -4259359 -693158 1946139 817525 -1931242 -3550479 -4338439 -5674497
44083 -5674497 -7424974 -8909003 -10253845 -11199629 -10254090 -6754641 -2710146 -885224
44075 -885224 -1406360 -1731453 -235290 1379869 303401 -3235378 -5737359 -5085061 -3684868
44066 -3684868 -4991186 -8117813 -8884906 -5973868 -2636836 -1638765 -2021839 -2240087 -2822603
44057 -2822603 -3743188 -2815265 221396 1430012 -1612306 -4838714 -3176947 1287277
44049 1287277 2125848 -1680939 -4668069 -3548344 -1171580 -646518 -723811 858987 3646387
44040 3646387 6352865 8989638 11000819 10512910 7615019 5480724 6107322 7619410
44032 7619410 7732587 7025744 6590375 5321893 2241366 -857981 -1773199 -906677 429110
44023 429110 2460936 5124588 6198572 4494444 2901635 4596399 7635552 7208659
44015 7208659 2543718 -2308542 -4486433 -5316201 -6633053 -7570928 -6607466 -4393305 -2761744
44006 -2761744 -2303085 -2258783 -1866178 -797829 989058 2950807 3901698 2919853 318836
43997 318836 -2372995 -3372948 -1900263 1149971 3878374 4837386 3714299 1067269 -1709680
43988 -1709680 -2593826 -768354 1579230 1134199 -2263146 -5084109 -4741112 -2732691 -1812295
43979 -1812295 -1988672 -1301933 781559 2707666 2727118 88796 -4543195 -8672471 -9470677
43970 -9470677 -7026353 -4412585 -3274757 -1752510 1431584 3855927 3351703 2204185
43962 2204185 3381909 4854414 2537431 -2458854 -4846374 -3074724 -877464 -494261
43954 -494261 135661 1950257 1970144 -1232989 -3747842 -1697511 2693552 4101922 1114366
43945 1114366 -3135152 -5921624 -7339391 -8326074 -8871392 -8424351 -6811517 -4700517 -3322438
43936 -3322438 -2925472 -1779151 1509542 4897729 4758608 1148814 -1809955 -1558167 266992
43927 266992 1935348 4352561 7537296 8458008 5731895 3060740 4026583 6245988 5062898
43918 5062898 895467 -1769728 -1275371 16817 590033 1155571 1408408 -126857 -2683871
43909 -2683871 -3629467 -2597016 -1624013 -1209794 -318740 -309345 -3915301 -9327710 -10474457
43900 -10474457 -5424454 116192 596614 -2260141 -3626113 -3024288 -3020711 -3151204 -555013
43891 -555013 4031382 5808257 2299974 -3232878 -5893241 -4183825 -32748 3888342
43883 3888342 5498308 3770267 -176127 -3034971 -2067484 1796553 4704973 4365625
43875 4365625 2831835 3447529 5613985 5143032 653879 -3340702 -2390183 1144215 1306393
43866 1306393 -2570631 -4973205 -2545465 1555157 3202850 2605026 1659052 418010
43858 418010 -549003 1517899 6558311 8723268 3946119 -2151787 -420975 8674543
43850 8674543 14721300 10950616 2104907 -3321809 -3389392 -2047548 -2211401 -3480798 -4673346
43841 -4673346 -5246595 -5001752 -4403435 -4416016 -4905158 -4552191 -3274544 -2862724 -4056682
43832 -4056682 -5106375 -4776321 -4608321 -6119394 -7595696 -6188849 -2127090 1449541
43824 1449541 2240608 585302 -1794826 -3156100 -2403145 100451 2769848 4665506
43816 4665506 6095519 6652605 4673408 361153 -2603241 -1227136 2391725 3789778
43808 3789778 2421657 1992968 4607703 7782176 8119891 5485194 2367502 781008
43800 781008 803105 1142259 665833 57774 1501030 5466565 8709799 7603081 2914924
43791 2914924 -1223624 -2699204 -2701932 -1723961 1773735 7409023 11340442 11058518 8820768
43782 8820768 7767572 7343763 5676172 4019912 4785850 6568870 5545509 1566340
43774 1566340 -1352377 -1194045 -627332 -2122431 -3934133 -3208750 -383876 2143160 3802964
43765 3802964 5541455 6998059 6861536 5545816 4909070 5320224 5325215 4464041 4127265
43756 4127265 4920178 5300943 4036359 2270979 1610905 1468084 140563 -2239419 -3762743
43747 -3762743 -3503984 -2356093 -918677 1529231 4964955 6969147 4809611 -1040217
43739 -1040217 -6682228 -8429726 -6121724 -2617624 -511598 93444 597807 1459467 1622266
43730 1622266 393319 -1218595 -1916185 -2207286 -3821596 -7093646 -10116304 -10831149 -9074263
43721 -9074263 -6221755 -3637595 -1868895 -670895 549546 1814963 2141984 836398
43713 836398 -1039067 -1912420 -2345766 -4385049 -7700401 -8777312 -5531654 -660907 1850281
43704 1850281 2005426 2870770 5303533 6653513 4835247 1103872 -1854046 -2662708 -1569498
43695 -1569498 263730 1264391 697861 -290291 -258239 -7715 -1721588 -5514631 -8891298
43686 -8891298 -9895357 -8704217 -5921381 -1928207 1404157 1287834 -2237685 -5629305
43678 -5629305 -6452837 -6173846 -6664606 -6856568 -5479903 -4434587 -5883913 -7823424 -6445605
43669 -6445605 -1979064 1596996 2212149 1405416 559773 -632800 -1491093 -142326 2703468
43660 2703468 3465118 1110174 -440817 2101238 6123832 6560458 2820030 -963566
43652 -963566 -1676032 -195341 1079760 967271 -445355 -2259615 -2828144 -1120731 1558701
43643 1558701 2729802 1869412 782606 483871 -480307 -3650251 -8019976 -10996038 -11144489
43634 -11144489 -9066502 -6370960 -4681799 -4802835 -5765750 -5392285 -2937005 -508004
43626 -508004 -555412 -2587415 -4050170 -4036711 -3976475 -4534588 -4372630 -3077632 -2906544 -5521891
43616 -5521891 -8689387 -8849822 -6076836 -3666912 -3072790 -2307467 -15067 1845183 979506
43607 979506 -1884910 -4619155 -6824183 -8963721 -9766704 -7502405 -3572043 -1924443
43599 -1924443 -4139668 -7258644 -7558562 -4812537 -1596132 236214 812147 822658 610773
43590 610773 675814 1668937 3321075 4173387 3060500 584403 -1400192 -1681205 -634430
43581 -634430 689785 1750810 2351082 1919534 54116 -2209935 -2900185 -1524292 861
43572 861 -157056 -1146644 -834249 574599 321630 -2888196 -6538660 -7546128 -6601791
43563 -6601791 -6959571 -9108304 -9385421 -5244985 243736 1743502 -1317655 -3955152
43555 -3955152 -2256937 1946702 4399395 4005434 2850595 2330654 2101597 2179113 3231688
43546 3231688 4722610 5215017 4771052 4740563 4927137 3535834 525771 -1684055 -1872127
43537 -1872127 -1732895 -2638566 -3424501 -3205596 -3677666 -6107091 -8282512 -7385422 -4269213
43528 -4269213 -1972356 -1282689 -735205 33269 42041 -488570 -258247 719244 1352110 1645947
43518 1645947 2184848 2142398 561324 -1094290 -737709 621063 423752 -578140 980826
43509 980826 5250764 8192440 7486416 5555642 5186777 5668490 5058923 3082296 -32147
43500 -32147 -4415416 -8324644 -8325155 -4093669 3542 697593 119463 1363592 2919347
43491 2919347 1494128 -2021780 -3964902 -3915856 -4709449 -6845840 -7332484 -4696882 -1336414
43482 -1336414 412927 1557911 4145501 7710691 9682846 8379833 4674142 1256658
43474 1256658 450993 2091719 3720516 3529734 2387796 1896325 1556571 -175497 -2625721
43465 -2625721 -3066924 -437350 3003884 4363533 3161884 1232683 586897 1697231
43457 1697231 3211266 3394037 2375899 2313113 4381811 6538521 5853660 2476019 -551799
43448 -551799 -1206750 -419649 -108596 -1041191 -2874893 -4672123 -4971466 -2881368 237893
43439 237893 1384962 -1022081 -5374357 -8569959 -8904870 -7097869 -5066198 -3933665
43431 -3933665 -3019256 -987723 1846273 3177397 1391391 -2145758 -4420935 -3834802
43423 -3834802 -1113377 2040717 4097228 4144502 2379947 -127745 -2728629 -5428924
43415 -5428924 -7433290 -7121273 -4595385 -2484605 -2647603 -3837562 -4397990 -5093340 -6730133
43406 -6730133 -7236258 -4731067 -1875424 -2835598 -6602662 -7885882 -4812057 -1145286
43398 -1145286 127858 870105 3409825 5987229 5478558 2070824 -1489220 -3484053
43390 -3484053 -3828823 -2733120 -902833 176645 -30197 -167633 845205 2020828 2072768
43381 2072768 1577927 1763474 2288759 1873605 352547 -1248687 -2071611 -1909044 -1048173
43372 -1048173 -302074 -276006 -108750 1806057 5277593 7944820 8174511 6871624 5646019
43363 5646019 4767098 3868390 3080066 2313636 802383 -1533561 -3481917 -4229037 -4482698
43354 -4482698 -5237861 -6737015 -9059105 -11972349 -13725245 -12203951 -8216422 -5382880
43346 -5382880 -5547945 -6452892 -5290181 -2401478 66016 1101526 838794 -402863 -1540435
43337 -1540435 -1094201 575128 1532497 1764395 3464321 6504452 7399158 5125888 3920032
43328 3920032 6712172 9581241 7467243 2367346 233109 1634943 1609544 -1810833
43320 -1810833 -4988050 -5263332 -4676828 -5490360 -6549598 -6149730 -4864983 -3509596 -1376984
43311 -1376984 1597869 3709170 4373061 5588071 8543350 11014183 10249621 6765490
43303 6765490 3351593 1659793 1459887 2072314 2831272 2872055 1872526 649749 210739
43294 210739 650667 1462426 2330402 3192915 3958254 4271464 3274704 189355 -4094780
43285 -4094780 -6888675 -6499794 -4406028 -3093487 -2592904 -1200092 1038971 2057307
43277 2057307 921332 -1005371 -2170332 -2141775 -992587 441267 -68794 -3975423 -9107325
43268 -9107325 -11529600 -10387762 -8349359 -7227175 -6170575 -4510161 -3090876 -1955146
43260 -1955146 36900 2156426 1681820 -1632497 -4143118 -3282502 -972435 58459
43252 58459 426526 1869980 3423116 3032045 1328573 677073 1442362 1906238 1212922
43243 1212922 30257 -1227436 -2779172 -4408069 -5593741 -6266031 -6256376 -4930987 -2654261
43234 -2654261 -1404209 -2279760 -3476430 -2574688 -3026 1634905 1114831 -245767 -637058
43225 -637058 427859 2023544 2468987 576359 -2874171 -5590964 -6315559 -5739199 -4337610
43216 -4337610 -1401899 2270933 3028104 -1469878 -7939032 -10366593 -6985964 -1833205
43208 -1833205 530539 -855485 -4864580 -10811872 -17401176 -20980855 -17920453 -9292882
43200 -9292882 -1240908 914697 -1740369 -3635815 -1884810 885062 1545592 1224904
43192 1224904 2483833 4191666 3177503 -107384 -1865483 -767900 697766 946459
43184 946459 907618 273612 -2808675 -6696175 -6204401 -376222 4689807 4335977 1911597
43175 1911597 2439253 4254750 2738239 -969529 -1604878 1414795 3099962 614559
43167 614559 -3346855 -5198233 -4205637 -1413199 1505978 2424947 970056 -198758 600760
43158 600760 539619 -3254562 -7797323 -8050753 -5019126 -3917169 -5085716 -3633198 1387190
43149 1387190 4518419 2604048 -321867 337187 3440831 5321567 4794037 2376152
43141 2376152 -1193993 -3317053 -895539 4202867 5718308 1786101 -1738505 -62603
43133 -62603 3443656 3221989 75436 -1411240 -486359 208514 277106 1467009 3391455
43124 3391455 4018284 3459578 3363061 3540739 2656964 1064128 -216817 -1782329 -3987318
43115 -3987318 -4796389 -2926343 -881983 -960703 -687089 3037685 7463533 7348545 3436486
43106 3436486 1440446 2946184 3716465 1806075 981523 3864732 7219063 7243191 5251902
43097 5251902 4603060 5206530 4628063 2489182 549495 -340105 -868378 -1669745 -2844848
43088 -2844848 -4286311 -5272757 -4668221 -2460385 -123882 1143664 1376123 733268 -903287
43079 -903287 -2714449 -3110423 -1904948 -798167 -1053071 -2156162 -3143411 -3544555 -2763964
43070 -2763964 -580208 1414950 1245915 -101562 495443 3274728 4454594 1672866
43062 1672866 -2419466 -4167956 -3818613 -3705449 -3777174 -2161249 1105443 3932950 5087161
43053 5087161 4840408 3567590 2047538 2154897 4565787 6590592 5235752 1884036
43045 1884036 697551 2489099 3748590 2389266 799102 1564623 3424547 3912538
43037 3912538 3443948 3753707 4051886 2246498 -648928 -883902 2621704 6087130 5452830
43028 5452830 1238738 -2603335 -3314128 -1391771 942510 1900218 1308437 718606 1774439
43019 1774439 3721424 3689317 634452 -2495325 -2577052 -963953 -1349648 -3687944 -4098494
43010 -4098494 -1397924 424304 -1724424 -5233080 -6219229 -5681448 -6994073 -9326086
43002 -9326086 -8684292 -5053637 -3246908 -5517332 -8022727 -6910098 -3932204 -2778897
42994 -2778897 -2917141 -1262682 1624236 1545961 -2929411 -7898891 -9362523 -8234455 -8082706
42985 -8082706 -9716791 -10601628 -9096777 -6750037 -5712870 -5771727 -5329210 -4148750 -3326713
42976 -3326713 -2993162 -1983988 -9182 1696943 2522306 3502898 5222017 6434850 6180453
42967 6180453 5588195 5745038 5307371 2622925 -908948 -2405170 -1898143 -2243753 -4581908
42958 -4581908 -6750183 -6809794 -5534353 -4394076 -3325555 -1820004 -560258 -690763 -2430175
42949 -2430175 -4955731 -6663769 -5689850 -1875075 1858627 2169911 -613055 -3337647
42941 -3337647 -4836889 -6795645 -9370039 -9654901 -6191365 -1761800 502564 1030626
42933 1030626 1511337 1401871 -395176 -2526119 -2914681 -1961690 -1282625 -743326 506448
42924 506448 1514494 1008141 201928 1089897 2829780 2804167 571705 -2136667 -4634256
42915 -4634256 -7348322 -9116496 -7784741 -3810863 -417531 355266 -550082 -1511945 -1953033
42906 -1953033 -1551048 -88563 1468942 1678746 597033 -622781 -1671307 -2535693 -1714020
42897 -1714020 2201109 7345799 9850469 8348768 4598261 17804 -4984171 -8352697
42889 -8352697 -7306959 -3016618 -442441 -1813752 -3799430 -3072265 -1038487 -393142
42881 -393142 -384383 902225 2037239 150590 -3837693 -5783640 -4041709 -1485333 -1358633
42872 -1358633 -3549083 -5746941 -6524576 -6254747 -5875753 -5598166 -4794223 -3013188 -850878
42863 -850878 690412 1534841 2365338 3206907 3312511 2557675 1775649 1613815 2207700
42854 2207700 3723532 5644542 5966691 3385463 100082 -343838 1825427 2873005
42846 2873005 1527693 878634 2849713 4846602 4513268 4033753 6022642 8172112 6430070
42837 6430070 1626267 -1574995 -1366900 -203886 46681 198458 717374 413615 -861096
42828 -861096 -1238427 262888 2117276 2542710 1579864 274022 -646011 -850245 -522824
42819 -522824 -485432 -1010072 -1007998 78082 471616 -1611281 -4496085 -4622175 -1507781
42810 -1507781 1492532 1655048 -332684 -2430807 -3686258 -3977881 -3446706 -2919582 -3187302
42801 -3187302 -3397474 -1798536 1647169 4969078 6511355 5978917 3646113 607564
42793 607564 -731873 952019 3239930 2430665 -1480919 -5179018 -7091679 -8526183
42785 -8526183 -9659684 -8597892 -5513971 -3637710 -4318711 -4791934 -2963339 -899312
42777 -899312 -1008721 -1919868 -1039773 1396529 3605456 5155429 5894091 4458052 797001
42768 797001 -2123121 -2204051 -1568763 -2824314 -4366094 -3340376 -1298710 -2230339 -5854663
42759 -5854663 -7544322 -5074176 -1341690 357266 297004 520878 1776728 3280864 3639669
42750 3639669 1629526 -2128173 -4375904 -2232107 3032693 7227582 7941831 5905865
42742 5905865 2362027 -2040187 -5873746 -7416511 -6878024 -5796950 -4371691 -2019205
42734 -2019205 -108580 -640897 -2160460 -937521 2951613 4742428 1782316 -2503139
42726 -2503139 -3652969 -1976999 -794794 -1571071 -3473596 -5544037 -6664219 -5273653
42718 -5273653 -1678566 1089490 1138570 566095 1806241 3143470 1292685 -2915112 -5250920
42709 -5250920 -4092933 -2168748 -2111335 -3466733 -4675443 -5102497 -4187777 -1215907 2744205
42700 2744205 4744782 3224620 -124514 -2821579 -4362211 -5339025 -5382214 -3720477 -968109
42691 -968109 1239691 2118066 2204038 2323347 2936145 4008602 4658241 3534364 624407
42682 624407 -1918027 -2123333 -957974 -1008394 -2480283 -2622493 136023 3554794 4614921
42673 4614921 3525813 2620963 2429235 1453123 -533732 -1699948 -982380 746942 2746691
42664 2746691 4947508 5773486 2786800 -2724241 -5165605 -1604118 3390531 3504501
42656 3504501 -783563 -3580357 -2080702 975790 2853241 3967861 5015570 5525549
42648 5525549 6247267 8541913 10171457 6557048 -1605358 -6887848 -4616280 499098
42640 499098 1333219 -1794745 -3249382 -1336172 292397 -618669 -2219922 -2798841 -3214872
42631 -3214872 -4337177 -5612611 -6862249 -8463835 -9368167 -7954574 -5214459 -4042813
42623 -4042813 -4907331 -5220201 -3518806 -1219410 379012 1613223 2112628 290135 -3433736
42614 -3433736 -6004818 -6008643 -5697429 -6921905 -7901914 -6368245 -3436571 -1727363 -1617492
42605 -1617492 -2038466 -3327254 -6401713 -10156469 -12340144 -12377299 -11161823 -8972312 -5955160
42596 -5955160 -3797682 -4152107 -5694862 -5426458 -2955539 -902229 -675439 -509478 1259133
42587 1259133 3308667 3432031 1926602 889392 874915 258268 -1909189 -4032355 -3926037
42578 -3926037 -1859124 -373373 -956256 -2109268 -1654731 -93521 64248 -1643398 -2207851
42569 -2207851 1080268 6828173 11128746 12157829 11321487 10001209 7279285 1985720
42561 1985720 -4182085 -7202308 -4683415 1408451 6518193 7929475 6967079 6623937
42553 6623937 7724660 8401626 7079215 4536857 2501457 1445387 792126 438974 787550
42544 787550 1579148 1867400 1243540 357447 190297 1322786 3698891 6379898 7628856
42535 7628856 6131245 2512383 -844830 -1963959 -1208623 -799477 -2276561 -4621930
42527 -4621930 -5360665 -3617017 -1289117 -519531 -826238 -117491 1869956 2992814 1787166
42518 1787166 -750825 -3152094 -5272324 -6786192 -5776301 -1161294 4264916 5712112
42510 5712112 1781535 -3551843 -5047820 -1581756 2988557 3968585 594990 -3400491
42502 -3400491 -4085973 -1638746 568936 624949 -144913 -212460 -112754 -446128 -99481 1406376
42492 1406376 1866544 -526811 -3557451 -3702537 -1724803 -2063438 -6475848 -11513063 -13207990
42483 -13207990 -11608257 -9393436 -8026215 -6704253 -4013473 217071 4077311 4864909
42475 4864909 2403854 268432 1677202 5008637 6181416 4787645 4108939 5052036
42467 5052036 4655003 1952579 667102 3356097 6845492 6946417 4495861 2895626
42459 2895626 2401830 1162951 -187776 336033 1691135 1279170 23794 1130923 4003768
42450 4003768 4503742 1951080 773976 3485665 6651712 6343360 3656350 1847275
42442 1847275 1317316 781965 728339 2023847 2940365 1269671 -1632359 -2293781 -102431
42433 -102431 2137832 2358386 1236707 161022 -256864 548465 3012156 6141162 8030727
42424 8030727 8023156 7070902 6129168 5540693 5474681 5378275 3834249 979806 -98180 2653227
42414 2653227 5763050 3748337 -2659532 -6205085 -2537957 4191655 7645206 7377612
42406 7377612 6996206 7278368 5904786 2844525 1278851 2676952 4528347 4049106 1633326
42397 1633326 -405813 -699442 345935 1174379 132068 -2872259 -5707832 -6224707 -4722595
42388 -4722595 -2762298 -361815 3334208 7185916 8771767 8001107 6985209 5966793
42380 5966793 2856665 -2065872 -4691386 -2634636 747062 780298 -2339544 -4879009
42372 -4879009 -5297614 -5173212 -5371753 -4886216 -3610735 -3314265 -5155394 -8216165 -10897439
42363 -10897439 -12141543 -11309180 -8692865 -6151552 -5285439 -4888021 -2263047 2682425
42355 2682425 6850403 7999848 7149545 6004218 4220720 878768 -2962739 -5101622
42347 -5101622 -4717609 -2545739 593789 3770105 5197833 3706541 1077051 840608
42339 840608 3818771 6442136 4993898 541307 -2262642 -1021194 1957405 3618029
42331 3618029 4123598 4963912 5116330 2384535 -2027751 -3989135 -2267216 -434579 -1295889
42322 -1295889 -2690786 -1515246 874408 918391 -1278957 -2394856 -1426886 -709831 -1347539
42313 -1347539 -1615780 -775939 -747461 -2298576 -2712219 406296 5119159 7317509 5649817
42304 5649817 2368000 117429 -435232 -138603 266130 1134071 3281849 6050967 6895323
42295 6895323 4452891 1308225 1263462 4003913 5380647 3478921 1179587 1345009 2591900
42286 2591900 2061350 -114941 -1707134 -1919348 -1456742 -379230 1722844 4356391 6903326
42277 6903326 9735526 12735369 13984478 12046209 8522548 6282068 6074532 6771523
42269 6771523 7744923 8838602 9154060 8257970 7579179 8177425 8280814 5933053 3121667
42260 3121667 3803051 8035116 11594058 11927801 11250364 12681205 16077386 19033031 19830418
42251 19830418 18200821 15178627 13442879 15892698 22362718 29178802 33384772 36215157
42243 36215157 40981936 48508556 56226579 61382914 63679126 64376697 63593537 59447380
42235 59447380 50510495 38854236 29331654 24980003 24010486 22301712 17946199 12250280
42227 12250280 7497719 5434181 6805309 10082903 11342567 8011325 2630701 434264
42219 434264 3060011 7051632 8779495 8201524 7107485 6329426 6034326 6646736 7870026
42210 7870026 8235411 7025472 5626287 5884645 7850283 9770954 9654828 6697501 2045545
42201 2045545 -1948654 -4131652 -5546291 -6772379 -5723745 -731288 5269666 7352934
42193 7352934 5385083 4272466 6633685 9162666 7892080 3449824 -1045750 -4052880
42185 -4052880 -5132342 -3465872 202218 2560438 1679669 80965 1110533 4099233
42177 4099233 5978632 6037954 6037387 6798169 7512226 7505349 6266697 2883921 -2121117 -5650872
42167 -5650872 -5259949 -2345119 257808 2277526 4804189 6741764 5957455 3015180
42159 3015180 408549 -1202658 -2814207 -4031792 -3672228 -2688216 -2867207 -3198075 -1363599
42150 -1363599 1621961 2488958 1294770 1356723 3178573 3234486 -31673 -3705778 -5628922
42141 -5628922 -7478135 -10205453 -10842688 -7181778 -2047436 642141 1051487 1113103 33117
42132 33117 -3559227 -7165815 -6940257 -3695321 -1858555 -2602940 -2337520 1212768 5213110
42123 5213110 5651438 2481241 -895043 -1699747 5627 2137628 2655838 1443533 554106
42114 554106 2005218 5321208 8004285 8254037 6350178 3750630 2073606 2679343 5635452
42105 5635452 8790021 9192213 5990933 1146575 -2871386 -5131565 -5838987 -5091708 -2832023
42096 -2832023 403890 3274295 4359822 3415971 2011489 2179616 3902160 4855712 3597294
42087 3597294 1925383 2461344 4697067 5649554 4260864 2711803 2868599 3841006 4202442
42078 4202442 4369838 4937779 4499643 1728470 -1219604 -217945 5442119 11203997 11803089
42069 11803089 6671856 161385 -2892998 -1394081 1614679 2419860 738548 -75887
42061 -75887 2366305 5641448 5273008 1127764 -1710882 427460 4905820 6705887 5192092
42052 5192092 3877718 4595761 5591401 5511429 5539392 6194986 5278463 1417416 -2642665
42043 -2642665 -3192462 -739791 808570 -423125 -2438015 -3017783 -2508675 -1994927 -827164
42034 -827164 2282618 6619220 9584052 9609492 8009214 7295099 7865282 7226571 3199080
42025 3199080 -2683301 -6320013 -5593263 -2246971 1003606 3172246 3937414 2388913
42017 2388913 -998210 -3023600 -1159074 2851042 5492852 6482991 8066556 10135085
42009 10135085 10009609 7311418 5006997 4479146 3399200 362974 -1961887 -1061431
42001 -1061431 943136 347496 -2526391 -4139641 -3000250 -860577 835389 2581776
41993 2581776 4599177 5521880 4136449 927940 -2640295 -5324318 -6375823 -5605041
41985 -5605041 -3442293 -523096 2540046 4748587 5049157 3755400 2553175 2211930
41977 2211930 1564300 -133918 -1432995 -1046918 -524946 -2158942 -5034758 -5705312 -2632345
41968 -2632345 2188019 5940865 7374564 6642425 4793651 3378766 2698521 748961
41960 748961 -3978448 -9143622 -10802602 -8912770 -7305031 -7579115 -6671617 -2187840 3238291
41951 3238291 5632629 5184704 4864294 5275424 4480176 2320439 1398256 3202340 5948738
41942 5948738 7310591 7422182 8069329 10120092 12690330 14126392 13320987 10719884 8210671
41933 8210671 7244797 7128439 6293842 5182433 6140152 9884681 13899185 15602711 15546921
41924 15546921 15627358 15370485 12671711 8062680 5350602 6797631 9770263 9997317 6861475
41915 6861475 3489327 2348409 2929840 3729847 4342417 4821237 4673583 3774386 3268050
41906 3268050 4163069 5417298 4705126 1294818 -2659852 -4158203 -2400059 531179
41898 531179 1951771 1176497 -389639 -1336155 -1577153 -1538672 -1170240 -511258 -280202
41889 -280202 -792234 -1031617 -71968 1261951 1647279 1509816 2140403 3084561 2783262
41880 2783262 1767926 2531660 5562637 8047315 7653380 5417031 3700085 3441562 4713631
41871 4713631 7680719 11252223 12815806 11205643 8223649 5679142 3115291 304499
41863 304499 -607362 1877385 5654583 7973923 9258785 10900904 11553056 9484824 6670395
41854 6670395 6092449 6504092 4801141 2469972 3944397 8651191 10750899 7855581
41846 7855581 4119349 2786714 1565944 -1566957 -3506022 -1289546 2081872 1925558
41838 1925558 -1156214 -3281532 -3679735 -4227905 -4601187 -3056868 -1015956 -1745250 -4593466
41829 -4593466 -5329466 -2819090 -922358 -2397219 -4812388 -4565606 -1898174 545580
41821 545580 1996119 3707162 5839913 6648712 4962031 2057335 511195 1654192
41813 1654192 4516394 7172814 8625161 8857252 7602788 4632216 1565778 1415448
41805 1415448 4900371 8768640 9689900 8564935 8577951 9863408 9234816 5471696 1802114
41796 1802114 1702890 4465919 6814160 7409376 7541528 7972964 7461946 5088193 2482882
41787 2482882 2383576 5359734 9060097 10753400 9650584 6508337 2315079 -1531078
41779 -1531078 -2925305 -956118 2125141 2842862 693130 -1444269 -1439640 -265855 626315
41770 626315 1846372 4202479 6266277 6137836 4445467 3238412 2606640 773667 -2554776
41761 -2554776 -5046468 -4445520 -1132495 2436660 4149858 4005476 3852401 5255746 7827552
41752 7827552 10549682 14223290 20412966 27783214 32479249 33411044 33986786 36416825
41744 36416825 37563173 33825679 27380527 23201121 21736567 19431753 15572196 13319026
41736 13319026 13617176 13116669 9602551 5381286 3528025 4126141 5750721 7513144
41728 7513144 8220716 6719628 4554421 5004015 7897257 8937590 6156787 3257470
41720 3257470 3841516 6039736 6420244 5850517 6954774 8245527 6076557 1415506 -573053
41711 -573053 1946552 4919245 4550166 2245185 1616384 3413768 5556109 6438553 6329439
41702 6329439 6396201 7578613 9859593 12092139 13170054 13351843 13344426 12362097 9023623
41693 9023623 4488207 2428587 4624509 8366784 9866639 8848818 7882171 8286790
41685 8286790 9112665 9767093 11004729 12783042 13543804 12855794 12738346 14592354 16497012
41676 16497012 15922748 13971127 13931318 15912695 16270175 13231803 9918136 9855834 12033345
41667 12033345 12966757 11883370 10958599 11372600 12006372 11871138 11455126 11496532 12136834
41658 12136834 13225953 14135692 13879127 12776026 12773927 14295830 14503057 11441398 8153419
41649 8153419 8839527 12141291 12904007 10264021 8747779 10565455 12244303 10981264
41641 10981264 9325519 10452123 12915161 13582719 12443580 11157847 10012795 9712159
41633 9712159 12791543 19117070 23120528 20550011 15679900 16241939 22471414 27092045
41625 27092045 26185524 24227163 26775747 33136490 39004264 42816891 46151694 49651891
41617 49651891 51760162 51570560 51152319 54080486 61647064 71132107 78893016 85059722
41609 85059722 93325333 105611314 119601514 133241421 148888972 169919644 194941526
41602 194941526 218583000 236828805 248449171 252230751 246416573 231004064 208281666
41595 208281666 181640135 155688581 135550393 122843018 113979549 105743023 100253031
41588 100253031 100043738 100920988 96379023 88212349 85326202 91046041 98862606 103165462
41580 103165462 107274685 116877725 131401093 147045417 164215628 186641777 215542799
41573 215542799 248558804 281652233 308157594 319357769 311902430 293887839 278843991
41566 278843991 273226724 272321952 267339979 253359023 231310935 206021182 182894018
41559 182894018 164270188 148657060 134354536 122373882 114146968 108337857 102590137
41552 102590137 97071244 93633853 92673025 93493982 96635910 102928851 111004586 118441223
41544 118441223 124793503 131167368 137624983 143220540 147363499 148698248 144263180 132982597
41536 132982597 118750574 106576944 96634259 85706474 73534544 63431368 56859841
41529 56859841 51845408 47245762 44329400 43118150 41231109 37901559 35509613 35310559
41521 35310559 34929808 32185189 28526657 26432477 25808489 25204923 24466950 23845876 22250366
41512 22250366 18818842 15077057 13366196 13791738 14354751 13559515 11706427 10134718
41504 10134718 9916535 10689140 10716933 9374911 9267912 13411358 19910419 22600807 18630279
41495 18630279 12577044 10654590 13197398 15826143 16202011 16003058 16856507 17847056 17615526
41486 17615526 16344731 14773768 13009221 11106559 9568101 8622623 7842218 6778734
41478 6778734 5350771 3700297 2414404 2584036 4636717 7294457 8713986 8558442
41470 8558442 7994687 7838480 7813640 7593054 7378653 7185549 6513644 5127557 3543033
41461 3543033 2494159 2376146 3225172 4692024 6024018 6626404 6673402 6709823 6736944
41452 6736944 6199787 4809168 2945867 1395929 981011 1935958 3132704 2745244 779118
41443 779118 155403 3437407 8610927 10354221 6392060 674468 -1314118 1063766
41435 1063766 3980733 4929262 5316455 6998496 9021053 9464284 8695272 8609946 9552385
41426 9552385 10177684 10043068 10147343 10728466 10662484 9684930 9209090 9928057 10461308 9718264
41416 9718264 8844072 9071626 9236531 7693735 5570540 5537627 7921704 10619005 12542742
41407 12542742 14295466 15278930 13364086 8639195 4729175 4558323 6834348 8548126
41399 8548126 9041983 9409306 9549364 8695031 8039912 9702287 12816265 13505522 9930340
41390 9930340 5171554 3358119 4457371 5117570 3916955 3080953 4500410 6663598
41382 6663598 7342733 7375245 8963173 11208023 10950461 8427794 8186633 12406377 16788633
41373 16788633 16338737 12635178 11247298 13516238 15535427 14815346 13154149 12309632
41365 12309632 11522504 10877045 12722389 17286737 20572022 19575023 16656902 15700036 16545254
41356 16545254 16546317 15409498 14776426 14449295 12715142 9742766 7507270 6808811 7049655
41347 7049655 8214162 10217419 11056014 8882925 5693924 5639757 9265344 12341998 11165640
41338 11165640 6617280 2271597 649216 2044548 5008333 7030830 6307106 3729650
41330 3729650 2130387 3117646 5459401 6525894 4508299 -275805 -5254610 -7545546
41322 -7545546 -7084790 -6543110 -6895259 -5301465 167330 6052554 7521420 5239512 3826668
41313 3826668 4467383 4171286 2319364 2330280 5463868 8149593 7657770 5808353 4552404
41304 4552404 2439738 -1273740 -3215545 -678274 3414314 4516993 2904493 2021565
41296 2021565 2643672 2977181 2839151 3344337 3618409 2141612 615139 2256415 6522713
41287 6522713 9460222 9221092 7551762 5973759 4394248 3574209 4840569 6796984
41279 6796984 6436207 4403801 4887776 8840008 11707608 10213975 7182090 6308793 5828038
41270 5828038 1843621 -4366814 -7410587 -5599041 -3182568 -3996776 -6455302 -6463407 -2897673
41261 -2897673 1633759 4137729 3809361 1987505 742040 1241959 2799460 3670220 3126486
41252 3126486 2380093 3066194 5148582 6828116 6440745 4088347 1412925 37932 232427
41243 232427 836489 437585 -1135023 -2429215 -1835907 416856 2258152 2154000 845476
41234 845476 -66962 -581794 -1940166 -4128511 -5565373 -5529580 -4921553 -3927189 -1214406
41225 -1214406 3063051 5751261 4644775 2245984 2529532 5014895 5600994 3057176
41217 3057176 778536 1144195 1828796 -166732 -3658321 -5186059 -4014096 -2466716
41209 -2466716 -2136667 -2222463 -1491030 -20408 1271790 1823201 2081779 3250867 5665371
41200 5665371 7232438 5095855 -280230 -4553912 -4580947 -2289890 -1448040 -2266821 -2056936
41191 -2056936 -136796 1275475 915850 16751 -440836 -1083281 -1974113 -1850004 -636472
41182 -636472 -197816 -1263502 -1971542 -924566 628822 1273466 1663778 2376417 2177121
41173 2177121 1018794 2068325 7069661 11803110 10783378 5437684 2516398 4343445
41165 4343445 6155382 4538778 2794906 4477982 6413094 3413106 -2783711 -5113166
41157 -5113166 -1151729 3754238 4239634 1491512 143760 1741776 3793264 3653924
41149 3653924 1204367 -1640163 -2685877 -1116114 1795795 3878734 4080705 2748345
41141 2748345 349800 -2656229 -4828060 -4514043 -2107789 114476 937035 1329893 2157351
41132 2157351 2773379 2740870 2817461 3029111 1996802 -168181 -634340 2070724 4753249
41123 4753249 3455111 -599873 -2457977 -411684 2075234 1891079 270674 -204959
41115 -204959 222714 -387626 -2053125 -2798697 -1708632 -118379 416136 34088 -70673
41106 -70673 528812 1113261 1249414 1744115 3272758 4445142 2828757 -1555546 -5371823
41097 -5371823 -5886761 -4446742 -4322714 -6072177 -7141522 -5592559 -2033258 2105346
41089 2105346 6080367 9277359 10976689 11230857 10664269 9278512 6835006 4249348
41081 4249348 2890518 2667997 2706517 3516579 5944853 8177277 7119526 3393335 1363916
41072 1363916 2650232 3188734 -601661 -5713824 -6157825 -971717 4884068 6921067
41064 6921067 5360447 3183531 2598539 3769170 5205002 5102466 3356892 1861895
41056 1861895 1830654 1844628 39302 -2866220 -4566019 -4238196 -2626860 -5656 3560811
41047 3560811 6506726 6855720 4991359 3226052 2706350 2725272 2771789 2982972 2787558
41038 2787558 1601145 832460 2465905 5328094 5616950 1965506 -2674920 -5214929
41030 -5214929 -5798764 -5605238 -4060394 -612481 2649216 2948889 707550 -756839 697060
41021 697060 3838311 6029208 6330798 6376702 8385821 12191397 14606849 12701540 7469826
41012 7469826 2795286 814921 176211 -912321 -2331646 -3647991 -5452755 -7352897
41004 -7352897 -6914740 -3038330 1270385 2169574 -65874 -2022630 -2257029 -2489168 -3941429
40995 -3941429 -5534141 -6259335 -6598587 -6499941 -4380196 123798 4118839 4272565 1022150
40986 1022150 -1756142 -1229484 1470592 3016833 1730911 -780797 -1537123 626939
40978 626939 3918174 5613256 4929321 3482828 2989362 3111868 1973425 -1433325 -5777549
40969 -5777549 -8426895 -7729989 -4118179 707255 4955998 7059626 6045042 2786179
40961 2786179 210072 612755 2819776 3645789 2273144 1158031 2021268 3332948 3201859
40952 3201859 2424849 2395001 1965842 -557208 -3641915 -4325293 -3189550 -3569021 -5557759
40943 -5557759 -5229091 -1384489 1301255 -984488 -4773304 -3895912 1584397 5695182
40935 5695182 5018621 2080904 -14753 -1470158 -2566103 -1066795 3774370 7794747
40927 7794747 6752098 2960350 2745292 7631023 12311086 12214074 9162440 7510286 7851304
40918 7851304 7589095 5851030 4436712 4341642 4225827 2723737 153206 -2664206 -5611953
40909 -5611953 -8559636 -10621899 -10862849 -9140531 -6151183 -3353317 -2470558 -3693740
40901 -3693740 -4525810 -2155313 2745420 6367769 6431769 4625916 3556584 3319830 2619995
40892 2619995 1523705 1032795 1022773 674639 261150 560785 1036483 547730 -540873
40883 -540873 -1011889 -1283924 -2957196 -5729158 -7131017 -5980823 -3870642 -2241107 -232118
40874 -232118 2910920 5233878 4297391 1057612 -976727 -393692 576786 -233417 -1652227
40865 -1652227 -1014145 1844152 4239324 4195618 2707919 1743032 1273539 -149481 -2316722
40856 -2316722 -2850811 -530696 2481323 3251385 1949059 1271276 2427951 3826206 4017491
40847 4017491 3781694 4225562 4633972 3848021 2516206 2070156 2225990 1583486 416190
40838 416190 563711 2133592 2606223 487403 -2032246 -2025069 -230592 -64180 -2488097
40829 -2488097 -4457984 -3322351 -642748 10524 -2219100 -4822613 -5432966 -4210566
40821 -4210566 -2756955 -2183342 -2597531 -3361730 -3446574 -2332420 -766558 81099 133782
40812 133782 195673 508874 830200 1758984 4233096 7445510 9115911 8458328 7098299
40803 7098299 6330328 5492714 4146415 3631882 4680709 5419727 3938766 1285879 -394762
40794 -394762 -1228276 -2451737 -3176199 -1524511 1536391 2749917 1081184 -1177600 -2066877
40785 -2066877 -1993799 -1740441 -1190513 -713618 -1303271 -2619574 -3225216 -3235347 -4117171 -5408667
40775 -5408667 -4801953 -2448839 -1753449 -4201170 -6690179 -6255735 -4434262 -4232745 -5451919
40766 -5451919 -6146254 -6509490 -7879170 -9460927 -9397014 -7950480 -6585826 -5122179 -2967623
40757 -2967623 -1847842 -3558827 -5889170 -4901711 -1064482 1074087 -325543 -2165931
40749 -2165931 -1948975 -1250231 -1719591 -1528875 1205493 4303616 4213743 1149705 -1599854
40740 -1599854 -2533292 -3208449 -4988269 -7052799 -7885268 -6855231 -4082850 -389928 2234085
40731 2234085 1686832 -1866988 -5647230 -7161182 -6808287 -6646516 -7007926 -5809362 -1796709
40722 -1796709 2797405 4385886 2434246 -70329 -838314 -957188 -2264573 -3995494
40714 -3995494 -4103790 -2727063 -1968176 -2723460 -3994290 -5232904 -7168483 -9964791 -12299456
40705 -12299456 -12624817 -10161928 -5103991 544771 3230156 1472719 -1347616 -811932
40697 -811932 2371001 3718495 2384856 2312300 4638963 4423248 -1551851 -8283930 -8859882
40688 -8859882 -4229743 -1129765 -1942813 -2508314 140764 3542257 4586481 3756309 2517706
40679 2517706 396368 -2706935 -4266263 -2138590 2006352 4729976 4907575 3711351
40671 3711351 2020491 248414 -307836 1443166 4222456 5504085 4812794 3942956 3714392
40662 3714392 2558655 -781987 -4682832 -6099526 -3999172 -364653 1928019 1550175
40654 1550175 -672484 -2839201 -3625102 -3341454 -3405652 -4467236 -5286988 -4127580 -1256576
40645 -1256576 776163 -186760 -3521259 -6568016 -7224512 -5335636 -2300857 -178557
40637 -178557 -476840 -2635880 -4182660 -3611096 -2473922 -3032604 -4657906 -5058285 -4674123
40628 -4674123 -6397380 -10139040 -11424235 -7577308 -2067095 363280 208332 1064209
40620 1064209 3088316 3299965 1616406 1620812 4620885 7254529 6477400 3399267 555168
40611 555168 -1390982 -2364414 -1366833 1415239 3437727 3076904 2002617 2111379 2300615
40602 2300615 835745 -1110067 -1256337 -21772 539105 444616 1268899 2723227 3044875
40593 3044875 2463615 2969959 4487049 4576556 2701331 1657452 3301715 5395281 4682822
40584 4682822 1512332 -580576 810268 4502678 7335390 7369902 5488829 4022836
40576 4022836 3861280 3637593 2336320 1420025 2672979 4904117 5254254 3468632 2074036
40567 2074036 2000288 1084054 -1864169 -4354687 -3615911 -570183 1902325 3143717 4683455
40558 4683455 6880626 8032606 6834237 4090511 1909455 2165322 5323126 9706967
40550 9706967 12421751 12080227 10156785 8772219 7972200 6362471 3569877 567226
40542 567226 -1907124 -3781113 -4810211 -4568185 -3071606 -584744 2579375 5300203
40534 5300203 5908170 4501912 3701085 5308463 7386522 6752892 3396999 136508 -1157696
40525 -1157696 -418978 2479895 7093629 10374720 9131972 5016727 3413783 6370751
40517 6370751 10109165 10853859 9549354 8893024 9131235 9305527 9634380 9843566 7915051
40508 7915051 3647714 890120 2612549 5967087 6322003 4437268 4976710 8820431
40500 8820431 11794103 11124293 8410275 5402394 1506493 -2813340 -4434975 -2030562
40492 -2030562 1135197 1670851 715400 1224026 2813991 2708309 571754 -994726 -579487
40483 -579487 258440 -262872 -1796354 -2997734 -3494248 -3841168 -4313480 -4475632 -3774921
40474 -3774921 -2280540 -760644 79337 285162 256851 17035 -397904 -244856 967088
40465 967088 2006455 1022766 -1678103 -3647984 -3454147 -1943181 177436 3602449 7866383
40456 7866383 9827867 7083749 1610558 -2221471 -2439597 -394039 2088630 4163056
40448 4163056 5061214 4068830 1680570 -697703 -2242251 -2918399 -2839564 -2664352 -3666032
40439 -3666032 -5775593 -6665600 -4873521 -2688653 -3191894 -5289583 -5074082 -1863933 988741
40430 988741 1910909 3519195 7324716 9912488 7663491 2634252 -42301 814194 1746835
40421 1746835 499475 -1124109 -817670 892280 2228437 2863726 3388495 3559794 2838780
40412 2838780 1849392 1589835 1497523 3073 -2688262 -3958537 -1976298 1505793 3045683
40403 3045683 1757330 -93731 -842189 -1627551 -3683133 -5360042 -4145308 -786507
40395 -786507 1075885 -566446 -3989846 -6342630 -6306849 -3867824 175040 3513534 3497628
40386 3497628 651057 -894625 1457846 4684680 3688238 -1833505 -6685481 -6454310
40378 -6454310 -2291876 1127312 612007 -3450686 -8470017 -11636346 -11140056 -7040620
40370 -7040620 -1679717 1314802 -372170 -5303616 -8845299 -7328676 -1916790 2608155
40362 2608155 3067457 646833 -1753964 -2845075 -2396480 389892 5347949 9477314
40354 9477314 9756798 7515430 6795595 8078926 7238559 2179960 -3009901 -3424857 -278619
40345 -278619 1234962 -452250 -2126793 -2094779 -2965519 -6398710 -9070138 -7214793 -2747667
40336 -2747667 -969573 -3210463 -5636996 -5395709 -4110179 -4120559 -4666272 -3997160 -2769831
40327 -2769831 -2678117 -3274566 -2784477 -1127535 301604 1206626 2446999 4015083 5127527
40318 5127527 5812645 6208847 5052379 1606479 -1559996 -1151267 1580114 1988526 -923358
40309 -923358 -2778749 -643871 2628854 3324103 2179833 1511438 697890 -1160090 -1060556
40300 -1060556 4116379 11265707 13959856 11156468 7711749 6205544 4061786 146025
40292 146025 -1673577 1165177 4644998 3480119 -1300470 -4423858 -4038758 -2845919
40284 -2845919 -2541720 -1716500 286653 1474021 732262 199891 1937622 4326696 4316536
40275 4316536 2090626 708461 1211161 927987 -2122504 -5440244 -5062961 -1308994 1347171
40266 1347171 254654 -2362379 -3332050 -2787683 -2523330 -2452597 -1639349 -1341000 -3514877
40257 -3514877 -6760169 -7311440 -4510146 -2020692 -2629411 -4890482 -6420209 -7644529
40249 -7644529 -10034475 -12749386 -13573885 -11996430 -9297067 -6593431 -4604456 -4224905
40241 -4224905 -5339186 -6000042 -4830521 -3375514 -3775714 -4828788 -3278628 788850
40233 788850 2866686 -217712 -5702108 -8251029 -6789848 -5425818 -7334983 -10143070
40225 -10143070 -9227572 -4474244 -1073205 -2966310 -7844166 -10503562 -9517656 -7870525
40217 -7870525 -7718058 -7753771 -6235619 -3604546 -841899 2166638 4965807 5591459 3431789
40208 3431789 1128635 1260617 2638151 2390367 481681 -645525 -180437 241070 -234570
40199 -234570 -320309 1067082 3255069 5218899 6814631 8039900 8512128 8219277 7634487
40190 7634487 6731624 4923091 2228774 -354621 -1723403 -1264919 994624 3959669
40182 3959669 5777404 5662330 4786558 4333514 3732758 2240028 942857 1154339 1976946
40173 1976946 1847356 1389681 1939687 2351489 772753 -1239254 -722312 681295 -2143028
40164 -2143028 -9363638 -14176974 -11992369 -6958666 -5375579 -6553517 -5445457 -1821668
40156 -1821668 -688171 -3835081 -6573611 -4501497 490942 3178158 1359471 -2860896
40148 -2860896 -6481011 -8256814 -8591438 -8230403 -7276248 -5335308 -2725221 -888555 -695045
40139 -695045 -973981 -192311 849853 -6565 -2440037 -3026620 310308 4793223 5511441
40130 5511441 1173539 -4318398 -6162660 -3470374 696711 3321248 4273281 4894872
40122 4894872 5020812 3089380 -798578 -3776336 -3248657 76308 3313731 4628647
40114 4628647 4159655 2755096 1473127 1728889 4088661 7017989 8349950 7829616 6716941
40105 6716941 5296591 2834961 -29864 -1194526 26685 2005114 3506704 5135843
40097 5135843 7013100 7272740 4635104 721324 -2124487 -3851057 -5516100 -6526839
40089 -6526839 -5572987 -3363103 -1785335 -960588 129230 651745 -1041728 -3349522 -2336971
40080 -2336971 2105591 4951034 3077232 -83423 -110419 1612907 1117750 -774630 -31978
40071 -31978 2737971 2460346 -1629420 -3793532 -808596 2827467 2676169 1992877 5918748
40062 5918748 11934689 12922284 7854475 2596784 563942 -657521 -2676287 -2963605
40054 -2963605 -273733 2454938 3452833 5146391 8577333 9839489 6218333 1445786
40046 1445786 90680 617221 -625507 -2004939 353763 4422565 4274059 -393621
40038 -393621 -3581709 -2377184 -562657 -1381177 -2728548 -1977508 -347935 441818 1372692
40029 1372692 3002010 3425024 2622823 4578400 10911835 16125061 14229729 7551717
40021 7551717 3601670 4657352 5884514 3500632 -461014 -2568600 -2833977 -3257514
40013 -3257514 -4501570 -5831275 -6387394 -5251619 -1948195 2181846 4737033 5118458
40005 5118458 4926903 4843148 3217987 -894249 -5120590 -6142798 -3802165 -1105537 -558705
39996 -558705 -2019597 -4040896 -5693991 -6406340 -5203205 -1562699 2966245 5223117
39988 5223117 3353484 -1208420 -5389920 -7570598 -8050639 -7183226 -4952513 -2381791
39980 -2381791 -1124098 -964853 69675 2088659 2372604 -95780 -1729104 969972
39972 969972 5642845 6801926 3514824 279644 17205 379333 -1431793 -3783970 -3214244
39963 -3214244 358336 3797885 4911569 3971679 1746911 -1517458 -4852167 -6216292
39955 -6216292 -4584282 -1743950 -854107 -2803772 -4718621 -3231693 887929 3150342
39947 3150342 1174533 -1955648 -2031861 500449 2041196 1738495 1960741 3128687 2485474
39938 2485474 -809340 -3366313 -2420828 299987 1899749 2506791 3498744 4318197 4162370
39929 4162370 4434731 6031047 6241588 2361206 -2977020 -4361077 -1020016 2371390
39921 2371390 2340581 139431 -1885348 -3536255 -5065920 -5564835 -4825135 -4311821 -4707661
39912 -4707661 -4706963 -3639442 -2968428 -3509764 -3371587 -756545 2890820 4719934 4219901
39903 4219901 3065048 2219984 1343646 517349 482247 1158642 1555730 1338819 1240576 1696289
39893 1696289 2092630 1730589 859549 330753 441406 420985 -674942 -2454486 -3111711
39884 -3111711 -1533644 990803 2265450 2067876 2063957 2895580 3151966 1675289 -915570
39875 -915570 -3747274 -6924072 -10173250 -12005189 -11633378 -10302178 -9401470 -8843230 -8676742
39866 -8676742 -10164312 -12937697 -13115137 -7663749 399175 4897313 4385882 3281507
39858 3281507 4590577 5806186 4102476 1756404 2760827 6344105 7997579 6127690
39850 6127690 3654842 2688293 1487975 -1649370 -4628371 -4378355 -1633071 -21039
39842 -21039 -1142758 -3165144 -4061758 -3698480 -2515897 -729870 466550 -510394 -2639853
39833 -2639853 -2452842 994601 3742052 2021302 -2365530 -4801232 -4162821 -2677105
39825 -2677105 -968042 1960659 4127341 1387896 -5745867 -10994157 -10408104 -7328491
39817 -7328491 -6373119 -6556180 -4285382 71265 3133993 3815871 3276477 1336604 -2482103
39808 -2482103 -5586556 -4800690 -1750566 -1132173 -3654350 -5309415 -4043376 -2452202
39800 -2452202 -2782082 -3758590 -4075675 -4914589 -6847159 -7884973 -7000518 -6318035 -7233740
39791 -7233740 -7390709 -4479187 -542954 703872 -924945 -2588040 -2792063 -2428713 -2287097
39782 -2287097 -2049881 -1423688 -528331 425647 837883 141259 -679976 262866 2604926
39773 2604926 3564510 2484998 2824900 7169237 12709695 14747862 12729665 9533822
39765 9533822 6574336 3434677 1096521 1209605 2374514 1250738 -2107092 -3663868
39757 -3663868 -1187501 2446746 3104428 262524 -3209099 -4460970 -3009383 -964701
39749 -964701 -1153937 -3723313 -5064457 -2033215 3350079 5978239 4191270 1354473
39741 1354473 732692 1804601 2366662 1485534 -586568 -2909630 -3466642 -929940 2359355
39732 2359355 2128560 -1953231 -5262771 -4686603 -2834651 -3452744 -5686033 -6119480 -4266265
39723 -4266265 -2397558 -1235911 526343 2816641 3615446 2227056 576408 449382
39715 449382 1119910 441227 -2648282 -6953240 -9738843 -8940354 -5372868 -2171251 -1265544
39706 -1265544 -1263601 187326 2987279 4954261 4846659 3550425 2746398 3553664 5766854
39697 5766854 7268327 5253532 -332012 -5463848 -5973560 -2194661 1988649 3843385
39689 3843385 3492114 1854807 -325455 -1569994 -591697 1419364 1884217 708990 581272
39680 581272 2705701 4918215 5213910 4444390 3790496 2267389 -670984 -2349239 -235094
39671 -235094 3100336 2272288 -3610028 -9526130 -11291905 -10342436 -10090425 -10634094 -9945709
39662 -9945709 -8230092 -7598723 -8165497 -7784113 -5756178 -3853739 -3183976 -2835174 -2340862
39653 -2340862 -2493801 -2532444 166640 5485644 8926505 7682246 5387869 6642014 9214177
39644 9214177 7224539 1056187 -2239181 686475 4819617 4836567 2162170 432555
39636 432555 -892993 -3334991 -3934770 601790 6508861 6482446 293501 -4412228 -2856392
39627 -2856392 1178005 2416602 1370833 1029408 703661 -1929531 -5083712 -4394608 162299
39618 162299 3340879 1535418 -2859590 -5573679 -6020469 -6217856 -6201603 -4135546 -755180
39609 -755180 112030 -2819923 -5171106 -2562705 2413944 3095751 -1581050 -4940552 -1783738
39600 -1783738 4430557 6883392 4775413 3077816 4505091 6442127 5958661 3762383
39592 3762383 1965786 994971 237032 -396269 -872847 -1391491 -1423648 61348 2708201
39583 2708201 4650684 4874628 4151485 3180320 1699254 185175 424195 3066413 6075159
39574 6075159 6948243 5478085 3263395 1384540 -456668 -3013261 -6194886 -8275684
39566 -8275684 -6777914 -1406868 4217599 5600627 2311831 -1791519 -3231152 -1771126
39558 -1771126 1224039 4445195 6082218 4667624 1804197 1264498 3725912 5131229
39550 5131229 2331702 -2344399 -4806164 -5031088 -5789676 -7231356 -6646719 -3202567 665867
39541 665867 3073406 4967198 7539073 9532207 8655022 4749061 379449 -1727646
39533 -1727646 -1496452 -1426731 -3330124 -5671013 -5455787 -2484949 342798 1204369 1207548
39524 1207548 1181331 -263684 -3433312 -5231386 -3116357 820235 2870158 2820813 2647557
39515 2647557 2166658 301623 -877263 1426535 4805157 3809167 -1260031 -3555461
39507 -3555461 204317 4392486 2857771 -2083904 -4055880 -2750660 -3601277 -8356137
39499 -8356137 -11965931 -10152147 -5468643 -3277548 -4669536 -6372883 -6125032 -4976991
39491 -4976991 -4277390 -3060046 138257 4184384 5918315 3843918 -63940 -2730254
39483 -2730254 -3174184 -2650203 -2542463 -3292204 -4906384 -7116798 -8911430 -9020287 -7285984
39474 -7285984 -4953280 -3390300 -2882449 -2521874 -845522 2953696 7717996 10768511
39466 10768511 10662705 8994371 8234180 8350415 7275986 4507463 2199166 2198493 3745852
39457 3745852 4921315 4970281 4317550 3438202 2621040 1961994 878105 -1470136 -4590516
39448 -4590516 -6439121 -5635894 -3216259 -1472061 -1650611 -3277758 -4906778 -4915411 -2547745
39439 -2547745 808784 2085580 -470275 -4914060 -7284861 -5864798 -2951592 -1901955
39431 -1901955 -2952629 -2961901 407751 5250246 7422111 5649311 2854014 1951368 2349096
39422 2349096 1972313 865365 515550 835319 504839 -204883 353734 2206300 3509357
39413 3509357 3470873 3029510 2366285 449317 -2319941 -3792830 -3476597 -3631387 -5617615
39404 -5617615 -7628033 -7663001 -6417746 -5329371 -3919704 -1302204 1406648 2497726
39396 2497726 2226333 1895646 1504061 227618 -1740290 -3536384 -4855026 -5501623 -5078976
39387 -5078976 -4367186 -5059468 -6504659 -5202733 -48178 4417410 3456884 -1047460 -3165374
39378 -3165374 -947765 2450118 4827563 7150671 9406586 9290312 6674759 5158945
39370 5158945 6935696 9566177 10140081 9431175 9284519 8799172 6339121 3241973 2230578
39361 2230578 3471181 5045034 5990319 6026168 3801849 -950195 -4495647 -2595834 2931376
39352 2931376 5462077 2599063 -206528 2440839 7846371 8859240 3594543 -2588892
39344 -2588892 -4432236 -2425471 -514773 -1225380 -4304045 -7813827 -9023319 -6065903
39336 -6065903 -444479 3452354 2968666 244275 -775653 896568 3287310 4868135
39328 4868135 5475205 4580739 1523358 -2339910 -4182029 -2994079 -416905 1937987
39320 1937987 3800665 4603852 3297436 915289 742880 4110537 7920116 8250010 5009371
39311 5009371 1301030 -603160 -1013429 -1574395 -3636100 -6883550 -8645314 -6094165
39303 -6094165 -259756 4034061 3762110 1274020 499874 1814457 3165665 4174420
39295 4174420 5710402 6675413 4928178 1221114 -916675 568387 4515180 8843708
39287 8843708 12082765 12834396 10447796 6512088 3498975 1860069 370120 -1214947
39279 -1214947 -2243317 -3292793 -5391014 -7470179 -7491995 -5776092 -4189357 -2585187
39271 -2585187 274231 2656101 1289667 -2629181 -3759623 -502644 2182688 310142
39263 310142 -3184628 -3352316 -351413 2342756 3991499 6298942 8565548 7611085 2639524
39254 2639524 -2951703 -5167439 -3103899 850119 3216491 2329799 1571 -583123
39246 -583123 822584 1079651 -1650382 -5204005 -6904873 -7098196 -6999615 -5657609 -2077878
39237 -2077878 1716674 3143752 3073371 3953078 5144854 3889373 399923 -1753917 -660802
39228 -660802 1660756 2618550 2139459 1710171 2245139 3434859 3958141 2551433 17586
39219 17586 -878327 828882 2181307 374580 -2631952 -2843809 -305007 1524751 1785601
39210 1785601 3028602 5718252 6724439 4767493 2932002 3410816 3667400 968026
39202 968026 -2444251 -2521176 308166 2093043 1750640 2517261 6461655 10721377 10836245
39193 10836245 6137518 193161 -3385555 -4122122 -3681600 -3136060 -2352755 -1495014 -1359107
39184 -1359107 -1716509 -1020291 993086 1911589 -285910 -3921122 -5683446 -5283674 -5408889
39175 -5408889 -7242309 -8848609 -8462677 -6784263 -5221052 -4200423 -4069151 -5251909
39167 -5251909 -6357437 -4524119 663935 5492191 6103181 2737433 -1473117 -4415522
39159 -4415522 -6055725 -6968856 -7666289 -8515693 -8811189 -6782134 -1945174 3410073 6485597
39150 6485597 6928769 6210346 5008904 2902401 120233 -2111079 -2988711 -2760677 -1996155
39141 -1996155 -1136841 -661849 -906215 -1688749 -2514059 -3033693 -3223096 -3422113 -3984830
39132 -3984830 -4264746 -2547050 1638947 5623424 6037702 3164284 629695 556401 1688710
39123 1688710 2948458 5565606 9890602 13041973 12315287 8838438 5433760 2918482
39115 2918482 1100808 1233564 4146375 7522012 8496155 7798698 7924702 8518984 7667246
39106 7667246 6831408 9506820 14611988 16300694 12070665 6608959 5061186 6390036
39098 6390036 6767304 6340622 8182304 12067535 13947547 11949711 9210256 9333154 11570817
39089 11570817 12428025 10585339 8070627 6889812 6586233 5950635 5563873 6807925 8905099
39080 8905099 9237149 7213123 5628234 6638008 8195047 6809097 2764863 -78250
39072 -78250 609958 3253834 5192786 5440576 4191998 1898338 -365379 -1509770 -2021351
39063 -2021351 -3067613 -3731578 -1717905 2408240 4690786 3169916 957089 1481280
39055 1481280 3158190 2119275 -1320809 -2718089 251417 4982214 7925185 8584032
39047 8584032 8472447 8245870 7344749 5375412 2758129 493301 -436466 -125435 -130216
39038 -130216 -1721008 -3800202 -3927408 -1579101 1133488 2464552 3198305 4958328 7699467
39029 7699467 10008269 10859314 9891239 6902019 2579214 -882956 -1660333 -768415 -967766
39020 -967766 -2773160 -3223748 194678 5586031 8374678 6757340 3654929 2685912 3790371
39011 3790371 4244745 2992835 1792776 1853149 1528074 -1076091 -4473645 -5046241 -1983436
39002 -1983436 1096086 611646 -2228805 -2938125 284701 4002384 3813646 -128176 -3486800
38993 -3486800 -3268952 -1086260 -196879 -1013656 -1402477 -601889 -280587 -1182350 -1209901
38984 -1209901 1319603 4187254 3674191 -44144 -2648720 -1348523 1667477 2711700
38976 2711700 1383232 -141921 -1052379 -2465002 -4574811 -5994056 -6379999 -7332238 -9586752
38967 -9586752 -11211969 -10080801 -6857256 -4083423 -3282038 -4263770 -6147143 -7328036
38959 -7328036 -5445732 227038 6472976 8461381 4929907 -608289 -4181127 -5083659
38951 -5083659 -4767462 -4120930 -3285719 -2757357 -3015783 -3701775 -4284446 -4899856 -5621043
38942 -5621043 -5744916 -4861455 -3814678 -3417913 -2938056 -1208699 1162592 1987669 -130182
38933 -130182 -4321934 -8051530 -8804525 -6118044 -2663373 -2171258 -5221009 -8271572 -8132224
38924 -8132224 -6011491 -5399488 -7308360 -9892550 -11671411 -12360869 -11164698 -7383977
38916 -7383977 -2816771 -535201 -699457 -351444 1860424 3519949 2205377 -1043320
38908 -1043320 -3451103 -3665387 -1926275 898351 3200794 3609252 3305433 5121657 8999442
38899 8999442 11013714 8823193 5278172 3932323 3646749 1289749 -2193727 -2853463
38891 -2853463 -227361 1610223 79851 -2464160 -2544018 1055 2760787 3796796
38883 3796796 2631532 -162242 -3214010 -5339058 -6841024 -8638311 -10004256 -9030595
38875 -9030595 -5819947 -3196277 -3206078 -4580810 -4872344 -3701326 -2509162 -2082920 -1762837
38866 -1762837 -750580 768895 1783324 1474309 290812 -290119 257865 372685 -1470934
38857 -1470934 -4141861 -5324992 -5176040 -5760149 -6650102 -4593265 827363 4603582 2464687
38848 2464687 -2640940 -3952302 288786 5239505 6561871 5272585 4370158 3974416
38840 3974416 2188982 -1125888 -3967223 -4883767 -4164884 -2672773 -1075843 -140121 -326441
38831 -326441 -859439 -314884 1600503 3823039 5608890 7115294 7825511 6062855 1536724
38822 1536724 -2878848 -4125680 -3305613 -4525667 -8948177 -12589051 -11546118 -7321024
38814 -7321024 -4734315 -5877662 -8534400 -9839558 -9013565 -6682965 -3924167 -2320199
38806 -2320199 -2977096 -5014783 -6480521 -6626614 -5601121 -2577689 3027211 8676651
38798 8676651 10509174 8669472 7280354 7929313 7215554 3016994 -980452 -769757 1298249
38789 1298249 46204 -4491584 -7665334 -7657649 -6981939 -6704732 -4657978 -520934 2378471
38780 2378471 2443180 2633989 5200076 7305683 5285933 520166 -2521154 -2296227 -882434
38771 -882434 134864 1164482 2457337 3294049 3431584 3370375 3234168 2913939 2871169
38762 2871169 3268285 2994291 1249799 -687494 -1192205 -958326 -1655161 -2572335 -1385366
38753 -1385366 1696104 3380666 1745718 -1044394 -1693609 134984 1831394 912374
38745 912374 -2683811 -6586172 -7945902 -6187631 -3709351 -2910320 -3223785 -2783720 -2133944
38736 -2133944 -3401251 -5878790 -5939842 -2476351 836084 587356 -1919386 -3588518 -4191936
38727 -4191936 -5063083 -5382773 -3616568 -1436883 -2060967 -4744938 -4893804 -638270 4044030
38718 4044030 4492928 1201818 -1515421 -1131731 829300 1513802 166479 -1319810 -796807
38709 -796807 1310722 2049499 -509153 -4415923 -5880106 -3688395 99996 3439865
38701 3439865 5935449 7110801 5908112 3070002 1545284 2815207 4798632 5211306
38693 5211306 5037020 6325087 8203752 8082853 6028566 4782118 5321067 5402956 3519550
38684 3519550 1812137 3267884 7474332 11093592 12006428 11207946 10388735 9235856 6445126
38675 6445126 2842536 1581616 4132476 7255350 6006959 -183076 -6355818 -7656509
38667 -7656509 -4468443 -872291 428347 27367 -245407 531025 1916852 2508771 1162598
38658 1162598 -1318826 -2579526 -1682927 -272185 565185 2631846 7357383 11846114
38650 11846114 11659857 6971618 2382999 572272 -164527 -1408495 -1714341 -110285
38642 -110285 990417 -802253 -3927320 -5242599 -4630117 -4409127 -5341156 -6011147 -5569250
38633 -5569250 -4587094 -3457092 -2088552 -1034819 -1009673 -1393922 -942845 169860 627409
38624 627409 34208 -931107 -2054925 -3402876 -3899332 -2320384 170106 752526 -1249884
38615 -1249884 -3422614 -3776329 -2957960 -1914150 144776 3403919 5087344 2402012
38607 2402012 -2905312 -5833026 -4124572 -436679 2049274 3454938 5032134 5600238
38599 5600238 3182802 -740494 -2028947 474398 3050879 2393381 241597 267066 2226968
38590 2226968 2639501 616581 -776204 282666 1313826 -408225 -3425949 -4320937
38582 -4320937 -2706627 -1331327 -2061944 -4167628 -6094102 -6661636 -4724394 64304
38574 64304 5816850 9548625 10150861 8850405 6754505 3766769 217169 -2458634 -3614271
38565 -3614271 -4383692 -5577011 -5747594 -2815727 2742947 7460309 7921207 4080763 -466392
38556 -466392 -1778065 545936 3146596 2990976 794500 -695124 -790693 -1176774 -2463957
38547 -2463957 -2977254 -1711930 -280856 -531232 -1830328 -2304923 -1679415 -1291724 -1936831
38538 -1936831 -3072341 -3750973 -3228330 -1114564 1911901 3866028 3120158 311848 -2267934
38529 -2267934 -3164399 -2910945 -2752734 -2947468 -2506605 -307193 3465425 6787474 7151899
38520 7151899 4039929 -140055 -2113152 -738400 2278014 4421651 4726501 4183500
38512 4183500 4145086 4540578 3924614 1446552 -1715668 -3555515 -3551816 -2847619 -2300506
38503 -2300506 -1638547 -775650 -512699 -1086650 -1142742 638882 3396096 4639846 2947148
38494 2947148 -451540 -2812273 -2527277 -802069 -379344 -2050792 -3127054 -766469
38486 -766469 3646441 5604042 3218584 -544947 -2320748 -2505175 -3213037 -4407004 -4712940
38477 -4712940 -4529559 -5330795 -6694835 -7026487 -6855179 -8226292 -10534474 -10244870 -6036954
38468 -6036954 -1471487 -534474 -2403495 -2923748 -317333 2801775 3047877 195742 -3041525
38459 -3041525 -4228236 -3485262 -2747624 -3306956 -4523519 -4878405 -3591739 -861395 2640514
38450 2640514 5658171 6513095 4709841 2058956 856346 1071670 665077 -1408420 -3972594
38441 -3972594 -5417002 -5172853 -3367848 -816718 407198 -1460979 -4973403 -6287732
38433 -6287732 -4064507 -1359188 -967075 -1214852 883327 4049969 4102238 588812 -1801518
38424 -1801518 331453 4379012 5494120 2840780 -473285 -2288206 -3231229 -3962811
38416 -3962811 -3579014 -1727806 -62604 28519 -281400 1034064 3770816 5904298 6449765
38407 6449765 5924174 4320062 1098709 -2395706 -3137472 -372536 2781814 3372259 2256038
38398 2256038 1667197 1258051 -354616 -1659155 95437 3642619 4360494 1019105 -2222899
38389 -2222899 -2297551 -1753429 -3912278 -6832127 -6141631 -1957492 1313282 1341763 22487
38380 22487 -668371 -896718 -240102 3245400 9054875 12414114 9502379 2890450 -1228534
38371 -1228534 -636626 821436 -1036640 -5353506 -7803354 -6116128 -2448053 -516896
38363 -516896 -1580952 -3651994 -4073273 -2246072 148714 1143657 421211 -577838 -256647
38354 -256647 1455907 3050659 3102732 1734120 125723 -1002106 -1642976 -1574602 -581443
38345 -581443 110862 -1686070 -6008958 -9388456 -8360130 -3763075 136967 556817 -1369080
38336 -1369080 -2894943 -2596755 -740953 1518315 2588031 1433840 -1039230 -2496656
38328 -2496656 -1564231 1084095 4001080 5979044 5834175 3232185 290801 73269 2310354
38319 2310354 2954234 -225023 -3925666 -3792656 -667698 995075 -263098 -1772790
38311 -1772790 -1910574 -2254711 -3768829 -4770260 -4422007 -4770273 -6928488 -8256595 -6355597
38302 -6355597 -3478158 -3435107 -5686412 -6281494 -3975250 -1700849 -1887608 -3669892 -5267069
38293 -5267069 -6107781 -5834784 -4073446 -2248902 -2998470 -6524195 -9883835 -11033914 -11055601
38284 -11055601 -11170782 -10545594 -8906081 -8198431 -9004140 -8314531 -4340688 -804943 -1938142
38275 -1938142 -5167664 -4247591 951925 3692176 377522 -4368386 -5107267 -3071766
38267 -3071766 -2475897 -3189401 -1902846 1407693 2982211 911561 -2548453 -4643227
38259 -4643227 -5095124 -4786303 -3890420 -2264335 -192259 1838427 3076986 2348740 -675474
38250 -675474 -4238799 -6151282 -6653553 -7879444 -10280984 -11524035 -9720089 -6148286
38242 -6148286 -3583324 -2936166 -2810331 -1985860 -1230601 -2309762 -5522858 -8673245 -8920405
38233 -8920405 -5631688 -801466 3353984 6144202 7516964 7143346 5547809 4530245
38225 4530245 4631436 3496909 -909465 -6377204 -8415914 -5785716 -1441718 1715341
38217 1715341 2989887 1917666 -1920214 -5959670 -5453449 372870 6070762 6716521
38209 6716521 4201094 3385229 4389116 3319723 -282892 -1815835 1512836 6233435
38201 6233435 7089165 3159799 -2587057 -7531796 -10607259 -10818812 -7596183 -2543471
38193 -2543471 1415950 3092649 3765462 4663285 5295475 4831599 3595756 2136918 70287
38184 70287 -2673186 -4325262 -2991600 199177 1637574 -526832 -4422103 -7476926
38176 -7476926 -9420904 -10808716 -10535164 -7365605 -2859755 61730 1084799 2234106
38168 2234106 3821606 4011558 3004287 3880253 7357593 9086581 5237992 -1545851
38160 -1545851 -5252145 -4110730 -1542230 -276616 607941 2353953 3686087 2789825
38152 2789825 -22236 -2917379 -4347303 -3505572 -592443 2540783 3464604 1741065
38144 1741065 -758499 -2563516 -4077017 -5730140 -6526728 -5642847 -3927241 -2371519
38136 -2371519 -389012 2759168 5860146 6906386 5810424 4269080 3251638 2319806
38128 2319806 1359904 1161517 1753673 1716577 193224 -1355951 -652314 2371223 5094453
38119 5094453 5097412 2872549 965033 561899 -97010 -3184837 -7756926 -10164364 -8408279
38110 -8408279 -4836998 -3362753 -4714732 -6003239 -4898435 -2418401 -739076 92153
38102 92153 1350940 2363459 663104 -3938057 -7796741 -7717056 -5163753 -3921515 -4650590
38093 -4650590 -4701921 -3069470 -2097629 -3317468 -4821330 -4618113 -3716454 -3396035 -2125463
38084 -2125463 1380172 4184806 2588108 -1484726 -2392754 712218 2215487 -1566391
38076 -1566391 -6824208 -7864594 -4740339 -1761727 -759756 349957 3301312 7097564
38068 7097564 9749724 10038189 7754654 4195599 2172771 3665578 7490759 10619832
38060 10619832 11380489 10125378 7672436 4895232 3166416 3175371 3561345 2438355 -57961
38051 -57961 -2331467 -3755215 -4592560 -4189505 -1725253 1433388 2701262 1842478 1174004
38042 1174004 1857337 2489384 2038682 1601801 2089655 2545337 2273972 2512540 4116199
38033 4116199 5352700 4173906 1485123 -30609 376617 1029721 617735 -481291 -1564176
38024 -1564176 -2395927 -2352488 -508304 2647263 4884896 4682473 3197050 2657901 3249793
38015 3249793 2999765 944220 -1120984 -1162534 -39727 -210346 -1735837 -2074809 -453294
38006 -453294 289612 -1980660 -4944990 -5233678 -3836904 -4437703 -7021860 -7218273 -2600219
37997 -2600219 4042556 8957502 11557846 12608748 11636507 8755989 6472732 6639061
37989 6639061 7369735 5831216 2644353 640917 449578 365395 -180665 -149701 394111
37980 394111 81654 -1098070 -1564626 -867464 -257361 -289415 -268056 -419738 -2044879 -4781145
37970 -4781145 -6193627 -5137438 -3251297 -1923398 -163504 2703617 4342824 2002610
37962 2002610 -3190148 -7014209 -7106156 -5181586 -4108553 -4472328 -4819224 -4179218 -3145974
37953 -3145974 -2639368 -2634142 -2661087 -2933463 -3895322 -4746759 -3888624 -1497341 -177720 -1703539
37943 -1703539 -4322027 -5095826 -3949772 -3131212 -3274089 -2752888 -1001918 427119 821013
37934 821013 1446119 2420530 1227612 -3441322 -8383731 -9042635 -5013948 -299238 1277000
37925 1277000 -805478 -4439081 -6889191 -6623626 -4732253 -4111545 -5994753 -8094017
37917 -8094017 -7588661 -4836665 -2127291 251751 3970325 8823948 11772742 10696533
37909 10696533 7054689 3717030 1688275 122782 -1558891 -2819582 -2854345 -1617145
37901 -1617145 -179851 30683 -964608 -978463 1907482 6133993 7626925 4794473 1079604
37892 1079604 1088330 4945441 8058178 6478994 1288711 -2829001 -2668020 579858 3332291
37883 3332291 3624522 2353409 1031138 -110835 -1078777 -582079 2752110 7923308 11763887
37874 11763887 11811785 8220919 3147318 -707351 -1386821 926947 3739783 4732057 4304744
37865 4304744 4256659 4382916 2719677 -532679 -1967154 851079 6221610 10805489 13385014
37856 13385014 14417270 13851864 12005560 11313066 14094153 18731444 20797268 18374667
37848 18374667 13920712 10272298 7253666 3645896 546597 494831 3760135 7359467
37840 7359467 8211398 6402079 4830268 5860693 8670954 10131924 8325873 4771049
37832 4771049 2759602 3853446 6652213 8725620 8850993 7347494 5220139 3471447
37824 3471447 2713481 2955128 3746456 4341826 3611372 656636 -3535613 -5844521 -4096828
37815 -4096828 -146617 2090184 1830623 2252522 5191895 7669357 6004838 1505497
37807 1505497 -1116206 -342189 455722 -1548998 -4487245 -4673767 -1581500 2102843 4316350
37798 4316350 5494139 6832574 8316808 8916112 7899700 5486007 2440278 -667154
37790 -667154 -3536492 -5373232 -4806430 -1700224 1340843 1174873 -1617974 -2650252 719852
37781 719852 5480789 6747120 4278688 2473782 4029817 6470830 5978616 2501157
37773 2501157 -585188 -769094 1099384 2166154 514400 -3034309 -5709007 -5749193 -4517136
37764 -4517136 -4842675 -7370802 -9769654 -9613514 -6594699 -1779257 3350072 6542889
37756 6542889 5853499 2577879 1161226 4245985 9310752 12139042 12021007 11127828 10232512
37747 10232512 8285994 5709007 4786246 6332442 8565859 9800398 9931177 8856569
37739 8856569 5980568 2123769 -365233 -409644 810609 2287403 4253984 6028282
37731 6028282 5560432 2664158 139367 -245323 -489517 -2803825 -5602090 -5931378 -4164174
37722 -4164174 -3073759 -3347415 -3223616 -1937717 -420163 995456 2379695 2003378 -2081602
37713 -2081602 -7848533 -10321598 -7934091 -4501088 -3335074 -2908825 -863605 932389
37705 932389 -794573 -4663525 -5679663 -2096315 2530750 4758885 5295369 6086259 6281797
37696 6281797 3786769 -615511 -3532175 -3273894 -1687120 -1127203 -1337620 -446533 2019365
37687 2019365 4521721 5590432 5271922 4361333 3278961 2295570 2091096 3101077 4456397
37678 4456397 4506638 2777172 816336 451554 1417387 1534704 -452569 -2993270 -3569976
37669 -3569976 -2067235 -1015126 -2179755 -4256918 -4907220 -3954795 -3038345 -2729168 -1902034
37660 -1902034 -89171 1281886 666979 -1757065 -4589355 -6537898 -6878058 -5714221
37652 -5714221 -4279346 -3944792 -4558702 -4846575 -4580262 -4785361 -5504359 -5327109 -3871008
37643 -3871008 -2630355 -2294592 -1458749 535669 1857311 1331165 1040923 3129045 5902345
37634 5902345 6145065 3796601 1173194 -1027592 -3342783 -4373528 -2244598 1171494
37626 1171494 1820745 -546024 -2187986 -1600332 -1350739 -2658480 -2979618 -1011567 498853
37617 498853 -272303 -662712 1684400 4291608 4123164 3089128 4654485 7507754 7675619
37608 7675619 5256959 3744170 3462002 1209354 -3196478 -5305719 -2571025 1798555
37600 1798555 3604433 2798768 1589147 392782 -1549289 -3486627 -3796234 -2305873
37592 -2305873 40685 2990444 6615216 9750203 10653576 9329078 7954010 8571909
37584 8571909 10823212 12236060 10820935 7365026 4722095 4553196 5611699 6071021
37576 6071021 6458559 8584733 12221143 15019404 15718738 15316180 14833829 14211055 14025165
37567 14025165 15906488 19982094 23896527 25785163 26472861 27384844 28336889 29304881 32324898
37558 32324898 38814964 46283548 50849373 52547234 54986148 59733499 64494205 67809502
37550 67809502 71988470 78888329 85373105 86465799 82033757 76893068 74117252 71493088
37542 71493088 65888733 58421873 52943141 50840856 49804768 47205793 42532741 36661091
37534 36661091 30895760 27050876 26395876 27704014 28010508 26129588 23769033 22258311
37526 22258311 20185810 16003222 11324374 9254608 10130005 11076688 9632470 6105305
37518 6105305 2508263 672690 1180988 2715819 2813050 742184 -909113 706402 4636027
37509 4636027 7295417 7284462 6435684 6049373 5072739 2888601 1152147 1350896 2662177
37500 2662177 3680802 4279168 4247788 2218192 -1965471 -5482113 -5531570 -3062499 -1303352
37491 -1303352 -1391600 -1726882 -1183306 -575969 -693520 -751431 615462 3921719 8551246
37482 8551246 12914177 14993420 13932772 11166729 8965380 7876991 6620634 4382528
37474 4382528 1956603 473286 233020 1106166 2832580 4322908 3875390 1212746 -1414778
37465 -1414778 -1533636 250330 656146 -2016244 -5302248 -5559927 -2761470 -303243 20865
37456 20865 369149 2855020 5548741 5136720 2179490 349865 707358 317729 -2601774
37447 -2601774 -5573428 -5734095 -4079393 -3413968 -3994737 -3828986 -2187229 -436316 74086
37438 74086 -848473 -2636007 -4017143 -3474490 -1122935 727810 317244 -1249865 -1826159
37429 -1826159 -1047429 314473 2237931 4454862 5017300 2606927 -714623 -1896455
37421 -1896455 -1216916 -1170850 -1752963 -472950 2900335 5333647 5043231 3631120 2627487
37412 2627487 1234206 -833814 -1351091 1187891 4521071 5218762 2953828 288350
37404 288350 -540012 1005202 4219283 7213037 7642335 5164125 2388279 1943158 3401267
37395 3401267 4380721 3710287 2113847 680414 82196 502104 1040603 126422 -2154480
37386 -2154480 -3293008 -1603049 912680 1158737 -336798 15556 3441115 6521069
37378 6521069 5415552 546087 -4307009 -6383511 -5939135 -4587852 -3450282 -3250989
37370 -3250989 -4733792 -7630987 -9665918 -8177371 -3409138 847059 923895 -2929274
37362 -2929274 -7262849 -9203751 -8374990 -5898337 -3303996 -2119876 -2630351 -3028215 -1590991
37353 -1590991 463763 500670 -1238309 -1671594 333778 2364935 2707239 2757423 3396540
37344 3396540 2599921 -402073 -1939822 1035898 5209215 5049785 1262676 -199849
37336 -199849 2695147 5391509 4401002 2396877 2925963 4148828 1691197 -4546874 -10122573
37327 -10122573 -11629532 -9567297 -6084882 -2591704 13279 838946 -144681 -1531186
37319 -1531186 -1574020 107853 2069097 2435160 878334 -1105136 -2154024 -2626100 -3578385
37310 -3578385 -5075481 -6720107 -8887854 -11581837 -12925240 -11410756 -9257151 -10203733
37302 -10203733 -13456126 -13512458 -7710624 -523841 2303140 1013309 -52889 797047
37294 797047 1854960 2527941 3908700 4945444 2675145 -2547945 -6064654 -5110789 -2663524
37285 -2663524 -2618583 -4000370 -3261496 -434740 880375 -766581 -2567554 -1825589 352219
37276 352219 1123213 -282293 -2428944 -4001336 -4458054 -3116421 377606 4458832 6246628
37267 6246628 4753017 2544545 2950139 5892664 7777621 5845073 1475941 -1741485
37259 -1741485 -2415445 -2350084 -3275252 -4335088 -3748733 -1696775 -10285 553305 1171992
37250 1171992 2972906 5428620 7020081 6435121 2979929 -2680248 -7593666 -8153049
37242 -8153049 -4231497 -393726 -898665 -4226031 -5025225 -1422066 2413813 1965392 -1910335
37233 -1910335 -4869715 -4858227 -3504628 -2681568 -2415628 -2347227 -2848161 -3767032 -3812641 -2396399
37223 -2396399 -881482 -658608 -744409 1189353 5490339 9595372 10978798 10168025 9867744
37214 9867744 11271621 12327949 10329485 5560821 1153154 -712063 -1052227 -1784545
37206 -1784545 -2504149 -1286862 1657016 3077437 240566 -5675174 -10686483 -12060743
37198 -12060743 -10509928 -8504568 -7178468 -5472672 -2331644 1014983 2001769 -71340
37190 -71340 -3160692 -5412923 -7375925 -9844280 -11108819 -8977869 -4798447 -2248693
37182 -2248693 -1872351 -287406 3863915 6755981 4930165 1186734 1041888 4785012
37174 4785012 7385090 6157920 4172836 4768123 6478191 5884311 2880060 176130
37166 176130 -919052 -1341916 -1607027 -997605 557570 2002793 2846934 3511529 3755876
37157 3755876 2747142 1296611 1892940 5111756 7686652 6179267 1722478 -1018474
37149 -1018474 499341 4051115 6063300 5763666 4666492 3309261 625530 -3404451
37141 -3404451 -6396353 -6138826 -3748229 -2709530 -4586452 -7054840 -7128754 -5315994 -4902830
37132 -4902830 -7315764 -10128636 -10379701 -8110859 -5210061 -2226223 1441960 4883990
37124 4883990 5874948 4164141 2261057 1938449 1951526 694815 -623950 410098 3591270
37115 3591270 6122087 6278825 5081738 4116972 3476616 2467629 960584 -753099 -2412894
37106 -2412894 -3367267 -2633800 -259513 2040381 2496125 1154319 -534220 -1479324 -1449150
37097 -1449150 -336291 1674976 3089993 1783687 -2242652 -5685852 -5022255 -704401
37089 -704401 3039604 2929587 -24356 -2404026 -2230451 120133 3442969 6234125 6479975
37080 6479975 3332872 -845893 -2316319 -437367 1680228 1762854 1397643 2994330 5686920
37071 5686920 6490208 4556599 2187189 1894344 3931753 6493570 7317347 5532758 2716209
37062 2716209 1395605 1980099 2539883 2284767 3040776 5691427 7553575 5906023 2259090
37053 2259090 107726 -14693 88239 417225 2258615 4269534 3501599 485675 -977459
37044 -977459 235912 1019004 -479773 -1997644 -1523307 -681998 -1542569 -3320954 -4542705
37035 -4542705 -5582743 -6882636 -7398204 -6814525 -6426714 -5971534 -3048959 1970796 4339137
37026 4339137 1519734 -2199973 -1647528 1843469 3412078 2239161 1086422 391987
37018 391987 -1649528 -4229139 -4588866 -3175386 -3021140 -4063374 -3249383 -702257 -450304
37009 -450304 -3686686 -6238986 -4806133 -1468659 357120 658360 777687 -123630 -3223992
37000 -3223992 -6621278 -6854612 -3174936 1557360 3718590 1796300 -2590115 -5921689
36992 -5921689 -6077649 -4514029 -3833945 -3772085 -2026891 1226190 2946373 1951641 721644
36983 721644 1222464 1974125 946960 -1284254 -3102620 -4253725 -4903746 -4393071 -2713654
36974 -2713654 -1451174 -1715275 -2698277 -3304955 -3394664 -2773308 -1321761 -649304 -2542127
36965 -2542127 -5013484 -3714808 1312818 4604851 3244687 1278040 2806221 5225356
36957 5225356 4079958 835103 -39596 816357 -1111669 -5877793 -8257168 -5666240
36949 -5666240 -1482850 596416 851892 872362 792587 933872 2700161 5932523 8081064
36940 8081064 7635254 6135216 5589769 6103418 7051644 8334312 9401486 9123342 7583687
36931 7583687 6079087 4731892 2349700 -637433 -1579562 871671 4678367 6921608
36923 6921608 6604277 4306051 1204969 -759545 -39282 2178613 2932878 1726215 1472602
36914 1472602 4158096 8037307 10434984 10792286 9482565 6431933 2939536 2077167
36906 2077167 4626477 7039341 6448864 5483774 8380513 13834579 16019181 12487336
36898 12487336 7074624 4295710 4348868 4959258 5147029 5110427 4383766 2414948 118237
36889 118237 -952768 -681091 -370961 -836767 -1562394 -1760526 -1332917 -511807 690485
36880 690485 2108186 3005190 2899867 2671533 3686560 5391248 5110660 1558307 -2411105
$$ [...]
##END NTUPLES=NMR SPECTRUM
##END=
