##TITLE=31Pdec_LR-729B-R1-1
 d6, 24 sc
 14.12.2020
##JCAMPDX= 6.0         $$ Bruker NMR JCAMP-DX V2.0
##DATA TYPE= NMR SPECTRUM
##DATA CLASS= NTUPLES
##ORIGIN= UXNMR, Bruker Analytische Messtechnik GmbH
##OWNER= root
$$ XWIN-NMR		Version 3.5
$$ Mon Dec 14 10:35:53 2020 Russian Standard Time (UT+4h)  she@DPX200
##.OBSERVE FREQUENCY= 81.013821
##.OBSERVE NUCLEUS= ^31P
##.ACQUISITION MODE= SIMULTANEOUS
##.ACQUISITION SCHEME= undefined
##.AVERAGES= 24
##.DIGITISER RES= 17
##SPECTROMETER/DATA SYSTEM= spect
##.PULSE SEQUENCE= zgpg30
##.SOLVENT NAME= D2O
##.SHIFT REFERENCE= (INTERNAL, D2O, 0, 182.463)
##AUDIT TRAIL= $$ (NUMBER, WHEN, WHO, WHERE, WHAT)
$$ ##TITLE= Audit trail, XWIN-NMR		Version 3.5
$$ ##JCAMPDX= 5.01
$$ ##ORIGIN= Bruker BioSpin GmbH
$$ ##OWNER= she
$$ F:/spectra/data/she/nmr/P31/1/pdata/1/auditp.txt
$$ ##AUDIT TRAIL=  $$ (NUMBER, WHEN, WHO, WHERE, WHAT)
(   1,<2020-12-14 10:34:44.59 +0400>,<she>,<DPX200>,
      <created by zg, POWCHK disabled, PULCHK disabled
       configuration hash MD5:
       00 E9 B6 7A A2 85 ED C7 34 08 36 98 17 FE 4E 26
       data hash MD5: 32K
       AD 93 F2 71 04 6A 7F AB 53 3B 6B 3F 56 23 B5 3F>)
(   2,<2020-12-14 10:34:47.14 +0400>,<she>,<DPX200>,
      <Start of raw data processing
       efp BC_mod = 2 LB = 1 FT_mod = 6 PKNL = 1 PHC0 = -2398.407 PHC1 = 60.20074 SI = 64K 
       data hash MD5: 64K
       AB 14 30 61 39 20 CB AD 22 50 2A 34 9A 42 6E BD>)
(   3,<2020-12-14 10:35:08.98 +0400>,<she>,<DPX200>,
      <pk PHC0 = -43.82867 PHC1 = -37.80004 
       data hash MD5: 64K
       37 99 88 2B 67 17 D5 13 AB 31 4B 7D CE 3B 91 89>)
$$ ##END=
$$ 
$$ hash MD5
$$ A5 A1 96 C6 8B B4 41 DB 38 D1 32 02 99 96 88 C6
##$RELAX= 
##$RELAX= 
##$RELAX= 
##$RELAX= 
##$RELAX= 
##$RELAX= 
##$RELAX= 
##$RELAX= 
$$ Bruker specific parameters
$$ --------------------------
##$DU= <F:/spectra>
##$EXPNO= 1
##$NAME= <P31>
##$PROCNO= 1
##$TYPE= <nmr>
##$USER= <she>
##$AMP= (0..31)
100 100 100 100 100 100 100 100 100 100 100 100 100 100 100 100 100 100 
100 100 100 100 100 100 100 100 100 100 100 100 100 100 
##$AQSEQ= 0
##$AQ_mod= 1
##$AUNM= <au_zg>
##$AUTOPOS= <>
##$BF1= 81.014009
##$BF2= 200.13
##$BF3= 200.13
##$BF4= 200.13
##$BF5= 200.13
##$BF6= 200.13
##$BF7= 200.13
##$BF8= 200.13
##$BYTORDA= 1
##$CFDGTYP= 0
##$CFRGTYP= 5
##$CHEMSTR= <none>
##$CNST= (0..31)
1 1 145 1 1 1 1 1 1 1 1 1 1 1 1 1 1 1 1 1 1 1 1 1 1 1 1 1 1 1 1 1 
##$CPDPRG= <waltz16>
##$CPDPRG1= <>
##$CPDPRG2= <waltz16>
##$CPDPRG3= <>
##$CPDPRG4= <mlev>
##$CPDPRG5= <mlev>
##$CPDPRG6= <mlev>
##$CPDPRG7= <mlev>
##$CPDPRG8= <mlev>
##$CPDPRGB= <>
##$CPDPRGT= <>
##$D= (0..31)
0 1 0 0 0 0 0 0 0 0 0 0.03 2e-05 3e-06 0 0 0 0 0 0 0 0 0 0 0 0 0 0 0 0 
0 0 
##$DATE= 1607927683
##$DBL= (0..7)
120 120 120 11 120 120 24 19 
##$DBP= (0..7)
150 150 150 150 150 150 150 150 
##$DBP07= 0
##$DBPNAM0= <>
##$DBPNAM1= <>
##$DBPNAM2= <>
##$DBPNAM3= <>
##$DBPNAM4= <>
##$DBPNAM5= <>
##$DBPNAM6= <>
##$DBPNAM7= <>
##$DBPOAL= (0..7)
0.5 0.5 0.5 0.5 0.5 0.5 0.5 0.5 
##$DBPOFFS= (0..7)
$$ [...]
##$SUBNAM2= <"">
##$SUBNAM3= <"">
##$SUBNAM4= <"">
##$SUBNAM5= <"">
##$SUBNAM6= <"">
##$SUBNAM7= <"">
##$SUBNAM8= <"">
##$SUBNAM9= <"">
##$SW= 369.568048894756
##$SWIBOX= (0..15)
0 1 3 0 0 0 0 0 0 0 0 0 0 0 0 0 
##$SW_h= 29940.119760479
##$TD= 32768
##$TD0= 1
##$TE= 0
##$TE2= 300
##$TE3= 300
##$TEG= 300
##$TL= (0..7)
0 120 53 12 22 120 120 120 
##$TP= (0..7)
150 150 150 150 150 150 150 150 
##$TP07= 0
##$TPNAME0= <>
##$TPNAME1= <>
##$TPNAME2= <>
##$TPNAME3= <>
##$TPNAME4= <>
##$TPNAME5= <>
##$TPNAME6= <>
##$TPNAME7= <>
##$TPOAL= (0..7)
0.5 0.5 0.5 0.5 0.5 0.5 0.5 0.5 
##$TPOFFS= (0..7)
0 0 0 0 0 0 0 0 
##$TUNHIN= 0
##$TUNHOUT= 0
##$TUNXOUT= 0
##$USERA1= <user>
##$USERA2= <user>
##$USERA3= <user>
##$USERA4= <user>
##$USERA5= <user>
##$V9= 5
##$VALIST= <valist>
##$VCLIST= <CCCCCCCCCCCCCCC>
##$VD= 0
##$VDLIST= <DDDDDDDDDDDDDDD>
##$VPLIST= <PPPPPPPPPPPPPPP>
##$VTLIST= <TTTTTTTTTTTTTTT>
##$WBST= 1024
##$WBSW= 4
##$XGAIN= (0..3)
0 0 0 0 
##$XL= 0
##$YL= 0
##$YMAX_a= 15668
##$YMIN_a= -23938
##$ZGOPTNS= <>
##$ZL1= 120
##$ZL2= 120
##$ZL3= 120
##$ZL4= 120
##$ABSF1= 0
##$ABSF2= 0
##$ABSG= 0
##$ABSL= 0
##$ALPHA= 0
##$AQORDER= 0
##$ASSFAC= 0
##$ASSFACI= 0
##$ASSFACX= 0
##$ASSWID= 0
##$AUNMP= <proc_1d>
##$AZFE= 0.1
##$AZFW= 0.5
##$BCFW= 0
##$BC_mod= 2
##$BYTORDP= 0
##$COROFFS= 0
##$CY= -3
##$DATMOD= 1
##$DC= 0
##$DFILT= <>
##$DTYPP= 0
##$F1P= 0
##$F2P= 0
##$FCOR= 1
##$FTSIZE= 65536
##$FT_mod= 6
##$GAMMA= 0
##$GB= 0
##$INTBC= 1
##$INTSCL= 5.30512e-09
##$ISEN= 30
##$LB= 1
##$LEV0= 0
##$LPBIN= 0
##$MAXI= 10000
##$MC2= 0
##$MEAN= 0
##$ME_mod= 0
##$MI= 50
##$NCOEF= 0
##$NC_proc= -6
##$NLEV= 6
##$NOISF1= 182.463
##$NOISF2= 159.3651
##$NSP= 0
##$NTH_PI= 0
##$NZP= 0
##$OFFSET= 182.463
##$PC= 4
##$PHC0= -2442.236
##$PHC1= 22.4007
##$PH_mod= 1
##$PKNL= yes
##$PPARMOD= 0
##$PSCAL= 0
##$PSIGN= 0
##$REVERSE= no
##$SF= 81.014009
##$SI= 65536
##$SIGF1= 159.3651
##$SIGF2= -187.1042
##$SINO= 113.3802
##$SIOLD= 16384
##$SREGLST= <1H.CDCl3>
##$SSB= 0
##$STSI= 65536
##$STSR= 0
##$SW_p= 29940.119760479
##$SYMM= 0
##$S_DEV= 0
##$TDeff= 32768
##$TDoff= 0
##$TI= <>
##$TILT= no
##$TM1= 0
##$TM2= 0
##$TOPLEV= 0
##$USERP1= <user>
##$USERP2= <user>
##$USERP3= <user>
##$USERP4= <user>
##$USERP5= <user>
##$WDW= 1
##$XDIM= 65536
##$YMAX_p= 559897773
##$YMIN_p= -13177829
$$ End of Bruker specific parameters
$$ ---------------------------------
##NTUPLES= NMR SPECTRUM
##VAR_NAME=  FREQUENCY,     SPECTRUM/REAL,   SPECTRUM/IMAG
##SYMBOL=    X,             R,               I
##VAR_TYPE=  INDEPENDENT,   DEPENDENT,       DEPENDENT
##VAR_FORM=  AFFN,          ASDF,            ASDF
##VAR_DIM=   65536,         65536,           65536
##UNITS=     HZ,            ARBITRARY UNITS, ARBITRARY UNITS
##FACTOR=    0.456856943014862, 1,           1
##FIRST=     14782.0589164895, 0,            0
##LAST=      -15158.0608439895, 0,           0
##MIN=       -15158.0608439895, -13177829,   0
##MAX=       14782.0589164895, 559897773,    0
$$ Real data points
##PAGE= N=1
##DATA TABLE= (X++(R..R)), XYDATA
$$ [...]
39445A625327N12163m97169j201011j156744k57674R65423J519487Q79432m88837
39436A900397j563681j433611J29625K140397K831507J466747o05804j597304
39428C268273j483354j418167j542648j053991j80781p8855n54121K0889J852961
39419a169794K814584J493012o05898j268676m96307K83392N93303P82320N83844
39410C009780l50611j203478j063534o42460j103929j743808r29128R23331J619125
39401a484712O35439m6269P29938J368821K27517j581362j808686k97559J160691
39392a096182J487734J167827P83362K70636l00684m56329r4262L09390M16991
39383B488483K80355q4306o30706q73356m03717K03348k3907q40857q57118L86504
$$ plain form
39445 1625327 2137490 1640321 439310 -717434 -975108 -9685 1509802 2389234 1900397
39436 1900397 336716 -1096895 -967270 1173127 4004634 5471381 4865577 3268273
39428 3268273 1784919 366752 -1175896 -2229887 -2410668 -2489523 -3043644 -3022755 -1169794
39419 -1169794 1644790 3137802 2531904 1263228 766921 1050313 1643616 2425936 3009780
39410 3009780 2659169 1455691 392157 -250303 -1354232 -3098040 -4027168 -3103837 -1484712
39401 -1484712 -849273 -895542 -165604 1203217 1430734 -150628 -1959314 -2256873 -1096182
39392 -1096182 391552 1559379 2342741 2613377 2312693 1856364 1762102 2071492 2488483
39383 2488483 2768838 2684532 2053826 1180470 776753 980101 956194 115337 -741781 -355277
39373c55277J513018J202008M5670m62450q2240J96711q8091m13667m78969o23555
39363D53158q72407p30062k59258k27225o99870o74613J76214O35495j00029p46642
39353c045239K47134K041282K414669J038366k43440m00701m05698r86848j260454
39344f00929n59997J73706P7207j07200M07368P60546n3649j164693j103979j84867
39334b356487K53897J88325M80154P68307P1154q51348k32033J510324J876606
39325A708899J75282j187025m05373R71609N73675j230969k123589j104001O69069
39316a952423J652187J248597j10457j246024j140504k33664q06o88053p26043
39307c197190P21217K055994J444798n10136j870820k097343j926904j362170
$$ plain form
39373 -355277 1157741 2359749 2405419 1942969 1860729 2057440 1969349 1555682 1076713 453158
39363 453158 -419249 -1149311 -1408569 -1635794 -2335664 -3010277 -2834063 -2198568 -2298597 -3045239
39353 -3045239 -2798105 -756823 1657846 2696212 2452772 2052071 1646373 659525 -600929
39344 -600929 -1160926 -987220 -910013 -1017213 -609845 150701 97052 -1067641 -2171620 -2356487
39334 -2356487 -2102590 -1914265 -1434111 -665804 -594650 -1445998 -1678031 -167707 1708899
39325 1708899 1884181 697156 291783 1263392 1837067 606098 -1517491 -2621492 -1952423
39316 -1952423 -300236 948361 837904 -408120 -1548624 -1782288 -1783094 -2471147 -3197190
39307 -3197190 -2475973 -419979 1024819 514683 -1356137 -3453480 -5380384 -6742554
39299f742554J91385K098395K725028J641015J59628m36718p4390O27565R67322
39290A156676M23456o83119j116853l07181N79953L21460l82561j35784O97907
39281E53954O59792k11088n67123k54825l66239q14520k57836J227709J791899
39272A761723P79715j98565M766M55346K30032j9676K02906J1600r67860j433090
39262H26897o75940j06445p68440j240673j27162J118174M28123j153414q94709
39253b593589J172196K194802Q68135q87343j102787k21281M69497Q50122J232632
39244A982384J082081j70437j779036k244097j031499P98130J603362P35223p40187
39235B35924j110544l9602J037877R82321N01285O96353J038487L42460q82415
$$ plain form
39299 -6742554 -6551169 -4452774 -1727746 -86731 72897 -363821 -438211 189354 1156676
39290 1156676 1580132 897013 -219840 -527021 52932 374392 -8169 -143953 553954
39281 553954 1213746 1002658 435535 180710 -185529 -1000049 -1257885 -30176 1761723
39272 1761723 2541438 2342873 2347639 2802985 3033017 3013341 3216247 3227847 2259987 826897
39262 826897 150957 44512 -723928 -1964601 -2091763 -973589 -545466 -1698880 -2593589
39253 -2593589 -1421393 773409 1641544 754201 -348586 -569867 -100370 749752 1982384
39244 1982384 3064465 2894028 1114992 -1129105 -2160604 -1362474 240888 976111 235924
39235 235924 -874620 -914222 123655 1105976 1607261 2303614 3342101 3684561 2802146
39226B802146r84656O2300M70322m41870j111103l30352P76141O31635k96771
39217A577792m24933L47360O07470k00353q54625j91869J136761J465999L08968
39208C772570r58214p91279N81908J436188O70641r86478k068299j964208j028190
39199a335361J42351Q53103M52340p37330j192858J7709J660548J766054L02627
39190A929183r49791j035914p82069r50139j026052m57641J97344J66358m00140
39181c308861q64843r49756o43605J0021O11050O27623K67717L30869R10195J186628
39171a822962Q32834M97468M03746k55081j650950k221566n27367K416037L902821
39162A574980K502770n03192k522457k041842Q7172J466312O79115r51266r76133
$$ plain form
39226 2802146 1817490 1879790 2350112 1908242 797139 466787 1242928 1874563 1577792
39217 1577792 1152859 1500219 2107689 1907336 1052711 860842 1997603 3463602 3772570
39208 3772570 2814356 2023077 2604985 4041173 4711814 3725336 1657037 -307171 -1335361
39199 -1335361 -1193010 -339907 112433 -624897 -1817755 -1800046 -139498 1626556 1929183
39190 1929183 979392 -56522 -838591 -1788730 -2814782 -3272423 -3075079 -2908721 -3308861
39181 -3308861 -4173704 -5123460 -5767065 -5757044 -5145994 -4518371 -4250654 -3919785 -3009590 -1822962
39171 -1822962 -990128 -492660 -88914 -343995 -1994945 -4216511 -4743878 -2327841 1574980
39162 1574980 4077750 3574558 1052101 -989741 -902569 563743 1242858 291592 -684541
39153f84541P52144J699828L20803j507138j101705J172898K496637J488485k96349
39144D341062p87867J49580J030050N50198j181543k642125k226003j54912J352238
39135D30678O38002j166740j614560k53805R83445O84399l23866o34420k66817
39126a523684j27960l84391l79188K35285J065647J506742J187002P7158j351877
39117C04734k175470j710438k97998R04296J122687P79569P85577J117391P56018
39108A586366n92872j489069n20001J326827J564106l17315j911257j237098N44509
39099a045804J122000M47913K77756J037340J310655M28482m53102l79074l9993
39090B706173l74469r88535r23124j67287M76111N42300K47562k9376j81133m28400
$$ plain form
39153 -684541 67603 1767431 2088234 581096 -520609 652289 3148926 4637411 4341062
39144 4341062 3553195 3702775 4732825 5283023 4101480 1459355 -766648 -921560 430678
39135 430678 1068680 -98060 -1712620 -1966425 -982980 -298581 -622447 -1256867 -1523684
39126 -1523684 -1651644 -2036035 -2415223 -2179938 -1114291 392451 1579453 1656611 304734
39117 304734 -1870736 -3581174 -3879172 -2974876 -1852189 -1072620 -287043 830348 1586366
39108 1586366 993494 -495575 -1015576 311251 1875357 1558042 -353215 -1590313 -1045804
39099 -1045804 76196 524109 801865 1839205 3149860 3578342 3125240 2746166 2706173
39090 2706173 2331704 1343169 420045 252758 728869 1271169 1518731 1489355 1308222 879822
39080H79822r70778j347128n55111J459679K902900J994563m14137j636092p59828
39071A553890K85849q8750q04874l06502O09234J94400j044381r34158P75534
39062B40242J749413N25558j343039j639469m49640N49864O67781M91807K28683
39053A021200n05345j246399p28990J032302K097342J058721q59344j429620m60310
39044b0443L31999J76818J30481P63250Q71393l63804j446371n06038J681003
39035A618288K489050J022480q74499j360908p16676j94716j95923m33334q09158
39026E44604j130693p24848O35545J890932J748231L79266p10839m42081P98148
39017B988265J783699J598337K33970j433791k230182j675715n21990j4542n24328
$$ plain form
39080 879822 -90956 -1438084 -1993195 -533516 2369384 4363947 3949810 2313718 1553890
39071 1553890 1839739 1750989 946115 639613 1248847 1443247 398866 -535292 240242
39062 240242 1989655 2515213 1172174 -467295 -916935 -367071 300710 792517 1021200
39053 1021200 515855 -730544 -1459534 -427232 1670110 2728831 1869487 439867 -20443
39044 -20443 311556 488374 618855 1382105 2253498 1889694 443323 -62715 1618288
39035 1618288 4107338 5129818 4255319 2894411 2177735 1983019 1787096 1353762 544604
39026 544604 -586089 -1310937 -675392 1215540 2963771 3343037 2632198 2190117 2988265
39017 2988265 4771964 6370301 6604271 5170480 2940298 1264583 742593 728051 203723
39008B03723j151412q35745L20721J127137P49411k28465n48318P9606O99565
38999D16223N99845K99657N14842Q56514M74612m53036r76509r35741j067477
38990b71070j462728j188881O3767J078645O85436m97544q04582L38539J798772
38981b59646K187221J366497M02813K76813Q12249R89533K83990p14430j247872
38972D097168j368786j396511j042930n8891P55815M80403k62946o0753R24660
38963B067229J030643j81655j087086n88610J85934j28294r65080j018943l95260
38954a081122n7220j6946L79823R54715R48295M33493J93707L81186L74279j54593
38944B355617q67085j277709j058040k33034M51339R3332q66641p49853R10672
$$ plain form
39008 203723 -947689 -1783434 -1462713 -335576 413835 185370 -362948 -283342 416223
38999 416223 1016068 1315725 1830567 2687081 3161693 2708657 1732148 796407 -271070
38990 -271070 -1733798 -2922679 -2858912 -1780267 -1094831 -1592375 -2396957 -2058418 -259646
38981 -259646 1927575 3294072 3696885 3973698 4785947 5775480 6059470 5345040 4097168
38972 4097168 2728382 1331871 288941 230050 985865 1466268 1203322 1142569 2067229
38963 2067229 3097872 2916217 1829131 1240521 1426455 1298161 333081 -685862 -1081122
38954 -1081122 -1138342 -1155288 -775465 179250 1127545 1561038 1754745 2135931 2510210 2355617
38944 2355617 1488532 210823 -847217 -1080251 -628912 -535580 -1402221 -2152074 -1241402
38935a241402K207788J378764o11082j515945r21411k07910j04610j06469N3480
38926a068797P9676O9268L08702L95074p1922m25801k6484K95975l66367r76108
38916a786784p8490J337454J056752o65760j423020o09593o3670m45950j59269
38907b838330J260936J815542M73218r17885p63248j07909j37388L7724J016844
38898a60496J154167m86664j615812j35806J963944J500091p12426j293854Q0121
38889B93265N30277p40481j130314N66706J787928L62430j876994j884062J64563
38880a926682J562939J117825L03473O19487J526843J478118J10636j265580j323150
38871B203909l93824O1265m51406q75776m91819j37645n82058r04817r979J225756
$$ plain form
38935 -1241402 966386 2345150 1734068 218123 -703288 -911198 -1015808 -1122277 -1068797
38926 -1068797 -989121 -919853 -611151 -216077 -287999 -713800 -740284 -444309 -810676 -1786784
38916 -1786784 -1865274 -527820 528932 -136828 -1559848 -2169441 -2233111 -2679061 -2838330
38907 -2838330 -1577394 238148 711366 -206519 -969767 -1077676 -1215064 -1177340 -160496
38898 -160496 993671 507007 -1108805 -1244611 719333 2219424 1506998 213144 293265
38889 293265 823542 83061 -1047253 -480547 1307381 1669811 -207183 -2091245 -1926682
38880 -1926682 -363743 754082 1057555 1677042 3203885 4682003 4792639 3527059 2203909
38871 2203909 1810085 1871350 1419944 544168 52349 -85296 -667354 -1572171 -1582150 -356394
38861c56394J181228J88641p0332N45169O16468n9921r5323P88819J083769J60096
38851C982220o95695p64605j098152k086067k141887m31313J161969P52760n95038
38842a915808p60681Q0342L62845J97800Q34850J690929P81354j715190k914596
38833c358155j081492J919077L073277J761635j66114r16820l79959L34180L19881
38824A505510j23387P2292J112038J666681N95731j161593j635766n77832K51544
38815A705218k76213j152553r34115K58290J223834J247970M11946q61216j750638
38806a27477j262437M90537J732603Q55820j343039k300981p54229J652105K239541
38797A182443L00238k228369k895706j165654J286660K415988J740763M85956
$$ plain form
38861 -356394 824834 1013475 943143 1488312 2104780 2044859 1949536 2738355 3822124 3982220
38851 3982220 3286525 2521920 1423768 -662299 -2804186 -3235499 -2073530 -1320770 -1915808
38842 -1915808 -2676489 -2596147 -2233302 -2035502 -1200652 490277 1271631 -443559 -3358155
38833 -3358155 -4439647 -2520570 552707 2314342 2148228 1231408 851449 1185629 1505510
38824 1505510 1382123 1454415 2566453 4233134 4828865 3667272 2031506 1453674 1705218
38815 1705218 1429005 276452 -657663 -399373 824461 2072431 2484377 1623161 -127477
38806 -127477 -1389914 -899377 833226 1689046 346007 -1954974 -2709203 -1057098 1182443
38797 1182443 1482681 -745688 -3641394 -4807048 -3520388 -1104400 636363 1122319
38789A122319K5933M14994N46933l20576j451559j369174K09444J658810J266528
38780B103652m74370j360548m56753N80587l9166j499777j547536P2562J128690
38771a492659J66189j340451j056656J034599K705966K281212L23131j359361
38763A261970j568197m88342P97202J310552R29463K82163p0133j62982k99825
38754A991871n37876p37300q50388q63340o11032Q2750J106805J969920J979058
38745C530468P65138r95987j711020n37447J146573J052651r12884k115360o38567
38736d16435J849681K100335m37119k945921k839143n62747J559361K036882J111711
38727A456605j44931q14839o33285q3849J99530K82097P39256J516000J674517
$$ plain form
38789 1122319 1148252 1563246 2110179 1789603 338044 -1031130 -821686 837124 2103652
38780 2103652 1629282 268734 -188019 392568 353402 -1146375 -2693911 -2621349 -1492659
38771 -1492659 -1326470 -2666921 -3723577 -2688978 16988 2298200 2621331 1261970
38763 1261970 -306227 -794569 2633 1313185 2242648 2524811 2454678 2291696 1991871
38754 1991871 1453995 716695 -133693 -997033 -1608065 -1525315 -418510 1551410 3530468
38745 3530468 4295606 3299619 1588599 1051152 2197725 3250376 2337492 222132 -416435
38736 -416435 1433246 3533581 3096462 150541 -2688602 -3251349 -1691988 344894 1456605
38727 1456605 1311674 496835 -136450 -220299 -20769 261328 1000584 2516584 4191101
38718D191101O33079r65965k040490k155822j462590k60810Q26637R77968K41949
38709a4943j33818O61019J596788J153258l24233r89164j95907O15731J77833
38700B546564p82550q45788p1188K52130m13141j170682r84297P0161J004198
38691c94593J019596L52635Q7068Q78742J850069J400789n69678k086330j498451
38682A039847K73569R91206R8517q92002q28869j93255K70026O00647O88941j56410
38672A892217j683716k142149o59515R81987O87014p30851p99548O09887J067413
38663g77261l57423j469249n30316Q91991N59925p61726p05631P12026J236547
38654a201117K39813k81687R01028K262476K025609P14149j87339n55923r92541
$$ plain form
38718 4191101 4824180 3858215 1817725 -338097 -1800687 -2061497 -1234860 -256892 -14943
38709 -14943 -148761 512258 2109046 3262304 2938071 1948907 1753000 2368731 2546564
38700 2546564 1764014 918226 847038 1099168 686027 -484655 -1468952 -1398791 -394593
38691 -394593 625003 977638 1064706 1943448 3793517 5194306 4624628 2538298 1039847
38682 1039847 1313416 2304622 2403139 1511137 682268 489013 759039 1359686 2048627 1892217
38672 1892217 208501 -1933648 -2593163 -1611176 -924162 -1655013 -2454561 -1844674 -777261
38663 -777261 -1134684 -2603933 -3134249 -2242258 -1682333 -2444059 -3149690 -2437664 -1201117
38654 -1201117 -961304 -1242991 -341963 1920513 3946122 4660271 4472932 3917009 2924468
38645B924468j102916k92449N17903k7668j274248j224702K71358J031125j75222
38636F47649j717432j563515j59338N55736O295o62784n34633K12249J126609
38627b089164J840566J683914K59498j436777j703218l09237J099177J221204
38619E65963O41511M86398O03492J45024p37438j033473m82127Q2918O7714j18621
38609B21361J30013P27683J073733O57023o03489k114584k686118j534233N82225
38600c546386J858580J382370K4808q77637j049254r87233q17462k78509M46873
38591c843850P44916M64934J63536L03356O65708P30923L26952k35746m77056
38582a156327j72247L62633N13530J38612j02543L90312J131675J009424j68983
$$ plain form
38645 2924468 1821552 1529103 2047006 2019338 745090 -479612 -208254 822871 647649
38636 647649 -1069783 -2633298 -2792636 -2236900 -2230605 -2893389 -3428022 -3215773 -2089164
38627 -2089164 -248598 1435316 1694814 258037 -1445181 -1754418 -655241 565963
38619 565963 1207474 1693872 2297364 2442388 1704950 671477 189350 272268 339982 221361
38609 221361 351374 1079057 2152790 2809813 2206324 91740 -2594378 -4128611 -3546386
38600 -3546386 -1687806 -305436 -280628 -1158265 -2207519 -3194752 -4012214 -4290723 -3843850
38591 -3843850 -3098934 -2634000 -2470464 -2167108 -1501400 -770477 -443525 -679271 -1156327
38582 -1156327 -1328574 -965941 -452411 -313799 -416342 -26030 1105645 2115069 1946086
38573A946086j263952j256214n18662q2605n6214M06248J549096K271084J487756
38564D482623k06244j040008k90438P70231O28151m08271q06894j83978J70840
38555C116012n48684j241830n63886Q91662J355100L79392p72018j113203r31950
38546E70595o34337O27Q82020J181241O26545J60138M03585M68336n60576j807043
38536A291131j709505m41036L52503J04866j1618P17780J249792M72833r80563
38527A046183j644538j189122m47809K3072L56027N84974M93708K89024M89682
38518A201R26404P17535l41780j142029o55603O21413J401863J294830P66320
38509C590154k02989j960807l545235k937151P8562K767655K684450R45398L31572
$$ plain form
38573 1946086 682134 -574080 -1092742 -1175347 -1231561 -825313 723783 2994867 4482623
38564 4482623 4276379 3236371 2945933 3716164 4344315 3936044 3129150 2945172 3116012
38555 3116012 2567328 1325498 761612 1653274 3008374 3387766 2615748 1502545 570595
38546 570595 -63742 -63115 818905 2000146 2626691 2786829 3190414 3658750 3098174 1291131
38536 1291131 -418374 -859410 -506907 -402041 -413659 304121 1553913 2026746 1046183
38527 1046183 -598355 -1787477 -2235286 -2212214 -1856187 -1271213 -777505 -488481 1201
38518 1201 927605 1645140 1303360 161331 -494272 127141 1529004 2823834 3590154
38509 3590154 3387165 1426358 -2118877 -5056028 -4977466 -2209811 474639 1420037 1751609
38500A751609R46231L67287j906585l138510j552125Q37845J446728R24376J281534
38491I58390J975993R82734j100445j393365O66807K155276R55406j384030k338241
38482A478525j760224j006616m60281L29963J192500J600949J634146J463371
38474D472333O89295p08485j645377j344343o79328q99354j702137j765093o20013
38465d202502J044852K333849K474215J045488j071594j924828q65168L32381
38457h33307N3367o96900k10494P85055L34380j155962j309498L41730J618608
38448a073021J240066N18636P14147J070470O48017Q0990J57552L03110j64991
38439C494976o39442l52117K59909M15207J22009m22823j290708j839604q47629
$$ plain form
38500 1751609 2697840 3065127 1158542 -1979968 -3532093 -2694248 -1247520 -323144 958390
38491 958390 2934383 3917117 2816672 1423307 2090114 4245390 5200796 3816766 1478525
38482 1478525 -281699 -1288315 -1748596 -1418633 -226133 1374816 3008962 4472333
38474 4472333 5161628 4453143 2807766 1463423 784095 -115259 -1817396 -3582489 -4202502
38465 -4202502 -3157650 -823801 1650414 2695902 1624308 -300520 -1165688 -833307
38457 -833307 -779940 -1476840 -1687334 -902279 -567899 -1723861 -3033359 -2691629 -1073021
38448 -1073021 167045 685681 1399828 2470298 3118315 3199305 3356857 3659967 3494976
38439 3494976 2855534 2503417 2763326 3178533 3300542 2877719 1587011 -252593 -1100222
38430a100222J275248K115250N61951j172050o73995J021074J123601o96588k249014
38421B05255k314313j684348r37750L25395J731710J850739L80473j071280j101513
38412b615632q8302Q59518J258831J048204K12170q09737j257856r94020n01069
38403b887893J37549J176973K032939J520070k68952j551072j012847N36419J334965
38394A018151P93742j24819j89716P81700J621563R67029q67135j775764n39245
38385A685506J141490P84883j291573k490294j724617l67273O16169J727965K496628
38376B578884J025352k418611m148125j794161J847013K505392L91746p03639
38368g16149N99586J611371J36745k308842k956508j397943N23911J201023O24934
$$ plain form
38430 -1100222 175026 2290276 2852227 1680177 1006182 2027256 3150857 2454269 205255
38421 205255 -2109058 -3793406 -4731156 -4405761 -2674051 -823312 -442839 -1514119 -2615632
38412 -2615632 -2703934 -1844416 -585585 462619 674789 -134948 -1392804 -2386824 -2887893
38403 -2887893 -2750344 -1573371 459568 1979638 1710686 159614 -853233 -316814 1018151
38394 1018151 1811893 1687074 1497358 2279058 3900621 4867650 4000515 2224751 1685506
38385 1685506 2826996 3611879 2320306 -169988 -1894605 -2261878 -1645709 82256 2578884
38376 2578884 3604236 1185625 -2962500 -4756661 -2909648 -404256 -12510 -716149
38368 -716149 -116563 1494808 1631553 -677289 -3633797 -5031740 -4507829 -3306806 -2681872
38359b681872m2834K77747J314166J490561m7707j858801j847464j73188J037317
38350b532075Q35134M66847Q23272Q25741m83732j800771j211628P96896J754358
38341e25958N90430r18224o28518J122308K132424J324701p8713n84433m48040
38332A985977p42117j287492j033731j58616O1228l24494K98362K115979K770348
38323C685444P34624k031253k745544j608354p24565n45516K1519R13507J153821
38314a146317J186040K016761K457123N18901k489420k928541m67413J045451
38306A92585m23418k066671j161896P04441J109323J111867K487599L332665P81634
38297F068129l402327m443031j386994J745054J935694N74270j981J0785n06437
$$ plain form
38359 -2681872 -2724706 -2446959 -1132793 357768 310061 -1548740 -3396204 -3569392 -2532075
38350 -2532075 -1696941 -1230094 -406822 418919 -64813 -1865584 -3077212 -2280316 -525958
38341 -525958 64472 -853752 -1482270 -359962 1772462 3097163 3018450 2434017 1985977
38332 1985977 1243860 -43632 -1077363 -1235979 -1174751 -1499245 -1200883 915096 3685444
38323 3685444 4420068 2388815 -356729 -1965083 -2689648 -3235164 -3213645 -2300138 -1146317
38314 -1146317 39723 2056484 4513607 5032508 2543088 -385453 -852866 192585
38306 192585 -230833 -2297504 -3459400 -2754959 -1645636 -533769 1953830 5286495 6068129
38297 6068129 2665802 -1777229 -3164223 -1419169 516525 1090795 1088814 1099599 593162
38288E93162j066966o57301K07443K79601m31207q14484l27886M38666O50160
38279a128812J60961l59935k01558L82749L89864l59966o90291J21125R92595
38270f93268P17959l142J25978N31896k76067j795877j951366l63562J176162
38261b531287J695690K014191K232522R63262j766808l362687k165077q5712K78180
38252b727726m88035n582J713487K149509K80367j662715j263812Q09486J833104
38243F38083O67091r25565q88332K18842J69638j268469j504901R61102L533946
38234A601435K660981r68367l152264k005756p5362P5763n87951n5427J197942
38225a309006J393313N09600p9709J9689J66044J79360J77214k98271j354679
$$ plain form
38288 593162 -473804 -1131105 -923662 -644061 -1075268 -1889752 -2217638 -1778972 -1128812
38279 -1128812 -967851 -1327786 -1529344 -1146595 -756731 -1116697 -1806988 -1685863 -693268
38270 -693268 24691 21549 147527 679423 403356 -1392521 -3343887 -3707449 -2531287
38261 -2531287 -835597 1178594 3411116 4374378 2607570 -755117 -2920194 -3005906 -2727726
38252 -2727726 -3215761 -3221343 -1507856 641653 922020 -740695 -2004507 -1195021 638083
38243 638083 1305174 379609 -508723 -289881 -120243 -1388712 -2893613 -1932511 1601435
38234 1601435 4262416 3294049 141785 -1863971 -1939333 -1863570 -2451521 -2506948 -1309006
38225 -1309006 84307 593907 514198 533887 699931 879291 1056505 758234 -596445
38216e96445j748405m94106J237868J558238O02142R8161O51350J200644R41432
38207C450879J88115n48661r69640o97524J43732M42793m81232j480487j090083
38198a042108Q6071K27021q31922j449577p96625K35620Q49887J289736J684388
38189B52491J555292Q68686K44552j21896n07282o51767j36066L24835l44190
38180A484655j491854j326684J73537R72536J32497p91818l68085O61260J056868
38171E02912R90550R20392K37908j283451k054651o43303J652530K160677M36190
38162B919754j255380j088161K34382R34982N08584j03268n2650M56759O96214
38153C251216L76670k39256r62773j794070k269911j535690K61911J426697O72137
$$ plain form
38216 -596445 -2344850 -2838956 -1601088 -42850 559292 657453 1308803 2509447 3450879
38207 3450879 3638994 3090333 2120693 1423169 1566901 2009694 1528462 47975 -1042108
38198 -1042108 -956037 -729016 -1560938 -3010515 -3807140 -3571520 -2721633 -1431897 252491
38189 252491 1807783 2676469 2921021 2799125 2291843 1640076 1504010 1828845 1484655
38180 1484655 -7199 -1333883 -1160346 -187810 -55313 -847131 -1215216 -553956 502912
38171 502912 1493462 2413854 2651762 1368311 -686340 -1329643 322887 2483564 2919754
38162 2919754 1664374 576213 810595 1745577 2254161 2150893 2098243 2555002 3251216
38153 3251216 3627886 3388630 2425857 631787 -1638124 -3173814 -2911903 -1485206 -813069
38144h13069q72435r62260O83705K071783J741556L95126n64329p17863m13762
38135E48452j05353l21672j147441j487421j84659J888830K444187R10795p34653
38126A811065q86310k56462o0939j47218j33946o13591j696534j942803m63174
38117d389912J263483J465025P53737P96235J361961Q86681o32501j488369q71362
38108h55022K03254N88993J40653p70645j535530j277584J61901J464443J335493
38099e44044L99765K20603Q53192R86343K57919l25401k97315l49611p77166q62749
38089d38464k73763K23063k9343o35067q23421l38570N12114J077720P70760r8937
38079e3908l51962L91470Q53224J07352n36031N04037K028181J420864j138051
$$ plain form
38144 -813069 -1685504 -2647764 -1964059 107724 1849280 2244406 1680077 962214 548452
38135 548452 443099 121427 -1026014 -2513435 -2698094 -809264 1634923 2545718 1811065
38126 1811065 924755 668293 607354 460136 326190 -287401 -1983935 -3926738 -4389912
38117 -4389912 -3126429 -1661404 -907667 -111432 1250529 2137210 1504709 16340 -855022
38108 -855022 -651768 -62775 77878 -692767 -2228297 -3505881 -3343980 -1879537 -544044
38099 -544044 -144279 76324 929516 1915859 2173778 1848377 1551062 1201451 424285 -438464
38089 -438464 -712227 -489164 -518507 -1153574 -1976995 -2315565 -1803451 -725731 45029 -53908
38079 -53908 -405870 -14400 838824 946176 410145 914182 2942363 4363227 3225176
38070C225176k523736j199651P16978R47078K00060K78773J003798R67989O9590
38061C686055o10660o95962o36512m73763N0970M77240K7405j059993j618700
38052h53920r81279L81437J548052J917513J450792O03292r9796n95030j083341
38043B287720j345156r56634k37449p085j86919J46031Q74453M96950j373489
38034c01578k647640j468358Q05336J287203k94174j282808l7380J885950K262035
38025B08586J196384L29790K17039O6424m18128n33477m7658J73745m08838r64172
38015a80305n20699M32292O11938j21597o31758l17511Q7797j30543n53780m54203
38005a778369R8788N94976Q20747O44362j26612r86202p39024Q19198K100838
$$ plain form
38070 3225176 701440 -498211 218767 1165845 1365905 1644678 2648476 3616465 3686055
38061 3686055 3075395 2379433 1742921 1269158 1320128 1797368 1824773 764780 -853920
38052 -853920 -1835199 -1453762 94290 2011803 3462595 4065887 3966091 3371061 2287720
38043 2287720 942564 -14070 -251519 -258604 -445523 -299492 574961 1071911 -301578
38034 -301578 -2949218 -4417576 -3612240 -2325037 -2619211 -3902019 -3939399 -2053449 208586
38025 208586 1404970 1734760 1951799 2018223 1600095 1066618 1018960 1192705 783867 -180305
38015 -180305 -701004 -268712 343226 221629 -410129 -727640 -639843 -770386 -1324166 -1778369
38005 -1778369 -1679581 -1084605 -263858 380504 253892 -732310 -1471334 -652136 1448702
37996A448702J680322K35567o34759o74562o62554o92041m35416m23771j172065
37987a330577j581954l37316J456467J379153n88244j905309j288627j58299K66514
37978d088192O60899J409359J351747J58320m10496O55149J645301R30774k30066
37969B082795Q9773J129630Q12605p02260j396821o56820J82352J88184l26040
37960A403398j030603j772168j786790m98943J099966J533057J032171R81064
37952I61152J465755J199845k03147j643647k235582j970793p96451J166253K483685
37943D27070J507507r86456k141436o64989J528742K077087J012282q9570m12813
37934B257424j82398L44322R38383J034406L28142n93770r66076q71379r07171
$$ plain form
37996 1448702 3129024 3364591 2729832 2055270 1392716 700675 265259 -158512 -1330577
37987 -1330577 -2912531 -3249847 -1793380 -414227 -1002471 -2907780 -4196407 -4354706 -4088192
37978 -4088192 -3427293 -2017934 -666187 -507867 -918363 -263214 1382087 2312861 2082795
37969 2082795 2172568 3302198 4114803 3412543 2015722 1358902 1541254 1729438 1403398
37960 1403398 372795 -1399373 -3186163 -3685106 -2585140 -1052083 -19912 961152
37952 961152 2426907 3626752 3423605 1779958 -455624 -2426417 -3222868 -2056615 427070
37943 427070 1934577 948121 -1193315 -1858304 -329562 1747525 2759807 2670237 2257424
37934 2257424 2075026 2419348 3357731 4392137 4720279 4126509 3160433 2289054 1381883
37925A381883j099092q16972K29880J379560J590112N35249r70779j731696j320459
37916h22314l00133N73936Q99739M56582o71381j561286j025820P13487J875005
37907A37815J361514J58215m00827n86505j151172j370154j33380J598381J587159
37898A201046l64808j842479j058822R19013J872838J127514k35762j015480r90352
37889c87292p41675p80240q41799k91544O68387R83590M23379J86944R07449J288547
37879A415746J87475j107787o32047J082123J782723Q91883j88919p72336j386511
37870A272350j759784r78031K49723K55414m02314N25793K657178K623002n71505
37861C871826l191146j969190J194906K375334J112781j71759m43263n74004p34077
$$ plain form
37925 1381883 282791 -534181 -304301 1075259 2665371 3200620 2229841 498145 -822314
37916 -822314 -1122447 -548511 351228 807810 136429 -1424857 -2450677 -1737190 137815
37907 137815 1499329 1657544 1256717 670212 -480960 -1851114 -1984494 -386113 1201046
37898 1201046 836238 -1006241 -2065063 -1146050 726788 1854302 1618540 603060 -387292
37889 -387292 -1128967 -1909207 -2751006 -3042550 -2374163 -1390573 -967194 -780250 127199 1415746
37879 1415746 1603221 495434 -136613 945510 2728233 3620116 3431197 2658861 1272350
37870 1272350 -487434 -1465465 -1215742 -960328 -1362642 -836849 1820329 4443331 3871826
37861 3871826 680680 -1288510 -93604 2281730 3394511 3222752 2779489 2205485 1471408
37852A471408l16017J33313l54279r31620o7512J385082J023867j075434j944975
37843f76167p3801K273441K313458M24928r14271n72819M31480R25079R08403
37834E039731Q81854Q88564P07335N83343J158293K484192L590394L711533L746517
37825B2791756N391664Q399822R754907O589960m41554p427749j0620492r281193
37817B5157121n720874l107884k842816l643447l453280k071479r44441n28442
37809B844458L31869J813002J998053j00831k142339j309539J448849K458411
37801G341933K82578k641201l510575k276636o98923L9895o2785m62243m85080
37792b473037K38706J300538J934949J963194J681819R62279n43949k223424k620873
$$ plain form
37852 1471408 1155391 1288704 934425 2805 -64707 1320375 2344242 1268808 -676167
37843 -676167 -749968 1523473 3836931 4261859 3347588 2774769 3206249 4131328 5039731
37834 5039731 5921585 6810149 7517484 8100827 9259120 11743312 15333706 19045239 22791756
37825 22791756 28183420 36583242 46338149 52928109 52486555 45058806 34438314 25157121
37817 25157121 19436247 16328363 13485547 9842100 6388820 4317341 3372900 2844458
37809 2844458 3176327 4989329 6987382 6886551 4744212 3434673 4883522 7341933
37801 7341933 7624511 4983310 1472735 -803901 -1502824 -1462929 -1525714 -1987957 -2473037
37792 -2473037 -2234331 -933793 1001156 2964350 4646169 5608448 5064499 2841075 220202
37783B20202j213976O84627J318985L63713r32477j193797k85514O68074O36202
37774B66039j7406l7518Q23423J218468P6458j679352k137482o79105J500467
37765f66008K731263K079118j61057k333900k407618j45197K131832J976523l31183
37756B873773k322892k339474r58278K62487M23310j93970m80690L56194J522350
37747h57190J286123m54017j504631m59076R82267O28462n55109j8756J845296
37738H93369J895189o75266k507001p85459K514303L167450K90486k686324k489971
37729c83224J55766J853984R54394n80331k40340J246673J062605j013531j757047
37720A298949O10891L470449L902434L177277M053952N833252O221573O515954
$$ plain form
37783 220202 -993774 -309147 1009838 1373551 441074 -752723 -1038237 -370163 266039
37774 266039 248633 211115 1034538 2253006 2329464 650112 -1487370 -2166475 -666008
37765 -666008 2065255 4144373 3983316 1649416 -758202 -903399 1228433 3204956 2873773
37756 2873773 550881 -1788593 -2746871 -2484384 -2061074 -2255044 -2735734 -2379540 -857190
37747 -857190 428933 -25084 -1529715 -1988791 -1006524 -378062 -933171 -951927 893369
37738 893369 2788558 2113292 -393709 -1179168 1335135 4502585 4793071 2106747 -383224
37729 -383224 -227458 1626526 2580920 2000589 1760249 3006922 4069527 3055996 1298949
37720 1298949 1909840 5380289 9282723 12460000 16513952 22347204 28568777 35084731
37712C5084731R647121J3229682J0454429j61639j0909567j3847687r867801n538492
37704B8090777m180462m094201l471251k654876k050422j277698n76680o80791
37696I104396j292687j498685j356010j415314j271216l33768N88331K89923p72760
37687B042210j154234o22311k5709M18594R50563J005000K4570r55089m84963
37678A198631Q78224J268805L62111m46469n59240q15987j498231j661930q57844
37669b131930J12908N15407L60976l11022j318498j520927R4377K327531K678893
37660H07715Q19346p36222j62205J283344J456785L23092o30691q16960q68681
37651A475523j146355j270351r90986n76078k97464r2879K00277N08750M51300
$$ plain form
37712 35084731 44731852 57961534 68415963 68254324 57344757 43497070 33629269 28090777
37704 28090777 23910315 19816114 16344863 13689987 11639565 10361867 9785187 9104396
37696 9104396 7811709 6313024 4957014 3541700 2270484 1936716 2525047 2814970 2042210
37687 2042210 887976 265665 239956 658550 1609113 2614113 2638683 1683594 1198631
37678 1198631 2076855 3345660 3707771 3261302 2702062 1886075 387844 -1274086 -2131930
37669 -2131930 -2019022 -1503615 -1142639 -1453661 -2772159 -4293086 -4198709 -1871178 807715
37660 807715 1627061 890839 728634 2011978 3468763 3791855 3161164 2344204 1475523
37651 1475523 329168 -941183 -1932169 -2508247 -2805711 -2898590 -2698313 -2189563 -1738263
37642a738263k55604j115271r81095N14378K032131J941891M61235o56539m72862
37633b69999K61114N93995M21305j84910j293101k253111j869220j67476J219725
37624c541678J248625Q24862R93119J088850J72248p77170r3301J577658J659814
37615C153027o37135k886778k637475n65335Q19567N79086r2170k12355j85182
37606b664750m07329k58780O83225J510095J171418J50450k39515J10712P8920
37597A34446o51343q74780K57524J683483J646892l0101j709918j878651p80031
37588b202479L3135l68858j068695m88477J140228J539205m89149k755814k255298
37579f916202N36950K224769J388592K73943P45746J308180J1726j915795j869856
$$ plain form
37642 -1738263 -1993867 -3109138 -4090233 -3575855 -1543724 398167 859402 202863 -269999
37633 -269999 -8885 585110 1006415 821505 -471596 -2724707 -4593927 -4761403 -3541678
37624 -3541678 -2293053 -1468191 -475072 613778 786026 8856 -84445 1493213 3153027
37615 3153027 2515892 -370886 -3008361 -3573696 -2754129 -2175043 -2267213 -2479568 -2664750
37606 -2664750 -3072079 -3330859 -2647634 -1137539 33879 184329 -55186 55526 134446
37597 134446 -516897 -1391677 -1134153 549330 2196222 2166121 456203 -1422448 -2202479
37588 -2202479 -2169344 -2538202 -3606897 -4095374 -2955146 -1415941 -1905090 -4660904 -6916202
37579 -6916202 -6379252 -4154483 -2765891 -2491948 -1746202 -438022 -426296 -2342091 -4211947
37570d211947J03151J656631J702894J184009P75343J83580l97834k68382K91230
37561A018675L43710M5982K70755O41962m4275j430230j718070m33000R15537
37552c88954J256482J085642Q20924J04193o95823l87769Q17522J000862n21362
37543C091717j840686j266058K26371P38494J70448k78175j40836K12184N68998
37534A482457P27244J96163q73248j340722o54914J78940J93280n6029K85958
37525A39129P58593M95570k13639o24972r05988j375958j249890K13758J948229
37516h15168K209303J114186L21376L52478Q4942q68024j162699R950J133689
37507B380033K61256j960096k693837n86859K155598K316971k60187k484248k049166
$$ plain form
37570 -4211947 -4108796 -2452165 -749271 434738 1210081 1393661 995827 727445 1018675
37561 1018675 1362385 1408367 1679122 2321084 2276809 846579 -871491 -1304491 -388954
37552 -388954 867528 1953170 2774094 2878287 2182464 1794695 2612217 3613079 3091717
37543 3091717 1251031 -15027 211344 949838 1120286 842111 701275 913459 1482457
37534 1482457 2209701 2405864 1532616 191894 -463020 -284080 -90800 -146829 139129
37525 139129 897722 1393292 1179653 554681 -351307 -1727265 -2977155 -2763397 -815168
37516 -815168 1394135 2508321 2829697 3182175 3267117 2399093 1236394 1246344 2380033
37507 2380033 2641289 681193 -2012644 -2599503 -443905 1873066 1612879 -871369 -2920535
37498b920535j58768P11445L61717M20588J236622J487526P54396K00584L32799
37489B426374K60009k22986j7193R45892R93305m42041j433835n51223Q26027
37480B784329R52787M66126N98127N83394o02152j563564m89772J353304J295223
37471E377802k71911l98158J578491K977666K106200O96207R77347K676993M112326
37462A9832963M415543L587068J849030j11239j462979k384951l690302n017706
37454A7017427m903806l053587r91636n336L9098m90686j571960k429913j808760
37445A800841j22376N58076m16355j162503l86782M42114k99426j455622r18147
37436a960180Q96467J704264P76613m88939j081083j340931j356161l97919J421367
$$ plain form
37498 -2920535 -3079303 -2367858 -2006141 -1585553 -348931 1138595 1892991 2093575 2426374
37489 2426374 2686383 2463397 2446204 3392096 4385401 3943360 2509525 1958302 2784329
37480 2784329 3737116 4203242 4801369 5384763 4782611 3219047 2729275 4082579 5377802
37471 5377802 5105891 4707733 6286224 9263890 11370090 12066297 13043644 15720637 19832963
37462 19832963 24248506 27835574 29684604 29573365 28110386 25725435 22035133 17017427
37454 17017427 12113621 9060034 8068398 8063062 8102160 7611474 6039514 3609601 1800841
37445 1800841 1678465 2236541 1820186 657683 270901 713015 413589 -1042033 -1960180
37436 -1960180 -1063713 640551 1417164 928225 -152858 -1493789 -2849950 -3247869 -1826502
37427a826502K478853J599398k15130r66205j67770O83988K28927q50709p08976
37418B55874R84394K207150J104689j402909k726152j936715n23864J36711L56745
37409a544077P16319P66056J00102o12431p11632n57189n26889j92994N06800
37400b055935O01578j67677l08234J119912K420008J463918r40729k086073j233189
37391a186421j91852k32678o90578q01017p45294m35891O70212J911016J592312
37382a10191k69516j295678o7091J621352J388732k40381q24997L68806J639338
37373B210374J472074K49961p65607r20649l98523J71397J68675l71968o53803
37364A161931k01770K84932p1519q46808q52786K3170O56280M08320j39606m16814
$$ plain form
37427 -1826502 652351 2251749 2036619 1070414 902644 1586632 1815559 964850 255874
37418 255874 1240268 3447418 4552107 3149198 423046 -1513669 -2037533 -1900822 -1544077
37409 -1544077 -827758 -61702 38400 -574031 -1285663 -1842852 -2369741 -2562735 -2055935
37400 -2055935 -1454357 -1622034 -1930268 -810356 1609652 3073570 2132841 46768 -1186421
37391 -1186421 -1378273 -1610951 -2301529 -3102546 -3847840 -4283731 -3613519 -1702503 -110191
37382 -110191 -379707 -1675385 -1742476 -121124 1267608 1027227 202230 571036 2210374
37373 2210374 3682448 3932409 3166802 2246153 1847630 2019027 2187702 1815734 1161931
37364 1161931 960161 1245093 1173574 326766 -526020 -502850 153430 561750 422144 5330
37354E330o63323j020410r14494p8967P18298Q21732P66866J207637J478035N54042
37344B874746r24791j155771J44044J070447K20667j232191j274023J5879P26955
37335D65962L6421p07581k59078N17415J9590j444930j835392k59075J680933
37326a785735K102877J323102R05353R36506K0393j925063k824538j420469N35932
37317b131642P38661k13171k2533J249327J085295j124938k418402m77844K659571
37308f55676L286843J037612j175430j509584j001694j043129j357635j166536
37300c585229o17209j31162M51470J206835J506809Q65502j83373o46232j07067
37291a239656J046051J936654J678114K22073j211065j321982l74177K40349K5554
$$ plain form
37354 5330 -657993 -1678403 -2592897 -2671864 -1953566 -1131834 -364968 842669 2320704 2874746
37344 2874746 1949955 794184 938228 2008675 2229342 997151 -276872 -260993 465962
37335 465962 502383 -205198 -464276 53139 72729 -1372201 -3207593 -3466668 -1785735
37326 -1785735 317142 1640244 2545597 3482103 3502496 1577433 -1247105 -2667574 -2131642
37317 -2131642 -1392981 -1606152 -1628685 -379358 705937 -419001 -2837403 -3315247 -655676
37308 -655676 2631167 3668779 2493349 983765 -17929 -1061058 -2418693 -3585229
37300 -3585229 -4202438 -4333600 -3882130 -2675295 -1168486 -302984 -486357 -1132589 -1239656
37291 -1239656 -193605 1743049 3421163 3643236 2432171 1110189 736012 976361 1001915
37282A001915k03909k3037p1136n62638n75280L39769J074605N26095p00293j175077
37272c68986n24288M48018Q82630M22926o42584j255461n18555P71979P87886
37263C565n23273r60917N28140J872091J043847n75281m05734J118028J415685
37254C516151O2585q69347n74363m61266r99555p51675N65989J051369r863n67019
37244I63006N86090J261772o29217l174659k987037k86186J586375J107512Q2628
37235a489716K00058P64960N16578l76804j008273r68011k40823R32516J663598
37226e917J070572l22111j013737o02148r5040R1837P51124J844040J687504m65719
37216B940405k485092j814521R08441K526605J440891o71519j447774o84616J17630
$$ plain form
37282 1001915 798006 774969 703833 141195 -434085 -94316 980289 1506384 806091 -368986
37272 -368986 -893274 -445256 437374 860300 217716 -1037745 -1556300 -784321 3565
37263 3565 -519708 -1480625 -952485 919606 1963453 1388172 982438 2100466 3516151
37254 3516151 3578736 2709389 2135026 1673760 674205 -77470 488519 1539888 1530025 963006
37244 963006 1549096 2810868 2181651 -993008 -3980045 -4266231 -2679856 -1572344 -1489716
37235 -1489716 -1289658 -524698 -8120 -384924 -1393197 -2361208 -2602031 -1669515 -5917
37226 -5917 1064655 742544 -271193 -873341 -968381 -876544 -125420 1718620 3406124 2940405
37216 2940405 455313 -1359208 -450767 2075838 3516729 2845210 1397436 712820 830450
37207H30450Q3818j94258L4819L76329j77549j556767k181690q40236J402759
37198b222325K210934R34766o24002q18752k22369j92358o06696m43467K26527
37189a757742M74906K93986M64507Q47328N33792k71788l26171L93571L69848
37180A022237q53650j576302n29471J019194J130029o0581r24639p51443j19702
37171a644328M35411P61458O76142M16133P85127J649897J315562r45484k805528
37162F44390j622242J376622K396619N34300j081754l31536Q23531K6724j449703
37153A316951j025287O93771R01184p27658j556902l62747Q03775J59838r40375
37144g37450m77073P23333L25579j508810k027509l5800K155688K033040L67200
$$ plain form
37207 830450 914268 720010 754829 1131158 953609 -603158 -2784848 -3625084 -2222325
37198 -2222325 -11391 923375 299373 -519379 -741748 -934106 -1540802 -1984269 -1757742
37189 -1757742 -1282836 -988850 -524343 322985 856777 584989 258818 652389 1022237
37180 1022237 168587 -1407715 -1937186 -917992 212037 151456 -773183 -1524626 -1644328
37171 -1644328 -1208917 -447459 228683 644816 1429943 3079840 4395402 3449918 644390
37162 644390 -977852 398770 2795389 3329689 2247935 1916399 2739930 2766654 1316951
37153 1316951 291664 985435 1886619 1158961 -397941 -760688 43087 202925 -737450
37144 -737450 -1214523 -491190 -165611 -1674421 -3701930 -3737730 -1582042 450998 818198
37135H18198l20429L42632M12863r09604j983314j476415l25144K34781P65284
37126b441148K046247K877779J684839n44167j312548k67348N77580K26735j89760
37117B658209m2146l22696j267576j382287j76254M85558n24042j362266k35279
37108b168779J322940Q53838q49002j017382N10058J211953K07051n27910K52295
37099b04938J144877P54700j95296o29079q71772j280763j008752L27439J353943
37090f09641R67663K69247O91979J415108P16951r04629j257902R2452J105678
37081B486906L59513j050200j467694r56571n24142k32053N33212J455132J359068
37072A963171o123j307964j222108p6157O66953K97853l67498j83461Q30385J540787
$$ plain form
37135 818198 497769 840401 1253264 343660 -1639654 -3116069 -3441213 -3206432 -2441148
37126 -2441148 -394901 2482878 4167717 3623550 2311002 2043654 2621234 2847969 2658209
37117 2658209 2616063 2293367 1025791 -356496 -532750 -47192 -571234 -1933500 -2168779
37108 -2168779 -845839 7999 -841003 -1858385 -1348327 -136374 70677 -457233 -204938
37099 -204938 939939 1694639 1499343 870264 -1508 -1282271 -2291023 -1963584 -609641
37090 -609641 358022 627269 1319248 2734356 3451307 2546678 1288776 1381228 2486906
37081 2486906 2846419 1796219 328525 -628046 -1152188 -1384241 -851029 604103 1963171
37072 1963171 1957048 649084 -573024 -649181 17772 315625 -51873 -235334 595051 2135838
37062B135838J078601j79313j043763p47362K84223Q23044J03300j218981j643637
37053d08050o24161N86467M64092p00331j177536l31166L70456m71609j952545
37044d244383j937923O0442K275146K898054J816724M8953j375335j584599j57975
37035b200896J895132K434778O28698j563566j616210K99772J723665J356285
37027B957658L75768L1960k19280j189985k076596j577346k4273J048165R94087
37018C20158M63005P7463j02751l8733K62683L61362l2597l99280k56255j15288
37008E39767m50901m25743P78141J954435J190071j039227k238481j458523k87426
36999a437887N8695K98137J026616J412317J003044P05988Q21992K74406r16333
$$ plain form
37062 2135838 3214439 3035126 1991363 1244001 1528224 2351268 2454568 1235587 -408050
37053 -408050 -1032211 -445744 18348 -681983 -1859519 -2190685 -1820229 -2291838 -4244383
37044 -4244383 -6182306 -6121864 -3846718 -948664 868060 917013 -458322 -2042921 -2200896
37035 -2200896 -305764 2129014 2757712 1194146 -422064 -122292 1601373 2957658
37027 2957658 3333426 3365386 3146106 1956121 -120475 -1697821 -1722094 -673929 320158
37018 320158 783163 860626 757875 719142 981825 1343187 1310590 911310 655055 539767
37008 539767 88866 -336877 441264 2395699 3585770 2546543 308062 -1150461 -1437887
36999 -1437887 -1379192 -1081055 -54439 1357878 2360922 3066910 3888902 4163308 3246975
36990C246975p88893J168001K205490K75541k329232k181807R7080J103083n468
36981B790770q87323l27191K78787K4596o0996N15446M64587r21861k244175k005439
36971b372799n82894P43817J375591J240785L37486q03575j209123o04752L09276
36962a566188Q98648J019542M78957p61908j847747j688065l91069R87835J861520
36953a008475K141981J449667j56753j245879o66212L75852k6286j257503j108426
36944a502034L77618Q70344k83822j097053n29302Q896k75954j4636J396092K177278
36934A127427J238394K50083O42074R39243n76784k577306k606420q24612N76419
36925a811482O21178Q6839k80117j95670O37478J771443J734095N2159j543566
$$ plain form
36990 3246975 2458082 3626083 5831573 6107114 3777882 1596075 1693155 2796238 2790770
36981 2790770 1903447 1576256 1855043 1879639 1818643 2334089 2798676 1876815 -367360 -2372799
36971 -2372799 -2955693 -2211876 -836285 404500 741986 -61589 -1270712 -1875464 -1566188
36962 -1566188 -667540 352002 830959 69051 -1778696 -3466761 -3857830 -2869995 -1008475
36953 -1008475 1133506 2583173 2426420 1180541 514329 890181 863895 -393608 -1502034
36944 -1502034 -1124416 -254072 -537894 -1634947 -2164249 -2155353 -2431307 -2445943 -1049851 1127427
36934 1127427 2365821 2615904 3257978 4197221 3620437 1043131 -1563289 -2387901 -1811482
36925 -1811482 -1190304 -1103465 -1383582 -1579252 -941774 829669 2563764 2615923 1072357
36916A072357j467286n63841l76546n24395J83258J227183J189391K11839m68990
36907D82970o96990j061746j118508q2939J225676J246166J56756m37212p893
36898b93720N32688O90223Q15669Q95147N90461K50573L16016J18827j044823
36889B871061k119144j498141K52227R35379j1455q36834l59243M18601K70522
36880g7027k84967J3438J160322J830360J045546n85164j362969l62397J283052
36871B660194J556585O3197j568953j944125j294179l14443P59384J291238L70977
36862A579875j173875r34476J476052L065820J577612j072905j772329p57193
36854A988581m31758j114233j058750P4132P33056K05725n93021q57818m82299
$$ plain form
36916 1072357 -394929 -958770 -1335316 -1859711 -1676453 -449270 740121 951960 482970
36907 482970 -214020 -1275766 -2394274 -2477213 -1251537 -5371 151385 -285827 -293720
36898 -293720 238968 929191 1744860 2640007 3230468 3481041 3797057 3915884 2871061
36889 2871061 751917 -746224 -493997 441382 429927 -406907 -766150 -347549 -77027
36880 -77027 -361994 -348556 811766 2642126 3687672 3102508 1739539 1377142 2660194
36871 2660194 4216779 4279976 2711023 766898 -527281 -841724 -82340 1208898 1579875
36862 1579875 406000 -528476 947576 4013396 5591008 4518103 2745774 1988581
36854 1988581 1556823 442590 -616160 -542028 191028 396753 -196268 -1054086 -1536385
36845a536385N47947J604382J243350n76823j515404k35259J007252j03688j721018
36836a285646o68121K063865K763099J006046j20705N25436Q22309k56690j097043
36827C752550q51351o01442m85543O54495K106398J511905q95344j972275n95116
36818B624277P38359L68962j59392L64149N41916n21760j103778M1193J221031
36809D114957N56479j010825j327571M9745J836049K442076Q64384k148046l804417
36800A572831k229150O54917J661710R32034Q06409J162476N5530j646462j084002
36791A886293J219216J790639K30862l35548Q46441J247166M88238R54474K412787
36782A0740568K091861O59812J508841L650379K853165L87856J892402O549716
$$ plain form
36845 -1536385 -988438 615944 1859294 1282471 -232933 -468192 539060 435372 -1285646
36836 -1285646 -1953767 110098 2873197 3879243 3758538 4283974 5106283 4849593 3752550
36827 3752550 2901199 2299757 1814214 2468709 4575107 6087012 5191668 3219393 2624277
36818 2624277 3362636 3731598 3572206 3936355 4478271 3956511 2852733 2893926 4114957
36809 4114957 4671436 3660611 2333040 2382785 4218834 6660910 7525294 5377248 1572831
36800 1572831 -656319 -1402 1660308 2592342 3398751 4561227 4616757 2970295 1886293
36791 1886293 3105509 4896148 5127010 4791462 5637903 6885069 7373307 8327781 10740568
36782 10740568 12832429 13492241 15001082 18651461 21504626 21892482 23784884 30334600
36774C0334600P478706M624254N702314J1582948J4090777J2587287J7163068
36767A03563954K8888556L5735207L9036220O0926540J03510741J21023818O7212737
36760E59897773l5884605j11484527j14575910p4554485m3699013l4974625k9459700
36753A15264908j9031626j2949308j3681681j2498523p067630m329779n882258
36746C9824103n556132k082760j347262m808789o631171m012998j066251o69722
36738A3649018n80250N62607N32482j318314k338067j633558j409730k052944
36730E411244j162450J279128J892936l88909k230715j224340P46974J187891
36722E511759M53663j49808o19390j004180n30890O05437P85363n69388j975201
$$ plain form
36774 30334600 37813306 42437560 48139874 59722822 73813599 86400886 103563954
36767 103563954 132452510 168187717 207223937 268150477 371661218 492685036 559897773
36760 559897773 524013168 412528641 297952731 223398246 179699233 144724608 115264908
36753 115264908 96233282 83283974 69602293 57103770 50036140 45706361 39824103
36746 39824103 34267971 32185211 30837949 26029160 19397989 15384991 14318740 13649018
36738 13649018 13068768 13631375 14163857 12845543 10507476 8873918 7464188 5411244
36730 5411244 4248794 5527922 7420858 7031949 4801234 3576894 4323868 5511759
36722 5511759 5965422 5815614 5196224 4192044 3661154 4266591 5051954 4482566 2507365
36713B507365k133591j461228q34816m36581k14116n4588N79915J891515K910261
36704B754136K715295J839029J058419j50071k160207l400435k256606J48248
36696E47808J343513Q52008l9699q24160j655459j679209j43190J559422J528753
36687A489787L13914k59629k56063q61031j447659n62767Q73738O67499p88205
36678h30416j086293P838L55024n69736r17021p52O89165N01411N20826Q98507
36668d31447L77713q24008p12905J004911K038478J132354j34002k52059Q8929
36659B287964l0532o1612M35088N68050k71796j231406j341561n97216O86275
36650D43254J979246K016994J88049j700336j411133J89418L76340q85587j042352
$$ plain form
36713 2507365 373774 -1087454 -1922270 -2358851 -2572967 -2627555 -2047640 -156125 2754136
36704 2754136 5469431 7308460 8366879 8216808 6056601 2656166 399560 547808
36696 547808 1891321 2743329 2703630 1879470 224011 -1455198 -1598388 -38966 1489787
36687 1489787 1803701 1544072 1288009 426978 -1020681 -1583448 -709710 -42211 -830416
36678 -830416 -1916709 -1908871 -1553847 -2123583 -3040604 -3041356 -2352191 -1850780 -1329954 -431447
36668 -431447 -53734 -877742 -1590647 -585736 1452742 2585096 2451094 2199035 2287964
36659 2287964 2257432 2195820 2630908 3198958 2927162 1695756 354195 -243021 443254
36650 443254 2422500 4439494 4627543 2927207 1516074 1705492 2081832 1196245 153893
36641A53893K87237N93447p04606r01153R95415K012880K14458j834870j366099
36632e49398K13389L78506q4627P35863J730878O78292j426943j787731m46109
36623e57880J25811n97139p12041M18566J227372R61388Q36957J583079K085214
36614E371327J218952n74601k073199k468974j653048l37123K78116q2276j99517
36605e20343P25687J459190N36319j172944j613118o92595j59547n41611m58446
36596b437408P07807J553674Q52577o20994j410225j301041r75863o56278j00512
36587d388263N28835O89429K89302p1175J50660O61116N66767m61697j495086
36578c530112j293353R0061J272804J243589M28748j74070k05800R1263M65118
$$ plain form
36641 153893 441130 1034577 329971 -571182 424233 2437113 2651571 816701 -549398
36632 -549398 -336009 42497 -42130 693733 2424611 3102903 1675960 -111771 -557880
36623 -557880 -432069 -1029208 -1741249 -1322683 -95311 866077 1703034 3286113 5371327
36614 5371327 6590279 6015678 3942479 1473505 -179543 -516666 -238550 -320826 -520343
36605 -520343 205344 1664534 2200853 1027909 -585209 -1277804 -1437351 -1978962 -2437408
36596 -2437408 -1729601 -175927 676650 55656 -1354569 -2655610 -3631473 -4287751 -4388263
36587 -4388263 -3859428 -3169999 -2880697 -2951872 -2801212 -2140096 -1573329 -2035026 -3530112
36578 -3530112 -4823465 -4733404 -3460600 -2217011 -1788263 -1962333 -2168133 -2076870 -1611752
36569a611752P49206Q25746P55508N16938k84184j655507k367429j127914J324401
36560b874987K762526K379642J539030J192662N10529r61033j776509q11881N72771
36551B532750M30503q49222j346723n10784N02298Q00990M91470r4834n44760
36542A411688k48202O37092P79328n13788j873221j662212l91181J97475k86467
36533a949488q59261j064764j151738q75596R1922R41544O70572p2144J57619
36524d111334J171165J399756M45901m46098n06651k77084j66943J78459P69487
36515a543342R53436N25717M7027m4256K99143J054911J710373J200765m22571
36506C781203j219813k6553J212864J73323j802387j538681O11386J055183j018993
$$ plain form
36569 -1611752 -862546 -36800 718708 1235646 951462 -704045 -3071474 -4199388 -2874987
36560 -2874987 -112461 2267181 3806211 4998873 5509402 4548369 2771860 1959979 2532750
36551 2532750 2963253 2114031 767308 256524 758822 1559812 2051282 1956448 1411688
36542 1411688 1163486 1800578 2579906 2066118 192897 -1469315 -1860496 -1663021 -1949488
36533 -1949488 -2808749 -3873513 -5025251 -5900847 -5808925 -4867381 -4196809 -4268953 -4111334
36524 -4111334 -2940169 -1540413 -1094512 -1540610 -2047261 -2324345 -2491288 -2312829 -1543342
36515 -1543342 -589906 -64189 -17162 -61418 237725 1292636 3003009 4203774 3781203
36506 3781203 2561390 2534837 3747701 3921024 2118637 579956 1191342 2246525 1227532
36497A227532k040267K0864K062567Q02187j894711k014720M59072K043004J199004
36488A864532k50199p59074q36577q80913r1753J551115K394475J335426n47028
36479C780004j573460j524065j222082j022828o94697k16506J83376N17001R39290
36470h33967J302097J241836O41002k45337j011560j295422r49533k35500K96214
36461a090170L32155J10604M7310J89742K97675L47407N48898Q08672O42620j11789
36451B123124r01504j137249q63731l28150N38800J471898J372987k56510j798049
36442B21616j151757J050337J823301K0703j876619j344952O80326J585489Q42656
36433A851100m1722k72926l08634k69923J76563O90953P11596N90472P35874M12686
$$ plain form
36497 1227532 -812735 -791871 1270696 2072883 178172 -1836548 -1377476 665528 1864532
36488 1864532 1614333 855259 18682 -862231 -953984 597131 2991606 4327032 3780004
36479 3780004 2206544 682479 -539603 -1562431 -2257128 -2473634 -2290258 -1773257 -833967
36470 -833967 468130 1709966 2350968 2105631 1094071 -201351 -1150884 -1386384 -1090170
36461 -1090170 -758015 -647411 -600101 -410359 -112684 234723 783621 1592293 2234913 2123124
36451 2123124 1221620 84371 -779360 -1107510 -568710 903188 2276175 2019665 221616
36442 221616 -930141 120196 1943497 1964200 87581 -1257371 -577045 1008444 1851100
36433 1851100 1809378 1536452 1227818 957895 1134458 1825411 2537007 3127479 3863353 4276039
36423D276039q15700j461310j99295J365026P61789j200258j498428K07913J201470
36414B637246L94335k65103K10411J61971j095290j555340k41343O73351l93273
36405E26965j641232j196850k65261l62072k81912J142536J964143K91408j808902
36396a631177j383370M20911N24302o11195j89714J393249J140054q11566j069403
36387b217909R59877J822099o69j528314n41596R14112O81332K02120J106939
36378A397991J559250m25013k732942k167035J96459P35520p50218r53343J249611
36369a889720K970928J952509k54356j104754n25812L2826J46138L01501M25084
36360B054344Q3397m71203o28659l69769m7318L01316O59937N75424j46317p02047
$$ plain form
36423 4276039 3460339 1999029 1799734 3164760 3926549 2726291 1227863 1435776 2637246
36414 2637246 3031581 2766478 2976889 3138860 2043570 488230 246887 920238 526965
36405 526965 -1114267 -2311117 -2576378 -2938450 -3220362 -2077826 -113683 177725 -1631177
36396 -1631177 -3014547 -2593636 -2069334 -2680529 -2870243 -1476994 -336940 -1148506 -2217909
36387 -2217909 -1258032 564067 563398 -964916 -1506512 -592400 88932 291052 1397991
36378 1397991 2957241 2532228 -200714 -2367749 -2171290 -1435770 -2185988 -3139331 -1889720
36369 -1889720 1081208 3033717 2779361 1674607 1148795 1181621 1327759 1629260 2054344
36360 2054344 2137741 1666538 1037879 668110 620792 922108 1582045 2157469 2011152 1309105
36350A309105j98974R03029J196618J71039j198079j788353j426590m92756O06646
36341i18315J147061K84436j607453k600644j367294Q14309J513830L85313n40942
36332b889699N9388J056469Q71714k34269r65647r43646n85671P7301J051943
36323b502117J504390P57106k32220K6582J144840J223309k21470j407629r42816
36314f50025J98313L13511n60417j003879l86090M71099O21678J07442l82504
36305a270872m72269m69978q02094j192769p97559N38935J648314J387778K89454
36296a141060j10826N62236J191458J063116P58229P26988L38193p83565j601028
36287A003741j023503K86323O82020k36386j247740j239794l87520M15507N63178
$$ plain form
36350 1309105 1110131 2013160 3209778 3380817 2182738 394385 -1032205 -1524961 -918315
36341 -918315 228746 513182 -1094271 -3694915 -5062209 -4247900 -2734070 -2348757 -2889699
36332 -2889699 -2830311 -1773842 -902128 -1136397 -2102044 -3045690 -3631361 -3554060 -2502117
36323 -2502117 -997727 -240621 -472841 -446259 698581 1921890 1700420 292791 -650025
36314 -650025 -451712 -138201 -698618 -1702497 -2088587 -1617488 -995810 -888368 -1270872
36305 -1270872 -1743141 -2213119 -3015213 -4207982 -5005541 -4466606 -2818292 -1430514 -1141060
36296 -1141060 -1251886 -689650 501808 1564924 2323153 3050141 3388334 2604769 1003741
36287 1003741 -19762 266561 948581 712195 -535545 -1775339 -2162859 -1747352 -1184174
36278a184174R9320l81956j97337O10057J040175K66784j094549j488072k84698
36269b614450J394303J927521Q80776p58802j710385j476963m74048N53279J088859
36260a189910R79676L55161l74970o38909j78396O09258J103675J176672J086707
36251B928964P48398k32064j589763k171606j242930M00184J288394J053699O48512
36242A831788P62307P79579j89322j682213k089580o34371J483438K398479J622632
36233D282737J45657j134522k054160k308539j304679N17931J461907O83079m59626
36224a70215l40661N79080P87079K47882M8670J26438m32197j040626r5044J846023
36214A556429K019869m03075k627618k164622j97246Q29468Q64900J128601J118468
$$ plain form
36278 -1184174 -1084854 -1466810 -1664147 -1054090 -13915 252869 -841680 -2329752 -2614450
36269 -2614450 -1220147 707374 1588150 829348 -881037 -2358000 -2832048 -2278769 -1189910
36260 -1189910 -210234 144927 -230043 -868952 -1047348 -438090 665585 1842257 2928964
36251 2928964 3677362 3445298 1855535 -316071 -1559001 -1158817 129577 1183276 1831788
36242 1831788 2594095 3373674 3184352 1502139 -587441 -1221812 261626 2660105 4282737
36233 4282737 4428394 3293872 1239712 -1068827 -2373506 -1855575 -393668 289411 -170215
36224 -170215 -510876 68204 855283 1103165 1151835 1278273 846076 -194550 -289594 1556429
36214 1556429 3576298 3173223 545605 -1619017 -1816263 -986795 -121895 1006706 2125174
36205B125174l20503k020082j716433J26663P76401l73285q88282N44195J929561
36196A83409J269134m03802j056033p80538q42465j013303j37323J344215J642901
36187B06195L60335q44030o42915L49364Q72700P39294M86726J43535o51185j558646
36177e38627j555238l66296P53270L71407j157051j900515p88687R61332J501908
36168b718497P40220N2747R0392K24464J17318L25448R09959Q85651j24501r22698
36158d19497n00291K73208L6606q06994p96915O7994K59437p62164j600908j018583
36148e268107L52269J123320R43851L63862k55299p63863p44448K0006Q93216
36139c335193J026936M79199R409j4618K08424N69223R99811R32835j09760j276897
$$ plain form
36205 2125174 1804671 -215411 -1931844 -1805181 -1028780 -1402065 -2290347 -1746152 183409
36196 183409 1452543 1048741 -7292 -787830 -1630295 -2643598 -2780921 -1436706 206195
36187 206195 566530 -277500 -920415 -571051 301649 1040943 1527669 1671204 1020019 -538627
36177 -538627 -2093865 -2460161 -1706891 -1335484 -2492535 -4393050 -5181737 -4220405 -2718497
36168 -2718497 -1978277 -1925530 -1835138 -1610674 -1493356 -1167908 -257949 627702 503201 -419497
36158 -419497 -919788 -646580 -609974 -1416968 -2213883 -2145889 -1886452 -2648616 -4249524 -5268107
36148 -5268107 -4915838 -3792518 -2848667 -2484805 -2740104 -3503967 -4248415 -4228409 -3335193
36139 -3335193 -2308257 -1829058 -1819649 -1834267 -1625843 -1056620 -56809 876026 766266 -510631
36129e10631r30752J041311K519859J643453p49088k206054j703885m51765J31396
36120a216156l856j80480j05680J79321O49918J013280O98262k57522q22671j58919
36110b04503J150191J743227J147173J44447l97650l79841j51159l5684l65335
36101B650866j333689k418627k467584r77780R29613J507968M76284m99701J78899
36092a953751K002844K985373K133190M41164p04950j140499j352575j213071
36084A197725l88945M69449K73336p85812j295892o29717K61441M17177N6360
36075d24878l43508r29567j585301j309895L05399J836204J650563K48497m44961
36066i97447J58078P25795K20544p22952j022454n97929k6015M03454O72317O49194
$$ plain form
36129 -510631 -1441383 -400072 2119787 3763240 3014152 808098 -895787 -1347552 -1216156
36120 -1216156 -1220012 -1400492 -1506172 -1326851 -676933 336347 1034609 777087 -45584 -204503
36110 -204503 945688 2688915 3836088 3980535 3582885 3203044 3051885 3016201 2650866
36101 2650866 1317177 -1101450 -3569034 -4546814 -3617201 -2109233 -1632949 -2132650 -1953751
36092 -1953751 49093 3034466 5167656 5608820 4903870 3763371 2410796 1197725
36084 1197725 808780 1278229 1551565 765753 -530139 -1159856 -898415 -481238 -424878
36075 -424878 -768386 -1697953 -3283254 -4593149 -4287750 -2451546 -800983 -552486 -997447
36066 -997447 -839369 -113574 106970 -615982 -1638436 -2236365 -2262380 -1858926 -1186609 -537415
36056e37415K79783j56301l54733l49045l66393m93704n69352l08240L53707R53475
36046a548218Q99506L72009K42117O97338P31344k51917j165688p40140L77287
36037c86362N29927l09868n47719L60400J057324N77584j97001k02932J26278
36028A007631p4945m82751k46400M47401O32659L7955n93841n11194K63618J002770
36018A482903R00744n1229q35457o34494j11483m68400j348067j132469M18858
36009a779094J507299R68681m0434o1162N24280O77765N84230P58614N41276o88413
35999B993042j807655j423346k71344r4281p38841o10327L23033M15920o53315
35990a867114j182112k96354P17623P70963N99680R16934Q40510l46210j406327
$$ plain form
36056 -537415 -257632 -413933 -768666 -1117711 -1484104 -1977808 -2547160 -2855400 -2501693 -1548218
36046 -1548218 -648712 -276703 -34586 662752 1394096 1142179 -23509 -763649 -386362
36037 -386362 143565 -166303 -714022 -353622 703702 1281286 1084285 881353 1007631
36028 1007631 932686 449935 203535 650936 1283595 1321550 727709 216515 480133 1482903
36018 1482903 2383647 2332418 1496961 862467 750984 282584 -1065483 -2197952 -1779094
36009 -1779094 -271795 696886 656452 595290 1119570 1797335 2381565 3140179 3681455 2993042
35999 2993042 1185387 -237959 -509303 -603584 -1342425 -1952752 -1629719 -1213799 -1867114
35990 -1867114 -3049226 -3345580 -2627957 -1856994 -1257314 -340380 500130 153920 -1252407
35981a252407q61643N72837J024803K43137l82609j95698N5526q3084j9381N25851
35971c72668P51773Q0659p61311q24235m03605m33647p92405l89499R10325J578823
35961f55790L63405j756768k505951r74460J467037K776565J976222m97996l104478
35952b912214l897016k194377K43350J026693L28431N28998K197139K773520O97214
35943a208262j539038r36082J252621J505210l23109j014151N21380J595397M43286
35934B97252r53586m25686R24580R65143k0662m35516k25012l46139o08996k01468
35924a030090N00722N25268l3317n23927j012759j493844r36669J050877K673922
35915b79817K139321M81547m5957M15230o4606j443132j497076L59144J844376
$$ plain form
35981 -1252407 -2114050 -1541213 -516410 -273273 -655882 -851580 -796054 -879138 -898519 -372668
35971 -372668 379105 459764 -301547 -1125782 -1529387 -1963034 -2755439 -3144938 -2234613 -655790
35961 -655790 -292385 -2049153 -4555104 -5529564 -4062527 -1285962 690260 192264 -2912214
35952 -2912214 -6809230 -9003607 -8760257 -7733564 -7405133 -6876135 -4678996 -1905476 -1208262
35943 -1208262 -2747300 -3683382 -2430761 -925551 -1248660 -2262811 -1741431 -146034 297252
35934 297252 -656334 -1082020 -157440 807703 787041 351525 126513 -219626 -828622 -1030090
35924 -1030090 -529368 -4100 -37417 -561344 -1574103 -3067947 -4004616 -2953739 -279817
35915 -279817 1859504 2341051 2295094 2710324 2645718 1202586 -294490 64654 1909030
35906A909030J272941j05458l84529K94019N95382Q8750p01540j233494j047357
35897F87744P037R99108O40652n89488n96476J120488K092027K06344k954699
35888A612737l986669k065210M42328J431263J228401J079175J107240O20101
35880A469366m24988j149695q03099L54465J286228J198678K36060q61586j529246
35871b23817j536105p58032N44539J447558J231473M65395K64309N01573l736
35862A933157j325293j903671q03447Q21875J363855P26915j72380p30507o13957
35853g03453L55219J279437N63089j549147k386585m88311J770047J431139n62578
35844b91143r86513N09823J228611K02089m72213K57838M92206r12738j889334
$$ plain form
35906 1909030 3181971 3076513 2691984 2986003 3581385 3670135 2968595 1735101 687744
35897 687744 694781 1693889 2334541 1745053 1148577 2269065 4361092 4567436 1612737
35888 1612737 -2373932 -4439142 -3996814 -2565551 -1337150 -257975 849265 1469366
35880 1469366 1044378 -105317 -908416 -553951 732277 1930955 2167015 1305429 -223817
35871 -223817 -1759922 -2517954 -1973415 -525857 705616 1171011 1435320 1936893 1933157
35862 1933157 607864 -1295807 -2099254 -1277379 86476 813391 641011 -89496 -703453
35853 -703453 -348234 931203 1494292 -54855 -2441440 -2929751 -1159704 271435 -291143
35844 -291143 -1277656 -767833 460778 662867 190654 448492 940698 27960 -1861374
35835a861374n80974J350849J380242Q2787k81206L47150K32961q03748j298405
35826a431718r29315p02350n53492N78232K188817K352377Q81924j43962K80431
35817B520944O56719j05801p64720k26772K34034p57005j900689j061472J183012
35808b21750K215843J121068m67040j141503j232690j230495o27001Q31359K081778
35799A329569J896214L72492j330638k165358j744816m09804Q21670R40140O901
35790b83630q45783o92879K87280J229900J375623M79442q80998j417824m06484
35781a155353J083171J232315o3152r73189m14882M23247J38956o28420m34332
35772g91639M41856N06930l20806n13742M74196J219997O04817m30042m37944
$$ plain form
35835 -1861374 -2442348 -1091499 288743 371530 90324 437474 670435 -133313 -1431718
35826 -1431718 -2361033 -3063383 -3616875 -3038643 -849826 1502551 2384475 2240513 2520944
35817 2520944 3177663 3071862 2307142 2080370 2314404 1557399 -343290 -1404762 -221750
35808 -221750 1994093 3115161 2648121 1506618 273928 -956567 -1583568 -752209 1329569
35799 1329569 3225783 3598275 2267637 102279 -1642537 -2052341 -1230671 -290531 -283630
35790 -283630 -1129413 -1822292 -1535012 -305112 1070511 1549953 668955 -748869 -1155353
35781 -1155353 -72182 1160133 1096981 123792 -291090 132157 271113 -357307 -791639
35772 -791639 -349783 157147 -163659 -677401 -203205 1016792 1621609 1191567 753623
35763G53623L30917N38194r5808n73245l29821M9754k0155k52751j67373N4409
35753B87744r7812o60120j161546j198339p68994k27505p1949m77061q43023k65513
35743e484118J149358J970661J202696j6934L65010K301333L169890J106244k203685
35734C560455l337133j314657J386649K078119Q55262k12343N7587Q66888R31643
35725D872470K02243k59826J90430R39270J143593J194463K168770L657516L489048
35716A7597977O54507k633966l495441k262400j658633k371366k163663o4726
35708C602289J425868J35285k099696k107273k06720N72017o32336j485151m53972
35699a249689J015497J187609N30274K13624k6848r24011j829930j501884j07959
$$ plain form
35763 753623 1084540 1622734 1526926 953681 623860 673614 653459 400708 233335 287744
35753 287744 189932 -470188 -1631734 -2830073 -3599067 -3826572 -3898521 -4375582 -5218605 -5484118
35743 -5484118 -4334760 -2364099 -1161403 -1178337 -813327 1488006 4657896 5764140 3560455
35734 3560455 223322 -1091335 295314 2373433 3228695 3016352 3073939 3940827 4872470
35725 4872470 5074713 4814887 5005317 5944587 7088180 8282643 10451413 14108929 17597977
35716 17597977 18252484 15618518 12123077 9860677 8202044 5830678 3667015 3602289
35708 3602289 5028157 5163442 3063746 956473 749753 1321770 689434 -795717 -1249689
35699 -1249689 -234192 953417 1483691 1697315 1670467 746456 -1083474 -2585358 -2693317
35690b693317R57089R65113M35865j5432l87513p38422p11839L040J061580J647306
35680E23470J300529M24890k19328m56733p05536r81852o47763L69134R34831
35671E41642K07418q77090p91506L56874J086147P23246p2408p68879j401298
35662i95854j596568q13687L09701N43316J86789P32737K075422K216055N06073
35653C163984j041811q59233r0445k19761m79474L87336J484740J162584j74143
35644C333777q90455p73224o87020m97299L77124J104375N32328m45138j04947
35635A949521R65912O39566j015926j664745o32871P0598n47603o81035R14532
35626b051K349904J422463q47275j707024n78009N90581L28478p30753j138584
$$ plain form
35690 -2693317 -1736228 -771115 -335250 -350682 -738195 -1476617 -2188456 -2185416 -1123836 523470
35680 523470 1823999 2248889 2029561 1572828 867292 -114560 -762323 -393189 541642
35671 541642 749060 -128030 -919536 -562662 523485 1246731 1174323 405444 -995854
35662 -995854 -2592422 -3406109 -3096408 -2553092 -2366303 -1633566 441856 2657911 3163984
35653 3163984 2122173 1262940 1172495 952734 473260 860596 2345336 3507920 3333777
35644 3333777 2443322 1670098 983078 485779 862903 1967278 2499606 2054468 1949521
35635 1949521 2915433 3554999 2539073 874328 241457 312055 -235548 -916583 -2051
35626 -2051 2347853 3770316 2923041 1216017 638008 1228589 1557067 826314 -312270
35617c12270l46596R16343J351297L44673j149228j448509j44084J390320J738699
35608B340645Q79834l55392j228338j125162J71408J653816J696487J94876j043287
35599C184887p79592N1078J29813k51876k85951m22582j306664j869587n08328
35590b058802K150252L567241K506226L65981r57335j115242p64955k78731J98973
35581C613608K38519m32089j272650j377033n64505L53014N15682O0627k2910
35572A112263Q27912J904744K008639Q45574q44928k273507k954701k346220l36180
35563b056404J767440K043061L08133j432669j499221m06119M41201O88323P03528
35554E57273M47947j22495m17094j45714o9362p01951j221935r17892n90395r26936
$$ plain form
35617 -312270 -658866 257477 1608774 1953447 804219 -644290 -788374 601946 2340645
35608 2340645 3220479 2865087 1636749 511587 682995 2336811 4033298 4228174 3184887
35599 3184887 2405295 2456373 2586186 2334310 2048359 1625777 319113 -1550474 -2058802
35590 -2058802 91450 3658691 6164917 6530898 5573563 4458321 3693366 3414635 3613608
35581 3613608 3852127 3420038 2147388 770355 205850 558864 1074546 1135173 1112263
35572 1112263 1940175 3844919 5853558 6699132 5854204 3580697 625996 -1720224 -2056404
35563 -2056404 -288964 1754097 2062230 629561 -869660 -1275779 -834578 -146255 557273
35554 557273 1005220 882725 465631 319917 250555 -451396 -1673331 -2591223 -3181618 -4108554
35544d108554o71111J402868L523051K612101j097501l756686k786011J82897
35536d698946K071768J984269R26089k82535j273009j484285p08518L63073J063257
35527b038837J455431J432492K93575j711222k614948j074717J302138J722811
35519a233277k0427j322278m59925J181024J304690j62560j275615p65804O28079
35510b126093J446275J179963L59169l76253p52133o92456k53762K37280L96752
35501e81258K60130K40364N01242O81055L74955l89760j246887j733133j423576
35492c316868l27279P81112J063566P88794R77688J620055J365469l02901j742017
35483I07619j224214M97254J199873L03993o51640n57290q9626j36721l19226
$$ plain form
35544 -4108554 -4779665 -3376797 146254 2758355 1660854 -2095832 -4881843 -4698946
35536 -4698946 -2627178 -642909 283180 645 -1272364 -2756649 -3465167 -3102094 -2038837
35527 -2038837 -583406 849086 1142661 -568561 -3183509 -4258226 -2956088 -1233277
35519 -1233277 -1253704 -2575982 -3035907 -1854883 -550193 -712753 -1988368 -2754172 -2126093
35510 -2126093 -679818 500145 859314 483061 -269072 -961528 -1215290 -978010 -581258
35501 -581258 -321128 -80764 420478 1101533 1476488 1086728 -160159 -1893292 -3316868
35492 -3316868 -3644147 -2863035 -1799469 -1010675 -32987 1587068 2952537 2649636 907619
35483 907619 -316595 180659 1380532 1684525 1032885 475595 385969 249248 -69978
35474f9978J19435Q99269J052820K58950p77169j127168n74346J72263K71970
35465B26046j28153m238R41145J443022K70554j800845k636551j230403J251669
35456a667754K752732K045223l76178k434407k158139k0200J312038M88385o31931
35447f90231q5977Q73041K0941j655626j324565Q00011J652865M81427j24551
35438e2665Q48914R99871p47229j572781M51032K535266J489756r70012j071046
35429A911106R09328J490469k32286j707049j430342o18557k56594K05780P81765
35420A053620N13966l20544k10385Q16386R54204k08939q22757M2938P92562P3810
35410B684861j029241r93306k23677Q3737k6001J19767L16815J3129m83353n33795
$$ plain form
35474 -69978 49457 948726 2001546 2260496 1483327 356159 -218187 -45924 226046
35465 226046 97893 93655 1034800 2477822 2748376 947531 -1689020 -2919423 -1667754
35456 -1667754 1084978 3130201 2754023 319616 -1838523 -1858723 -546685 -58300 -690231
35447 -690231 -776208 96833 117774 -1537852 -2862417 -2062406 -409541 71886 -52665
35438 -52665 796249 1796120 1048891 -523890 -72858 2462408 3952164 2982152 1911106
35429 1911106 2820434 4310903 4078617 2371568 941226 322669 66075 271855 1053620
35420 1053620 1567586 1247042 1036657 1853043 2807247 2598308 1775551 1818489 2611051 2684861
35410 2684861 1655620 662314 438637 522374 496373 616140 932955 946084 462731 -71064
35400g1064k83077l10442p15275j199497j430434r03635O57067K315778K432202
35391D91623P81854r02786j184135n79055k04900m6206L18133M32782j26369l91766
35381a410825P89918K536263K554731K03022k348893k563394l98631J825811K082143
35372C270145O63658m89189j77843Q21826J085559M48558j95720n67794j216974
35363C642226k005390j788692k47219J137126R00765m08849j083508n53001K00561
35354b05981K34812l33403q86133j084746r08355m20197K48698Q47516J076308
35345a431481Q08149L48529K81607P43212J072086O69359o9565l94246m95654
35336A531996j141821k107449k214043j157120l0183L88381N88319R91194J018881
$$ plain form
35400 -71064 -354141 -664583 -1379858 -2579355 -4009789 -4913424 -4256357 -1940579 491623
35391 491623 1273477 370691 -813444 -1392499 -1597399 -1643605 -1325472 -892690 -1019059 -1410825
35381 -1410825 -620907 1915356 4470087 4673109 2324216 -239178 -637809 1188002 3270145
35372 3270145 3933803 3444614 3266771 4088597 5174156 5622714 5426994 4859200 3642226
35363 3642226 1636836 -151856 -399075 738051 1638816 1229967 146459 -406542 -205981
35354 -205981 28831 -304572 -1190705 -2275451 -3183806 -3604003 -3355305 -2507789 -1431481
35345 -1431481 -623332 -274803 6804 750016 1822102 2491461 2421896 2027650 1531996
35336 1531996 390175 -1717274 -3931317 -5088437 -5118620 -4730239 -4141920 -3150726 -2131845
35327b131845L66324q0191K92796O05082K4315n36552J63599J403689J432333
35318A539550K46177m42317L0637L83013l71126j390083j423525n62385K08381
35309a781678L53385N244m84562o27942j7108J009438J440418Q32595j5798j57484
35299E56508K07680J82237l92217p14692k69862L65890L08567l83633p18264p8837
35289i36623Q38183P64981n08110j677385j374064J78294J349742R29602n77522
35280a012902j610234j245403M6335J245884J920192K167266J789142L83240j507871
35271B175649k263524j040564Q11001J260383K29828m95181R5588J099235J436956
35262C309371J178980M92683j098693l175568l587699j034550K321053K929355
$$ plain form
35327 -2131845 -1765521 -1845712 -1552916 -947834 -923519 -1460071 -1296472 107217 1539550
35318 1539550 1785727 1343410 1374047 1757060 1385934 -4149 -1427674 -1990059 -1781678
35309 -1781678 -1428293 -1423049 -1907611 -2535553 -2552661 -1543223 -102805 729790 713992 556508
35299 556508 764188 946425 554208 -160484 -430346 -64456 244111 -139522 -857786 -936623
35289 -936623 -98440 666541 158431 -1518954 -2893018 -2714724 -1364982 -435380 -1012902
35280 -1012902 -2623136 -3868539 -3822204 -2576320 -656128 1511138 3300280 3683520 2175649
35271 2175649 -87875 -1128439 -317438 942945 1172773 677592 773180 1872415 3309371
35262 3309371 4488351 4981034 3882341 706773 -2880926 -3915476 -1594423 1334932
35254A334932M40870j787115j184403Q87270J467908J1629j425621j279681j73451
35245a707662N02094M00490N3783k73968o91551q93260j99848J266794K118469
35236E75341J164195q71719j930049j070739M33208Q80806L01532L8243N87026
35227A07844R14673J28712j039990j117070N7731R33491J79527j521535k274038
35218c630655j417423k85997j69968m43466L03629J824137K276283Q43197r44585
35209a644848j081723N32920K217332K465537J210702n11363j615068j731944
35201a58455j190991m03323M22928R00036N43060k25580n1764J354209K120628
35192C310748O46473j655058k082644o30579K30613l02716l16896J118702K175143
$$ plain form
35254 1334932 1775802 -11313 -1195716 -308446 1159462 1171091 -254530 -1534211 -1707662
35245 -1707662 -1205568 -805078 -751295 -1025263 -1716814 -2610074 -2809922 -1543128 575341
35236 575341 1739536 867817 -1062232 -2132971 -1699763 -818957 -517425 -479182 107844
35227 107844 1022517 1151229 111239 -1005831 -948100 -14609 164918 -1356617 -3630655
35218 -3630655 -5048078 -5334075 -5504043 -5947509 -5643880 -3819743 -1543460 -700263 -1644848
35209 -1644848 -2726571 -2193651 23681 2489218 3699920 3188557 1573489 -158455
35201 -158455 -1349446 -1752769 -1329841 -429805 113255 -112325 -164089 1190120 3310748
35192 3310748 3957221 2302163 219519 -411060 -180447 -483163 -800059 318643 2493786
35183B493786J470578K72254j94238r38449k560511l009215p67831J846464J731030
35174C43868k46065q37468M44771J276696Q75439P73027J336223R88195o33893
35165D320793j780450j509588q70082n92018j42654L40205k34155j504004j504665
35156c476618J08255J074138o8159j728703j705172j03384J350778J450184J35362
35147b963319j555694j688001O82552L445475L332016L70158j872429j196654
35139a445896O04187J069078M04138l0345j99617n29115m92192J50818L50212
35130a18732m21806r70849m19519K51516R5605j58729K18738N04098J85504J49850
35120f84324P51831P86444j17728m16401M00296M28798j091180j757909q5631
$$ plain form
35183 2493786 3964364 4236618 4042380 3103931 543420 -2465795 -3233626 -1387162 343868
35174 343868 97803 -739665 -294894 981802 1857241 2630268 3966491 4954686 4320793
35165 4320793 2540343 1030755 160673 -431345 -573999 -233794 -467949 -1971953 -3476618
35156 -3476618 -3368363 -2294225 -2362384 -4091087 -5796259 -5899643 -4548865 -3098681 -2963319
35147 -2963319 -4519013 -6207014 -5524462 -2078987 1253029 1623187 -249242 -1445896
35139 -1445896 -841709 227369 631507 601162 401545 -127570 -619762 -468944 -118732
35130 -118732 -540538 -1511387 -1930906 -1679390 -1583785 -1742514 -1523776 -1019678 -834174 -684324
35120 -684324 67507 853951 736223 319822 720118 1148916 57736 -1700173 -1785804
35111a785804J369003J02394j936697j719426k96130l55531r30529N90175K854806
35102b107739K296941l80157r62718J126404J927479j53063j874183j004109L01612
35093h29533m7071o36077J14192J004716Q57673Q28284J558025J304563o31156
35084C523616j802103n99511P17507j02932j309496l54077J461317J267615m03075
35075B398861q31258L4552j50235j662951k250584j082069J47007L85583N92041
35066b419053J321844J464712L10743r85371r21598N41022K151345K500525J065071
35057E029240r83117j497624O409J250582K44057j546881j277379P06682J198211
35048C130180q21010k396169r88519J788658K582110P89482j312440j980240j598018
$$ plain form
35111 -1785804 -416801 -314407 -2251104 -3970530 -4266660 -4622191 -5552720 -4962545 -2107739
35102 -2107739 189202 -190955 -1153673 -27269 1900210 1747147 -127036 -1131145 -829533
35093 -829533 -876604 -1512681 -1398489 -393773 463900 1292184 2850209 4154772 3523616
35084 3523616 1721513 1122002 1839509 1736577 427081 73004 1534321 2801936 2398861
35075 2398861 1567603 1602155 1451920 -211031 -2461615 -3543684 -3396677 -3011094 -2419053
35066 -2419053 -1097209 367503 678246 -307125 -1228723 -687701 1463644 3964169 5029240
35057 5029240 4046123 2548499 2554908 3805490 4049547 2502666 1225287 1931969 3130180
35048 3130180 2309170 -86999 -1075518 713140 3295250 4084732 2772292 792052 -805966
35039h05966j117378o45544j9671L95621K61550K4472K81299N71161k27554j952712
35029c234722k603338p46142K152822L255382K031177P01176P55615J023500J55481
35020C490951r40373q34242k25762p25466j908467j860947l27615Q41197M80040
35011b010684n23431r43530o82674j39552M84307Q32783N36682J6093O4532N05976
35001a859498M43047r1367q8723O48916J114714Q12154L98266J61097n98169j913133
34991i72696k334910q54265J388194K366177J436881m22444j892117k097135q82869
34982d265184R02093J948191J843395J282701O83596l19520j538959j774041o29845
34973a867573M70761L12925k08351L24811J360855J271930J14996m66581P8193
$$ plain form
35039 -805966 -1923344 -2568888 -2588559 -2192938 -1931388 -1906916 -1625617 -1054456 -1282010 -3234722
35029 -3234722 -5838060 -6584202 -4431380 -1175998 855179 1556355 2311970 3335470 3490951
35020 3490951 2550578 1716336 1490574 765108 -1143359 -3004306 -3331921 -2490724 -2010684
35011 -2010684 -2534115 -3477645 -4160319 -4299871 -3815564 -2982781 -2446099 -2430006 -2365474 -1859498
35001 -1859498 -1416451 -1507818 -1596541 -947625 167089 979243 1377509 1538606 940437 -972696
34991 -972696 -3307606 -4161871 -2773677 -407500 1029381 606937 -1285180 -3382315 -4265184
34982 -4265184 -3363091 -1414900 428495 1711196 2394792 2075272 536313 -1237728 -1867573
34973 -1867573 -1396812 -1083887 -1292238 -967427 393428 1665358 1780354 1313773 1391966
34964A391966N68778L13969J01251M27958M69076l02104r27663n28867J27211
34955A641575p0057o31189l47611M39225J56196j399220k379175j355475P48234
34946c197497J967193J649161O27730k80004q90198j066303n93958K34002P01154
34937h48720N69744L21115L17098K88786r6461o54383r37899o85964J09006J087671
34927e30007J389987L56513j346421k080128j195909J10688N07727K47730K83154
34918b256666M64046m8270r61527r45559L30313J544191J497481N25592l04571
34909a54970n35764l83765j95136l00038p71627r70726m4504J698407K675872
34900A017749J884662K04145p99294p55159m19830k74102j54582l9883k39361
$$ plain form
34964 1391966 1960744 2274713 2375964 2803922 3272998 2970894 2043231 1514364 1641575
34955 1641575 1571518 940329 592718 1031943 1188139 -211081 -2590256 -3945731 -3197497
34946 -3197497 -1230304 418857 1046587 766583 -123615 -1189918 -1783876 -1549874 -848720
34937 -848720 -278976 42139 359237 648023 551562 -102821 -1040720 -1726684 -1617678 -530007
34927 -530007 859980 1216493 -129928 -2210056 -3405965 -3295277 -2787550 -2539820 -2256666
34918 -2256666 -1792620 -1840890 -2802417 -3747976 -3417663 -1873472 -375991 149601 -154970
34909 -154970 -690734 -1074499 -1269635 -1569673 -2341300 -3312026 -3356530 -1658123 1017749
34900 1017749 2902411 3106556 2307262 1552103 1132273 858171 703589 663706 424345
34891D24345p23406r87791p23745q9754P12520J529215J848180J045895n71983
34882B463476j591065r97363M42324J014175J96339p94428p81321j39720O6324
34873a21259k04675j31921L62350L76144l84178r18503m13631N40072R68148R24266
34863I96813R71554R61358M14508l82055p72977q30343r38656p36088J92839R31982
34853H08935J79151j447333j787842j88630J469126J413027J67815o92912o38522
34844g17185q1512O53509J221477J026222N8215p81884r32168q87198j018454
34835a458978p72982J16080P82701O24636M15222Q52265J127380L01947r49141
34826A039130j477257j538429j856274j782226l79444J400683J831091J235921
$$ plain form
34891 424345 -299061 -1286852 -2010597 -2100351 -1387831 141384 1989564 3035459 2463476
34882 2463476 872411 -124952 317372 1331547 1527886 733458 -47863 -187583 -121259
34873 -121259 -325934 -457855 -95505 280639 -103539 -1022042 -1435673 -895601 72547 996813
34863 996813 1968367 2929725 3344233 2962178 2189201 1358858 420202 -315886 -123047 808935
34853 808935 988086 -459247 -2247089 -2435719 -966593 446434 614249 -78663 -717185
34844 -717185 -798697 -145188 1076289 2102511 2160726 1378842 446674 -440524 -1458978
34835 -1458978 -2231960 -2115880 -1333179 -708543 -293321 558944 1686324 1988271 1039130
34826 1039130 -438127 -1976556 -3832830 -5615056 -5994500 -4593817 -2762726 -1526805
34818a526805J357391K100279J505754o98009k139514j336305J24301K65814l75109
34809g22203j80347P22517R49907L02141q6057K76555N63196j8324j159992j861875
34799a214482j412331m5350J114471J080725J68778l74747o0570K77377q9406
34790e55535o68192o19359J3839O07294Q82558R12411P13788L68812R1264j91433
34780A555447p51393j291064j051129m5419O99070N71704Q5175l09833r37520
34771a474962j720860j581082r7056J343835J327215M38559J78446O51242P88007
34762a46656K74868k27048m10135m99899l90788J59266P45173Q17412N63505K81037
34752A166735m08232j494956j674629j59641J471282J233328j81900n90855j0856
$$ plain form
34818 -1526805 -169414 1930865 3436619 2738610 599096 -737209 -612908 -347094 -722203
34809 -722203 -902550 -180033 769874 1072015 985958 1262513 1825709 1807385 647393 -1214482
34799 -1214482 -2626813 -2672163 -1557692 -476967 -308189 -682936 -743506 -466129 -555535
34790 -555535 -1223727 -1843086 -1829247 -1221953 -339395 573016 1286804 1655616 1746880 1555447
34780 1555447 804054 -487010 -1538139 -1583558 -884488 -312784 -227609 -537442 -1474962
34771 -1474962 -3195822 -4776904 -4873960 -3530125 -2202910 -1764351 -1585905 -934663 -146656
34762 -146656 128212 -98836 -508971 -1008870 -1399658 -1240392 -495219 322193 885698 1166735
34752 1166735 758503 -736453 -2411082 -2570723 -1099441 133887 -48013 -638868 -649724
34743f49724m10938j889188k148531l48246J435764J557624Q63659K88766p26581
34734b027395j869551r98564K153014L989043J687996k232073l193391q82211
34726c373132J105822R34860K34310M12857P69109O99606P57016Q21060j01408
34717B260100j498896j356550N37810J762931Q82431m55837m09916K90949J52678
34708B165700m63205m53355j52549m30920q45025n86173j98040m73541o50552
34699b087660K97084J440308J116811k58174q34088l64499k44000o27578m1918
34690a603714J702977K612429J429345n33906j521766j512522j142272k12374
34682g81803J221607J730297K97443j682083j929171k60004J464425J861878J022923
$$ plain form
34743 -649724 -1060662 -2949850 -5098381 -5446627 -4010863 -2453239 -1589580 -1300814 -2027395
34734 -2027395 -3896946 -4895510 -2742496 1246547 2934543 702470 -2490921 -3373132
34726 -3373132 -2267310 -1332450 -1098140 -685283 83826 783432 1540448 2361508 2260100
34717 2260100 761204 -595346 -57536 1705395 2587826 2131989 1722073 2013022 2165700
34708 2165700 1702495 1249140 1096591 665671 -179354 -765527 -963567 -1437108 -2087660
34699 -2087660 -1790576 -350268 766543 508369 -325719 -690218 -934218 -1561796 -1603714
34690 -1603714 99263 2711692 4141037 3607131 2085365 572843 -569429 -781803
34682 -781803 439804 2170101 2467544 785461 -1143710 -1403714 60711 1922589 2945512
34673B945512n08037k054373k372785p09336J597849K252735R98950j67129j10517
34664A872869J5057p79384j408113o57114N88887Q48957N26025Q61311J353965
34655C222460N78033q86088r18995N91721J268997K9862j159836o07292L52507
34646B471369j73039j325571j080497J62503K87361q58091j249883j76491O71947
34637a270392J46105o62071n55269l5396J30293L44291R00178Q84630j61455q78267
34627a157353m8782J210694J036454k58103p83361q5017M51629J00238k47608
34618B18791O6975L63181k433m65809k16117N58350J002159N76703n85925j706305
34608a90430j672907j61145J490351J523385P5450q58276j45936J002353R60058
$$ plain form
34673 2945512 2437475 383102 -1989683 -2699019 -1101170 1151565 2150515 1983386 1872869
34664 1872869 1887926 1108542 -299571 -956685 -367798 481159 1007184 1868495 3222460
34655 3222460 3800493 2914405 1995410 2587131 3856128 3885990 2726154 2118862 2471369
34646 2471369 2298330 972759 -107738 54765 342126 -515965 -1765848 -1942339 -1270392
34637 -1270392 -1124287 -1786358 -2341627 -2377023 -2246730 -1902439 -1002261 -117631 -279086 -1157353
34627 -1157353 -1206135 4559 1041013 782910 -451 -85468 366161 466399 218791
34618 218791 285766 648947 646514 180705 -35412 522938 1525097 2101800 1515875 -190430
34608 -190430 -1863337 -2024482 -534131 989254 1064704 206428 60492 1062845 2022903
34599B022903m3067o14749l56261r3568l29187o57701p46261q97562j296797j368381
34589d380631m23693J238204K321610J829618K39090r44442q98998l28173k56603
34580a604018n11397j80340P17313J087779M24541l84738l20283M86535J166679
34571H82071J129032K88671r72998j664744q74861P80438J286163l09106k302244
34562a757578k300596k80484J523218J571854O24461K29387O96901J072428M95112
34553A874703q76510j993297j794578k78680J245994J383062K05832q26916o28575
34544a688965L13506P70525L94904j3149K09774O08050L14682n12271o71674L69783
34534I5165J414349R70493n97428j433656p50032J81565Q2401m45502m7154J185788
$$ plain form
34599 2022903 1979836 1365087 1008826 915258 586071 -71630 -817891 -1715453 -3012250 -4380631
34589 -4380631 -4804324 -3566120 -1244510 585108 824198 -120244 -1019242 -1347415 -1604018
34580 -1604018 -2115415 -2295755 -1578442 -490663 -66122 -450860 -771143 -284608 882071
34571 882071 2011103 2299774 1326776 -337968 -1212829 -432391 853772 544666 -1757578
34562 -1757578 -4058174 -4338658 -2815440 -1243586 -619125 -389738 307163 1379591 1874703
34553 1874703 998193 -995104 -2789682 -3068362 -1822368 -439306 -233474 -1060390 -1688965
34544 -1688965 -1375459 -604934 -210030 -223179 -13405 594645 909327 397056 -274618 95165
34534 95165 1509514 2480007 1882579 448923 -301109 -119544 -37143 -482645 -529799 655989
34524F55989J849481J206767q0208j088632j527565j472772j095159q00515r11879
34515c264493j047805m44768R35126K164807K375252J566815L38751p03769j193649
34506G26267j117887q05647m98236m1418N91781P57532j24864j371789j475721
34497c359982k4892J558878J654202L22830q84313p13540N42567J438713Q64519
34488A398982p49790j779176j186494K47975R33010M82741n994L12169Q99683
34479E53106Q06909N4177n63419o48466n50079o38750p24413l67504L83042P87705
34469i07692K11495q45789r91846L47810J858728J727196j6330j385777q51677
34460h53882Q73373J833072J075399n21180j356077p14585N71408R50436j96441
$$ plain form
34524 655989 2505470 3712237 3632029 2543397 1015832 -456940 -1552099 -2352614 -3264493
34515 -3264493 -4312298 -4757066 -3821940 -1657133 718119 2284934 2623685 1919916 726267
34506 726267 -391620 -1197267 -1695503 -1736921 -1145140 -387608 -512472 -1884261 -3359982
34497 -3359982 -3384874 -1825996 -171794 151036 -733277 -1446817 -904250 534463 1398982
34488 1398982 649192 -1129984 -2316478 -2068503 -1135493 -652752 -658746 -346577 553106
34479 553106 1360015 1414192 850773 202307 -347772 -986522 -1710935 -2078439 -1695397 -907692
34469 -907692 -696197 -1541986 -2533832 -2186022 -327294 1399902 1383572 -2205 -853882
34460 -853882 19491 1852563 2927962 2406782 1050705 336120 907528 1857964 1661523
34451A661523j794199k236000j133520M98036J544820J670685J119074M38753
34443A769172L01702P44787P13153o03564k074993j674556N21120J974972J094495
34434B766288n45303o32143N26762P83326m97293j762783j774983j001176k41134
34425b378439N55679J449902J730315Q90795l56780r03435o34764k82810k24267
34416a53804j73456N1286J81992N2881q7176j08946l84321j153547j803400j446082
34406e024573k16551P38017Q29374Q18768J447593K018470J369206j68415j061034
34397G50855p81043l76424n46566n40095L02402J135974Q56629p4298k93313M12298
34387H46419Q76025K40513j056987j948602j687840k91138J301641J736539O51576
$$ plain form
34451 1661523 -132676 -2368676 -3502196 -3004160 -1459340 211345 1330419 1769172
34443 1769172 2070874 2815661 3528814 2925250 850257 -824299 -303179 1671793 2766288
34434 2766288 2220985 1588842 2115604 2898930 2401637 638854 -1136129 -2137305 -2378439
34425 -2378439 -1822760 -372858 1357457 2248252 1891472 988037 353273 70463 -153804
34416 -153804 -327260 -275974 -93982 -41101 -128277 -237223 -621544 -1775091 -3578491 -5024573
34406 -5024573 -5241124 -4503107 -3673733 -2854965 -1407372 611098 1980304 1811889 750855
34397 750855 -30188 -406612 -953178 -1493273 -1190871 -54897 801732 727434 434121 846419
34387 846419 1722444 1962957 905970 -1042632 -2730472 -3021610 -1719969 16570 668146
34378F68146o38480o34162L96833Q57321P1844r51329j141289p02362l66281j24219
34368b563978N66941J652330K217417J486434j58653j396939j349613n73962k61601
34359c81624n46701m13399M90664J012724K34472q99412q78184J11580O24787
34350f45093K85362J18055N71366P70101R0187q60316j311853j243716q05608
34341c031515M099O16696R2192j306421j918199q42724P90943J501113J255466
34332b838350P14651k6926p27562l28202J338054K229375N43520k157971k561973
34323c815384j82140K068764K201083J521304J662220J661734m4796k389797k856256
34314a73268j191657L49942L86987n9153K12314P16522N12138j55578n38406o62614
$$ plain form
34378 668146 29666 -604496 -207663 649658 721502 -229827 -1371116 -2073478 -2439759 -2563978
34368 -2563978 -1997037 -344707 1872710 3359144 3200491 1803552 453939 -120023 -381624
34359 -381624 -928325 -1341724 -851060 161664 396136 -503276 -1381460 -1269880 -645093
34350 -645093 -359731 -241676 329690 1099791 1189978 329662 -982191 -2225907 -3031515
34341 -3031515 -3027416 -2410720 -2318528 -3624949 -5543148 -6385872 -5594929 -4093816 -2838350
34332 -2838350 -2123699 -2150625 -2878187 -3206389 -1868335 361040 904560 -1253411 -3815384
34323 -3815384 -3997524 -1928760 272323 1793627 3455847 5117581 5072785 2682988 -173268
34314 -173268 -1364925 -1014983 -627996 -687149 -474835 241687 753825 598247 59841 -602773
34304f02773p84461m13676Q27219J948724J639643L34480k41352L43333O54633
34295C705770j23123p24435R7375J278519Q37872j085631k299897j593105j03062
34286i717O73269P55767Q16782O72162k02806j322125j525439m76398R94573J863634
34276B239702J568339O4453j874921k694883j504533N08987J233414L53969l23756
34267d29229L00775Q94539j68200k086564k595809j100470P47881J483565J288088
34258a665424Q22233J37992o23121p56458j02327L91241J33776l7321O41384J172157
34248A14132J07733j897924k496530p30317J674196K501067J442792j63590j039962
34239d88403p89584K59307J317823J581773R07811r5154p80735r84128q34019
$$ plain form
34304 -602773 -1387234 -1800910 -973691 975033 2614676 2949156 2707804 3051137 3705770
34295 3705770 3582647 2858212 2955587 4234106 5071978 3986347 1686450 93345 -9717
34286 -9717 663552 1419319 2236101 2908263 2705457 1383332 -142107 -618505 376068 2239702
34276 2239702 3808041 3872494 1997573 -697310 -2201843 -1692856 -459442 -105473 -429229
34267 -429229 -128454 766085 597885 -1488679 -4084488 -5184958 -4437077 -2953512 -1665424
34258 -1665424 -843191 -705199 -1328320 -2084778 -2187105 -1795864 -1662088 -1699409 -1058025 114132
34248 114132 221865 -1676059 -4172589 -4902906 -3228710 -727643 715149 551559 -488403
34239 -488403 -1277987 -1018680 299143 1880916 2788727 2693573 1912838 928710 94691
34230I4691n20705l05417k82300j16967M78678J098749J094439N55944J09165
34221B206277j11010l95918n67930k83027q6945p58119j579001r63334Q68963
34212a670044J745829P84123k19254K15080Q66044J03054j238515j412180p63594
34203a589457p35418r23681J26969J716745J498675o54502k038120j048181O89574
34194b957396J104979M50735J4492r3905l08745j55280Q62229J781054J226986
34185A925149m43180j430164q42542L46664P98066L78165r1215q8760J05892O0301
34175G18376j37715j78221k03563n19300o79138J69420J681112K166063Q17419
34166C834453r59142j471553r59815n87047k81325O41444J506639J058456j42031
$$ plain form
34230 94691 -426014 -731431 -1013731 -1130698 -652020 446729 1541168 2097112 2206277
34221 2206277 2095267 1699349 1131419 848392 761447 3328 -1575673 -2539007 -1670044
34212 -1670044 75785 859908 640654 855734 1721778 1824832 586317 -825863 -1589457
34203 -1589457 -2324875 -3248556 -3121587 -1404842 93833 -560669 -2598789 -3646970 -2957396
34194 -2957396 -1852417 -1401682 -1387190 -1481095 -1789840 -1945120 -1082891 698163 1925149
34185 1925149 1481969 51805 -790737 -444073 353993 732158 640943 552183 658075 718376
34175 718376 580661 402440 198877 -320423 -999561 -830141 850971 3017034 3834453
34166 3834453 2875311 1403758 443943 -143104 -424429 217015 1723654 2782110 2640079
34157B640079k62375Q54774J356602K15197j487346k355793k008833n45586J404690
34148a88591K121525M89213j685976j542387M82670J073114o80197j764544k58105
34139a953278J557601J128858m15148q17676n48920j122141j682879n20037J469811
34130b903809J950888Q10687j32969k40837k66027k78819R4078J54532o79234
34121a491510j073339K54275J750122J091449q32715j210103K7963L45023p23992
34112a862827p41487J205936K733380J981316K71559m30245k42460j76208k91032
34103B447932l20565m12915k93176O22815J593074R32920j237962k611817j867820
34094a147514k76216O56691J077179J409386J199228M24863J1400J9710o74405
$$ plain form
34157 2640079 2377704 3232478 4589080 4804277 3316931 961138 -1047695 -1593281 -188591
34148 -188591 1932934 2422147 736171 -806216 -323546 749568 69371 -1695173 -1953278
34139 -1953278 -395677 733181 318033 -499643 -1048563 -2170704 -3853583 -4373620 -2903809
34130 -2903809 -952921 -142234 -275203 -516040 -782067 -1060886 -966808 -812276 -1491510
34121 -1491510 -2564849 -2310574 -560452 530997 -301718 -1511821 -1483858 -1138835 -1862827
34112 -1862827 -2604314 -1398378 1335002 3316318 3587877 3157632 2915172 2738964 2447932
34103 2447932 2127367 1714452 1421276 2044091 3637165 4570085 3332123 720306 -1147514
34094 -1147514 -1423730 -767039 310140 1719526 2918754 3343617 3355017 3374727 2700322
34085B700322j933687j870703q607J464346J092194L49130O12892M68870j506024
34076A368733l453815k706324o3451J418860R88506O23899J370715K011212J439672
34067B998007J11849j070582j566850r24149O50034J587221N07779j591050k273545
34058a571286p68636J296119K169452J593043K75081q48227q85195K03380J169907
34049B633638R50550J64245q1242j91235j177150k284885j671232N48062K039712
34040I30463J456041K2409o49405n78280m68920l42050j08124k26806p38589o75069
$$ plain form
34085 2700322 766635 -1104068 -1112675 351671 1443865 1792995 2405887 2874757 1368733
34076 1368733 -2085082 -4791406 -4854857 -3435997 -2447491 -1823592 -452877 1558335 2998007
34067 2998007 3109856 2039274 472424 -451725 198309 1785530 2293309 702259 -1571286
34058 -1571286 -2339922 -1043803 1125649 2718692 2993773 2145546 1260351 1463731 2633638
34049 2633638 3584188 3748433 3667191 3475956 2298806 13921 -1657311 -1109249 930463
34040 930463 2386504 2408913 1759508 1181228 712308 370258 262134 35328 -703261 -1378330
$$ [...]
##END NTUPLES=NMR SPECTRUM
##END=
