##TITLE=31Pdec_LR-729-B2-C1
 CDCl3, 24 sc
 17.12.2020
##JCAMPDX= 6.0         $$ Bruker NMR JCAMP-DX V2.0
##DATA TYPE= NMR SPECTRUM
##DATA CLASS= NTUPLES
##ORIGIN= UXNMR, Bruker Analytische Messtechnik GmbH
##OWNER= root
$$ XWIN-NMR		Version 3.5
$$ Thu Dec 17 10:24:32 2020 Russian Standard Time (UT+4h)  she@DPX200
##.OBSERVE FREQUENCY= 81.013821
##.OBSERVE NUCLEUS= ^31P
##.ACQUISITION MODE= SIMULTANEOUS
##.ACQUISITION SCHEME= undefined
##.AVERAGES= 24
##.DIGITISER RES= 17
##SPECTROMETER/DATA SYSTEM= spect
##.PULSE SEQUENCE= zgpg30
##.SOLVENT NAME= DMSO
##.SHIFT REFERENCE= (INTERNAL, DMSO, 0, 182.463)
##AUDIT TRAIL= $$ (NUMBER, WHEN, WHO, WHERE, WHAT)
$$ ##TITLE= Audit trail, XWIN-NMR		Version 3.5
$$ ##JCAMPDX= 5.01
$$ ##ORIGIN= Bruker BioSpin GmbH
$$ ##OWNER= she
$$ F:/spectra/data/she/nmr/P31/1/pdata/1/auditp.txt
$$ ##AUDIT TRAIL=  $$ (NUMBER, WHEN, WHO, WHERE, WHAT)
(   1,<2020-12-17 10:23:36.64 +0400>,<she>,<DPX200>,
      <created by zg, POWCHK disabled, PULCHK disabled
       configuration hash MD5:
       00 E9 B6 7A A2 85 ED C7 34 08 36 98 17 FE 4E 26
       data hash MD5: 32K
       47 8B CF B2 C0 B2 A5 91 22 75 AA A7 A3 B1 C2 D0>)
(   2,<2020-12-17 10:23:44.50 +0400>,<she>,<DPX200>,
      <Start of raw data processing
       efp BC_mod = 2 LB = 1 FT_mod = 6 PKNL = 1 PHC0 = -2279.351 PHC1 = -428.5992 SI = 64K 
       data hash MD5: 64K
       22 F9 95 5B 4E E6 54 14 FC FC A6 62 C2 A9 CA 5F>)
(   3,<2020-12-17 10:23:57.71 +0400>,<she>,<DPX200>,
      <pk PHC0 = 0.7857206 PHC1 = 0 
       data hash MD5: 64K
       DE 70 44 B2 8D 1F F6 C3 E6 86 C7 AD 22 81 D3 5C>)
(   4,<2020-12-17 10:24:01.01 +0400>,<she>,<DPX200>,
      <abs ABSG = 5 
       data hash MD5: 64K
       A2 D6 B1 CD F9 4E D9 74 5F 5D 18 8E E4 57 FE 4E>)
$$ ##END=
$$ 
$$ hash MD5
$$ CA 49 9E F3 4D 73 CA 0C A8 E9 4B C2 4E 47 A3 27
##$RELAX= 
##$RELAX= 
##$RELAX= 
##$RELAX= 
##$RELAX= 
##$RELAX= 
##$RELAX= 
##$RELAX= 
$$ Bruker specific parameters
$$ --------------------------
##$DU= <F:/spectra>
##$EXPNO= 1
##$NAME= <P31>
##$PROCNO= 1
##$TYPE= <nmr>
##$USER= <she>
##$AMP= (0..31)
100 100 100 100 100 100 100 100 100 100 100 100 100 100 100 100 100 100 
100 100 100 100 100 100 100 100 100 100 100 100 100 100 
##$AQSEQ= 0
##$AQ_mod= 1
##$AUNM= <au_zg>
##$AUTOPOS= <>
##$BF1= 81.014009
##$BF2= 200.13
##$BF3= 200.13
##$BF4= 200.13
##$BF5= 200.13
##$BF6= 200.13
##$BF7= 200.13
##$BF8= 200.13
##$BYTORDA= 1
##$CFDGTYP= 0
##$CFRGTYP= 5
##$CHEMSTR= <none>
##$CNST= (0..31)
1 1 145 1 1 1 1 1 1 1 1 1 1 1 1 1 1 1 1 1 1 1 1 1 1 1 1 1 1 1 1 1 
##$CPDPRG= <waltz16>
##$CPDPRG1= <>
##$CPDPRG2= <waltz16>
##$CPDPRG3= <>
##$CPDPRG4= <mlev>
##$CPDPRG5= <mlev>
##$CPDPRG6= <mlev>
##$CPDPRG7= <mlev>
##$CPDPRG8= <mlev>
##$CPDPRGB= <>
##$CPDPRGT= <>
##$D= (0..31)
0 1 0 0 0 0 0 0 0 0 0 0.03 2e-05 3e-06 0 0 0 0 0 0 0 0 0 0 0 0 0 0 0 0 
0 0 
##$DATE= 1608186216
##$DBL= (0..7)
120 120 120 11 120 120 24 19 
##$DBP= (0..7)
150 150 150 150 150 150 150 150 
##$DBP07= 0
##$DBPNAM0= <>
##$DBPNAM1= <>
##$DBPNAM2= <>
$$ [...]
##$SUBNAM3= <"">
##$SUBNAM4= <"">
##$SUBNAM5= <"">
##$SUBNAM6= <"">
##$SUBNAM7= <"">
##$SUBNAM8= <"">
##$SUBNAM9= <"">
##$SW= 369.568048894756
##$SWIBOX= (0..15)
0 1 3 0 0 0 0 0 0 0 0 0 0 0 0 0 
##$SW_h= 29940.119760479
##$TD= 32768
##$TD0= 1
##$TE= 0
##$TE2= 300
##$TE3= 300
##$TEG= 300
##$TL= (0..7)
0 120 53 12 22 120 120 120 
##$TP= (0..7)
150 150 150 150 150 150 150 150 
##$TP07= 0
##$TPNAME0= <>
##$TPNAME1= <>
##$TPNAME2= <>
##$TPNAME3= <>
##$TPNAME4= <>
##$TPNAME5= <>
##$TPNAME6= <>
##$TPNAME7= <>
##$TPOAL= (0..7)
0.5 0.5 0.5 0.5 0.5 0.5 0.5 0.5 
##$TPOFFS= (0..7)
0 0 0 0 0 0 0 0 
##$TUNHIN= 0
##$TUNHOUT= 0
##$TUNXOUT= 0
##$USERA1= <user>
##$USERA2= <user>
##$USERA3= <user>
##$USERA4= <user>
##$USERA5= <user>
##$V9= 5
##$VALIST= <valist>
##$VCLIST= <CCCCCCCCCCCCCCC>
##$VD= 0
##$VDLIST= <DDDDDDDDDDDDDDD>
##$VPLIST= <PPPPPPPPPPPPPPP>
##$VTLIST= <TTTTTTTTTTTTTTT>
##$WBST= 1024
##$WBSW= 4
##$XGAIN= (0..3)
0 0 0 0 
##$XL= 0
##$YL= 0
##$YMAX_a= 12756
##$YMIN_a= -13250
##$ZGOPTNS= <>
##$ZL1= 120
##$ZL2= 120
##$ZL3= 120
##$ZL4= 120
##$ABSF1= 182.463
##$ABSF2= -187.1042
##$ABSG= 5
##$ABSL= 3
##$ALPHA= 0
##$AQORDER= 0
##$ASSFAC= 0
##$ASSFACI= 0
##$ASSFACX= 0
##$ASSWID= 0
##$AUNMP= <proc_1d>
##$AZFE= 0.1
##$AZFW= 0.5
##$BCFW= 0
##$BC_mod= 2
##$BYTORDP= 0
##$COROFFS= 0
##$CY= -3
##$DATMOD= 1
##$DC= 0
##$DFILT= <>
##$DTYPP= 0
##$F1P= 0
##$F2P= 0
##$FCOR= 1
##$FTSIZE= 65536
##$FT_mod= 6
##$GAMMA= 0
##$GB= 0
##$INTBC= 1
##$INTSCL= 5.30512e-09
##$ISEN= 30
##$LB= 1
##$LEV0= 0
##$LPBIN= 0
##$MAXI= 10000
##$MC2= 0
##$MEAN= 0
##$ME_mod= 0
##$MI= 50
##$NCOEF= 0
##$NC_proc= -7
##$NLEV= 6
##$NOISF1= 182.463
##$NOISF2= 159.3651
##$NSP= 0
##$NTH_PI= 0
##$NZP= 0
##$OFFSET= 182.463
##$PC= 4
##$PHC0= -2278.565
##$PHC1= -428.5992
##$PH_mod= 1
##$PKNL= yes
##$PPARMOD= 0
##$PSCAL= 0
##$PSIGN= 0
##$REVERSE= no
##$SF= 81.014009
##$SI= 65536
##$SIGF1= 159.3651
##$SIGF2= -187.1042
##$SINO= 113.3802
##$SIOLD= 16384
##$SREGLST= <1H.CDCl3>
##$SSB= 0
##$STSI= 65536
##$STSR= 0
##$SW_p= 29940.119760479
##$SYMM= 0
##$S_DEV= 0
##$TDeff= 32768
##$TDoff= 0
##$TI= <>
##$TILT= no
##$TM1= 0
##$TM2= 0
##$TOPLEV= 0
##$USERP1= <user>
##$USERP2= <user>
##$USERP3= <user>
##$USERP4= <user>
##$USERP5= <user>
##$WDW= 1
##$XDIM= 65536
##$YMAX_p= 425742113
##$YMIN_p= -19526162
$$ End of Bruker specific parameters
$$ ---------------------------------
##NTUPLES= NMR SPECTRUM
##VAR_NAME=  FREQUENCY,     SPECTRUM/REAL,   SPECTRUM/IMAG
##SYMBOL=    X,             R,               I
##VAR_TYPE=  INDEPENDENT,   DEPENDENT,       DEPENDENT
##VAR_FORM=  AFFN,          ASDF,            ASDF
##VAR_DIM=   65536,         65536,           65536
##UNITS=     HZ,            ARBITRARY UNITS, ARBITRARY UNITS
##FACTOR=    0.456856943014862, 1,           1
##FIRST=     14782.0589164895, 0,            0
##LAST=      -15158.0608439895, 0,           0
##MIN=       -15158.0608439895, -19526162,   0
##MAX=       14782.0589164895, 425742113,    0
$$ Real data points
##PAGE= N=1
##DATA TABLE= (X++(R..R)), XYDATA
$$ [...]
47642 -7707857 -5164174 -1078434 1706649 3136146 4698801 6631494 7799781 7283762
47634 7283762 5268885 3054016 2115003 2170446 830693 -3184669 -7322357 -8078138 -5951588
47625 -5951588 -4474606 -4556253 -3561922 -671894 945606 -786593 -3169008 -2725214 -40555
47616 -40555 2199499 3563256 5172923 6541420 6282098 4714551 3011766 1018682 -1479208
47607 -1479208 -2863686 -2041175 -1211869 -2916044 -5559140 -5604547 -3282463 -1954336 -2208505
47598 -2208505 -1160463 1887918 3680432 2360298 556348 1090228 3011468 4191713
47590 4191713 4920430 6357762 7733357 7677004 6662975 5903275 5217060 3881938 2249379
47581 2249379 929151 -141458 -445602 1376115 4918475 7236201 6618126 5025614
47573 5025614 4609505 4185908 2061464 65039 883492 2815858 1564327 -3049372 -6455273
47564 -6455273 -6057306 -4576589 -5081160 -6059829 -4025321 955323 4985278 4973086 1653277
47555 1653277 -1987386 -3978166 -4522720 -4417454 -3350079 -756536 1969277 1998682 -1334592
47546 -1334592 -5173272 -6712560 -6375018 -5668409 -4039435 -749610 1955424 1499363 -152031
47537 -152031 1228942 5030997 5957096 2454818 -74502 2823114 7884934 8979283
47529 8979283 5441414 1375164 -1016666 -2858158 -4627836 -5257876 -4987708 -5221094 -5367197
47520 -5367197 -3385486 141943 2033968 1450707 1394161 3887192 6781055 7269450 5882915
47511 5882915 4658177 3514086 1152668 -1850530 -3561200 -3566930 -3024757 -2361178 -1130523
47502 -1130523 205384 642755 759789 2226280 4854542 6320806 5594785 4663319 5613898
47493 5613898 7543902 7870484 5783675 3016324 1683178 2381195 3974909 4441533 2500846
47484 2500846 -751954 -2434091 -965597 2033639 3780905 3437688 2058596 365422
47476 365422 -1737576 -3891593 -5343974 -6257093 -7360076 -8278432 -7779187 -5664472 -2759616
47467 -2759616 790278 4978397 7671134 5935710 782409 -2430028 -488875 3247337
47459 3247337 3624625 771613 -1096415 -574980 -486466 -2297483 -3376026 -1487354 1264531
47450 1264531 1514024 -417408 -1340095 110266 2164856 3019256 2868921 2329371 765115
47441 765115 -2440293 -5899567 -7169584 -5860366 -4494807 -5367304 -7364361 -7332493 -4352427
47432 -4352427 -798057 1367764 3224817 6176255 8342350 6430821 782585 -4177111
47424 -4177111 -5043296 -2814451 -473331 707183 1264230 1734289 2297496 3041603 3183761
47415 3183761 1155981 -2938414 -5908334 -4537626 143486 3511060 2614482 -668574
47407 -668574 -2301339 -665752 2425176 4391756 4268563 2596881 272106 -1803470
47399 -1803470 -2691304 -2179714 -1514777 -2245353 -3912727 -3920717 -600726 4292819 7240193
47390 7240193 6726073 4251252 1837143 -165753 -2545145 -5551780 -8256995 -9155827
47382 -9155827 -7415005 -4004793 -1277355 -667986 -1161578 -904339 187640 644061 -198482
47373 -198482 -1564860 -2759455 -3769537 -4490900 -4925845 -5893632 -7688241 -8360302 -5769226
47364 -5769226 -1371286 856111 -254438 -1909806 -2463324 -4030888 -7900518 -10832690
47356 -10832690 -9371869 -5445473 -3778365 -5108127 -5914501 -4371567 -2671398 -2912824
47348 -2912824 -3911304 -3270120 -503729 2805268 4479834 3148489 -208574 -2152709
47340 -2152709 -123188 4126974 6467722 5683838 4343824 4183389 3672412 1395713 -988634
47331 -988634 -1328178 -547319 -1184290 -3442693 -5062824 -4779378 -3858571 -3917052 -4679803
47322 -4679803 -4550889 -2715373 -104449 1662769 2071909 2108792 2637156 3020346 2353698
47313 2353698 1649645 3104568 6810618 9941038 10316262 9362161 9858816 11574970 11154042
47304 11154042 6484215 -420992 -5531985 -6712134 -4819153 -1869438 638419 1774735
47296 1774735 897047 -1890700 -5398682 -8066843 -8952449 -7884270 -5249765 -2172293
47288 -2172293 -157284 546800 1735062 4928260 8543559 9324743 6856937 4442313
47280 4442313 4552974 5628902 4935633 2525382 244421 -1389135 -2692540 -2661882 -468593
47271 -468593 1683784 638633 -2779948 -4251471 -2006297 673838 92395 -3403701
47263 -3403701 -6923012 -8598006 -8121169 -5794394 -2837735 -1233130 -1766524 -3199402
47255 -3199402 -4063641 -3808417 -1816912 2259069 6120514 5579942 -213475 -6566395 -8669738
47246 -8669738 -7317186 -6558403 -7461383 -7640798 -6111709 -4929210 -5602109 -6805990 -6610406
47237 -6610406 -4939256 -2955611 -1540040 -1075309 -1535589 -2282181 -2671138 -2946559 -3579599
47228 -3579599 -3984734 -3227515 -1829036 -1309887 -1893608 -2250065 -1708984 -1062317 -749267
47219 -749267 17076 1460733 2122273 819657 -1261154 -1858097 -656491 205180 -1176313
47210 -1176313 -4065876 -5885799 -5216696 -3402320 -2685752 -3153855 -2729045 -500545 1441096
47201 1441096 732714 -1908323 -3983559 -5203396 -7695805 -11902095 -14753351 -13400760
47193 -13400760 -9154121 -5938767 -5695985 -7045204 -8109558 -8774770 -9625464 -10042228 -8585087
47184 -8585087 -4988542 -842511 2007106 3273011 4009829 4824366 5044682 4071712 3048506
47175 3048506 4275299 8647792 14162865 17532536 17283293 14863227 12591000 11103573
47167 11103573 9479898 7458858 6143976 6000081 5546968 3465464 1195847 1576516
47159 1576516 4937126 8272805 8645723 5897256 1638848 -2670547 -5778525 -6417472
47151 -6417472 -4450534 -1440631 844998 1817456 1656190 893621 911084 3049623 6267490
47142 6267490 7572125 6047706 4376876 4622936 4763917 2070552 -1872557 -2873910
47134 -2873910 -54874 3175584 3872607 2349017 165293 -1839537 -3060879 -3098265 -2699490
47125 -2699490 -2713052 -2098817 630434 4033678 4750777 2374950 290559 716288 1973487
47116 1973487 2117969 2200241 3645964 4968486 4036175 2011188 1913507 3814414 4305990
47107 4305990 1235237 -3031073 -4165878 -973364 2999621 3252358 -514485 -3922364
47099 -3922364 -3167283 362728 2161234 314169 -3101778 -5807148 -7596670 -8452121
47091 -8452121 -7397935 -4597763 -2272619 -2052462 -3258605 -4910529 -7236335 -9799623
47083 -9799623 -10434660 -7978948 -4263303 -1590461 8337 1280859 1576361 424126
47075 424126 -446825 794234 3180900 4518654 4795092 5645499 7152106 7397704 4903331
47066 4903331 53687 -5249144 -8370792 -7825704 -5510789 -5056850 -6579029 -5845216 -868059
47057 -868059 3941877 3718482 281453 -1220292 -437259 -1056396 -3305175 -3548249 -1497797
47048 -1497797 -1422544 -4538284 -6096333 -2937897 998449 394574 -3960720 -7224723 -7239064
47039 -7239064 -5493972 -3521193 -2020023 -2109143 -3941473 -4918726 -2406025 2233965 5012602
47030 5012602 4376726 2423936 1335083 1175155 1479884 2558500 4186473 4712239 2931002
47021 2931002 269027 -108831 3254252 7949305 9680539 6745885 1944244 -661776
47013 -661776 -138544 1360725 2213648 2842537 3755908 4368820 4257307 3562816 1701719
47004 1701719 -2037374 -5911747 -6316288 -2275338 2912010 5843471 6476450 6058751 4563960
46995 4563960 2503056 2457534 5560030 8511159 7597528 4134987 2288433 2754080 2682672
46986 2682672 1186347 424243 937609 405084 -1682837 -2263409 204279 2368303 606371
46977 606371 -3498141 -5509981 -4421479 -3346737 -4554273 -6788024 -7772700 -6966726 -5079895
46968 -5079895 -2699474 -472582 586713 205565 -338306 406589 2122135 3082598 2410202
46959 2410202 1068570 473973 1078801 2684678 4978518 6845648 6303283 2751577 -1297312
46950 -1297312 -2604723 -1192167 -56321 -839482 -1927143 -1322650 848234 3559358
46942 3559358 6297698 8067452 7412035 5080957 4178831 5426736 4786271 -1051943 -8749888
46933 -8749888 -11676587 -8207997 -2923434 51372 990542 1503917 1320363 -393725 -3020301
46924 -3020301 -5077305 -5211352 -2438320 2467761 5938970 4798365 743475 -1400065
46916 -1400065 -343588 264172 -1922530 -4278757 -3934056 -2547398 -3180087 -5033316 -4941564
46907 -4941564 -2665668 -1242321 -2460878 -4655475 -5057748 -2647755 1158991 3535434
46899 3535434 2589779 -368651 -1917860 -706855 941046 584004 -1120732 -2174786
46891 -2174786 -2149070 -1554441 -394149 631868 -248040 -2600027 -2601171 1668479 6083778
46882 6083778 5662922 2087088 1280783 4471067 6946849 5903266 4145672 4518915 5505438
46873 5505438 4826225 3462832 3117553 2678965 335013 -2899307 -4619259 -4469085 -3702068
46864 -3702068 -2639245 -888449 888396 1478454 734140 -716660 -2425018 -3634566
46856 -3634566 -3222624 -1446753 -247022 -477165 -694681 -307398 -1577011 -5919003 -10241185
46847 -10241185 -10302667 -6513301 -2987931 -1606487 -618638 1099405 2214752 1906886 1121006
46838 1121006 -174327 -3625944 -8856294 -12292417 -11746911 -9599825 -9053930 -9483246 -8310589
46829 -8310589 -5744090 -4347451 -4706771 -4739714 -3271829 -1433176 -118854 1293009 2921921
46820 2921921 3564542 3134691 3685635 6156878 7813949 5290249 -628432 -5556199 -6641063
46811 -6641063 -5032474 -3154407 -1947890 -1802272 -3871578 -8169674 -11515269 -10113409
46803 -10113409 -4430349 677123 1499765 -633562 -2100786 -1844685 -1525863 -1982857 -2202639
46794 -2202639 -1829155 -2057104 -3006504 -2439764 1087448 5301176 6611910 4635146 2089148
46785 2089148 648144 -458917 -1430033 -441573 3122057 6218421 5387564 1350909 -2001672
46776 -2001672 -2655344 -2081979 -1940242 -1890413 -1578748 -2378116 -5271730 -8324757 -8245996
46767 -8245996 -4136810 1636015 6042042 7767169 7270676 5657207 3710164 1489661
46759 1489661 -1094310 -3184629 -3313565 -1558414 -293922 -1278441 -2628846 -728886
46751 -728886 4683236 9360498 9447744 6023713 3377398 3738663 5405146 5837863 4809948
46742 4809948 3689989 2822283 1267971 -775547 -933758 2553716 7627525 9860024
46734 9860024 7502750 3372529 755879 -789564 -3639630 -7331634 -8273723 -4364905
46726 -4364905 2191467 7201596 8061666 4866371 -128941 -3561147 -3301633 -660469
46718 -660469 1098666 831186 230992 117680 -1112750 -3758677 -4510224 -890244 3986954
46709 3986954 4818671 1529099 -504067 1996479 5915199 6410471 3174742 -29027
46701 -29027 -477577 989228 1955177 1224768 -507964 -1835997 -2057679 -1482305 -455784
46692 -455784 1332007 3927677 6016038 5932227 3774145 1430596 422049 767391 1989266
46683 1989266 3821860 5497407 5745520 4427259 3262720 4009586 6386607 8364634
46675 8364634 8111072 5456927 2143977 775856 2514355 5376590 5790537 2437715
46667 2437715 -2268742 -5050761 -5215816 -4636856 -5161785 -6796150 -7859856 -6468922 -2589285
46658 -2589285 1064767 1298754 -1787063 -4461778 -3614159 -170629 2657774 3201446 2060514
46649 2060514 264055 -1451102 -2243398 -1940219 -1909793 -3456341 -5507932 -5583320 -3127746
46640 -3127746 -344035 522689 -591170 -2233434 -3069571 -2670102 -1824927 -2157693 -4283658
46631 -4283658 -6462711 -6463487 -4586707 -3071879 -2570995 -1549441 263728 495842 -2203062
46622 -2203062 -5287529 -5351466 -2650371 -285428 193330 -81623 -143696 -627515 -1995691
46613 -1995691 -3410564 -4071914 -4106098 -3527792 -1843598 584845 2236318 2395486 2119129
46604 2119129 2274648 2015268 548625 -943930 -1115760 -1268720 -3861141 -8218123 -10296076
46595 -10296076 -7721028 -3071769 -689198 -1685825 -3801064 -5025810 -5186001 -4423068
46587 -4423068 -2587279 -711576 -1015298 -4111091 -7422494 -7764846 -4877011 -1253741
46579 -1253741 1000946 1892083 2362559 2839893 3387138 4281999 5625581 6735316 6632881
46570 6632881 5206089 3458801 2352961 1650089 386080 -1474716 -2593877 -2081249
46562 -2081249 -1173548 -1932481 -4307572 -5755190 -4247462 -670727 2316980 2934523 1306252
46553 1306252 -1072362 -2190570 -941046 1453100 2500084 1710562 1292721 2461307
46545 2461307 3133365 1461463 -395651 570208 2611101 1151413 -3705099 -6390752
46537 -6390752 -4073383 -1033687 -1901741 -4375252 -2929539 2598090 6875502 6721742
46529 6721742 4487663 3518072 4113335 5161436 6679816 8945366 10984558 11452248 9974573
46520 9974573 6987013 3453459 1007757 754908 1539142 1107375 -641157 -1564338 -949517
46511 -949517 -826852 -2375203 -3400004 -1410548 2496015 4985778 4534793 2145804 -823916
46502 -823916 -3309939 -3829303 -1558121 2000992 4329270 4697296 4050766 2815130 1103074
46493 1103074 582525 3112415 7114290 8368411 5660537 2844321 3413916 5583590
46485 5583590 5523775 3594270 3658009 6587094 8256277 5306994 94528 -2339736 -670493
46476 -670493 1799320 2141285 1265545 1688421 3672394 5128097 4610560 2842825 1275777
46467 1275777 516861 637873 1791458 3509979 4189418 2593445 -303051 -2136150 -1926449
46458 -1926449 -996997 -844520 -1147823 -629593 725774 1216456 -778834 -4929089 -8967969
46449 -8967969 -10586467 -9423514 -7078173 -5032498 -3030180 -61432 3536439 5979937
46441 5979937 5944455 3620262 -1416 -3697801 -5856299 -5263913 -2631329 -162784 869601
46432 869601 930467 365171 -1390082 -3910774 -5181292 -4471893 -3984687 -5575720 -7434295
46423 -7434295 -6584985 -3491757 -1174512 -427668 678572 2454905 2387919 -521137 -3346249
46414 -3346249 -3126786 -884129 352016 -181098 -835114 -496315 418160 1283265 1897458
46405 1897458 2178574 2388638 3042297 3668295 2756767 158611 -1734112 -853035 1641769
46396 1641769 3235057 3748709 4765297 6123022 5936872 4197290 3324312 4187471 4338452
46387 4338452 1981909 -485697 560506 4544820 6920338 4966524 1165167 -130011
46379 -130011 2146715 5343785 6914004 6760103 5654148 3341323 -366542 -3834510
46371 -3834510 -4948372 -3907781 -2792092 -2416908 -1790564 -957400 -1668785 -4021336 -5106897
46362 -5106897 -3039137 45393 1559626 2706714 5596573 7917891 5223120 -1666831
46354 -1666831 -6357067 -5206711 -1773241 -925938 -2264150 -2338693 -547416 829272 910436
46345 910436 892898 823247 -1106813 -5341309 -9231467 -9748766 -7016435 -4201881 -3947332
46336 -3947332 -5352017 -5095427 -1795256 1853921 2575246 1045519 549831 1676059 1675753
46327 1675753 -449979 -2023989 -1445582 -1067454 -2637696 -3447258 -925684 1777369 -195014
46318 -195014 -5290477 -6850373 -2594375 2243103 2472669 -725422 -3018298 -2830463 -1442545
46309 -1442545 153349 1612224 1947973 422531 -1898125 -3215112 -3209005 -3035670 -3564959
46300 -3564959 -4392077 -4142598 -1536070 2913447 6168803 5190842 780596 -2617833 -1852697
46291 -1852697 1459533 3269534 1700771 -1658415 -4082898 -4359706 -3672350 -4251315 -6529249
46282 -6529249 -7926922 -5875610 -1727841 557483 -200914 -1042230 268052 1967773
46274 1967773 1688283 437210 601442 1883416 2060202 602784 -1112303 -2350082 -3271483
46265 -3271483 -3321424 -1868253 -77303 187199 -901119 -1633621 -1657648 -2033326 -2578622
46256 -2578622 -1698899 759869 2695896 2379255 199159 -2405197 -3934065 -2755080
46248 -2755080 1621873 6716101 8812402 7317789 5295358 4909594 4744261 2893581
46240 2893581 260791 -1218509 -1684278 -2251969 -2111991 580407 5267025 8742714 8647798
46231 8647798 5740821 2603515 1308969 2279841 4159629 4782351 3418902 1976704
46223 1976704 2694738 4745564 4811333 1510843 -2374830 -3159380 -593736 2320305 3152590
46214 3152590 2294203 1597947 2079015 3256468 3903608 3102877 1155090 -354482 -15230
46205 -15230 1692585 2800821 2121054 258249 -1790261 -3694617 -4806668 -3829004 -1096000
46196 -1096000 217595 -2387408 -6662392 -7842632 -4977369 -2018894 -1858114 -2494672
46188 -2494672 -960205 1776717 2498128 371346 -2852890 -5714684 -7274080 -5937413
46180 -5937413 -1454664 2808175 3253414 1368273 1882327 5589173 8251051 7527013 6455299
46171 6455299 7887741 9642819 8551062 6050863 5618992 6743440 5925006 2768687
46163 2768687 705413 1528152 3218764 4084223 5304757 7553710 8283437 5251048 836335
46154 836335 -401459 2033191 3710197 1186498 -3624117 -6314694 -5441735 -3107267
46146 -3107267 -1024406 1401056 4636148 7039117 6879401 4880411 2963644 1483583
46138 1483583 -292851 -1747240 -1481995 -266436 -760231 -3564614 -5839941 -4990122 -1839928
46129 -1839928 1054620 2509043 2747195 1907133 157563 -1631836 -2527405 -2067059 211623
46120 211623 4103961 7115505 6056500 1614657 -1348782 -87073 2233932 1836462
46112 1836462 613529 2923959 7850159 9590973 5471155 -858994 -4842970 -5666243
46104 -5666243 -4496876 -2001188 493722 581163 -1987593 -3720580 -1322291 4055419
46096 4055419 8201101 8487501 5864026 3096389 2018666 2002294 910026 -1821158 -3821079
46087 -3821079 -3113078 -1694992 -2901683 -5801711 -6116918 -3136912 -1329200 -3367796
46079 -3367796 -5779932 -4373915 -499754 1582992 936986 -96151 -222608 54790 544113
46070 544113 988561 36411 -2229166 -2406675 1867071 7137780 7955564 4476877 1490259
46061 1490259 194231 -3539882 -11353299 -18023300 -17975096 -12699857 -8298135 -7755626 -8859570
46052 -8859570 -8665767 -7040749 -5576088 -4847674 -3642649 -779626 2558491 3273990 174777
46043 174777 -3647618 -4253822 -2035751 -815032 -1948324 -2693772 -1325581 -362615 -2497015
46034 -2497015 -5962841 -6811000 -4341843 -1657949 -1457498 -3260101 -4461695 -2859596
46026 -2859596 1307390 4966903 4875091 1484551 -1259478 -874850 818466 1127407 456214
46017 456214 691010 1727560 2490344 3832723 7067472 10455779 10620460 7314351 3604448
46008 3604448 1227940 -1005252 -3715088 -5179674 -4264116 -2344237 -944568 89188
46000 89188 781771 86158 -1488363 -1006326 2618270 5720506 4380372 290722 -1366484
45991 -1366484 792518 2899092 1964311 -167854 -446683 853564 1659788 2151300 4244701
45982 4244701 7591950 8962825 6377869 1928867 -776993 -892696 -675016 -2006281
45974 -2006281 -4024737 -4577942 -2964332 -368178 1861815 3220499 3389667 1975382
45966 1975382 -277072 -1095498 967726 4175659 5334515 4032987 3144122 4203614
45958 4203614 4543905 1270385 -3503527 -4697637 -1270641 2371145 2861503 2142655 3009210
45949 3009210 3712008 968215 -3434927 -3850332 1137186 6107328 5928433 2133295 -215656
45940 -215656 436674 1273434 116748 -1744286 -1976720 -313927 1662217 2811188 3572298
45931 3572298 4859823 6293113 6205838 3839819 779203 -917060 -1388960 -2064278 -2477672
45922 -2477672 -494944 3838727 7339579 7792840 6552745 5405936 3369837 -886992
45914 -886992 -5377466 -6529381 -3604853 1075131 5289027 7845848 7616328 4768502
45906 4768502 2381192 3666249 7625026 10240294 9829293 8254089 6860145 4626531
45898 4626531 1136713 -1683786 -2091713 -529989 1736190 3749322 4077454 1575828
45890 1575828 -2153323 -3663603 -2071015 -29785 632860 1328836 3375414 5249763
45882 5249763 5119508 3529709 1617410 -791041 -3231625 -3454693 -798246 1657909
45874 1657909 1050280 -1255773 -2323020 -2138118 -2418783 -2951641 -2460448 -1439009 -780256
45865 -780256 710717 3855497 5950691 4288769 1360063 1720664 4514013 4394939 -70725
45856 -70725 -4365686 -5270498 -4789453 -5083740 -4644542 -2251619 -263411 -637930 -1400093
45847 -1400093 -568821 -233534 -2784452 -5949067 -6005133 -3820283 -2985427 -3317798 -1306084
45838 -1306084 3210997 5854955 4225677 1251001 200421 51027 -1619402 -3980924
45830 -3980924 -4388423 -2871400 -2004247 -2809120 -3597904 -3114272 -2415582 -2805562 -3813228
45821 -3813228 -4450006 -4995251 -5947536 -6222269 -4361565 -1228466 503399 -181474 -1538210
45812 -1538210 -2005390 -2289719 -3365349 -4278395 -3765207 -2632063 -2378332 -2506662 -1633742
45803 -1633742 -590801 -1605263 -4312902 -5261063 -2103245 3744267 9140607 11897220
45795 11897220 11056673 6981882 2190644 -62843 698347 1730629 863306 -1363973
45787 -1363973 -4068309 -7663956 -11492186 -12630808 -9621245 -5296800 -3227199 -3125597
45779 -3125597 -2604729 -1723853 -2174169 -2910819 -703080 4478648 8088002 6416736 1137603
45770 1137603 -2896570 -2905924 -218793 1864967 1445630 -230002 -340174 1729104 3028032
45761 3028032 766522 -3567424 -5924901 -5011582 -3243944 -2178650 44130 5093364
45753 5093364 10372393 11000567 5583824 -1638719 -4965419 -2968982 604270 1797029
45745 1797029 1273965 2586348 5998113 7104792 3233213 -1714644 -2134848 1405899
45737 1405899 3308252 1214810 -1462750 -1787530 -1328591 -1998636 -2035906 645109 3966955
45728 3966955 4173507 1225323 -1574728 -2476719 -2786272 -3728153 -4498852 -3919658 -2219355
45719 -2219355 -593166 8867 -548965 -1584204 -2238319 -2358416 -2105356 -678531 2949949
45710 2949949 7379632 8936185 6088892 1959197 391754 1090714 1146397 28571 -174198
45701 -174198 1034771 1612966 728439 256562 1331409 2202301 1357645 513788 1993225
45692 1993225 4414265 3806516 -893727 -5715892 -6081422 -2154925 1582935 1797265 -157743
45683 -157743 -889387 114162 240057 -1623583 -2760829 -518640 3302974 4426556 1699103
45674 1699103 -1803294 -3124668 -2352120 -807996 1112831 3095590 3884855 2703327
45666 2703327 550640 -1053276 -1576522 -932528 1088786 3664161 4668361 3134665
45658 3134665 880641 116771 502193 314526 -517719 -747346 -481846 -1018926 -2130287
45649 -2130287 -2098015 -932036 -1003977 -3288663 -5123435 -3463857 1065600 5203623 7169380
45640 7169380 7849806 8362557 8408205 7305072 5149954 2393088 -613665 -2957708 -3016634
45631 -3016634 -139257 3735669 5297129 3270790 19894 -1057851 535511 2170804
45623 2170804 1933894 1117148 1713874 2857081 2028958 -669658 -2180398 -974437 718683
45614 718683 486823 -763099 -732201 844707 2969650 5737060 8957527 9754648 5219162
45605 5219162 -2647785 -8051581 -8024906 -5060842 -2677090 -1533239 -938502 -964006 -1313064
45596 -1313064 -770220 458010 389673 -1051269 -936184 1824208 3641556 1451773 -1935426
45587 -1935426 -1634515 2072685 4487866 3205615 -176336 -4017918 -7547067 -8179881
45579 -8179881 -3185684 5013146 9918891 8887924 5822101 4440264 3455725 863275
45571 863275 -1548930 -1670636 -1443773 -3475250 -5872075 -4979139 -1615176 -32270 -1389615
45562 -1389615 -2529076 -1201150 1416963 3873483 6421299 8728737 8803555 5960820
45554 5960820 2599812 1193633 1065745 -83255 -2440089 -3625203 -1841154 1706635
45546 1706635 3939284 3119526 580343 -968108 -610963 2036 -885607 -2951679 -4566066
45537 -4566066 -4733335 -3604903 -2110627 -1840046 -4066275 -7878017 -10523220 -10715086 -10143764
45528 -10143764 -10362591 -10028192 -7453487 -4353347 -4084764 -6764810 -8986701 -8353242 -5804144
45519 -5804144 -3345526 -1859092 -1535311 -2400798 -3925137 -5624002 -7948904 -10893295
45511 -10893295 -12253672 -9671814 -4293479 38989 1306149 738449 26740 -46258 1607201
45502 1607201 5373178 8166838 5511418 -2121736 -8488670 -8994593 -5829952 -3619803
45494 -3619803 -3170209 -2427924 -966090 39569 759000 2325705 4259242 4883125 3746526
45485 3746526 1623665 -1032180 -3741329 -5159039 -4515107 -2869626 -1274495 815856
45477 815856 3444630 4475313 2666213 597581 1318617 3515473 3561729 1244509 -507137
45468 -507137 -894726 -1817084 -3120828 -2043910 1362058 2681727 -698697 -5345196 -6315046
45459 -6315046 -3265169 555442 3089695 4405171 4591108 3752390 3249164 4329691 5898763
45450 5898763 5716903 3463364 739684 -1589496 -4047909 -6538137 -7625998 -6485912
45442 -6485912 -4319102 -3066388 -3233274 -3423413 -1911054 1265085 3733211 2838850 -1428789
45433 -1428789 -6176688 -8635810 -8619984 -7467147 -5792983 -3641342 -2025126 -2406704 -4460306
45424 -4460306 -5851084 -4960989 -3010800 -2731778 -5242748 -8793427 -10596996 -9553535
45416 -9553535 -6922833 -4507364 -2854700 -1614322 -797905 -511455 67730 1788386 3621305
45407 3621305 3608561 2146688 2020402 4033686 5157956 3207573 979297 2318742 5561516
45398 5561516 5245856 331739 -3809417 -3016033 170470 1164872 -38721 -531463 -246487
45389 -246487 -1551960 -4105050 -4729634 -2845661 -1868056 -3790384 -5955810 -5380547 -3305607
45380 -3305607 -2566726 -2624283 -714005 3049837 5293892 4272503 2032353 810715 -57403
45371 -57403 -2075886 -4508833 -5540606 -5432633 -6230585 -8397940 -9697216 -8159068 -4936122
45362 -4936122 -3116387 -4131112 -6315076 -7096282 -5774048 -3603716 -1766407 -370574
45354 -370574 472827 -138552 -2644685 -5582033 -6496881 -4303261 -150289 3806679 5923182
45345 5923182 5908191 5115717 5532160 7314772 7821684 4633067 -772699 -4278539 -4091810
45336 -4091810 -2256382 -856753 546181 2362445 2620641 -257826 -4070910 -5048291
45328 -5048291 -2502020 1301667 4935136 8344511 10034344 7456659 1206489 -4232755
45320 -4232755 -5531517 -3990298 -2491719 -1430335 88532 986949 -793962 -4639883
45312 -4639883 -7228376 -6350148 -3007681 320595 1867706 1013636 -1682476 -4385122
45304 -4385122 -5243066 -4212613 -2632001 -1051453 895895 2282528 837425 -3495688
45296 -3495688 -6749495 -4896033 1074646 6074350 6710490 4210211 1419047 -912483
45288 -912483 -3624849 -6439927 -7618423 -6149149 -3041650 -195641 1352970 1867414
45280 1867414 2097847 2435231 2829773 3206398 3502518 3243250 1813681 -271932 -1158525
45271 -1158525 151610 1980282 1942466 370775 -337983 165364 -538814 -3315228 -5396565
45262 -5396565 -4661456 -3349123 -4615732 -7440504 -8415958 -7176605 -6209885 -6116372 -5263299
45253 -5263299 -4039866 -5072218 -8464817 -10929924 -10756523 -9621074 -8177928 -4381016
45245 -4381016 1567401 5106231 3480488 245556 -92609 1448397 1348423 -8025 187238
45236 187238 1511303 1223190 -639710 -2023361 -3471054 -6738896 -9668683 -8250951
45228 -8250951 -3910601 -2801451 -6664001 -10020121 -8507294 -4786915 -3275844 -3541053
45220 -3541053 -2603463 -458731 547136 -202045 -1321964 -1847617 -1606567 -549527 542926
45211 542926 249053 -1262332 -2133281 -2032002 -2848682 -4843009 -5284726 -2963105 -737911
45202 -737911 -881454 -1072528 1597847 5486935 7179650 7010828 7437847 7740238 5250032
45193 5250032 1037099 -614557 1321985 3121246 2169551 348787 98937 481937 -793273
45184 -793273 -3747021 -6491001 -7742690 -7443179 -5872720 -3399019 -696287 1387936
45176 1387936 2108415 1269414 -251436 -1228493 -1907678 -3763997 -6509531 -7327273 -4939873
45167 -4939873 -2351448 -2748491 -4458631 -3528799 -16590 2481769 2959918 3918091 5788171
45158 5788171 5459643 2073398 -319637 1288651 3945303 3197558 -223975 -1864307
45150 -1864307 -17543 2792999 3987956 3454495 2124527 657031 -304620 -584814 -1362214
45141 -1362214 -3934358 -7435873 -9261676 -8030119 -4961383 -2102617 -225576 1192127
45133 1192127 2673821 3851948 3625340 1232964 -2582332 -5714252 -6399213 -4748900
45125 -4748900 -2476736 -1280937 -1471536 -1894405 -1338511 -312132 -845423 -3746462 -6811866
45116 -6811866 -7248496 -5372134 -3870708 -3459829 -1843256 2142747 5889460 6321409 3993369
45107 3993369 1783966 846452 204431 -425965 -6039 1483125 2189566 637926 -2432903
45098 -2432903 -5074761 -6076805 -5463884 -3811577 -1649987 637226 2489484 2848822
45090 2848822 823525 -2729709 -4899598 -3204032 1444114 5111766 4673957 975547
45082 975547 -2097986 -1601025 1566112 3820752 2948990 528032 -250234 1307007 2750606
45073 2750606 2091758 430160 -40190 657804 659556 -637349 -1725830 -1444798 -655335
45064 -655335 -712869 -1438809 -1674842 -1202958 -963264 -1519716 -2358177 -2908923 -3336355 -3779329
45054 -3779329 -3576540 -2152259 -263404 723451 767935 1264647 2977333 4987802 6224464
45045 6224464 6932198 7787057 8498637 8336472 7318230 5822951 3724461 1063549 -1111086
45036 -1111086 -1919102 -2062750 -2540266 -2462581 -55540 4151483 7013019 6202851 2659011
45027 2659011 -829226 -2328935 -1726469 -162848 917625 862320 279593 65373 312224
45018 312224 771995 1575091 2354855 1583457 -1517381 -5020629 -6087588 -4276191 -1315137
45009 -1315137 1634332 4233231 5299356 3892708 1879835 2239644 4522124 5191273
45001 5191273 3080174 1149115 1721359 3266745 3496348 2609508 1582186 7643 -2205703
44992 -2205703 -3324770 -2097472 381615 2794587 5405687 8063612 8826390 6674447
44984 6674447 3582664 2041232 2412512 3981101 5949587 6062999 1778748 -5053012
44976 -5053012 -8424428 -5906447 -2363096 -2549128 -4052215 -2150008 2015124 3813239
44968 3813239 2997943 3000669 3981962 2922647 18387 -1157539 -9947 278844 -1230442
44959 -1230442 -1963580 -1377491 -2231281 -4947083 -6022797 -4001481 -2145343 -2919149 -4291969
44950 -4291969 -3938806 -2865830 -2206851 -538388 2432985 3167521 -1014143 -7185025 -10263870
44941 -10263870 -9214308 -6701612 -4421273 -2041189 313484 1538828 1309238 432744
44933 432744 -396536 -1168369 -2306623 -4165705 -5912044 -5381812 -2015425 669286 -1279762
44924 -1279762 -6105896 -7786184 -4521510 -1409074 -2592071 -5055877 -3557192 1699388
44916 1699388 6234608 7785054 7728637 7552463 7513048 7961643 8938980 8979486 6763254
44907 6763254 3387142 1000743 8571 -536536 -791849 -298680 563875 954065 625859
44898 625859 -452496 -2291271 -3841993 -3521987 -1593003 165486 1774743 4901693
44890 4901693 8394358 8179719 3859007 933633 2957426 5717177 3839425 -565112
44882 -565112 -1590559 840729 1509462 -1130997 -2885214 -913967 2581213 4543506
44874 4543506 4379604 2485170 -337348 -1565576 697308 3618519 2256820 -3046881
44866 -3046881 -6422520 -4710747 -1447408 -1008375 -3089520 -5161386 -6458714 -6811214
44858 -6811214 -4764399 41422 4727912 6031242 3944262 874904 -1274372 -1915956
44850 -1915956 -1450750 -1380316 -3070074 -5448750 -5749409 -3299600 -504557 710203 1145253
44841 1145253 2068144 2997340 2869959 1441023 -1286305 -4956963 -7699686 -7557064 -5595786
44832 -5595786 -4789978 -5311186 -4320652 -1293479 437262 -847020 -2273675 -1381773 -283263
44823 -283263 -1541322 -3209948 -1980556 1082425 2098543 206683 -2047060 -3285205
44815 -3285205 -4580829 -6357069 -7190702 -6135206 -4067241 -2418765 -1968365 -2658793 -3475509
44806 -3475509 -3134982 -1856284 -1385316 -2357947 -3234367 -2977382 -2775237 -3543898 -3903844
44797 -3903844 -2660219 -1144840 -713039 16708 2651570 5536055 5767318 3360596 638424
44788 638424 -1190662 -2157476 -1812167 -332834 206106 -1220451 -2084356 -208728 1747688
44779 1747688 47326 -3443285 -3516183 66300 2137524 520294 -725847 1788395
44771 1788395 5497713 6068597 3071453 -1124046 -4928236 -7363364 -6964511 -3576063
44763 -3576063 494159 3122250 4586508 5796942 6384365 6037838 5632362 5482584 4541696
44754 4541696 2753541 1860751 2257373 1603934 -1270272 -3443736 -1495885 3662525 7955636
44745 7955636 8741207 6223577 1970428 -1698247 -2437156 -476786 760079 -1122384
44737 -1122384 -4078604 -4716714 -3118757 -1795424 -1446506 -1107948 -1332961 -3455621 -6161499
44728 -6161499 -6529875 -4480845 -2532025 -965680 2635016 7975105 10373072 6867798
44720 6867798 792380 -2581672 -2588061 -2325623 -3050543 -2943297 -1036047 863045 972002
44711 972002 119816 274188 1496067 1540283 -1446662 -6281858 -9357696 -8361392 -4914798
44702 -4914798 -2381182 -1347093 667615 4402212 6353492 3333782 -2215280 -4651667
44694 -4651667 -2435534 273936 -91959 -1866343 -1644761 115628 -61487 -3230804 -6293560
44685 -6293560 -5903138 -2005512 2989589 6788009 8186896 7018853 4437965 2556969
44677 2556969 2675473 4030116 4858095 4414825 3523754 3447680 4493908 5390792 4125677
44668 4125677 312190 -3209799 -2652167 2007977 6075065 5382085 1323170 -1317268
44660 -1317268 -750395 201576 -1001738 -2906198 -2702226 -616185 518533 -617252 -2182398
44651 -2182398 -1953872 -281101 751440 572092 1200635 4331174 8110549 8538584 4531101
44642 4531101 -159627 -1447112 179320 1328706 990905 1020499 1759486 1055711 -1296921
44633 -1296921 -1914743 1035258 4173481 3599203 917628 729068 3477896 5089041 3564338
44624 3564338 1719619 2332740 4168659 4592540 3307107 1431597 -868295 -3479719
44616 -3479719 -4686288 -2902512 683068 3197981 3349364 2051511 499217 -617176
44608 -617176 -465399 1432231 4010873 5474018 5322980 4321197 2785649 645251 -964344
44599 -964344 -386037 1722549 2382912 235380 -2457624 -3315601 -3545587 -5813511 -9566659
44590 -9566659 -11396670 -10014038 -7990123 -7646985 -7742950 -5999686 -3089627 -1758529 -2739156
44581 -2739156 -3744160 -2515828 809203 4486775 6815195 6816809 4758545 2434317 1706342
44572 1706342 2387997 2720111 2065449 1537429 1656424 1460469 848463 1521460 3881392
44563 3881392 5117221 2903288 -565480 -1281859 751328 1796123 237663 -1505795
44555 -1505795 -1561672 -1373517 -2274951 -2659490 -1017846 939253 1119343 794912 2150220
44546 2150220 3796498 2725061 -47546 -128986 3541377 6777044 6344758 4330898 3992644
44537 3992644 4426933 2681725 -820185 -2682823 -1686437 -118192 234595 320373 1072137
44528 1072137 1103498 -952481 -3484963 -3570387 -1077335 933124 211574 -1891299 -2544276
44519 -2544276 -1229512 36820 -75906 -568387 -411257 -890368 -3786592 -7772614 -8863448
44510 -8863448 -5092292 938525 5121354 6049425 5050606 3505036 1979919 1236877 2039299
44501 2039299 3887583 5348269 5648941 4869580 3028158 521893 -909964 332506
44493 332506 3093117 4221580 2401711 -484583 -2184533 -2305073 -1131778 1472649
44485 1472649 4641965 5971422 4211809 1082976 -1244917 -3003664 -5241284 -6831742
44477 -6831742 -5650219 -2077212 1219697 2908241 4079406 5515168 6161019 5202648
44469 5202648 3986385 4632660 7364754 9877627 9237072 4691098 -923923 -3298628
44461 -3298628 -1150403 2156728 2719475 810595 -340631 506160 1575651 1794312 2514563
44452 2514563 4669334 6718344 6807808 5213246 3416056 2207567 1724795 1965337 2288822
44443 2288822 1655080 131234 -1064757 -1480985 -1891722 -2550674 -2917951 -3452451 -5194864
44434 -5194864 -6905724 -5584725 -1118934 2760586 4004314 5257867 8608233 10908363
44426 10908363 8564165 4295142 3890469 7445856 9201749 6162582 1822441 292145
44418 292145 1264010 2557341 3720881 4791996 4659765 3244734 2892347 5059097 7483856
44409 7483856 7143789 4668350 3419825 4927344 7229307 7448420 4658831 491434
44401 491434 -2231965 -1918396 179940 1386235 830341 187623 1040542 3005550 4858894
44392 4858894 5849055 5383272 3279505 1035298 851388 2486937 3137746 1429453 -765891
44383 -765891 -1706877 -2328368 -3613524 -4135950 -2763331 -1453994 -2293453 -3559022 -2061630
44374 -2061630 1810527 4639414 4708997 3123474 1018565 -1144097 -2119008 -1044176 215481
44365 215481 -937283 -3793142 -5505383 -5773912 -6528329 -7224641 -5097441 -771908 1260764
44356 1260764 -510117 -1947070 73314 2775578 2620116 1251174 1893091 2956995
44348 2956995 512580 -4554423 -7236824 -5951097 -4482393 -5709245 -7665022 -7312498
44340 -7312498 -4810391 -2191139 -423233 294646 -648512 -3100193 -4983438 -4086496 -558660
44331 -558660 3308584 5267322 4656993 2693499 1701704 3056338 5375134 5773970 3379463
44322 3379463 443963 -551049 442545 2038830 3592387 5023040 5582859 4547458 2778325
44313 2778325 2061381 2780810 3406883 2635130 1257600 1397719 4039538 7524890 8777340
44304 8777340 6500139 3107162 2633812 6390116 11538479 14449134 14346972 12701134
44296 12701134 10281041 6774294 2952001 979558 1766167 3428864 3387260 1139211
44288 1139211 -1758191 -3529039 -3136418 -425006 3301159 5425216 4364523 1715277
44280 1715277 504286 1174216 1199112 -558049 -1309240 1737260 6342450 7180681 2870943
44271 2870943 -1938542 -2727480 -750738 -366142 -2659018 -4764433 -4771470 -3978410 -3768673
44262 -3768673 -3237012 -1415752 404168 590732 -64007 381307 1851449 2471618 1558382
44253 1558382 349913 -306029 -1076242 -2432422 -3411129 -2978704 -1632097 -792049 -1123539
44244 -1123539 -1921487 -1747108 376338 3705787 5793264 4852312 2272296 1539599 4244277
44235 4244277 8361417 10914477 10847108 8547825 4418468 -419428 -3415628 -2856884 -383505
44226 -383505 700874 -542228 -2105404 -2356859 -2008426 -2397006 -3449008 -3995311 -3023665
44217 -3023665 -366001 2798848 4291989 3282531 2045695 3300620 5803536 5344292
44209 5344292 926749 -3020003 -2350770 1528801 4441249 5070444 4733020 3408831 -83788
44200 -83788 -4522867 -6625371 -5312982 -2661975 -328272 1942279 3781969 3509172 1207900
44191 1207900 -398967 326731 1893444 2829556 4128863 6594135 8401440 7835366 6208029
44182 6208029 5331084 4220771 1511824 -802395 1687 2277797 2060405 -80678 886674
44173 886674 6497168 11561641 11265197 7698049 6103917 7413763 8268170 6836320 4668922
44164 4668922 3105565 1367010 -1153602 -3461126 -4874440 -6301962 -8421439 -10166593
44156 -10166593 -10259688 -9053531 -7637550 -6085417 -3881523 -1397032 349917 945851
44148 945851 438104 -1425800 -4240243 -5705722 -3596547 652290 2641556 488787
44140 488787 -2460485 -2190639 634177 2490257 2689435 3624847 5556665 5187360 865510
44131 865510 -4059323 -5363930 -3187300 -825841 -32864 125173 1005015 3154103 6212416
44122 6212416 8116287 5892709 -389726 -5914907 -6164027 -2496785 285667 716743
44114 716743 1271606 2909967 3431605 1829962 223026 216899 878514 1659383 3820597
44105 3820597 7195590 8865784 7265601 4764016 3943370 3998574 3160979 2047310 1904552
44096 1904552 1816798 480072 -1139576 -1543204 -1224899 -959218 314376 3110109 5111813
44087 5111813 4477803 3303218 4127832 4949994 2035215 -3579034 -6922424 -5903995 -3050054
44078 -3050054 -813955 529373 452273 -1744948 -3920830 -2636347 1332586 3257629
44070 3257629 1375349 -711168 -43755 1574982 1566468 620645 120845 -897186 -3266034
44061 -3266034 -5237704 -5550215 -6223927 -9139405 -12171242 -11984216 -8830286 -5567536 -3646667
44052 -3646667 -2930370 -3624933 -5236710 -5279623 -2360182 844291 1043841 -586590 -472656
44043 -472656 1322525 1293994 -1628662 -4590829 -5527540 -5410220 -5026044 -3413076 -916509
44034 -916509 -189220 -2047112 -3312692 -1272555 2054373 2789532 596550 -1628083 -2351284
44025 -2351284 -2694617 -3407682 -3468118 -2411814 -1699094 -2321225 -2617671 -341129 3786224
44016 3786224 6536543 6309124 4916854 4397892 3834758 1228757 -2514536 -4022398 -1962848
44007 -1962848 1272009 3108187 3756545 4364174 4362858 2797437 924466 1067735 3378724
43998 3378724 5779771 6896605 7154697 6975101 5755673 3151824 24554 -2462468
43990 -2462468 -3802748 -3836985 -2278308 909608 4845145 7630441 7268119 3498037 -1124218
43981 -1124218 -3118168 -1715535 345263 267620 -1763615 -3748669 -4528755 -3977999 -2038974
43972 -2038974 644812 2224679 1617682 155564 -366739 -245020 -660610 -1142531 -548130
43963 -548130 357327 -130521 -1673667 -2423276 -2105784 -1975925 -2029292 -1077754 484015
43954 484015 971867 729000 2077174 5230147 7217505 6067602 3464058 1881417 1434915
43945 1434915 1122717 1103282 1920915 2957836 3305821 3163978 3202412 3483034 3814846 4169181
43935 4169181 4267564 3990941 4401066 6628459 9433086 10005485 7879871 5760708 5376609
43926 5376609 4870416 1999502 -2039891 -4057892 -2916802 -358465 1308638 943884
43918 943884 -1065888 -2860365 -2375540 241312 2276444 1562684 -848506 -2145384 -1205209
43909 -1205209 381284 421526 -1227532 -2026193 740577 6148942 9474579 7548359 3086163
43900 3086163 1057450 1803740 1527507 -758241 -1644786 104990 364670 -4097929 -10051944
43891 -10051944 -11974807 -8949014 -4086543 313660 3415433 3830477 978196 -2606820
43883 -2606820 -3694849 -2377682 -1117001 -1036392 -1753714 -3304066 -5193080 -5042882 -1598102
43874 -1598102 2054597 1811648 -1623934 -3634668 -1860121 1812884 4937783 6770817
43866 6770817 7003287 5522022 3613166 2636973 1644224 -964657 -3943521 -4581007 -3154489
43857 -3154489 -2368951 -2401656 -513018 3678916 6441176 5003569 1313052 -920397 -440578
43848 -440578 1686843 4098366 5570265 5310215 4019349 3176568 2747816 1423547 -624645
43839 -624645 -1570748 -1012796 -741791 -1714952 -2743113 -3008156 -3267320 -3492196 -2058361
43830 -2058361 1152329 3380309 2691214 936559 804272 1571816 292628 -3595837 -7155549
43821 -7155549 -7500928 -4951083 -2248551 -1433979 -2052796 -2441048 -2177425 -2199313 -2528319
43812 -2528319 -1808819 -154224 -286854 -3672154 -7314947 -7307936 -4363924 -2654840 -3972535
43803 -3972535 -6361608 -7931422 -8403227 -7159373 -3650463 19359 739205 -834379
43795 -834379 -825738 1942879 4358449 4127205 2649967 1787999 1516269 1824886 3115612
43786 3115612 3717160 1170878 -2907067 -3850189 -1224078 39686 -2180890 -3466582
43778 -3466582 -411883 3596602 4377527 3773540 5381627 7584662 6563929 3350084
43770 3350084 2174360 3643977 4676707 3878833 2484846 1183425 -25950 -293315
43762 -293315 134161 -1460277 -5730399 -7894009 -3696179 3435252 6458942 4233105
43754 4233105 1549298 1165361 1627405 2008074 2670458 1717714 -3023586 -8244461 -7709193
43745 -7709193 -1512129 3331567 2983457 1448019 3072732 6204241 7231710 5891350
43737 5891350 3401869 -95206 -2967931 -1443418 4590375 8987142 6813832 1318182
43729 1318182 -908601 911998 2160422 583523 -1388786 -1646746 -1196010 -1356553 -1752760
43720 -1752760 -2109793 -3186475 -4624963 -4167185 -710714 3319622 4489556 2651060
43712 2651060 1039284 2019018 4336761 5445914 5169390 5225805 5743356 4720506 1460176
43703 1460176 -1803630 -2849011 -1941087 -89968 2753263 5894613 6843741 4718342
43695 4718342 2457993 2613758 3184822 1324070 -1003160 224837 4080280 5714434
43687 5714434 3933426 2333177 2572200 2064578 -380555 -1962378 -1026462 -51399 -960800
43678 -960800 -1673778 -181623 1659763 1520196 691791 1689828 4186210 6059200 6391667
43669 6391667 5202053 2440065 -673743 -1660411 -153684 1128507 610008 279186 1805720
43660 1805720 3205376 1986476 -977154 -3365083 -4846518 -6130330 -6952173 -7336817
43652 -7336817 -8299387 -9037139 -6540757 -781380 3046558 1005978 -3789268 -5625540
43644 -5625540 -3622190 -645614 2300974 5577123 6978178 4020347 -626053 -1283531
43636 -1283531 3093059 7969493 10061673 10709959 11880632 12929690 12534587 10670367
43628 10670367 7660991 3843900 716220 -68058 783131 927386 -360845 -1864426
43620 -1864426 -2892628 -3516135 -2904681 -385127 2210563 2340795 667237 31778 744586
43611 744586 310030 -2088492 -4365706 -5158813 -5165941 -4352415 -1574412 1935917 2441755
43602 2441755 -1065063 -4531310 -3918416 -372069 1751798 424922 -2293802 -3057021
43594 -3057021 -577444 3233936 5114633 4026242 2303850 2119743 2168943 132179 -2970641
43585 -2970641 -4243681 -3873727 -4564281 -6092156 -4917308 -210267 4008689 4511228 2913249
43576 2913249 2088498 2015480 1575030 1393368 2212011 2886077 2472783 2051703 2187661 1030562
43566 1030562 -2437192 -5561005 -5421930 -3244727 -2283617 -2740752 -2060874 540454 3057987
43557 3057987 4099780 4607731 5834201 7567433 8725695 8389606 6271618 3306365
43549 3306365 1475873 1875726 3288959 3764614 3165338 2993709 4039655 5329976 5336295
43540 5336295 3532643 937701 -560989 68853 1770937 2680273 2623809 2965446 3745334
43531 3745334 2888921 -759214 -5311681 -8092179 -8674260 -8278829 -7346292 -5412736 -2842855
43522 -2842855 -1178029 -1578681 -3368527 -4116870 -1645668 3152089 6223749 4852202
43514 4852202 1654025 1586883 5234953 8284272 7989406 6342812 5629898 5011563 3874166
43505 3874166 4584554 8485674 12423066 13150145 12391711 13195794 13760580 10148924 3689253
43496 3689253 11295 952344 2924380 3915606 6557974 12410436 18244349 20941120
43488 20941120 22037997 24004028 25403679 23994546 22442292 26197962 36106862 47286829
43480 47286829 55882266 63028881 70299158 74563580 71065137 60581332 49740607 43248796
43472 43248796 38734477 31364173 21288609 13247553 9822950 9004498 8785630 9963390
43464 9963390 12447653 12681997 8300289 2810920 1524186 4204741 5978436 4850692
43456 4850692 3729585 4575658 5234795 3910979 2793539 4399762 7187259 7980023 6820358
43447 6820358 6193030 6691575 6766799 6231489 6664265 8045699 8147327 6343192 5247168
43438 5247168 6734821 8547199 7332652 3689716 1357349 1900502 3121963 3033560 2498027
43429 2498027 2820052 3320539 3008970 2441701 1945062 228824 -2677803 -3342375 660749
43420 660749 5838081 6494130 2583925 -700706 -975371 -1095483 -2720970 -3052641 -336966
43411 -336966 2460800 2725297 2408995 3482411 3595477 879621 -1004394 1687273 5500323
43402 5500323 4431770 -274251 -1983739 667029 2389736 974770 933327 5203308
43394 5203308 9831979 10398853 8419868 7418681 6959518 4889426 2208501 1286864 1477434
43385 1477434 605404 -759896 -383858 1274278 1411343 -659870 -2434636 -1812813 529078
43376 529078 2651057 3459181 2991027 1931015 1241689 1591858 2954843 4809263 6289127
43367 6289127 6267598 4339427 1816944 599574 1057302 2342300 4341336 7106274 8597298
43358 8597298 6174957 1123824 -1608898 169145 2773548 2103649 -629111 -1492365
43350 -1492365 147520 1592163 1464815 1061043 1440666 1808513 826183 -2059592 -6072562
43341 -6072562 -8693595 -7175247 -2138924 1913459 1674725 -1043202 -2635329 -2840237
43333 -2840237 -3502663 -4205657 -3234195 -1825316 -2976765 -6099107 -7223179 -5155697 -3240654
43324 -3240654 -3782214 -4735782 -3839676 -2360080 -2129539 -1908654 154119 2587661 2471252
43315 2471252 99430 -1273059 76319 2623039 4227432 4264528 3017626 974731
43307 974731 -700601 -515805 1693708 4213667 5104821 4051755 2449360 1980312 2965432
43298 2965432 3752336 2129549 -2033335 -5988300 -6844044 -4800448 -2566464 -1751543 -1382448
43289 -1382448 -402497 150618 -1074771 -2993187 -3254103 -1901507 -1555330 -3337347 -4879780
43280 -4879780 -3909699 -1923247 -1943895 -3775194 -4304489 -2217053 535000 2318050 3837853
43271 3837853 5531673 6024271 5144492 5652816 9000490 11445232 8135212 248426 -5706916
43262 -5706916 -5956690 -3400503 -2483477 -3220695 -2393119 1221818 5189494 6458194 4453545
43253 4453545 1197558 -652278 254772 3380911 7135647 9928133 10576054 8802264
43245 8802264 6066629 4819022 5606800 5824202 3049965 -1149583 -3017737 -1858350
43237 -1858350 -768755 -1749508 -3000647 -2449863 -1378340 -2227161 -4379455 -4700225 -1811599
43228 -1811599 2269456 4878024 5526089 5519628 5746246 5620212 4224624 2088584 1037599
43219 1037599 1767222 2481408 1304872 -597144 -325992 2455863 4934049 5255484 4571655
43210 4571655 3991467 2472035 -257923 -1415130 1249882 5510694 7521260 7146533
43202 7146533 6896487 6643339 3765357 -1253322 -3774384 -1153894 3551751 6129794
43194 6129794 6582484 7373785 8508403 7505139 3447962 -1580267 -5060326 -6238828
43186 -6238828 -5815450 -4853011 -4058633 -3253460 -1764605 102308 859514 74505 -274489
43177 -274489 1722058 4785062 5703034 3540380 770939 -19990 1071237 2307265 2741942
43168 2741942 2715892 2742185 2769613 2343997 1136372 -616932 -2297283 -3688323 -5066856
43159 -5066856 -6007495 -4842682 -427885 5873035 11025312 12970032 11696995 8471174
43151 8471174 5340499 4569601 6464068 8026229 6070324 1803342 -184442 1919939
43143 1919939 4668369 4315020 1741751 377309 1131249 1955398 1495277 782206 1398481
43134 1398481 3525840 5759896 6004835 3176234 -1111240 -3419877 -1976391 1651120
43126 1651120 5000868 7232284 8243565 7494413 5588932 4991570 6689147 7810198
43118 7810198 5342716 861244 -1395202 -35904 2863932 5443254 6979993 6253835
43110 6253835 2920012 -86103 411776 2791719 2987430 1505550 2805990 7207526
43102 7207526 9379297 6827208 4079911 5274660 7815774 7476024 5300357 4691362
43094 4691362 5259424 4672137 3811494 4824029 6077650 4325635 565113 -1284556 -607962
43085 -607962 -139178 -546687 -4952 1138383 425409 -1679408 -1857085 192088 919058
43076 919058 -743017 -1182323 1708739 4823103 5109251 4388820 5397909 6455048 4309256
43067 4309256 131369 -1702068 16534 1968149 1363752 -719453 -1593650 -171835
43059 -171835 2834802 6069565 7904888 7037562 3988023 1439415 1959792 5385972 9236835
43050 9236835 11729647 13261861 14330046 13529740 9698067 5330572 4809105 8436246
43042 8436246 11136851 8844790 3696991 698757 1621253 4942776 9490437 14486464
43034 14486464 17694719 17687460 17012740 18981424 22118105 22458690 20964524 23130675 30195856
43025 30195856 36100603 35401306 29614430 23053760 16708572 9846652 4269064 2633329
43017 2633329 4147284 5434925 4950479 4148314 4966513 7788059 11108338 12383310 10522213
43008 10522213 7821540 7299836 8117397 6925343 4073894 3964003 7695505 10310296
43000 10310296 8210774 4632745 3928885 4723266 3438025 960378 483246 1553426
42992 1553426 1782212 2186738 5073701 8363641 8056797 5276829 4743968 6745394 6935830
42983 6935830 4406610 3589689 6783703 10544804 11459803 10502426 9696935 9218231 9875132
42974 9875132 13693008 19422454 21891775 18863122 14729548 14390817 17027827 19085166
42966 19085166 19980525 21239636 22741689 23446405 23742939 24044928 23315388 21861619 22894360
42957 22894360 27879919 32954873 33956165 32841699 34814281 40844231 47659066 53831026
42949 53831026 60861793 68773426 75767943 82649240 92839678 107179793 123227458 140966257
42941 140966257 164980237 199467206 244835951 299520964 358647515 407849662 425742113
42934 425742113 400871227 344819981 282620296 230884203 190025311 155448001 127496787
42927 127496787 107893765 93764107 80895314 69448262 61654205 56278307 50102592
42920 50102592 43408449 39183869 37354052 34499863 29826956 26904634 27797732 29306029
42912 29306029 27635998 24023965 22659058 24636831 26958109 26865625 24532712 21365537
42904 21365537 17840223 13968655 10792955 10120020 12301803 14702936 13754297 9492464
42896 9492464 6676059 9264602 14763222 17165220 15250819 13992221 16827655 20961916
42888 20961916 22648515 22865162 24146733 25593944 25889865 28300646 36459902 46280349
42880 46280349 48550904 40475090 29128096 21806035 18019115 13694085 8815386 6736814
42872 6736814 8228610 10189867 9865098 7830534 6676143 7985101 10682811 12114053
42864 12114053 11092476 9386588 9196106 10183798 10875620 11696757 13554057 14406873 11541970
42855 11541970 7355327 8001340 14871626 22115712 24857334 25121811 26266080 26163980
42847 26163980 21083536 13379791 9562096 11692531 15644319 17625631 17915916 17813087
42839 17813087 17138299 16060430 16163523 18153037 20684233 22538647 24074746 25699762
42831 25699762 26737981 26753897 26565349 27193186 28983630 32168088 36907583 42208174 46073867
42822 46073867 47610915 48371632 51148940 57773247 67993326 79949133 91896094 103913294
42814 103913294 117472478 133012986 149145262 165167196 182707554 202609914 220801005
42807 220801005 229728943 224568752 206955476 182828466 158008705 135614442 115904459
42800 115904459 97892483 81691095 69035633 60875658 55534942 50790102 46822477
42793 46822477 45049464 44706630 43114036 39265620 34660246 30343063 25737143 21103724
42785 21103724 18522231 19017466 20780815 21808613 22566474 24283842 26035021 25660708
42777 25660708 23080141 20921770 21760378 25645947 30255664 32902271 32743119 31498161
42769 31498161 31529980 32915003 33219160 30576394 25918019 21498489 18483641 17073065
42761 17073065 17622173 19734758 20994350 18914951 14384040 11239055 11794264 14386389
42753 14386389 16061464 15940702 14676620 12329925 9010731 6676471 7573656 10733511
42745 10733511 12456952 10984030 8447249 7201690 6642234 5365268 4108414 3951527
42737 3951527 3538829 1428197 -111335 2324955 7244692 9153718 6255270 2998943
42729 2998943 3225932 4814755 3913230 1091979 -312071 382272 1256971 1804808 3123485
42720 3123485 4802322 5108534 4215581 4290243 6199049 8605462 10396391 11625441 11973877
42711 11973877 10691987 8447447 7123586 7353282 8055996 8611288 9537251 10652131 10514763
42702 10514763 8461606 5790406 4192667 3891481 3701781 2406244 245541 -582706
42694 -582706 2156297 7580793 11820210 12434405 11079684 10334819 10003471 8784703 7392263
42685 7392263 7022236 6739438 5888925 7069876 12301654 17864301 18315778 15001521 14767548
42676 14767548 19779850 24480383 24140100 20928645 19231666 19901631 21930119 25618188
42668 25618188 31274220 38133370 46388220 56699171 67300666 77573414 95198231
42661 95198231 129952074 174618909 201225224 186999167 140393773 92070676 62872531
42654 62872531 50226654 43427299 38898740 36848251 34021294 27523136 20384772 17231863
42646 17231863 17823861 19238456 20960110 23459382 24837893 23469185 21704723 22580264
42638 22580264 24572122 23888926 20699930 18746149 19292623 19644696 17944671 15776120
42630 15776120 15180455 16068342 17537182 19192637 20125789 18843139 15397449 11762445
42622 11762445 9145992 6843618 4762907 4845408 8173121 12376834 14063200 12774678
42614 12774678 10655971 9246798 8703201 9237164 10787067 11758658 10802584 9693662 11515928
42605 11515928 15765850 18525198 18317822 18267456 20839253 24094440 25786141 27793419
42597 27793419 32884428 39713839 45112201 49437418 55756311 65957723 82149799 108631054
42589 108631054 144660758 175956008 182689609 159690336 122584479 90669943 69802624
42582 69802624 55631005 45694243 40297080 36147342 28581931 19438789 15205870 16867161
42574 16867161 18008321 14212517 8625344 6135136 6781783 7672287 7951075 8863230 10775490
42565 10775490 12457809 12574456 10952778 9054428 8989895 10813918 11602213 9220989 6001573
42556 6001573 5779371 7971174 8190144 4842983 1356301 944283 2617122 3806891 3989890
42547 3989890 4027548 4262912 4763486 5530027 5534264 3654941 1154853 579508 1497533 573110
42537 573110 -2783215 -4293249 -644934 5408273 8513862 7180462 4192629 2406397
42529 2406397 2782330 5191972 8554931 10937158 11384093 10723234 9259405 5585974 -330071
42520 -330071 -4974056 -5077972 -2231288 -769227 -2033640 -3673885 -3856219 -2909434 -1051120
42511 -1051120 2123287 5422821 6484048 5395595 5070133 6635782 7162622 4105456
42503 4105456 -141720 -986923 2140868 5355966 6021028 5767627 6666548 7217449 4800300
42494 4800300 549687 -1578822 -459998 852237 282531 -208572 1176206 1973797 -934532
42485 -934532 -5603436 -6984426 -3845445 156273 2084109 2499525 2428552 1613432 659955
42476 659955 1115063 2354811 2254719 1973660 5337345 11478969 13369310 7369118 -395867
42467 -395867 -2029936 1522992 3489264 1988848 1120992 2576591 3073361 855669 -1323414
42458 -1323414 -1556419 -2030443 -4421233 -6241023 -4879674 -2221213 -1906331 -3820672 -4378679
42449 -4378679 -1604660 2383269 4011473 2137230 -895732 -1830725 -124514 1681972
42441 1681972 1850488 2250783 5342680 9624792 11134199 9085934 6630370 5721781 4892793
42432 4892793 3214572 2713129 4641596 6448415 5297787 2393963 903113 1247077
42424 1247077 1441050 921900 897569 1331284 595812 -1491658 -2725016 -1492514 872262
42415 872262 1610963 -435281 -3777482 -5633595 -4189820 -127888 3988387 6210063
42407 6210063 6888548 7524557 8477763 8547722 6533879 2612055 -1526353 -3494235 -1886006
42398 -1886006 2049098 5001490 4851583 2928736 2071451 2885832 3227271 1368992 -1646026
42389 -1646026 -3348531 -2699927 -961732 -105282 -905255 -2556306 -3787341 -4041869 -3494533
42380 -3494533 -2288654 -371003 1877100 3500085 3793656 2855414 1164445 -747646
42372 -747646 -1980843 -1583324 76818 1065973 112653 -1417475 -1112322 1023239 2240583
42363 2240583 778887 -1441676 -1192900 1682297 3995821 3559162 2129117 2815416 5621672
42354 5621672 7369139 5870829 2366220 -581090 -1810263 -1304784 936435 4015182
42346 4015182 5371417 3117262 -1184289 -3838919 -2934989 487834 4498366 7463136
42338 7463136 7714383 4762840 1177593 649949 3361480 5610438 4903231 2851987 1747412
42329 1747412 1049390 -572722 -2086685 -1683329 219312 2318717 5225143 9681266
42321 9681266 13024595 11217338 4603893 -1679038 -3833968 -3136641 -2579266 -2556590 -1608053
42312 -1608053 613107 3159714 5405048 7058562 7256224 5199581 1572544 -1636901
42304 -1636901 -2741529 -1522614 717001 1990896 1159314 -1020644 -2822201 -3435912
42296 -3435912 -3129300 -1862460 706485 3707890 5391407 5624055 6227857 7814366 8213176
42287 8213176 5709118 2192251 869098 1876810 2562994 1622113 500737 615954 1463972
42278 1463972 2047155 2249612 2030127 920520 -735670 -1452263 -550183 677415 739049
42269 739049 -105877 -639003 -449077 180665 1233774 2494841 2813351 1330138 -855957
42260 -855957 -1677653 -740447 309443 174961 -583138 -744780 54455 1588508 3776363
42251 3776363 6245150 7794387 7325994 5249928 3319463 2998438 4283023 5974132
42243 5974132 6719365 5939986 4287298 3296091 4085754 6036351 7042854 5582320 2454013
42234 2454013 -86698 -922930 -903670 -677038 943604 4795009 8311563 7317010 1596423
42225 1596423 -3787336 -4500092 -2288588 -1864191 -3914796 -4594602 -1730030 2033222 3330092
42216 3330092 2318351 1026082 -182754 -2136995 -4278564 -4928776 -3596768 -1287918
42208 -1287918 1048413 2959913 3872623 3348556 1599787 -1082479 -4509509 -7356545
42200 -7356545 -7360706 -4398351 -1717973 -1808362 -2607175 -910911 1745893 917369 -3069230
42191 -3069230 -4173647 659001 6069305 4943714 -2246266 -8501795 -8998313 -4866791
42183 -4866791 801953 6360760 10302287 10447830 6705764 2406199 581112 201311
42175 201311 -1786341 -5605958 -8254106 -7861294 -6060890 -5207700 -5296688 -5207374 -5374407
42166 -5374407 -6752998 -7783918 -5407283 153919 4377239 4018026 1543071 1473342 3934680
42157 3934680 5237745 4214380 3836717 5492711 5643555 1089025 -5015772 -6238651
42149 -6238651 -1293728 4094456 4367772 421479 -2737511 -2666219 -1543955 -1985039 -3003631
42140 -3003631 -1436421 3332674 7711338 7724173 3613012 -675342 -2318198 -2274613 -2618404
42131 -2618404 -3015934 -1621863 1261514 2537494 -79249 -5060698 -8574424 -8478187 -6086271
42122 -6086271 -4199637 -4162858 -5157855 -5864402 -5984247 -5879113 -5393970 -3885443 -1351887
42113 -1351887 1220973 2852753 3338682 2833720 1377084 -589400 -1676683 -382384
42105 -382384 3288258 7414703 9690083 9282801 7017758 4020859 960885 -1219890
42097 -1219890 -1159721 969291 2266570 99134 -3784678 -4753089 -1522839 2104786 3197897
42088 3197897 3952185 7117850 10398799 9859138 6760833 5624750 6420360 4683701 -140241
42079 -140241 -2743463 -374642 2647954 2186154 917936 3315255 8017974 10211396
42071 10211396 8806063 6346421 3896088 950436 -998608 328079 3879568 6495136
42063 6495136 7474865 8081250 7759233 5365087 3090630 4069729 6615473 6279556 3607079
42054 3607079 3901893 8406073 11843371 10650297 7696560 6061579 4008938 142432
42046 142432 -1780695 1494830 6152441 6108224 1801841 -1433481 -2036749 -3465817 -7308118
42037 -7308118 -10606853 -10748179 -8620078 -5939895 -3117770 -676464 667084 2316226
42029 2316226 6712886 12584882 14772498 10980088 5704663 4545657 6789412 7064482
42021 7064482 3209829 -1282458 -2956242 -3010260 -4436509 -7000803 -7899208 -6456684 -5058873
42012 -5058873 -4964874 -4172291 -1186529 1588000 1171797 -822561 -149532 3241029 4574350
42003 4574350 1599433 -1549905 -407602 3288169 4659961 2920943 1431764 1814243
41995 1814243 2321851 1929071 1943155 2710828 2232051 -467135 -3254293 -3725043 -2075131
41986 -2075131 78266 1752920 2320601 1258004 -422867 -460985 1413394 2462304 857594
41977 857594 -1433280 -1827860 -1137634 -1472019 -1775081 755114 5332082 7738223 6502649
41968 6502649 5163462 6780305 9548483 10267890 9313743 8921624 8595520 6182704 2631910
41959 2631910 1448342 3029997 3577807 1082076 -1264483 -77370 2756687 2871124
41951 2871124 -283244 -3504471 -5110690 -6324664 -7459414 -6516687 -2798486 955307
41943 955307 1767241 18293 -1473574 -676725 2142437 4766499 4403369 368547 -4192930
41934 -4192930 -5214525 -2744257 -719612 -1266921 -2359840 -2216682 -2179485 -2913331 -1726129
41925 -1726129 2545166 5363201 2201668 -3831694 -5721717 -2702045 -544149 -1757233
41917 -1757233 -2235956 544086 2584183 428647 -2181293 58590 5257209 6899792
41909 6899792 3411839 -315718 -592735 771848 554637 -1497717 -3712452 -4948409
41901 -4948409 -4633587 -2581038 117948 1865629 2902753 4842726 7271219 7349020 4056914
41892 4056914 379564 -593337 354945 710942 489486 1442481 3112704 3026076 908183
41883 908183 -314217 1389662 4485564 6498115 7205756 7658727 7760657 6820520 5400219
41874 5400219 4561716 3908423 2343094 363129 -480809 -310087 -869496 -2423096 -3019966
41865 -3019966 -1744754 -401369 -378241 138454 3491388 8380169 11076896 10450829 9148697
41856 9148697 9355166 9714380 7620595 3006524 -1473292 -3201012 -1534270 2381754
41848 2381754 6760689 10257443 12404685 13107388 12168101 10016415 8393441 8816248 10270439
41839 10270439 10091256 7700333 5774099 6669714 9247734 10651395 9880997 7891279
41831 7891279 5375572 2712766 1394300 2844359 5645297 6338697 3690304 189169
41823 189169 -1414621 -1018185 361351 2701238 5653090 6960354 4864589 1319532
41815 1319532 215013 2435069 4884458 4602258 1725177 -1993477 -5270258 -6884825
41807 -6884825 -5400654 -1146172 2848084 3784592 2298093 1216919 1835300 3068303
41799 3068303 3794983 4130112 4297229 3923645 2900895 1718913 593504 -634033 -1436222
41790 -1436222 -596464 2229568 5802953 8472264 9269705 7873267 4799086 1960264
41782 1960264 1542292 3432248 4874951 3673563 891901 -582130 545953 2985970
41774 2985970 4791747 5311082 5322579 5774419 6404689 5822821 3597942 1820443 2998630
41765 2998630 6280918 7823563 5800203 2944773 2530233 3770743 3554897 1317634
41757 1317634 -726759 -1625782 -2871016 -5135922 -6560247 -5486730 -3007871 -1423563
41749 -1423563 -1365644 -1638902 -1135300 51383 958418 637510 -872342 -2233714 -2104046
41740 -2104046 -892092 -406053 -1483504 -2838795 -2739142 -1154550 272058 22527 -1776061
41731 -1776061 -3324641 -2731748 -143826 1884900 911034 -2578027 -5629723 -5999428 -3992366
41722 -3992366 -1318703 663572 1339843 662255 -744609 -1888291 -2246019 -1983718 -1353383
41713 -1353383 -366181 998238 2647555 4103421 4103252 1595560 -1929314 -2626365 1139201
41704 1139201 5545853 5465233 1377432 -1272701 4802 1415988 -688152 -3768007
41696 -3768007 -2968358 1288325 3828281 2241994 -194099 58545 1821927 1608577 -1149086
41687 -1149086 -3737406 -4201624 -3444864 -3109879 -3270943 -3222573 -3235658 -3902624 -4263470 -2539707
41677 -2539707 878967 3043191 2142644 26708 -566479 20923 -689332 -3227768 -5527623
41668 -5527623 -6143844 -5607736 -4372326 -1993364 939737 2558443 2605630 3393148 6363410
41659 6363410 9501859 9854220 7260824 4025462 1994626 1402847 1679671 2139394 2590439
41650 2590439 3948290 7080993 10548177 11373787 9103305 7057729 8061968 10884857
41642 10884857 12637039 12611566 11544967 9152643 5344632 2397182 2649841 4836667
41634 4836667 5793569 5200071 5358376 6540240 6203762 3537318 1486798 2777559 6318314
41625 6318314 9068772 9607142 8365749 5828184 2148861 -2015088 -5283480 -6062575
41617 -6062575 -3521349 1040047 4293535 4009180 1897028 1372555 2532577 1940134 -1873315
41608 -1873315 -5533609 -5342117 -2485332 -1126314 -2519956 -3939678 -3342961 -2264794
41600 -2264794 -2890025 -4258214 -3511131 -370449 1799337 212257 -3528256 -5407727
41592 -5407727 -4110671 -2155477 -1746687 -1690279 251721 3552378 5397821 4305527 1605267
41583 1605267 -382617 -321794 1613943 3860465 4354387 2443488 -366970 -2379421 -3561346
41574 -3561346 -4387337 -4202924 -2651370 -1574216 -2953721 -5530809 -6145194 -4247938 -2268408
41565 -2268408 -1335067 261318 3376274 5693627 4922629 2358571 1334462 3158444
41557 3158444 5953864 6874731 4777556 1424071 148794 2176782 4477516 3094161
41549 3094161 -1545989 -5084405 -5134090 -3639366 -2507675 -537972 3092835 5600550
41541 5600550 4319678 1543837 1803348 5287134 7668691 6298032 3080646 676919
41533 676919 -916318 -2616071 -3659807 -2806562 -744600 575299 403704 -407463 -1027130
41524 -1027130 -1316695 -1008271 420115 2620665 4167292 4197047 3505214 3102328 2413739
41515 2413739 424866 -1659129 -997221 2857043 6353557 5827471 1676110 -2804688
41507 -2804688 -5354234 -5632199 -3623063 47364 2796390 2059939 -1152251 -3122836
41499 -3122836 -2176261 -315066 97968 -1126134 -3119122 -5072915 -5721460 -4216619 -2015697
41490 -2015697 -1235720 -814204 2253226 7012656 8027320 2925212 -3275856 -4459563
41482 -4459563 -1064054 1908240 2082417 1211489 1148164 1940250 3019233 3314337 1198241
41473 1198241 -2914267 -5221026 -2907519 1261046 2093278 -1071980 -4042129 -3970951 -2304026
41464 -2304026 -1391276 -1525842 -2066964 -2806860 -3426447 -3568546 -3699302 -4100938 -3446879
41455 -3446879 -692243 2169387 2091726 -491715 -2110344 -1247313 219940 791702 1221525
41446 1221525 1880577 1471591 -392838 -2038860 -2347325 -2105833 -1867202 -1091587 -341382
41437 -341382 -1416128 -4002102 -5078223 -3266932 -1012004 -640839 -1059309 -557642 -226687
41428 -226687 -1793663 -4069920 -4451403 -2653606 -517316 701761 712302 -710910 -2712479
41419 -2712479 -2839772 21386 3462463 4740901 4708009 5668140 6707467 4877959 585901
41410 585901 -2072290 -919212 1698937 2884872 2758852 2676278 2502796 1507089 122019
41401 122019 -905716 -1752432 -2544307 -2558899 -1735974 -1473705 -2321042 -2363366 26026 2964423
41391 2964423 3066461 184556 -2424681 -2806530 -2636582 -4019134 -6245475 -7253960 -6652792
41382 -6652792 -5515398 -4364663 -3343765 -3609962 -6221875 -9583844 -10188196 -6732284
41374 -6732284 -1986853 364254 -350920 -1842657 -1805902 141279 2684013 3986890 3100750
41365 3100750 922304 -624545 -723212 -282844 -149685 114022 997727 1926149 2485589
41356 2485589 3533106 5637614 7441326 7241952 5428931 3611635 2052087 12868
41348 12868 -1799756 -1569413 556333 1930717 849757 -1037414 -774050 2419524 6488201
41339 6488201 8761789 8372639 6805979 6047588 6005718 4610009 1199667 -1540612 -790535
41330 -790535 2269084 3914737 3054831 2287675 3566160 5451175 5579251 3711392 1262688
41321 1262688 -473075 -727909 466616 1570596 676687 -1897815 -3730016 -3541017 -2462044
41312 -2462044 -1516613 -205134 1344077 1345941 -764580 -2632189 -2302767 -1385295 -2399950
41303 -2399950 -4377875 -4004492 -691994 2169469 1452625 -2038577 -4780807 -4366770 -1608525
41294 -1608525 782073 1352536 1435099 2952922 5251046 5749902 3803158 1778722 1532718
41285 1532718 1988475 1563317 902976 1239803 1678194 440747 -2112216 -3817926 -3538304
41276 -3538304 -1962685 -110687 1457718 2381717 2657584 2618794 2177967 1247424 1376197
41267 1376197 4739238 10145938 12609919 9276371 3600766 748925 814387 140174 -2166648
41258 -2166648 -3328403 -1998970 66927 1866336 4610209 8195598 9825683 7882446
41250 7882446 4358024 1742906 -38304 -1934797 -3380664 -3522729 -2934908 -2281466 -982714
41241 -982714 1020626 1911042 436220 -1783138 -2557316 -2412398 -3107517 -3932821 -2518188
41232 -2518188 827200 2724437 1621910 471274 2733389 7461973 10566127 10126754
41224 10126754 8129025 6881500 6031179 4228872 2007909 1097295 1556509 1528827 -55796
41215 -55796 -2121119 -3160527 -2885250 -1577550 777901 3655422 5310380 4276191 1238328
41206 1238328 -1467719 -2091139 -753777 1147284 2408890 3088784 4091377 5382250
41198 5382250 5315449 2954224 411690 806043 3905303 6150645 5426203 3239806 1368984
41189 1368984 -706415 -3409271 -4930425 -3816742 -1468555 295945 2057349 4681010
41181 4681010 6530885 5766083 3727279 3089224 4150997 5690936 7559538 9274740
41173 9274740 8286138 3662933 -422959 439681 4007376 4453287 1302020 -404371 1432422
41164 1432422 3535278 4017928 5224399 7846620 8223740 4589645 883559 784516 2327505
41155 2327505 2143933 1050207 1335411 1916359 562777 -1704041 -2634774 -2907549 -4168955
41146 -4168955 -5015467 -3265020 -594826 -369560 -1831830 -1034148 2649185 5312910 4462195
41137 4462195 2424892 2515290 4506142 5413439 3206137 -1260916 -5065440 -5577767 -2672973
41128 -2672973 1408755 4519128 5950802 5308371 2325543 -1134366 -1579619 1572832
41120 1572832 4473132 4314393 3553438 5268290 7093442 4657560 -597539 -2684655
41112 -2684655 27533 2774641 2215563 926687 2005736 3999788 4279828 3555374 3367353
41103 3367353 2137157 -2065800 -6693444 -7043588 -2869485 1238135 2379218 2797749
41095 2797749 5663605 10163215 12695384 11420897 7825694 4534287 3097981 3601797
41087 3601797 5079118 6186837 6400106 6594768 7544825 7932234 5387851 227244 -3414576
41078 -3414576 -1915128 3077693 6191741 4638565 1062775 -434693 753622 2053053
41070 2053053 1708520 766657 1260830 3619155 6188718 6907835 5279671 2730099 1062375
41061 1062375 876492 1644232 2617558 3094211 2622605 1781462 1769381 2233718 1019421
41052 1019421 -2314629 -4657497 -3647518 -1857794 -2875794 -4793149 -2772130 2388077
41044 2388077 4412633 1425444 -738956 2066069 5577524 4097444 -809355 -3736693
41036 -3736693 -3625129 -3043784 -2391626 -530245 1086377 581882 186341 2979030 6563457
41027 6563457 5814816 1024742 -2505214 -2475283 -1423083 -956063 -306088 -690021 -4460003
41018 -4460003 -8906195 -7664703 -395852 5296813 4420187 1038904 633540 1781498
41010 1781498 294237 -2908719 -3680497 -1641666 -79954 -401218 -1141203 -1614391 -2691470
41001 -2691470 -4263310 -4990758 -4521756 -3729143 -2908676 -1417390 1111152 4184870 6543264
40992 6543264 6507823 3599640 98300 -893961 719542 2354097 2963127 3784150 4478733
40983 4478733 2659587 -1234162 -2917354 -587846 1866470 1158878 35217 2249194
40975 2249194 5653264 5478872 2172837 467018 1732598 2541915 778956 -1537378
40967 -1537378 -2192058 -1638336 -1005807 -383886 77380 -3688 281642 2337229 5192128
40958 5192128 5806261 2988232 -935397 -3007327 -2613769 -1204577 -492904 -1176125 -2244180
40949 -2244180 -1610498 1478058 5039506 6455555 5299300 2966381 626770 -956023
40941 -956023 -862838 792167 2211652 2319335 2422726 3363457 2858464 -1200999 -6210940
40932 -6210940 -7400314 -4404012 -1583215 -1777102 -3327305 -3719292 -2666011 -710629
40924 -710629 1965649 4093074 3535685 414701 -2345050 -2873403 -2549857 -3129390 -3949450
40915 -3949450 -3562180 -2229103 -1070706 -161121 915475 1641682 1139209 -387450 -1680698
40906 -1680698 -1546957 202967 2141621 1698068 -2409348 -8091844 -11606780 -11489896 -9429405
40897 -9429405 -7372131 -5639002 -4091648 -3053001 -2328966 -1077858 567897 1339056
40889 1339056 967703 804552 1493536 1801482 942340 443373 2002878 4414966 4414660 596167
40879 596167 -4664099 -7647542 -7270459 -6098210 -7078215 -9722746 -10660845 -7993383 -3414500
40870 -3414500 611384 3669808 5996978 6618863 5406370 5085958 7882908 11208356
40862 11208356 10187453 4172045 -2432952 -5603070 -4803975 -1023787 4532163 9323318
40854 9323318 10607806 8699724 6345321 4499905 1827424 -1428915 -2906199 -2229767
40846 -2229767 -1786618 -2272694 -1435198 1248881 2730225 1305277 -467900 -188922 668042
40837 668042 100260 -846526 -788732 -1012804 -2543061 -3172471 -836270 2635382 4455360
40828 4455360 5064607 6048715 6426115 4637756 1920793 21418 -2174943 -5900991 -8752998
40819 -8752998 -7986149 -5506687 -4961089 -5598265 -3999528 -638305 547159 -1399190 -3421277
40810 -3421277 -3665363 -3008810 -1634543 1024059 3046401 1968380 157184 2595670
40802 2595670 8513805 11300343 8528537 5814743 7563334 9787606 6849386 699746
40794 699746 -2341827 -1226141 -752947 -3568537 -6834818 -7230507 -5068656 -2227564 915191
40785 915191 4666099 7883589 8631447 6756635 4502203 3773722 3372722 610046 -3837418
40776 -3837418 -5076585 -326848 5847446 6460414 1545087 -1849954 323488 3883429
40768 3883429 3252932 -762862 -3262151 -2177043 582671 2745176 3176033 1427490
40760 1427490 -1275348 -2072409 -113868 1479502 -94859 -3027919 -3891132 -2817034
40752 -2817034 -1969357 -700021 3126345 7809517 8781456 5365887 2203992 2831542 5572127
40743 5572127 7131006 6843497 5708538 4185106 2807485 2594891 3198765 2801726 1237143
40734 1237143 844986 2685579 4396767 3786973 2207386 1951174 2358908 1385872 -429125
40725 -429125 -752003 396959 346191 -2119753 -4815849 -5038467 -2695334 146362 1656161
40716 1656161 1587742 967156 809433 885164 56461 -1822867 -3215152 -2995012 -2306397
40707 -2306397 -2936315 -4488598 -4822724 -3052393 -521907 1176793 1736701 1717499 1984980
40698 1984980 3459383 5862181 6787675 3929260 -1404753 -4902496 -4153467 -1329888
40690 -1329888 -120860 -1531842 -3744190 -4711286 -3688988 -1369091 366677 -38117
40682 -38117 -1476605 -716639 3355433 7418175 7445158 3669390 -159903 -1627046 -1556161
40673 -1556161 -1558773 -1991341 -2429947 -2287187 -909620 1247026 1832589 -907175 -5002966
40664 -5002966 -6506487 -4447992 -1464878 682237 2898274 5055672 4272174 -545843
40656 -545843 -5373841 -5676306 -2510386 -528924 -1079030 -1126606 1103000 3201067 2335739
40647 2335739 -953774 -4191762 -6065952 -6520592 -5389438 -2824486 -409204 -213630
40639 -213630 -2502204 -5034595 -4989849 -1813141 1727969 1952965 -1582916 -5017229 -4384062
40630 -4384062 -323310 2906883 2725804 589335 -1049664 -1915332 -3014727 -4240035
40622 -4240035 -4332309 -2507163 827736 4423294 6780752 7223553 6799909 7112511 7871331
40613 7871331 7001002 3935992 1266360 1708105 4526747 6572250 6209680 4587415 3253411
40604 3253411 2145112 376518 -1988858 -3634408 -3354985 -1588522 -333678 -1011776
40596 -1011776 -2571145 -2725472 -1128218 175695 18878 40087 1953929 4402101 4599846
40587 4599846 2392204 562246 1193457 3449734 5046556 4511763 2000005 -827833
40579 -827833 -1906682 -1102092 -1028404 -3822743 -7608401 -8558811 -6390231 -4846255 -5995194
40570 -5995194 -7238903 -5760325 -2954322 -1583101 -836625 1947424 5668819 5825674
40562 5825674 1190469 -3411346 -2828006 2155878 6158887 5300159 211316 -5860653
40554 -5860653 -9958858 -10812759 -9081808 -6595059 -4632255 -2936852 -768869 1622807
40546 1622807 3206384 3217294 1277370 -2673412 -7384813 -10034433 -8746451 -5270741
40538 -5270741 -3437584 -4696421 -6830555 -7514669 -7196663 -7271227 -7179533 -5431899 -2679243
40529 -2679243 -1409654 -2415669 -3607478 -3143027 -2015998 -2094929 -2781235 -1665678 1686434
40520 1686434 4710985 5344079 4762067 5168117 6209014 5779030 3769380 2363720 2311242
40511 2311242 1747275 -4555 -259952 2964560 6882668 7178866 4039150 1300701 140904
40502 140904 -2172526 -6532732 -9245192 -7263687 -3023335 -1234554 -2850922 -4816435
40494 -4816435 -4391947 -1444199 2422572 5052690 5177011 4260396 5377556 8671582 10172984
40485 10172984 7446183 3894572 4058997 6745154 7085131 4106102 1454813 999682
40477 999682 797657 98779 1319259 5106953 7753514 6224433 2522751 306486 -226547
40468 -226547 -1312660 -3498437 -5236361 -5336408 -3751824 -977083 1857281 3472745
40460 3472745 4038567 4750712 5222060 3679287 647252 -602064 1143112 2987350 2781443
40451 2781443 2547066 4128159 4934295 2135828 -1631389 -1534850 2205739 5132610 5447079
40442 5447079 5152455 4922674 3086260 138382 -721949 1211768 2760178 2130947 1601031
40433 1601031 3251259 5771974 7446340 8766029 9882038 8862310 5154795 1845982
40425 1845982 1624569 3023556 3453851 3349207 4019295 3850512 764673 -3095617 -3566044
40416 -3566044 -796378 887678 -375259 -1706709 -913299 -190356 -2200378 -5548835
40408 -5548835 -7104053 -6914059 -7670971 -10049200 -11565669 -10391580 -7905112 -6408912
40400 -6408912 -5913795 -4607464 -1760333 1254509 2826633 2913925 2553093 2236531 1518289
40391 1518289 207538 -645432 508741 3884338 7610488 9289983 8373133 6546964
40383 6546964 5585789 5393226 4661523 2880804 809382 -749746 -1645277 -1930405 -1664521
40374 -1664521 -1127435 -368478 1156463 3363084 4502285 3121083 632267 -468051
40366 -468051 -718339 -2735129 -5735375 -5390213 -1182722 755473 -3813626 -9761428 -9293030
40357 -9293030 -3591230 -1027706 -4476619 -7656856 -5509994 -1412289 -801434 -3181193
40349 -3181193 -4760294 -4861453 -5002972 -4602444 -2361718 66829 322796 -147405 1840329
40340 1840329 5628133 7635172 7387370 7998174 10173764 10297392 6207170 1228213 -23320
40331 -23320 2509259 5026946 4852652 2482554 -446754 -3117733 -5326562 -6599149 -6181557
40322 -6181557 -3900004 -856372 1287264 2109202 2800719 4018201 4395216 2639597 190652
40313 190652 -417080 445308 -310364 -3776830 -6993223 -6861990 -4129629 -1810659 -1171557
40304 -1171557 -1193592 -1004573 -758653 -471201 107515 402181 -492855 -1865046 -1548663
40295 -1548663 1076137 3490677 2785534 -530839 -2818889 -1440920 2538867 6141775
40287 6141775 7849922 8278842 8233172 7561690 6143860 4809432 4447927 4706283 4372865
40278 4372865 3028197 1765678 1997343 3664868 4967817 4244245 2048495 636334
40270 636334 1030906 1499654 -150321 -3554671 -6379929 -7287539 -6611457 -4589687 -1301106
40261 -1301106 1483920 1160982 -1874585 -3755495 -2185301 327020 443727 -938699
40253 -938699 -593272 1555168 2460926 1097297 -33667 833421 2117800 1903022 998780
40244 998780 1141205 1936548 1701592 448363 96847 1779462 4187904 4842057 2476136
40235 2476136 -1823315 -5509885 -6648906 -5291327 -2913226 -888447 212357 457705
40227 457705 524111 1409538 3174482 4229299 2968737 -2894 -2351920 -2598211 -1117475
40218 -1117475 1149487 3430501 4501172 3109789 -240240 -3185981 -3898073 -2655807
40210 -2655807 -742469 893696 1371479 -117423 -2874004 -4441369 -3147544 -205060
40202 -205060 1905998 2556820 3219756 4928905 6811274 7394045 6483858 5205180 4444619
40193 4444619 3763924 2243885 345295 93190 2654598 6406924 8730440 9357639 10141847
40184 10141847 11365845 10573336 6309205 1077812 -1480074 -1206295 -913513 -1806543 -2063027
40175 -2063027 -457158 1101220 229834 -2375506 -4170644 -4769278 -6244778 -9085705
40167 -9085705 -10326722 -7473000 -2746392 -872080 -2930144 -5045319 -3934428 -1297446
40159 -1297446 -922276 -3236150 -5252030 -5194884 -4591497 -5485864 -7611525 -9081371 -8579980
40150 -8579980 -6274895 -3534531 -2083456 -2469880 -3137245 -2026532 706247 2687199
40142 2687199 2360560 938289 787292 2651457 4948925 5385794 3170922 10780 -1380707
40133 -1380707 -188560 1823052 3106352 4285907 5844215 5681201 1814597 -3575085
40125 -3575085 -6274071 -5915353 -6018618 -7918327 -8837893 -7227623 -5721274 -6431384 -7167838
40116 -7167838 -5519398 -3441403 -3972922 -5904249 -5923738 -4339633 -4220406 -5746213 -5929017
40107 -5929017 -3948061 -2451553 -2701274 -2287409 699142 4296253 5525682 4480186
40099 4480186 3492520 3565002 3537394 2257647 122166 -1633386 -2473064 -2996503 -3659677
40090 -3659677 -3433369 -938157 2804621 4607145 3386129 2313762 4557893 8525481
40082 8525481 10240015 9213541 8320942 8337132 6863431 3454614 1586761 3425174 6024920
40073 6024920 5510268 2533543 518005 255297 -343387 -1890713 -2391018 -1021152 -310579
40064 -310579 -2975233 -7919531 -11043941 -9874639 -6211930 -3641941 -3153057 -2462868 239225
40055 239225 3521639 4793365 3718828 1651766 -1247105 -5600541 -9785766 -10477864
40047 -10477864 -7166935 -3493621 -2674199 -3796531 -4178750 -3254642 -2193736 -1533855 -1430648
40038 -1430648 -2777028 -5670800 -7874036 -7263136 -5037901 -4048504 -4560327 -4363062 -2825334
40029 -2825334 -1883107 -2501597 -2930361 -1638829 302337 1269959 1619662 2312526 2420857
40020 2420857 282493 -3329585 -5334136 -3994504 -924371 1136720 1350751 773108
40012 773108 311656 13169 92204 1255595 3541670 5858119 7398377 8685107 10207222
40003 10207222 10733643 8541274 4297030 1138036 1274254 3648604 5620548 5877358
39995 5877358 4794706 2920665 452638 -2091394 -3786136 -3991781 -2702270 -496861
39987 -496861 1456147 1946708 1000066 194469 1001640 3121989 4973008 5303151 3804310
39978 3804310 968372 -1767674 -2560222 -1058969 839965 1393044 1468998 2993129 5501876
39969 5501876 6392696 4680790 2336424 1347368 1600581 2655228 5414856 10224159 14866541
39960 14866541 16583520 15203195 12348705 8479286 3169951 -2113338 -4503542 -3716305
39952 -3716305 -2939672 -4331781 -5816279 -4386999 -949946 801537 -280175 -1348061
39944 -1348061 107810 2762377 3511103 1601068 -754949 -1391182 -648669 -612083 -2290694
39935 -2290694 -3987955 -3073113 494711 3564946 3693335 2365032 2434298 3455125 2588492
39926 2588492 -32917 -599720 2516280 5819430 5875173 4232305 4128090 5124860 4949891
39917 4949891 4467858 6048617 8131593 6645668 1951759 -741705 1059280 4004765
39909 4004765 5038770 5786988 7958611 8829509 5547551 936414 345321 4172898 7675086
39900 7675086 7573379 5265248 3663575 3992194 5882195 8042282 8538296 6455211 3418238
39891 3418238 1886904 2377113 4017535 6820585 10955073 14586673 15502223 14754699 15551564
39882 15551564 18080014 18609914 14965389 10110975 8382898 10094015 12004971 12020274
39874 12020274 11260396 11605258 12887138 13350625 12316767 11233173 11356076 11239332 8488414
39865 8488414 4179027 2877629 6708167 11913451 13900502 13505912 14701847 17714552
39857 17714552 18954632 17326872 15727077 15533197 14401025 11321793 9432882 11043311
39849 11043311 13548586 13597994 12426941 13474697 16850592 19763361 20913068 21013136
39841 21013136 20195603 18463447 17928525 20870771 25584304 27663344 26174908 25638237
39833 25638237 30585074 40238895 50112901 57840287 66048596 78962973 95701879 107397564
39825 107397564 103506194 82853280 56596009 37665020 28605140 22607418 14685474
39818 14685474 7005912 3087012 1957796 549499 -1657255 -3364064 -4596931 -6260804
39810 -6260804 -7837906 -7919538 -6356882 -4301013 -2930217 -3257030 -5811686 -9168699 -10395561
39801 -10395561 -8636738 -6599907 -6579453 -6955753 -5315349 -3154773 -3678149 -5910701 -5552662
39792 -5552662 -2099834 -500203 -3856027 -8506267 -9368769 -7024529 -5611302 -5735514
39784 -5735514 -4190137 -508368 800933 -3640764 -10752162 -14213937 -11606709 -6311045
39776 -6311045 -2989317 -2945534 -4000956 -3769527 -2468708 -2485333 -5119458 -8276938 -8510745
39767 -8510745 -5416989 -2503167 -2882121 -5447377 -6657949 -5124510 -2701609 -1483184
39759 -1483184 -1608477 -2316417 -3568764 -5780271 -8758103 -11561559 -13009104 -12155940 -8913427
39750 -8913427 -4489214 -746573 1074479 828929 -838753 -2518590 -2384043 -25883
39742 -25883 2150863 1133146 -2587505 -4826787 -2675669 1748672 3858313 1820248
39734 1820248 -2282645 -5685691 -7495151 -8165929 -8152727 -7632347 -6649579 -5135549 -3262275
39725 -3262275 -1732307 -1096327 -891042 -129063 1440855 3133602 4092384 3581632 1046948
39716 1046948 -2985793 -6369480 -7037353 -5279905 -3101163 -1397503 568818 2666194
39708 2666194 3020779 900040 -1285030 -816677 1437456 2049553 -336152 -3359425 -4153361
39699 -4153361 -2504627 -309973 647774 -290418 -2500258 -3994066 -2681822 1147026
39691 1147026 4539431 5262365 4531605 4875576 6155202 5820279 2888512 -689800 -3154013
39682 -3154013 -5162146 -7703183 -9705289 -9544724 -7750680 -6310149 -5893251 -5441089 -4103513
39673 -4103513 -2031179 465233 3052333 4898668 5504675 5760497 6690521 7474257 6470255
39664 6470255 3985768 2005070 1162189 242618 -1003612 -1059148 558617 2208158 3035770
39655 3035770 4419351 6783770 7531149 4684934 576421 -1140710 -772380 -1549455 -4037803
39646 -4037803 -5210124 -3456413 -1233135 -1434916 -3483026 -4500296 -2836540 736873
39638 736873 4138036 5418250 4196139 2239763 1453760 1014724 -1687518 -6518169 -9168107
39629 -9168107 -6085695 550070 4961867 4328002 1192109 -618262 -481982 -602218 -2483357
39620 -2483357 -5092194 -6290986 -5229488 -3083025 -1796344 -2381594 -4295888 -6071119
39612 -6071119 -6345849 -4576429 -1243768 2416687 5008993 5604999 4264057 2260515
39604 2260515 1342801 1930048 2248634 454273 -2341331 -2873397 -291471 1986098 634638
39595 634638 -2957087 -4773086 -3778592 -2486060 -2206738 -1098392 2070513 5124513 5338641
39586 5338641 3175595 1248443 919845 1783537 3422513 5627391 7378705 7517336 6419256
39577 6419256 5554032 5347900 4801817 3397948 2128328 2106928 3058575 3892549 4285013
39568 4285013 4859280 5713437 5526615 2994242 -874189 -3025569 -1801133 659916 802133
39559 802133 -1841023 -4060062 -3086233 193831 2719162 2679004 677688 -1518101 -2548797
39550 -2548797 -2405402 -2305604 -3029241 -3356616 -1371178 2448679 4977516 3967377 453607
39541 453607 -3028608 -5071716 -5396002 -4038792 -1945702 -840660 -981200 -471555 1637626
39532 1637626 3263933 2408173 756510 1402681 3984434 5187904 3808234 2223689
39524 2223689 2478605 3734158 4451797 4668208 4980107 5233458 5274898 5265703 4406486 1368475
39514 1368475 -2858010 -4707102 -2418874 1137898 2244549 1488182 2361486 5440707
39506 5440707 7266098 5669942 3190232 3223934 4840161 4214733 516669 -2622333 -2136554
39497 -2136554 579737 2392100 2918115 3802110 4880039 4399748 2917438 3359886 6036798
39488 6036798 6965504 3523843 -895227 -1092145 2719985 5497141 4576130 2650668 2951866
39479 2951866 4595116 4341712 1133331 -2769516 -4420924 -3029042 -499820 641997
39471 641997 140764 308281 2829500 6243074 7726218 6294951 2860954 -1369889 -4538537
39462 -4538537 -4025594 117682 2984613 -39984 -6674295 -10563001 -10243733 -10075800 -11833474
39453 -11833474 -11632947 -7514208 -3859012 -4127015 -4566538 -645745 4488290 4512180 151149
39444 151149 -2110762 -294498 1270989 628992 1513112 5889793 9401777 7836068 3630711
39435 3630711 2000077 3720930 5588255 5805452 5155277 4099004 2199452 94386
39427 94386 -691356 -38812 542843 52954 -1041617 -1913240 -2287639 -2324720 -2382660 -2667171
39417 -2667171 -2652808 -1532162 259581 1035599 204088 -562420 256488 1506579 900503
39408 900503 -1518190 -3185471 -2209140 695847 3569307 5248715 5769676 5733310 5685977
39399 5685977 5536611 4464176 2024839 -614526 -1364588 485493 3181113 4127832 2318734
39390 2318734 -1126263 -4423552 -6439630 -6530591 -4099367 462794 4499782 4443962 -286140
39381 -286140 -5639624 -6805253 -3422695 646223 2444291 2618433 2650897 2065982 161511
39372 161511 -1362840 15102 4090440 8046538 9899469 10047899 9489889 8324006 6369672
39363 6369672 3774010 548783 -3151647 -5795127 -5038815 -736885 3523185 3418577
39355 3418577 -1435503 -6691434 -7580196 -3697656 905123 2328767 881019 -91329
39347 -91329 1032649 2055722 315766 -3267964 -5212229 -4041475 -1918205 -1383551 -2228002
39338 -2228002 -2637153 -2195830 -2224994 -3499428 -5009230 -5297958 -4192466 -2725543 -1824810
39329 -1824810 -1665837 -2142434 -3178279 -4124114 -3490699 -436811 3337880 4418401 1314473
39320 1314473 -3411851 -5682399 -4140499 -859479 1632525 2522196 2040692 473611
39312 473611 -1470721 -2737769 -3295666 -4246440 -5565714 -5007098 -908523 4607152 7132088
39303 7132088 4763087 -94295 -3933346 -5653585 -6234678 -6338699 -5624812 -3950262 -1984771
39294 -1984771 -479886 365222 694720 735234 912292 1689816 2945924 3888275 4066404
39285 4066404 4246494 5592063 7805171 8810828 7038751 3735679 2027414 3426923
39277 3426923 6155849 7531782 7192642 6829184 7169073 6845593 4750525 2152260 1253370
39268 1253370 2201436 2813277 1391004 -1111501 -2182866 -558427 2540155 4912812
39260 4912812 5794135 6397388 7901026 9424906 8963942 6366728 4100632 4269546 5945968
39251 5945968 6669957 5742984 4507415 4011982 4280355 5514307 7768195 9409900 8494002
39242 8494002 6201464 6050873 8525444 9595917 6617574 2545930 1240774 1547169
39234 1547169 362418 -662363 2891004 10136903 14756836 13921664 11801312 12332205
39226 12332205 14009531 14776610 16496182 19935940 20127920 13010795 3638278 791156
39218 791156 4666374 6904571 3026877 -2129063 -3161160 -1759135 -2004574 -3067318
39210 -3067318 -1360907 2890203 5746420 4971757 2014109 -604427 -1375169 -232302
39202 -232302 953139 -579498 -4925232 -8349460 -7818964 -5150300 -4064399 -4645352 -4051541
39193 -4051541 -1849368 -856148 -2449714 -4460504 -4658632 -3529799 -2439612 -1468024 -394728
39184 -394728 228467 357333 968740 1973447 1589701 -462719 -1102224 2236025 7151910
39175 7151910 8796162 6541212 4902307 7005147 10246574 10545340 8516575 8177000
39167 8177000 10519936 12122498 10733446 8725524 8995309 10197291 9057259 5731402
39159 5731402 3415505 3323052 3608156 3369534 4101201 6224606 7597280 7112078 6770493
39150 6770493 8170722 9713774 9647577 9185414 9689009 9268406 5919777 2275887 2980558
39141 2980558 7996506 12564689 13842413 13850762 15349587 18269991 21272170 24015721 26765032
39132 26765032 29860702 34108710 39572003 43937171 44643961 42542545 40369360 37745180
39124 37745180 31730521 22966968 16583723 14996112 14143989 9875828 4369453 2499209
39116 2499209 4610689 6917850 7281967 6771808 6542354 6577135 7063442 8496763 11081121
39107 11081121 15778289 24059208 34049625 39148046 34312269 22607681 11886922 5888118
39099 5888118 2354926 -953133 -3058590 -3002991 -2099286 -1697662 -1784755 -2588451 -4522639
39090 -4522639 -5968111 -4598704 -1871068 -2443269 -7440064 -11907776 -11387249 -7848159
39082 -7848159 -6050555 -6572531 -6171942 -3699141 -1796736 -2636135 -4979656 -6353296 -6164351
39073 -6164351 -5569346 -5349413 -5037932 -3979610 -2525587 -1684008 -1693768 -1769245 -1763476 -3087173
39063 -3087173 -6711163 -10934987 -12804730 -11520585 -8899956 -6830111 -6093210 -7288946
39055 -7288946 -10451855 -13584556 -14074519 -12115454 -10410214 -10032133 -9206871 -6847693 -4325725
39046 -4325725 -2609903 -749855 1221136 1092827 -1617918 -3666525 -2759591 -1378006
39038 -1378006 -2589303 -4612739 -3685646 -594087 259201 -2294381 -4688672 -4279486 -2596738
39029 -2596738 -2052789 -2677874 -3302494 -3362360 -2495361 -698088 271183 -1821029 -5805783
39020 -5805783 -6994788 -2773026 3439351 5776710 2504316 -2617669 -4944990 -3494124
39012 -3494124 -1002450 -545998 -2598987 -5293555 -7008895 -7746169 -7822940 -6776277 -4715005
39003 -4715005 -3303830 -3544822 -3727578 -1898310 531530 522760 -1599939 -2204117 68233
38994 68233 2033942 668825 -2694141 -4764735 -4755057 -4311912 -4432722 -4501027 -3692872 -1933614
38984 -1933614 42642 967735 369047 -132815 1313208 3156063 1346516 -4693479 -9903550
38975 -9903550 -9953141 -7230716 -6897676 -8821003 -8092757 -3249817 1061913 1191132 -134223
38966 -134223 1359580 4343290 3755319 -1329870 -5953334 -6057311 -3567409 -2861084 -4626654
38957 -4626654 -5913035 -5121539 -4023861 -4668713 -6723218 -8693911 -9789782 -9466063 -7034699
38948 -7034699 -3435819 -1816230 -4028593 -7389013 -7350775 -3193741 1200566 2271213
38940 2271213 187940 -2947325 -5796746 -7629883 -7599197 -5782393 -3708784 -2583620
38932 -2583620 -1975634 -1191600 -765468 -1458779 -2753626 -3459625 -3173797 -2413201 -1994993
38923 -1994993 -2640433 -4168813 -4962740 -3847221 -2678197 -4630120 -9001005 -10632483
38915 -10632483 -6638181 -1157658 -277568 -3885122 -6237675 -4087835 -539879 -130800
38907 -130800 -3040372 -5637567 -5014661 -1702967 1158747 670862 -3086652 -6949890 -7967107
38898 -7967107 -6420901 -4522650 -2899700 -413979 2721502 4141172 2521235 -340018
38890 -340018 -1899961 -2000152 -2284793 -3353319 -3871434 -2374507 895916 4085689 5432305
38881 5432305 4922640 4137273 4180520 4168119 2526452 -441605 -2370527 -1544737 902528
38872 902528 1976542 -136403 -4073832 -6367752 -4906349 -1366692 581459 -383620
38864 -383620 -2025847 -2179726 -1601229 -1616636 -908388 2461159 6748522 7645741 4075586
38855 4075586 -62866 -953026 802848 2283237 2525908 2695805 3224484 2951388 1093298
38846 1093298 -1302201 -2426249 -1945386 -1711176 -3570844 -6361343 -6440506 -2330036 2580777
38837 2580777 3992129 2260745 1269424 2357243 2910024 1444163 285287 1377774
38829 1377774 2631151 1156241 -2005785 -3310208 -1696207 474033 961730 56238
38821 56238 -391121 1058522 4060781 6108378 4353174 -1079231 -6509344 -8522059 -7303042
38812 -7303042 -5180506 -3490338 -2526700 -2913344 -4560847 -5229416 -2752607 1534436 3817457
38803 3817457 2325438 -922750 -2831729 -2039389 873713 4262868 6286371 6150497
38795 6150497 4619707 2606897 -27272 -3259815 -5714465 -6439183 -6832838 -8643756
38787 -8643756 -10803663 -10593667 -7466071 -3412898 -149894 1503873 272082 -4050739
38779 -4050739 -7858102 -6502201 -675811 3740552 3523717 1885050 2373610 3158394 982203
38770 982203 -2395372 -2401500 1179408 3794442 2698463 47583 -1062796 -355774 741936
38761 741936 1307155 943657 -341301 -1431711 -1076639 -79757 -493869 -2195086 -2785549
38752 -2785549 -1760212 -1783998 -4014901 -5133586 -2055474 2588641 3480518 -2569 -3512383
38743 -3512383 -4569794 -5159745 -6459221 -5657226 -986116 3674446 3439549 -240704 -1312097
38734 -1312097 2346586 6329278 6176740 2690586 -511923 -1529291 -452746 2166772
38726 2166772 4851160 5183930 2585319 -291693 -869476 132355 692763 854798 1488997
38717 1488997 1375102 -1043521 -3845699 -3340639 326183 2912040 2177135 726992 1231802
38708 1231802 2009710 -155273 -4961874 -9032247 -10193128 -8964864 -6531505 -3476722
38700 -3476722 -466864 1541409 2179270 2027888 2144545 3443821 5705736 6771446 4172583
38691 4172583 -1278075 -4968420 -3434087 1126225 3474865 1973468 67208 933851
38683 933851 3390025 4495566 4051808 4225575 5747939 6973604 6729911 5864514 5205876
38674 5205876 3938075 1516529 -222093 970489 4203685 6130734 5268919 3315716
38666 3315716 1617618 -943732 -4926395 -7752800 -6916531 -4119882 -3059332 -4029057
38658 -4029057 -4128333 -2456219 -1298306 -1616427 -1248787 801058 1767426 -689065 -4300486
38649 -4300486 -5026650 -2329727 1047508 3226742 4457514 5172436 5432179 5964185 7519140
38640 7519140 9288529 9701257 8546334 6791816 4851676 2751452 1478493 2212085
38632 2212085 4352517 5992432 6215563 5454824 3957510 1657355 -560898 -1225186 -150580
38623 -150580 1263253 1660628 804479 -536083 -913232 688186 2998885 3048297 127196
38614 127196 -2396603 -1355214 1671305 2783108 1356276 -44572 -284089 -401708 -295027
38605 -295027 1147618 2482361 688301 -3385774 -4850748 -1610263 2596849 3841612
38597 3841612 2814180 1730184 302046 -2152678 -3830077 -3047267 -1211331 -139493
38589 -139493 989423 2830458 2838967 -992870 -5624229 -6511255 -4045823 -2168097 -1963948
38580 -1963948 -1275945 248735 710675 394794 1711398 4219706 4524723 2194803 1076277
38571 1076277 2987015 4557107 2803488 -81216 -539979 949752 1622281 1125679 1045938
38562 1045938 1443983 1208001 795661 1532891 2757628 2461870 573695 -897941 -1060078
38553 -1060078 -1204770 -2241253 -2974090 -1815239 963693 3526093 4424044 3643813 1929279
38544 1929279 -355925 -3165420 -5552237 -5583734 -2635819 942257 2272033 1795076 2401036
38535 2401036 4478045 4660261 812276 -4380198 -6936584 -6631165 -5989049 -5834761 -4830895
38526 -4830895 -2738795 -1232233 -1361155 -2438552 -3658941 -4996970 -6323411 -7156337
38518 -7156337 -7339652 -6761929 -4893778 -2066819 -379374 -1256314 -2782776 -2017871 343420
38509 343420 550069 -2652045 -6051004 -6523003 -4764209 -3008653 -1572698 253132 1776451
38500 1776451 1712217 356350 -978916 -1880311 -2585587 -2791443 -2431396 -2687185 -4202032
38491 -4202032 -5006564 -2632627 1784613 3986477 1875826 -1742321 -2868670 -1047251
38483 -1047251 1270691 2838713 4664367 6965442 7577495 4880262 815011 -1120047
38475 -1120047 -377766 382073 -294406 -583987 998662 2425541 1199947 -992759 -49998
38466 -49998 4364942 7678804 6240841 1639355 -1938626 -2381374 -424788 2080279 3082093
38457 3082093 1362977 -1613646 -2459590 -110150 2313431 1694719 -779359 -1837435
38449 -1837435 -1114587 -1016438 -2359215 -3100789 -1468561 1959017 5366164 6982422 5557875
38440 5557875 1692413 -1578207 -1744746 -76443 390835 -542063 -755049 -459608 -2102333
38431 -2102333 -4851761 -3840956 2563426 8584185 7710984 997607 -4985824 -6626109
38423 -6626109 -5820499 -5200855 -4877003 -3958446 -1978625 1473554 5710677 7585286 4425684
38414 4425684 -1346731 -4077145 -2295303 -621210 -2625918 -5634116 -5559474 -3550247
38406 -3550247 -3540226 -5193451 -4281832 159896 3832503 3515925 1418904 1103966 2262855
38397 2262855 2343103 1190534 940979 2333563 3922925 4508982 3952565 1903405 -1820704
38388 -1820704 -5511937 -6586479 -4761943 -2189076 -120173 2153962 4405884 4396677 1482574
38379 1482574 -1111762 -194745 2748235 3567503 1221647 -1337153 -1812088 -1148377 -856678
38370 -856678 -399714 1282358 3421243 4300794 3540774 2070596 460998 -1296789 -2579971
38361 -2579971 -2164429 -18386 1790146 911916 -2598609 -6131289 -7354643 -6545382 -5463539
38352 -5463539 -4695666 -3533628 -2088056 -1385041 -931607 1347397 5312375 7141961 4154803
38343 4154803 -647724 -2003610 582886 2653163 1390865 -1253643 -2691028 -3326318
38335 -3326318 -4346997 -4833838 -3504018 -1462171 -811648 -1508247 -1496982 531136 3709574
38326 3709574 5767633 4671405 575559 -3423378 -4036090 -1845211 -731670 -2588052
38318 -2588052 -5111044 -6104141 -6981563 -9526402 -11754965 -10469459 -6437295 -3448945
38310 -3448945 -2881807 -2636740 -1425404 -795415 -2128242 -4276994 -5367901 -5167672 -4638494
38301 -4638494 -4375140 -4276259 -4032638 -3599782 -3582955 -4783126 -6819911 -8080837 -7877611
38292 -7877611 -7427634 -7530651 -6899812 -4615729 -2513047 -2559288 -3298001 -2052177 284966
38283 284966 249675 -2600016 -4649324 -3257316 243151 3086776 3748324 1718630 -2269753
38274 -2269753 -5198052 -4129379 -457977 1308678 -223819 -1770208 -977232 377056
38266 377056 512780 867802 2528280 3155637 831215 -2108314 -2742647 -2479502 -4325640
38257 -4325640 -7318269 -7975099 -6030528 -4510527 -4754929 -5376503 -5871653 -7220338 -8567878
38248 -8567878 -7202764 -2981641 382445 -56832 -2855718 -4463993 -3329463 -687521
$$ [...]
##END NTUPLES=NMR SPECTRUM
##END=
