##TITLE=31Pdec_LR-729-B-R4C1
 CDCl3, 24 sc
 19.11.2021
##JCAMPDX= 6.0         $$ Bruker NMR JCAMP-DX V2.0
##DATA TYPE= NMR SPECTRUM
##DATA CLASS= NTUPLES
##ORIGIN= UXNMR, Bruker Analytische Messtechnik GmbH
##OWNER= root
$$ XWIN-NMR		Version 3.5
$$ Fri Nov 19 11:33:46 2021 Russian Standard Time (UT+4h)  she@DPX200
##.OBSERVE FREQUENCY= 81.013821
##.OBSERVE NUCLEUS= ^31P
##.ACQUISITION MODE= SIMULTANEOUS
##.ACQUISITION SCHEME= undefined
##.AVERAGES= 24
##.DIGITISER RES= 16
##SPECTROMETER/DATA SYSTEM= spect
##.PULSE SEQUENCE= zgpg30
##.SOLVENT NAME= CDCl3
##.SHIFT REFERENCE= (INTERNAL, CDCl3, 0, 248.564)
##AUDIT TRAIL= $$ (NUMBER, WHEN, WHO, WHERE, WHAT)
$$ ##TITLE= Audit trail, XWIN-NMR		Version 3.5
$$ ##JCAMPDX= 5.01
$$ ##ORIGIN= Bruker BioSpin GmbH
$$ ##OWNER= she
$$ F:/spectra/data/she/nmr/P31/1/pdata/1/auditp.txt
$$ ##AUDIT TRAIL=  $$ (NUMBER, WHEN, WHO, WHERE, WHAT)
(   1,<2021-11-19 11:32:31.71 +0400>,<she>,<DPX200>,
      <created by zg, POWCHK disabled, PULCHK disabled
       configuration hash MD5:
       00 E9 B6 7A A2 85 ED C7 34 08 36 98 17 FE 4E 26
       data hash MD5: 32K
       08 7D 78 1E 7E 00 DE 46 A9 08 AA B1 92 CF 01 7E>)
(   2,<2021-11-19 11:32:36.42 +0400>,<she>,<DPX200>,
      <Start of raw data processing
       efp BC_mod = 2 LB = 1 FT_mod = 6 PKNL = 1 PHC0 = -9200.479 PHC1 = 113.0692 SI = 64K 
       data hash MD5: 64K
       F4 DF BA A2 66 A1 6E 6F B3 C1 5F 99 C8 35 94 6A>)
(   3,<2021-11-19 11:33:02.82 +0400>,<she>,<DPX200>,
      <pk PHC0 = 99.05829 PHC1 = -221.4 
       data hash MD5: 64K
       61 98 33 ED DD 29 84 69 D4 F6 F2 4C F2 AD C2 C4>)
(   4,<2021-11-19 11:33:16.23 +0400>,<she>,<DPX200>,
      <abs ABSG = 5 
       data hash MD5: 64K
       06 C2 8B 3A 30 30 42 F5 77 99 F6 44 0D 04 1A 82>)
$$ ##END=
$$ 
$$ hash MD5
$$ EB 42 DC C1 C5 6B 95 65 29 B5 10 71 5A 02 B3 06
##$RELAX= 
##$RELAX= 
##$RELAX= 
##$RELAX= 
##$RELAX= 
##$RELAX= 
##$RELAX= 
##$RELAX= 
$$ Bruker specific parameters
$$ --------------------------
##$DU= <F:/spectra>
##$EXPNO= 1
##$NAME= <P31>
##$PROCNO= 1
##$TYPE= <nmr>
##$USER= <she>
##$AMP= (0..31)
100 100 100 100 100 100 100 100 100 100 100 100 100 100 100 100 100 100 
100 100 100 100 100 100 100 100 100 100 100 100 100 100 
##$AQSEQ= 0
##$AQ_mod= 1
##$AUNM= <au_zg>
##$AUTOPOS= <>
##$BF1= 81.014009
##$BF2= 200.13
##$BF3= 200.13
##$BF4= 200.13
##$BF5= 200.13
##$BF6= 200.13
##$BF7= 200.13
##$BF8= 200.13
##$BYTORDA= 1
##$CFDGTYP= 0
##$CFRGTYP= 5
##$CHEMSTR= <none>
##$CNST= (0..31)
1 1 145 1 1 1 1 1 1 1 1 1 1 1 1 1 1 1 1 1 1 1 1 1 1 1 1 1 1 1 1 1 
##$CPDPRG= <waltz16>
##$CPDPRG1= <>
##$CPDPRG2= <waltz16>
##$CPDPRG3= <>
##$CPDPRG4= <mlev>
##$CPDPRG5= <mlev>
##$CPDPRG6= <mlev>
##$CPDPRG7= <mlev>
##$CPDPRG8= <mlev>
##$CPDPRGB= <>
##$CPDPRGT= <>
##$D= (0..31)
0 1 0 0 0 0 0 0 0 0 0 0.03 2e-05 3e-06 0 0 0 0 0 0 0 0 0 0 0 0 0 0 0 0 
0 0 
##$DATE= 1637307151
##$DBL= (0..7)
120 120 120 11 120 120 24 19 
##$DBP= (0..7)
150 150 150 150 150 150 150 150 
##$DBP07= 0
##$DBPNAM0= <>
##$DBPNAM1= <>
$$ [...]
##$SUBNAM3= <"">
##$SUBNAM4= <"">
##$SUBNAM5= <"">
##$SUBNAM6= <"">
##$SUBNAM7= <"">
##$SUBNAM8= <"">
##$SUBNAM9= <"">
##$SW= 501.771253377433
##$SWIBOX= (0..15)
0 1 3 0 0 0 0 0 0 0 0 0 0 0 0 0 
##$SW_h= 40650.406504065
##$TD= 32768
##$TD0= 1
##$TE= 0
##$TE2= 300
##$TE3= 300
##$TEG= 300
##$TL= (0..7)
0 120 53 12 22 120 120 120 
##$TP= (0..7)
150 150 150 150 150 150 150 150 
##$TP07= 0
##$TPNAME0= <>
##$TPNAME1= <>
##$TPNAME2= <>
##$TPNAME3= <>
##$TPNAME4= <>
##$TPNAME5= <>
##$TPNAME6= <>
##$TPNAME7= <>
##$TPOAL= (0..7)
0.5 0.5 0.5 0.5 0.5 0.5 0.5 0.5 
##$TPOFFS= (0..7)
0 0 0 0 0 0 0 0 
##$TUNHIN= 0
##$TUNHOUT= 0
##$TUNXOUT= 0
##$USERA1= <user>
##$USERA2= <user>
##$USERA3= <user>
##$USERA4= <user>
##$USERA5= <user>
##$V9= 5
##$VALIST= <valist>
##$VCLIST= <CCCCCCCCCCCCCCC>
##$VD= 0
##$VDLIST= <DDDDDDDDDDDDDDD>
##$VPLIST= <PPPPPPPPPPPPPPP>
##$VTLIST= <TTTTTTTTTTTTTTT>
##$WBST= 1024
##$WBSW= 4
##$XGAIN= (0..3)
0 0 0 0 
##$XL= 0
##$YL= 0
##$YMAX_a= 2819
##$YMIN_a= -3551
##$ZGOPTNS= <>
##$ZL1= 120
##$ZL2= 120
##$ZL3= 120
##$ZL4= 120
##$ABSF1= 248.5645
##$ABSF2= -253.2056
##$ABSG= 5
##$ABSL= 3
##$ALPHA= 0
##$AQORDER= 0
##$ASSFAC= 0
##$ASSFACI= 0
##$ASSFACX= 0
##$ASSWID= 0
##$AUNMP= <proc_1d>
##$AZFE= 0.1
##$AZFW= 0.5
##$BCFW= 0
##$BC_mod= 2
##$BYTORDP= 0
##$COROFFS= 0
##$CY= -3
##$DATMOD= 1
##$DC= 0
##$DFILT= <>
##$DTYPP= 0
##$F1P= 0
##$F2P= 0
##$FCOR= 1
##$FTSIZE= 65536
##$FT_mod= 6
##$GAMMA= 0
##$GB= 0
##$INTBC= 1
##$INTSCL= 5.30512e-09
##$ISEN= 30
##$LB= 1
##$LEV0= 0
##$LPBIN= 0
##$MAXI= 10000
##$MC2= 0
##$MEAN= 0
##$ME_mod= 0
##$MI= 50
##$NCOEF= 0
##$NC_proc= -7
##$NLEV= 6
##$NOISF1= 182.463
##$NOISF2= 159.3651
##$NSP= 0
##$NTH_PI= 0
##$NZP= 0
##$OFFSET= 248.5645
##$PC= 4
##$PHC0= -9101.42
##$PHC1= -108.3308
##$PH_mod= 1
##$PKNL= yes
##$PPARMOD= 0
##$PSCAL= 0
##$PSIGN= 0
##$REVERSE= no
##$SF= 81.014009
##$SI= 65536
##$SIGF1= 159.3651
##$SIGF2= -187.1042
##$SINO= 113.3802
##$SIOLD= 16384
##$SREGLST= <1H.CDCl3>
##$SSB= 0
##$STSI= 65536
##$STSR= 0
##$SW_p= 40650.406504065
##$SYMM= 0
##$S_DEV= 0
##$TDeff= 32768
##$TDoff= 0
##$TI= <>
##$TILT= no
##$TM1= 0
##$TM2= 0
##$TOPLEV= 0
##$USERP1= <user>
##$USERP2= <user>
##$USERP3= <user>
##$USERP4= <user>
##$USERP5= <user>
##$WDW= 1
##$XDIM= 65536
##$YMAX_p= 453531198
##$YMIN_p= -42173011
$$ End of Bruker specific parameters
$$ ---------------------------------
##NTUPLES= NMR SPECTRUM
##VAR_NAME=  FREQUENCY,     SPECTRUM/REAL,   SPECTRUM/IMAG
##SYMBOL=    X,             R,               I
##VAR_TYPE=  INDEPENDENT,   DEPENDENT,       DEPENDENT
##VAR_FORM=  AFFN,          ASDF,            ASDF
##VAR_DIM=   65536,         65536,           65536
##UNITS=     HZ,            ARBITRARY UNITS, ARBITRARY UNITS
##FACTOR=    0.620285442955139, 1,           1
##FIRST=     20137.2065510759, 0,            0
##LAST=      -20513.1999529892, 0,           0
##MIN=       -20513.1999529892, -42173011,   0
##MAX=       20137.2065510759, 453531198,    0
$$ Real data points
##PAGE= N=1
##DATA TABLE= (X++(R..R)), XYDATA
$$ [...]
##PAGE= N=2
##DATA TABLE= (X++(I..I)), XYDATA
42735A976523L57893o80808m22776Q76466N82809j276910j618464K16882J164380
42726A175995q9818r33906Q6690N75715r24037j780754M2954J992677J138439
42717A283955p88973l91368J786675K474925Q43431j072091j939946j987120j192677
42708i83189N08038J825036J377452j00516p64514k48756M12848O22534M38719
42699C087652j03349n81580k70420L22757k51343j478387p74641K024812L081656
42690E057157J69440l062821k160979J200900J874640p10976k171845m35023J631122
42681A391615J524881M84748J35750k55122j254710j352784K37244J626274J308882
42672C846778P28339J432079J906739P8354k666301l101829j020107O29509L99956
$$ y = [1976523, 2334416, 1653608, 1230832, 2107298, 2690107, 1413197, -205267, 11615, 1175995, 1086177, 152271, 238961, 814676, -109361, -1890115, -1847161, 145516, 1283955, 494982, 103614, 1890289, 4365214, 5208645, 4136554, 2196608, 209488, -983189, -475151, 1349885, 2727337, 2626821, 1862307, 1613551, 2026399, 2648933, 3087652, 2984303, 2402723, 2132303, 2455060, 2203717, 725330, -49311, 1975501, 5057157, 5226597, 2163776, 2797, 1203697, 3078337, 2367361, 195516, -239507, 1391615, 2916496, 3401244, 3536994, 3281872, 2027162, 674378, 911622, 2537896, 3846778, 4575117, 6007196, 7913935, 7992289, 5325988, 2224159, 1204052, 1833561, 2233517]
42663B233517J39868J310552K194624O40208k125055k838665q30869J082429P51697
42654B558306m63838l20181O53953L38492j105353j267381N24813J920189J133300
42645C972300n31972j115354q76673r77022j083340m23549J68423l95171j084500
42636b346858j85785J585332J937428O22580l44117m5554L10085K3431L8784P17618
42626B312944P93215l61113j373992j040630k10823j62716m56475O5904J051885
42617F18199R71636n73744k002002j391997J339966L905994L585189K77105k825850
42608C904496k729887m08815N91635p89924j793045l36969J612962J154189q55080
42599C49562r91549J378854K821250O90100k930306l811275j014078K148612K512218
$$ y = [2233517, 2373385, 3683937, 5878561, 6518769, 4393714, 1555049, 724180, 1806609, 2558306, 2094468, 1774287, 2428240, 2766732, 1661379, 393998, 918811, 2839000, 3972300, 3440328, 2324974, 1448301, 471279, -612061, -1035610, -867187, -1262358, -2346858, -2532643, -947311, 990117, 1612697, 1268580, 1223026, 1533111, 1556542, 1595326, 2312944, 3106159, 2745046, 1371054, 330424, 119601, -43115, -499590, -433686, 618199, 1589835, 1016091, -985911, -2377908, -1037942, 2868052, 6453241, 6730346, 3904496, 1174609, 765794, 1357429, 567505, -1225540, -1562509, 50453, 1204642, 349562, -641987, 736867, 3558117, 4248217, 1317911, -2493364, -3507442, -1358830, 1153388]
42590A153388O92457m97187J2899P44592L71297n83774j131177j248791j032695
42581a518991R9008J993194K802052J226626j118632j579534k03968N44872l56844
42572A887783j288387r64199k33846k3654L35307J379167J936779R45309n07334
42563C466925o88463J99181O47894L26051J39643K00234l96303j578912j754582
42554E61668j9858K138612K360239K85560j922928k088703m74699Q10350N90931
42545B241172j50771j59774J19711m11950j293379j009971M57545J358622P36361
42536A887566m02412r93344j273528j397252m51632J745923L254615K154056p02655
42527C821337k658443k441368r66793N08666J434482J412067K67781j067874j115198
$$ y = [1153388, 1845845, 1348658, 1361557, 2106149, 2477446, 1893672, 762495, -486296, -1518991, -1419983, 573211, 3375263, 4601889, 3483257, 1903723, 1699755, 2244627, 1887783, 599396, -364803, -598649, -622303, -286996, 1092171, 3028950, 3974259, 3466925, 2778462, 2977643, 3625537, 3951588, 4091231, 4291465, 3895162, 2316250, 561668, 541810, 2680422, 5040661, 5326221, 3403293, 1314590, 839891, 1650241, 2241172, 2090401, 1930627, 2050338, 1638388, 345009, -664962, -207417, 1151205, 1887566, 1485154, 491810, -781718, -2178970, -2630602, -884679, 2369936, 4523992, 3821337, 1162894, -1278474, -2245267, -1736601, -302119, 1109948, 1377729, 309855, -805343]
42518h05343K23819J285241P43071o50165j069036K7876J234920J014607k96186
42509A708804r25605j58221N82443j8514p79639L54628K648776K923258J99589
42500F535519k439232k144541l14027j00915j562402k049410n48351J244420J933667
42491E54728J748753P59820j395631l405128k738939N16336K785590J689577n50562
42482c5456n12871J425891K147949P39675o11132m78241m1812l96549n77574L26686
42472A986566J075168J82430j375351j499864l26138Q8651o11561k89191J956446
42463A187156L594936K114821q97262j631834N69450K305069Q96786k187087l597824
42454B354211k043507J086980L569245L705347J185340k146396l481460k178350
$$ y = [-805343, -581524, 703717, 1446788, 796623, -272413, -244537, 990383, 2004990, 1708804, 783199, 624978, 1207421, 1188907, 409268, 763896, 3412672, 6335930, 6535519, 4096287, 1951746, 1637719, 1536804, -25598, -2075008, -2623359, -1378939, 554728, 2303481, 3063301, 1667670, -1737458, -4476397, -3960061, -1174471, 515106, -35456, -548327, 877564, 3025513, 3765188, 3154056, 2675815, 2634003, 2237454, 1659880, 1986566, 3061734, 3244164, 1868813, 368949, 42811, 131462, -480099, -769290, 1187156, 4782092, 6896913, 5999651, 4367817, 4937267, 7242336, 8139122, 5952035, 2354211, 310704, 1397684, 4966929, 8672276, 9857616, 7711220, 4229760, 2051410]
42446B051410n88132o43229j141147r8477J717308K008150P08737k13683l28459
42437C472478j190530k919319l198462q22402K013434K463404N60727j336771
42429i57441j513228j91228J255812J504680M02302o28435j34970J249143J484058
42420B470693J04312j115546r31508k31852p8355k4361M99013R00237Q16580J046785
42410C455998J709135J355113l80158j271818Q7591J319260l36412l144112l004853
42401b10256K09061K330929J185314o11309l23812Q80481O42432n59343p09139
42392B834358J15546R7979j115590j933837j403387l88688O7634J68881O81261
42383h75843J637223K144544J257474r06773k781972k572553l12123J793360J736847
$$ y = [2051410, 1463278, 820049, -321098, -419575, 1297733, 3305883, 4014620, 3800937, 3472478, 2281948, -637371, -3835833, -4658235, -2644801, -181397, 379330, -957441, -2470669, -2661897, -1406085, 98595, 500897, -127538, -262508, 986635, 2470693, 2575005, 1459459, 527951, 296099, 217744, 193383, 692396, 1592633, 2409213, 3455998, 5165133, 6520246, 6140088, 4868270, 4955861, 6275121, 5938709, 2794597, -210256, -1195, 2329734, 3515048, 2903739, 2579927, 3460408, 4102840, 3543497, 2834358, 2949904, 3047883, 1932293, -1544, -1404931, -1793619, -1725985, -1557104, -875843, 761380, 2905924, 4163398, 3256625, 474653, -2097900, -2410023, -616663, 1120184]
42374A120184O1697r17099m8965J379430J525785M11359k44396N24971J483086
42365E296052Q59272r63417j680266l19652J139471N58780j131676j374812j5692
42356B368060N11897p90953j817118p77824R36253J056058j11445o55548l23173
42347C96207m16230r66135n07856J119923K016652J072693k28301l9276J114352
42338C562029J217354l23390j984089k136846p03343J198109K341521J949878
42330E121223N0167k132796k681814p51585K155152L370868J802559r97477k744711
42321C191586k747001j799661n58300Q09221J676776J147640m46377j441333q87997
42312a055446K28408N19229R1094L1568O53661J266244J358160J080775O56901
$$ y = [1120184, 1181881, 264782, 215817, 1595247, 3121032, 3532391, 3287995, 3812966, 5296052, 6155324, 5191907, 3511641, 3191989, 4331460, 4890240, 3758564, 2383752, 2368060, 2879957, 2089004, 271886, -505938, 430315, 1486373, 1374928, 719380, 396207, -20023, -986158, -1494014, -374091, 1642561, 2715254, 2486953, 2447677, 3562029, 4779383, 4455993, 2471904, 335058, -368285, 829824, 3171345, 5121223, 5171390, 3038594, 356780, -394805, 1760347, 5131215, 6933774, 5936297, 3191586, 444585, -1355076, -1913376, -1104155, 572621, 1720261, 1273884, -167449, -1055446, -827038, -307809, -216715, -185147, 468514, 1734758, 3092918, 4173693, 4830594]
42303D830594O5289o34586j141497j140185n53281K55011N68215J27998j98674
42294B178884N57877J693652J329055q36823k672798k437364j087696m56334l77656
42285b109203N76037K303944L113496K201838M87476r30729j628367j370876l77262
42276B266354R7384q46630j891539r53372J412274K204989J32938k513447l081453
42267c172502j757923l33865N08674J068932J086416J79863q20635o42863N46339
42258c337564J347414J125068O50050O77207R11327P58721L94273M66183R50910
42249C943589R50141l9415j122513j079556k85455l14951j329990j469940J59692
42240e88398J607046R29373n91700m61991R92849J498089R14330J025549J506126
$$ y = [4830594, 4895883, 4261297, 3119800, 1979615, 1426334, 1681345, 2249560, 2377558, 2178884, 2736761, 4430413, 5759468, 4922645, 2249847, -187517, -1275213, -1731547, -2109203, -1533166, 770778, 3884274, 6086112, 6573588, 5642859, 4014492, 2643616, 2266354, 2363738, 1517108, -374431, -1327803, 84471, 2289460, 2422398, -91049, -3172502, -4930425, -5264290, -4755616, -3686684, -2600268, -2420405, -3241040, -3883903, -3337564, -1990150, -865082, -215032, 462175, 1373502, 2132223, 2526496, 2992679, 3943589, 4893730, 4854315, 3731802, 2652246, 2366791, 2051840, 721850, -748090, -588398, 1018648, 1948021, 1356321, 894330, 1887179, 3385268, 4299598, 5325147, 6831273]
42231F831273J0462l100070m125446j590136J268332J517772N11110M85543O52532
42222B461372l14230j022558r0524O01818p66950j840292L45270L634483L498370
42213F506759L28134j184623L41034J220469p29087k773271k090161K7819Q98255
42204B545328K68769n84147j136309j300579p93320l197K66422M13835J302716
42195I79518J904269N24975j541573j153104J376477K164223P3380j270113K82254
42186C340306J687453J97990j675910o21559J556282J051788j420674k025619
42178B090057k00547R76812Q8790j128821j353043j101346o64515K26444Q05132
42169b61037J83046n27133K24626J408983R58356m62135n58068M49110M70447
$$ y = [6831273, 6841735, 3741665, -383781, -1973917, -705585, 812187, 1323297, 1808840, 2461372, 2147142, 1124584, 1034060, 1635878, 868928, -971364, -626094, 3008389, 6506759, 6834893, 5650270, 5991304, 7211773, 6482686, 3709415, 1619254, 1647073, 2545328, 2814097, 2229950, 1093641, -206938, -1000258, -1003455, -737033, -323198, 979518, 2883787, 3408762, 1867189, 714085, 2090562, 4254785, 4328165, 3058052, 3340306, 5027759, 5225749, 3549839, 2928280, 4484562, 5536350, 4115676, 2090057, 1889510, 2866322, 2955112, 1826291, 473248, -628098, -1292613, -1066169, -261037, -77991, -605124, -380498, 1028485, 1986841, 1524706, 966638, 1415748, 1886195]
42160A886195k26127M44520J832285J057346j555966k287257l06017O63706j245888
42151B62797k690407p86647K146282K744612J732477J275751N96052j591266l065612
42142F24039j234948J670869J452359j183243j655487R25146K423903O79629j141112
42133B561155j57754J521955O86515j533847j670999M11240J450023p8491j864200
42124A325597j355018Q23064K138377J504241J34053m13191L4525N98600P13725
42115E503973N89745M58002M3056q04434j436455j142636m13101n17853j549079
42106G31218j830962n2288K641879L766411K533158O15846l53486p89005j762784
42097E499987k662124j881287L56804J682184P25104q83533p76339R39711K096026
$$ y = [1886195, 1660068, 2104588, 3936873, 4994219, 3438253, 1150996, 844979, 1508685, 262797, -2427610, -3214257, -1067975, 1676637, 3409114, 4684865, 5280917, 3689651, 624039, -610909, 1059960, 2512319, 1329076, -326411, 598735, 3022638, 3702267, 2561155, 2403401, 3925356, 4611871, 3078024, 1407025, 1818265, 3268288, 3189797, 1325597, -29421, 793643, 2932020, 4436261, 4570314, 4157123, 4191648, 4790248, 5503973, 6093718, 6551720, 6594776, 5790342, 4353887, 3211251, 2798150, 2280297, 731218, -1099744, -1152032, 1489847, 5256258, 7789416, 8405262, 8051776, 7262771, 5499987, 2837863, 956576, 1313380, 2995564, 3720668, 2837135, 2060796, 3000507, 5096533]
42088E096533J424838l20067j830134k367620j571315L19127J822647J224174
42080C798183j223124l146674k641735k38534K015320K616305J506068k04798
42072B481011j082173o30235J70055K23066r4533K26657Q35591M97219n77884
42063B048774q27372l980L19827m98895j028662k95389N80625M75149Q5633L35980
42053A191690P67573Q83783J202125J524272L60435k063570k648913J43836K974658
42044D335889K046109r92184j537418O96947J444672j064237l388084k459725
42036i18031M9333J004308L77909J23492O68112R85959P95969N53937J39138p15380
42026C064746j349106r75482m3699L61949K1020m63433p15074p49562n25177o3598
$$ y = [5096533, 6521371, 6201304, 4371170, 2003550, 432235, 751362, 2574009, 3798183, 2575059, -571615, -3213350, -3451884, -1436564, 1179741, 2685809, 2481011, 1398838, 768603, 938658, 1161724, 1067191, 1293848, 2129439, 2626658, 2048774, 1221402, 1217422, 1537249, 1038354, 9692, -285697, 294928, 770077, 855710, 1191690, 1959263, 2843046, 4045171, 5569443, 5929878, 3866308, 1217395, 1361231, 4335889, 6381998, 5389814, 3852396, 4549343, 5994015, 4929778, 1541694, -918031, -868698, 135610, 513519, 637011, 1305123, 2291082, 3087051, 3640988, 3780126, 3064746, 1715640, 740158, 696459, 1058408, 1079428, 615995, -99079, -848641, -1373818, -1437416]
42016a437416L23647M62391O03306Q86112R29247L28688p12004j443150j136507
42007a195686J77071J316509R52914m83176r01023M99682J678345P73674o75778
41998B142532k013K033436K100864m27642k459856k053011r53713r91546j117402
41989a728351j0226J068832M78760p48841n72908P54821J390223Q67212K39225
41980A738747r000l25638q57938j282360j402309j000550Q9667J113614R06540
41971a029227m4588J85166J796274K481527J091177l38826k7544N66835m33577
41962D247217j846761j592505l20384J81323L71137J407595J893704k6854k525658
41953A788814k114971P95008K381610J215297l74111p59402q48346j070727m59926
$$ y = [-1437416, -1113769, -651378, -48072, 838040, 1767287, 2095975, 1383971, -59179, -1195686, -1018615, 297894, 1250808, 767632, -133391, 366291, 2044636, 2818310, 2142532, 2140519, 4173955, 6274819, 5847177, 3387321, 1334310, 380597, -610949, -1728351, -1738577, -669745, -190985, -939826, -1512734, -757913, 632310, 1499522, 1738747, 1729747, 1404109, 546171, -736189, -2138498, -3139048, -3049381, -1935767, -1029227, -1073815, -888649, 907625, 3389152, 4480329, 4141503, 4113959, 4680794, 4247217, 2400456, 807951, 487567, 668890, 1040027, 2447622, 4341326, 4314472, 1788814, -326157, 468851, 2850461, 4065758, 3691647, 2932245, 2083899, 1013172, 553246]
41944E53246N54003J96147j004103m18121J860927K400692L3651j955915j157237
41935A063290L58143J32675o54097j02186P69282M43748N7314Q26231J002504
41926C896904j028298l004641k048646L15719N77520q56025o41550J495115K377650
41917A083748R48961k45079K11267N15059n00161j132080j20921R69730O33793
41908B364317K8520O03065J345701O59933p10588r23983n9578K22798o44924j581276
41898A303985j538091m04392J257992K280116J441876q51068k294250j429243
41890b33075K28173L91721n61035m42184R78445J551393L17205r50778o50365
41881F29500L49123O13560N01189R24863J239340L81124q73103r16288K0898L73091
$$ y = [553246, 1107249, 1303396, 299293, -118828, 1742099, 4142791, 4176442, 2220527, 1063290, 1421433, 1554108, 900011, 797825, 1567107, 2010855, 2068169, 2894400, 3896904, 2868606, -136035, -2184681, -1868962, -1291442, -2147467, -2789017, -1293902, 1083748, 2032709, 1787630, 1998897, 2513956, 2013795, 881715, 760794, 1730524, 2364317, 2392837, 2995902, 4341603, 5001536, 4290948, 3366965, 3307387, 3530185, 2885261, 1303985, -234106, -638498, 619494, 2899610, 4341486, 3490418, 1196168, -233075, -4902, 386819, -174216, -616400, 362045, 1913438, 2230643, 1279865, 629500, 978623, 1592183, 2093372, 3018235, 4257575, 4638699, 3765596, 2849308, 2870206, 3243297]
41871C243297L6840K82165Q89393O8240k089873k790816o24561J862045J662279
41862B539009m82394j674496j210090o88084o43039P0323J596273K372336J606447
41853C486285M43353Q3326L64084O56181O98403K55890o05679q20686M39273J800032
41843F800462R90485j596077k915252j551516L14751L35939q10682j182442n79852
41834a94184M0418O16399J492454K007627J408903L09972l44171q25022j557240
41825B955156j587228j3586J887947K020238M72182p51277o72479j56544k0773
41816D133636j76010n50880j095047r69116L89408J467122J48825k691204l475461
41807b818727p86474K279403K224227j73175j378565j19731J560783J904618J567627
$$ y = [3243297, 3280137, 3562302, 4451695, 4519935, 2430062, -360754, -985315, 876730, 2539009, 2056615, 382119, -827971, -1516055, -2159094, -2088771, -492498, 1879838, 3486285, 3929638, 4012964, 4377048, 5033229, 5731632, 5987522, 5381843, 4561157, 5000430, 6800462, 7790947, 6194870, 3279618, 1728102, 2042853, 2378792, 1568110, 385668, -194184, -153766, 462633, 1955087, 3962714, 5371617, 5681589, 5337418, 4512396, 2955156, 1367928, 1354342, 3242289, 5262527, 5734709, 4983432, 4310953, 4154409, 4133636, 3957626, 3406746, 2311699, 1342583, 1731991, 3199113, 3347938, 656734, -2818727, -3605201, -1325798, 898429, 725254, -653311, -773042, 787741, 2692359, 4259986]
41798D259986J590348J430185L43523q36302j009397q55728j597635k349504j113062
41789a37586J536619K471740O41002j025797j05802J481341P95473j123205j154697
41780C379088L86806L89744j298023j370614R55802K116085K00797j531556j135
41771C226994K494608K014611q70474k545745j997742j077527n09508M49695J204842
41762B389754M61744p55951l28327R77374M03302j895007k673691q97354O19726
41753a698430O3825n44011P51611K323316J845020K05444k72698K15634k47958
41744B641753j503514j281680R95796K913846K349013K50112j016341q95105p20926
41735C732954j076027q67655M46404J347102M04183j171428j163591K9027k7895
$$ y = [4259986, 5850334, 7280519, 7624042, 6787740, 5778343, 4922615, 3324980, 975476, -137586, 1399033, 3870773, 4511775, 3485978, 3380176, 4861517, 5656990, 4533785, 3379088, 3765894, 4155638, 2857615, 1487001, 2442803, 4558888, 4759685, 3228129, 3226994, 5721602, 7736213, 6865739, 4319994, 2322252, 1244725, 735217, 1184912, 2389754, 2851498, 2095547, 1767220, 2744594, 3147896, 1252889, -1420802, -2318156, -1698430, -1634605, -2178616, -1427005, 896311, 2741331, 2946775, 2674077, 2889711, 2641753, 1138239, -143441, 852355, 3766201, 6115214, 6365326, 5348985, 4453880, 3732954, 2656927, 1789272, 2235676, 3582778, 3986961, 2815533, 1651942, 1680969, 1653074]
41726A653074j517536j685445N28089K245904J014077j312977j610442r3453J020757
41717B42048J398629J838172J430731p69194k592346j338176J372068J566238
41709C148170p55748j751231j58508J121993M96931q128P55092P34297j209726
41700B373142k811880k159729m65715Q59707K380899L881623L155853k0583k269262
41691D924055j560280k30445l22962J12460K501432L527535K07106l966091l454918
41682A737892P25279K521442L2988k420243j592541M97103Q60462j87985p53700
41673A420697l07603N86357J268470Q33187j008373k534913j644711R08004K221455
41664A742570J359967K47129J71399J37120o12694j079837n87736j00888l18300
$$ y = [1653074, 135538, -1549907, -1021818, 1224086, 2238163, 925186, -685256, -778709, 242048, 1640677, 3478849, 4909580, 4140386, 1548040, 209864, 1581932, 3148170, 2392422, 641191, 482683, 1604676, 2101607, 2093479, 2848571, 3582868, 2373142, -438738, -2598467, -3064182, -2204475, 176424, 4058047, 7213900, 7193317, 4924055, 3363775, 3133330, 2810368, 2922828, 5424260, 8951795, 9158901, 5192810, 1737892, 2463171, 4984613, 5017601, 2597358, 1004817, 1501920, 2362382, 2174397, 1420697, 1113094, 1699451, 2967921, 3801108, 2792735, 257822, -1386889, -478885, 1742570, 3102537, 3349666, 3521065, 3658185, 3045491, 1965654, 1377918, 1277030, 958730]
41655I58730m15365K13702P50233N43549K54158M06143L85506j14414j79567P12284
41645C514959J541341J311143N63465K48313J26089o06656j843421k631444k235455
41636a1666p00711J039705J508000J20160j562639j263799R65924K466376J356068
41627C917418j030483j950878n53764J537990K336205J395754j29180r08571r10503
41618C703988j188975j994207k027099n38233R01093M74670q09818m52817J422178
41609e09220K009937K72302j382635r57507K69393M11911J09180P25837J316307
41600B265505J56163j762853j653572Q23382K780525K039129j49241j148821l08027
41591C042190P25262L54463j135246j999019j002292J087311K229743J484875
$$ y = [958730, 543365, 757067, 1507300, 2050849, 2305007, 2711150, 3096656, 2982242, 2802675, 3514959, 5056300, 6367443, 6930908, 7179221, 7305310, 6698654, 4855233, 2223789, -11666, -712377, 327328, 1835328, 1955488, 392849, -870950, 94974, 2561350, 3917418, 2886935, 936057, 382293, 1920283, 4256488, 5652242, 5523062, 4614491, 3703988, 2515013, 520806, -1506293, -2044526, -1143433, -668763, -1478581, -1931398, -509220, 1500717, 1773019, 390384, -567123, -297730, 114181, 223361, 949198, 2265505, 2421668, 658815, -994757, -171375, 2609150, 4648279, 4499038, 3350217, 3042190, 3767452, 4121915, 2986669, 987650, -14642, 1072669, 3302412, 4787287]
41583D787287J24671r8844P73691J167092J55294j510712k456713j971321k97948
41574F72497J536238K142637R09160r96973j541175j83388J334107J151698l29402
41565D695399j087814k00027J126251J352706M22631o88915j314865j255941m35780
41556B613645O01261N88037p68774j628824k53111K021419K201869M2121j523837
41547C893806r38760j34475o81006q19639J164270L154099K150993p18224j896315
41538E174749j076871j136874k654285k775873l36302J876218J561143K55909
41530H87814L03471J313682J760846J647147J360353R9233k158955l075708r96241
41521A141642J915155K306469L40581r31902k22198O69137O1716j428637k249802
$$ y = [4787287, 4911958, 4813114, 5586805, 6753897, 6909191, 5398479, 2941766, 970445, 672497, 2208735, 4351372, 5260532, 4263559, 2722384, 2538996, 3873103, 5024801, 4695399, 3607585, 3407558, 4533809, 5886515, 6309146, 5620231, 4305366, 3049425, 2613645, 3214906, 3802943, 3034169, 1405345, 1152234, 3173653, 5375522, 5417643, 3893806, 2955046, 2820571, 2139565, 1319926, 2484196, 5638295, 7789288, 7071064, 5174749, 4097878, 2961004, 306719, -2469154, -2805456, -929238, 631905, 887814, 1191285, 2504967, 4265813, 5912960, 7273313, 7372546, 5213591, 2137883, 1141642, 3056797, 5363266, 5703847, 4771945, 4549747, 5218884, 5280600, 3851963, 1602161]
41512A602161j731587k60811J118962J286332K62101m66802J18208R27613L62656
41503C218833j086856j425048J8070J834170K432520J461745l25772j510337r03342
41494C713983P99506J149070q03785k512654j245620J616347K261298l3534k040711
41485B903900j488845R0028L30336o65451j302842q56536L80242J753323K108528
41476C252683N94678j544716j764727K18100J592854M61678j320840j079811O81970
41467A091869J432837N09260n12944o66828n47581o25264n46135j45252L78357
41458C68319J187949K288561K587595J115118j024049j706264p62817o260j79514
41449C868638o8256P69835P57492q75231k100460r51060J115570J161609o96071
$$ y = [1602161, -129426, -390237, 728725, 2015057, 2277158, 1810356, 1928564, 2856177, 3218833, 2131977, 706929, 724999, 2559169, 4991689, 6453434, 6127662, 4617325, 3713983, 4513489, 5662559, 4858774, 2346120, 1100500, 2716847, 4978145, 4944611, 2903900, 1415055, 1505083, 1835419, 1169968, -132874, -989410, -609168, 1144155, 3252683, 3847361, 2302645, 537918, 756018, 2348872, 2810550, 1489710, 409899, 1091869, 2524706, 3033966, 2521022, 1854194, 1306613, 681349, 135214, -10038, 368319, 1556268, 3844829, 6432424, 7547542, 6523493, 4817229, 4054412, 4048152, 3868638, 3800382, 4570217, 5327709, 4452478, 2352018, 1400958, 2516528, 3678137, 2982066]
41440B982066j407600K39417J654313L68055k212286k812343p67130J581130K393431
41431B019053K098409J528876M09008j336264k358916j452064M89698J455345
41423B853145Q05974m42304j384500j853220j500942N3576J849830J997013K69734
41414B648306j076671k22879J554853J584773m66469k186556j736182q3909O39536
41405F54802l9790o99083j96117Q37802R44293k00251j328410j149039J21666
41396a054127J190831J280638O52673k14441j056583j375869n87644R66911K020717
41387A823106J887077J141765L27142r34999k666442l448564k003527P14047K404751
41378g55644K160182J075016L34145L5081j1820L75256J116750J428723N72684
$$ y = [2982066, 1574466, 1813883, 3468196, 3836251, 1623965, -1188378, -1955508, -374378, 2019053, 4117462, 5646338, 6055346, 4719082, 2360166, 908102, 1397800, 2853145, 3659119, 3216815, 1832315, -20905, -1521847, -1468271, 381559, 2378572, 2648306, 1571635, 1348756, 2903609, 4488382, 4021913, 1835357, 99175, 15266, 654802, 615012, -84071, -280188, 557614, 1501907, 1301656, -26754, -1175793, -1054127, 136704, 1417342, 2070015, 1855574, 798991, -576878, -1164522, -197611, 1823106, 3710183, 4851948, 5179090, 4244091, 1577649, -1870915, -3874442, -3160395, -755644, 1404538, 2479554, 2813699, 2848780, 2836960, 3212216, 4328966, 5757689, 6330373]
41369F330373j190268k496087j787638J021547L594035L102730j15529k344225
41361F114938j302032N45655k41396k602999k657421m5656J533908M79694l97945
41352A426746P57118J437014n19631k508054j240364J478392J472750r39026j527566
41343a62621Q37998K425149O98729j893717j953106Q3057J330096O54268n75891
41334A443962q54586q5723P37206O13910k58354l59966J104545K386502J199574
41325E927070j511262k186913K91925K671140J892710o39503j501223l14168K65564
41316D895340j051590k408896j742056M48995K045454J852326M51119q10908j062376
41307B617408m30222K86099M89383L59697M45191P83831P35280j69010j354877
$$ y = [6330373, 5140105, 2644018, 856380, 1877927, 5471962, 8574692, 8459163, 6114938, 4812906, 5358561, 5117165, 2514166, -143255, -188911, 1344997, 1824691, 1426746, 2183864, 3620878, 3101247, 593193, -647171, 831221, 2303971, 1364945, -162621, 675377, 3100526, 3799255, 1905538, -47568, 35489, 1365585, 2019853, 1443962, 589376, 503653, 1240859, 1854769, 1596415, 1236449, 2340994, 4727496, 5927070, 4415808, 2228895, 2520820, 5191960, 7084670, 6445167, 4943944, 4629776, 4895340, 3843750, 1434854, -307202, 141793, 2187247, 4039573, 4490692, 3679784, 2617408, 2187186, 2473285, 2962668, 3322365, 3767556, 4551387, 5286667, 5117657, 3762780]
41298C762780j541809k58910J215793J149443l20386j135530j27258J214777Q53901
41289D812801q55477j857273j403933n85338r4086N66831J411122J427576L90241
41280C812464m12775j25617L54843n3360q65143q67472J00048J142271J581672
41271D666931J528434J436046J410466Q74354p15121k426531k136244N23956K576483
41262G738774J135084k236122l236645p98642J631936J354033j38643l28249N25790
41253E647316P88674M62657M64528L54771r37466k877514l607432k135971P34258
41244a106179L128775L300951J122125j297693j715616n28043J74812j8034J06802
41235C167900K22651j208386l086085k197222J273502L075838J509637P2661R96291
$$ y = [3762780, 2220971, 1962061, 3177854, 4327297, 4006911, 2871381, 2744123, 3958900, 4812801, 3957324, 2100051, 696118, 110780, 16694, 583525, 1994647, 3422223, 3812464, 3399689, 3274072, 3628915, 3575555, 2710412, 1842940, 1942988, 3085259, 4666931, 6195365, 7631411, 9041877, 9916231, 9201110, 6774579, 4638335, 5162291, 7738774, 8873858, 6637736, 3401091, 2602449, 4234385, 5588418, 5449775, 5121526, 5647316, 6435990, 6898647, 7363175, 7717946, 6780480, 3902966, 295534, -1840437, -1106179, 2022596, 5323547, 6445672, 5147979, 3432363, 2904320, 3079132, 3061098, 3167900, 3390551, 2182165, -903920, -3101142, -1827640, 1248198, 2757835, 2830496, 3826787]
41226C826787J191705j625820l769550j601084J642607J084030j323905m53054
41218a028284K535625K085463j674908k757339N42265L045018J678077j23278
41210D302639N82482J367349j60942j651109n01148J387525J110968n26028j179388
41201D732348q06113l99300K41639Q86351k6384k228400k730681o17582O85303
41192b62819j131599l019429j362666K104315L252041J918626R85489R63675J3281
41183C460914j645872j682625J24583J273785M33552r59331j303792o47153L40314
41174f05625J203999J366004N75638l05688k61168M16010O94263K67521n23512
41165B827442j372132j677778o83275J102105J995680J587435J337965J724754
$$ y = [3826787, 5018492, 3392672, -376878, -1977962, -335355, 748675, -575230, -1028284, 1507341, 3592804, 1917896, -839443, -297178, 2747840, 4425917, 4302639, 4885121, 6252470, 6091528, 4440419, 3939271, 5326796, 6437764, 5911736, 4732348, 3926235, 3526935, 3768574, 4654925, 4628541, 2400141, -330540, -948122, -262819, -1394418, -4413847, -5776513, -3672198, -420157, 1498469, 2483958, 3447633, 3460914, 1815042, 132417, 257000, 1530785, 1964337, 1005006, -298786, -945939, -605625, 598374, 1964378, 2540016, 2234328, 1973160, 2389170, 3083433, 3350954, 2827442, 1455310, -222468, -905743, 196362, 2192042, 3779477, 5117442, 6842196]
41157F842196J118581r50971k042911o11896R39452o4306k005984j503580J111919
41148B832500K524288J642614M15641q9422q65746k170547k733258k111881j161409
41139a717220M0914K087255L836164K937630m59732k956197k015413Q79716K270303
41130D903420Q03181j592066k097403j90698J643019R40691j232916j552648M98745
41121B123325J545502l07416k120974q13996J627608J368035r63313j543530K72040
41112A187281J404738M85413n46456m22070n2830K91550J413831K385993J264525
41103G411975q74589p66158J426050J776874q68392k727082j449209K9394j100263
41094B858600k586269j364055Q56964O51702j086876q29485J451968K406572R48807
$$ y = [6842196, 7960777, 7009806, 4966895, 4354999, 5294451, 5230145, 3224161, 1720581, 2832500, 5356788, 6999402, 7415043, 7325621, 6459875, 4289328, 1556070, -555811, -1717220, -1676306, 410949, 4247113, 7184743, 6725011, 3768814, 1753401, 2633117, 4903420, 5706601, 4114535, 2017132, 1826434, 3469453, 4410144, 3177228, 1624580, 2123325, 3668827, 3361411, 1240437, 426441, 2054049, 3422084, 2458771, 915241, 1187281, 2592019, 3077432, 2530976, 2108906, 2056076, 2347626, 3761457, 6147450, 7411975, 6537386, 5771228, 7197278, 8974152, 8105760, 5378678, 3929469, 3958863, 2858600, 272331, -1091724, -234760, 416942, -669934, -1499419, -47451, 2359121, 3307928]
41085C307928m17178o8798N84956J49343n27716k72384M20703M40451k77190r59565
41075B380550r94713l41702M10339M36469k82557p27130k87500L34735N25439
41066A453930R37663J940861K103681K00208k131119k132571j6442J236375L61743
41057C954329n65312J39104J009184J34895j412438j245401M13615J100443J00284
41048C628703n69943K94283J055246J91047p69509M02823K539681K227240r57022
41039H042549l253528j819532J405608K634223J116647r93061k139214k238840
41031B754852j077734J325699L080910K010722q59106k059347m85314J192221
41023E882903P98458m18650o26471n29564j381541j957657l82901K154776K484880
$$ y = [3307928, 2890750, 2821952, 3406908, 3556251, 3028535, 2756151, 3176854, 3617305, 3340115, 2380550, 1385837, 1044135, 1454474, 1890943, 1608386, 881256, 593756, 928491, 1453930, 2391593, 4332454, 6436135, 6636343, 4505224, 2372653, 2356211, 3592586, 3954329, 3389017, 3528121, 4537305, 4672200, 3259762, 2014361, 2427976, 3528419, 3628703, 3058760, 3353043, 4408289, 4599336, 3829827, 4232650, 6772331, 8999571, 8042549, 4789021, 2969489, 4375097, 7009320, 8125967, 7132906, 4993692, 2754852, 1677118, 3002817, 6083727, 8094449, 7235343, 5175996, 4690682, 5882903, 6681361, 6262711, 5636240, 5106676, 3725135, 1767478, 1384577, 3539353, 6024233]
41014F024233O7910k042290j323038J097102K251358R64843j185245j891420n29105
41005C434348J258402J362571k64392j383442k54575K012843K795994J186328
40997A0148077j167527k218677j497231n074Q89522L91681j050898j925391j188242
40988B376240L91008J115103M95763l29046l19646K44909N15782K55710j26846
40979D618977k15552N5127L66424K72205j79505k42703N55495J443477J216741
40970G890686l5060r62292q38024l70986l09566l35641J245K35736k10899r10421
40960D154778j092949q62856p21142l81293O91133J799979J474041l68567j877884
40951B815240j394074O55463K379813K362934P56867r93849j408715m70245L09701
$$ y = [6024233, 6092143, 4049853, 2726815, 3823917, 6075275, 7040118, 5854873, 3963453, 3434348, 4692750, 6055321, 5790929, 4407487, 4152912, 6165755, 8961749, 10148077, 8980550, 6761873, 5264642, 5259568, 6149090, 6540771, 5489873, 3564482, 2376240, 2767248, 3882351, 4378114, 4049068, 3729422, 3974331, 4490113, 4745823, 4618977, 4403425, 4458552, 4824976, 5097181, 4917676, 4674973, 5230468, 6673945, 7890686, 7855626, 6893334, 6055310, 5684324, 5374758, 5039117, 5040362, 5276098, 5065199, 4154778, 3061829, 2198973, 1477831, 1096538, 1787671, 3587650, 5061691, 4693124, 2815240, 1421166, 2076629, 4456442, 6819376, 7576243, 6582394, 5173679, 4703434, 5013135]
40942E013135o408k02346J212812L089853K765410J92231j608401j021734n2663
40933I381889n52089j039029K29942J499110K17744k201321k234171J3017J047563
40924F362655j43511p79184M05681Q37319j101355k762595j385189J377892K104352
40915D916065O79475l53680j18317k819n60401o04972M52087J435979J082919
40906F926336l21724j353898r71492L73413J057134J91283r98152p66421M36751
40897D573230N74100o22934j077671L08233J975665K226949J327774J93241q88634
40888H589953j348877m52994Q22058N43187q16962q10960M43381M5393k090950
40879D923229k120080R58933K554496O7945j980198O32916M091809K567520j859493
$$ y = [5013135, 5006727, 4804381, 6017193, 9107046, 11872456, 12064687, 10456286, 9434552, 9381889, 8829800, 7790771, 8020713, 9519823, 9737567, 7536246, 5302075, 5315092, 6362655, 6219144, 5439960, 5845641, 6682960, 5581605, 2819010, 1433821, 2811713, 4916065, 5595540, 5241860, 5123543, 5120724, 4560323, 3955351, 4407438, 5843417, 6926336, 6604612, 5250714, 4279222, 4652635, 5709769, 5901052, 4902900, 4136479, 4573230, 5147330, 4524396, 3446725, 3754958, 5730623, 7957572, 9285346, 9478587, 8589953, 7241076, 6788082, 7610140, 8153327, 7336365, 6525405, 6968786, 7014179, 4923229, 2803149, 3762082, 6316578, 6384523, 4404325, 5037241, 9129050, 11696570, 9837077]
40870I837077k702582O0816O82313j861465k366895R80643L297334J333661j603259
40861G657643j766179l64560M4792k08569j00330k81869q15873k30068J202845
40852E137832J017791q76387j255712R27070K365091R00556j017856q77449n6545
40843F264391n21941j328428j136045o90903l29649J254178L358294K630506j077932
40834H422471k744365L77375L781803K443608j580524l133747j932354j200910
40826D433357j253787j15510J465755J150175j98367L8645J119686K28713k052006
40817D816661k452513n76585R27688J187908J446770J200098r82521l055170j307231
40808A205105K984306M145405N37179k851002k117755K67981O29629j8078J024755
$$ y = [9837077, 7134495, 7195311, 7877624, 6016159, 3649264, 4629907, 7927241, 9260902, 7657643, 5891464, 5526904, 5571696, 5363127, 5262797, 4980928, 4165055, 3934987, 5137832, 6155623, 5279236, 4023524, 4950594, 7315685, 8216241, 7198385, 6320936, 6264391, 5742450, 4414022, 3277977, 2587074, 2257425, 3511603, 6869897, 9500403, 8422471, 5678106, 6055481, 9837284, 12280892, 10700368, 7566621, 5634267, 4433357, 3179570, 3064060, 4529815, 5679990, 5481623, 5520268, 6639954, 6868667, 4816661, 2364148, 1787563, 2715251, 3903159, 5349929, 6550027, 5567506, 2512336, 1205105, 4189411, 8334816, 8871995, 6020993, 3903238, 4171219, 4800848, 4782770, 5807525]
40799E807525K639741J710572j389240l140914k067547k78739J73715k23266j52618
40790C079229M06956P39833Q01735R69321R81251K21496r38684j088396L25910
40781E498651J756715J258373q31799k110488j086710J186870K624330K146950
40773A0442892J56753j779483j787729K56943J772792N78340j414311n37104K561975
40764A0251068L051743p17996m159174l155930L0858R30931l45886n79526P30092
40755F036180J414491J001211P98989O06610o73067j849543p87891J479345J789020
40746I815345j22543j279672k98767R30763Q32694K01047k3186k68784q43669
40737H943228j128820q38348l90512K7560K81827k26532j300609j330574J39556
$$ y = [5807525, 8447266, 10157838, 8768598, 5627684, 3560137, 3281398, 3455113, 3231847, 3079229, 3486185, 4226018, 5027753, 5997074, 6978325, 7199821, 6261137, 5172741, 5498651, 7255366, 8513739, 7681940, 5571452, 4484742, 5671612, 8295942, 10442892, 10599645, 8820162, 7032433, 7289376, 9062168, 9640508, 8226197, 7689093, 10251068, 13302811, 12584815, 8425641, 5269711, 5300569, 6231500, 5885614, 5306088, 6036180, 7450671, 8451882, 9250871, 9857481, 9184414, 7334871, 6546980, 8026325, 9815345, 9692802, 8413130, 8114363, 9045126, 9877820, 10078867, 10055681, 9786897, 8943228, 7814408, 6976060, 6585548, 6613108, 6894935, 6668403, 5367794, 4037220, 4176776]
40728D176776Q79707n16266j567694L78313L272650L186150M85617j197463r66165
40719H131625q73674j035460K95161K134063J626146m13296l14103J685747J347231
40710A2583440j866526l092858n2514L081993K493747J42914o18509o3556L57151
40701A2965282R89364J505440m0212k736824k284608J762543L588622J23321l126469
40692A2746459p06600L575842K930654j159182j922141J139502K159844n30290
40684A8234088k089636j13309J760692J083438O17736K311038L127283N16941
40676B5448271k574241k077830J171207L397472L292004K195447J064606L81799
40668C2298735J208467L094279K367467l946153j2845003j7136471j3136620m588457
$$ y = [4176776, 5056483, 4540217, 2972523, 3350836, 6623486, 9809636, 10295253, 9097790, 8131625, 7257951, 6222491, 6517652, 8651715, 10277861, 9864565, 9550462, 11236209, 12583440, 10716914, 7624056, 7571542, 10653535, 13147282, 13290196, 12671687, 12608131, 12965282, 13954646, 15460086, 15419874, 12683050, 10398442, 12160985, 15749607, 15872928, 12746459, 12039859, 15615701, 18546355, 17387173, 15465032, 16604534, 18764378, 18234088, 16144452, 16031143, 17791835, 18875273, 19493009, 21804047, 24931330, 25448271, 22874030, 20796200, 21967407, 25364879, 28656883, 30852330, 31916936, 32298735, 33507202, 36601481, 38968948, 35022795, 22177792, 5041321, -8095299, -12683756]
40660a2683756J655625K318681m71404k641784k322795q27301k86536r29438j128823
40651a7317531J00297J652399J892335Q95761K39852Q48948J915045K089322J175518
40642f508054K85367M29937J230475J309814N7167j392862j449552j10897J055194
40633e093411J043799N96019P59200J174477Q30987p130m6034P83809Q45802o39983
40623B47535j888234q79570J416282K092404M72335r00587r5880J423071J262714
40614C150070k76708j003387k92130M07714J83982k56984k33238l3952J07553
40605A752920M61396Q56714O91378K19980L86522R75594N22139j225223k297527
40596B343893j066981J347328K447705J362105o03472j839159j838249j059000
$$ y = [-12683756, -11028131, -8709450, -9180854, -11822638, -14145433, -14972734, -15259270, -16188708, -17317531, -17217234, -15564835, -13672500, -12776739, -12536887, -11687939, -9772894, -7683572, -6508054, -6222687, -5792750, -4562275, -3252461, -3195294, -4588156, -6037708, -6148605, -5093411, -4049612, -3453593, -2694393, -1519916, -688929, -696059, -742093, 41716, 887518, 247535, -1640699, -2520269, -1103987, 988417, 1460752, 560165, 464285, 1887356, 3150070, 2873362, 1869975, 1577845, 1985559, 2169541, 1912557, 1679319, 1645367, 1752920, 2214316, 3071030, 3762408, 3982388, 4368910, 5344504, 5866643, 4641420, 2343893, 1276912, 2624240, 5071945, 6434050, 5830578, 3991419, 2153170, 1094170]
40588A094170k21098L35959R43562J939025K595166J564490j044483k904151j891397
40579B411243J027370K530597R00763j691373j801480P74748K565714J113672
40571G831254j465714j481202P82364J497300n38286j767819L22007K699455J345397
40562I224756k223345l177822p48947J171302N00598n33844n6635N67258j1854
40553D711467o71822m58916m97717j333720j318974K80858J361803M35194o11664
40544A896509K96598J883520J893760Q56487N47630N59126m34416j444590n24479
40535E530145J546751K108812O58051q43813j326664j475468j439202m85139Q74441
40526E147914R59261m29217j551620j288391k57274Q06298J797122K116206Q65097
$$ y = [1094170, 873072, 1209031, 2152593, 4091618, 6686784, 8251274, 7206791, 4302640, 2411243, 3438613, 5969210, 6869973, 5178600, 3377120, 4151868, 6717582, 7831254, 6365540, 4884338, 5666702, 7164002, 6625716, 4857897, 5179904, 7879359, 9224756, 7001411, 3823589, 3074642, 4245944, 4746542, 4212698, 4156063, 4723321, 4711467, 4039645, 3580729, 3083012, 1749292, 430318, 711176, 2072979, 2508173, 1896509, 2193107, 4076627, 5970387, 6826874, 7374504, 7933630, 7499214, 6054624, 5530145, 7076896, 9185708, 9843759, 8999946, 7673282, 6197814, 4758612, 4273473, 5147914, 6107175, 5677958, 4126338, 2837947, 2580673, 3386971, 5184093, 7300299, 8165396]
40517H165396j286203k264382j279205K46658R80652J255491J605366J354765
40509H778538j31177j829209j945914j15822K006531K333888M39146j815366k101836
40500E618779m12425P62204j98307j593827q60956J411635K172624M25882j417038
40491E908571j274313j52467M0883n19477m94841Q7127J79600j17382L20894J452713
40481E431308J718650L19896j405603j590470q2594J588981K051580J253925J9149
40472I304822q90187j139685p80206k24148m2635l75349n85334O7108J267296
40463F601682J605070J53768k072720k864722j303938R66269J599316M90567j25792
40454E049500J103680K518688J801902l49237r92315N47223J395377m39341k649754
$$ y = [8165396, 6879193, 4614811, 3335606, 3582264, 4562916, 5818407, 7423773, 8778538, 8647361, 6818152, 4872238, 4756416, 6762947, 9096835, 9535981, 7720615, 5618779, 5206354, 5968558, 5770251, 4176424, 3315468, 4727103, 6899727, 7325609, 5908571, 4634258, 4481791, 4522674, 4003197, 3508356, 3595483, 3775083, 3657701, 3978595, 5431308, 7149958, 7469854, 6064251, 4473781, 4391187, 5980168, 8031748, 9285673, 9304822, 8414635, 7274950, 6494744, 6270596, 6227961, 5852612, 5267278, 5334386, 6601682, 8206752, 8360520, 6287800, 3423078, 2119140, 3085409, 4684725, 5175292, 5049500, 6153180, 8671868, 10473770, 10124533, 9132218, 9679441, 11074818, 10635477, 7985723]
40445G985723j938716Q26202J784537j23054j777622q42174R26692Q28439p05789
40436F964238j289691k88143R00638J410813J545166J174906k76322j919526j532475
40427F689604J303375L703376K714646p36876k894752j910044M28349J935064
40419A1232742K563923K451348J17867m504179p223042l985017K405796M663267
40411G722705Q88393k795313j426501J947426K045169n32896j742878j154014
40403D952091j030495q72052J150893K974733J174270k169082j760699J852314
40395F271973K535387j203320l491993q48039K352815J660839n10175j70903J424538
40386H021122J254861L56728R52538J474734k35619j913545m83363J936123J245819
$$ y = [7985723, 6047007, 6873209, 8657746, 8534692, 6757070, 5914896, 6841588, 7670027, 6964238, 5674547, 5386404, 6287042, 7697855, 9243021, 10417927, 10141605, 8222079, 6689604, 7992979, 11696355, 14411001, 13674125, 10779373, 8869329, 9297678, 11232742, 13796665, 16248013, 16365880, 11861701, 4638659, 653642, 3059438, 7722705, 8611098, 5815785, 4389284, 6336710, 8381879, 7848983, 6106105, 4952091, 3921596, 3049544, 4200437, 7175170, 8349440, 6180358, 4419659, 6271973, 8807360, 7604040, 4112047, 3264008, 5616823, 7277662, 6767487, 6596584, 8021122, 9275983, 9632711, 10585249, 12059983, 11824364, 9910819, 9427456, 11363579, 12609398]
40377A2609398j414892j435668J445835K779938O22973k039287k497564j530138
40369H540595p16540k31920l3587k66192j38619J013771J768698M38984j632623
40360H742567j602138M55685J749638J124944J55404M3804L40512N95420O17888
40351A2223724m25120k463729k995440k68824L023680K923307J69116j190867
40343A0995847m33284n33048j970245j569457J378645L050001J186569j306875
40335A0798153j325908m8694K78448L01670J178134J469737j36897j592345m89046
40326A0433252J703897J882512K20906o33527j84776l86099j729372k364780j418959
40317G523054l78787m16486n63497M18533J932159K403034J306467m82092j712416
$$ y = [12609398, 11194506, 9758838, 11204673, 13984611, 14607584, 12568297, 10070733, 8540595, 7824055, 7592135, 7558548, 7292356, 7153737, 8167508, 9936206, 10375190, 8742567, 7140429, 7596114, 9345752, 10470696, 10626100, 10669904, 11010416, 11605836, 12223724, 11798604, 9334875, 6339435, 6070611, 9094291, 12017598, 12186714, 10995847, 10562563, 10029515, 8059270, 6489813, 7868458, 10918459, 12105028, 10798153, 9472245, 9423551, 9701999, 10003669, 11181803, 12651540, 12514643, 10922298, 10433252, 12137149, 14019661, 14240567, 13607040, 13422264, 13036165, 11306793, 8942013, 7523054, 7144267, 6727781, 6164284, 6582817, 8514976, 10918010, 12224477, 11742385, 10029969]
40308A0029969j550484J0592J826990K152800M00319j723911j770547M54433K361198
40299A2191359J754327l74250j466876j024029o99040j093592q97266L46630J159458
40290I896721Q05178N27566P86010J4871j966267k290084M28874K738573J208340
40281A2149782j713071j167808K366303L816459J433181j153879j195996k46914
40273A4288057j22329J45009J497769K619191K368620J545395Q73991L2149m75578
40264B2772274L68090J370040M78516p63463J088415M544954M215755M96079N99882
40255C5170542N653066N003574q534097k4111090k4449520r311803M126111M689629
40247a1763588m77740l98498L763277M326086Q70410o89795J140937K256920J170988
$$ y = [10029969, 8479485, 8490077, 10317067, 12469867, 12870186, 11146275, 9375728, 9830161, 12191359, 13945686, 13571436, 12104560, 11080531, 10381491, 9287899, 8390633, 8737263, 9896721, 10701899, 11229465, 12015475, 12030346, 10064079, 7773995, 8202869, 10941442, 12149782, 10436711, 9268903, 11635206, 15451665, 16884846, 15730967, 14534971, 14288057, 14165728, 14310737, 15808506, 18427697, 20796317, 22341712, 23215703, 23247852, 22772274, 23140364, 24510404, 24988920, 24225457, 25313872, 29858826, 34074581, 34570660, 35170542, 40823608, 45827182, 37293085, 13181995, -11267525, -20579328, -16453217, -11763588, -12241328, -12639826, -8876549, -4550463, -3680053, -4369848, -3228911, -971991, 198997]
40238A98997R50438K759900L718880K222733K74675o84905j703252k776645j843515
40229C117306R33822K091393K86607j102351N88415K963309K801608J273472J185845
40220A4139426J841906Q80022q74630q71287L06187R1889r70889Q737K686978
40211A7238339L396522J126257q55083l84999O75939L55445l34440p4507J36675
40202B1280148q94950k181749k093284n24353J529331K854878K137409o35790
40194B1471640k811862j725579J309255K618736J538813O00639O38986J43330
40186B3783958l72241J498746M652896M683379J104840j305677o91104j622839
40178C1731958o890408j1481345r596797l256939J205575J881098J561049J860810
$$ y = [198997, 1149435, 3909335, 7628215, 9850948, 10125623, 9440718, 7737466, 4960821, 3117306, 4051128, 6142521, 6429128, 5326777, 5915192, 8878501, 11680109, 12953581, 14139426, 15981332, 16861354, 15986724, 15115437, 15421624, 15513513, 14542624, 14551361, 17238339, 20634861, 21761118, 20906035, 20521036, 21196975, 21552420, 21217980, 21143473, 21280148, 20385198, 18203449, 16110165, 15585812, 17115143, 19970021, 22107430, 21471640, 18659778, 16934199, 18243454, 20862190, 22401003, 23001642, 23640628, 23783958, 23411717, 24910463, 29563359, 34246738, 35351578, 34045901, 33354797, 31731958, 24841550, 13360205, 3763408, 506469, 1712044, 3593142, 5154191, 7015001]
40170G015001J828254R63715m0188o03020k32043J156721J908028M55776j035064
40161A1417180R26040M596096M487264N28852j066663J819250L595660R86572
40153B7290251j357978K57675K061469N61825r07522P23011K176567R07180N54115
40144C2266593L181842M312213J962436J407754M314215L898092j408041j991483
40136D7943621N636791R543046K578870l028195L469840J1246077P202752R1375
40128H4684177L485072R807073O812964M576746J5714102K4484464J3309989M718712
40120A67593299K6482231M2984784j3215450j27906079j90697949j31048601j4399329
40113b40207094M6030832L0002725M813828J0890637K2551210J5162810M948157
$$ y = [7015001, 8843255, 9806970, 9766782, 9163762, 8931719, 10088440, 11996468, 12452244, 11417180, 12343220, 16939316, 21426580, 21955432, 20888769, 22708019, 26303679, 27290251, 25932273, 26189948, 28251417, 28813242, 27905720, 28628731, 30805298, 31712478, 32266593, 35448435, 39760648, 41723084, 43130838, 47445053, 51343145, 49935104, 47943621, 53580412, 63123458, 65702328, 62674133, 66143973, 77390050, 84592802, 84684177, 88169249, 97976322, 104789286, 109366032, 125080134, 149564598, 162874587, 167593299, 194075530, 237060314, 223844864, 95938785, -94759164, -225807765, -240207094, -194176262, -164173537, -159359709, -148469072, -125917862, -110755052, -105806895]
40106a05806895Q430918J2609444N571782j84925N620290J0639787M209935k639280
40098f1548944J389970P646761N099154l41135K87483K136789j228869l398510
40090d9957301K025295P058867K858380l587742j319919N388957M753222k626028
40082c5406269o053257k333843J865468K409841J465729P57956J1087M32174K629322
40073c4221792L383013N48910k049487m53894K518061K213710M8625J56148J804928
40064b6051778J588719J6585k50029J60511n09492m73574K277590M797627L271215
40055a5172626k21910r72004N77533M19992j430072j311421R63099J561313n35970
40046a6122066j661976M19659K966454K570135q9459j685417p47760P95225K08063
$$ y = [-105806895, -97375977, -84766533, -79194751, -79379676, -73759386, -63119599, -58909664, -61548944, -60158974, -52512213, -47413059, -47754194, -47466711, -45329922, -46558791, -49957301, -47932006, -40873139, -38014759, -41602501, -42922420, -37533463, -32780241, -35406269, -41459526, -43793369, -41927901, -39518060, -38052331, -37294375, -37283288, -36851114, -34221792, -30838779, -30289869, -32339356, -32793250, -30275189, -28061479, -28012854, -27856706, -26051778, -24463059, -24446474, -24696503, -24535992, -25045484, -25519058, -23241468, -18443841, -15172626, -15394536, -16366540, -15789007, -15369015, -16799087, -18110508, -17147409, -15586096, -16122066, -17784042, -17364383, -14397929, -11827794, -11917253, -13602670, -14350430, -13555205, -13347142]
40037a3347142k541944m387419k863343N55058K404325J795138O40640n0876q93583
40028a8689146j319416J52502K396684K344767k8308j360050m69288N7635q70947
40019a7785567p18917J505675K595433M73696j914855j217380J246884K150330
40011a3664701J016021m24907j182382r15204O26467K118857J302295j267111
40003a2390665k131313j08029J846991J494808K78829k36986q37994j682547j132448
39994a4899354L94446l7319k289748k188967J153929K695804k12900k695193m42172
39985a8521474K579776P57570l326644k924336J851734M426968K018884j274092
39977a4411614j660708j31571J029276J501696J533762P72151m65557j129727
$$ y = [-13347142, -15889086, -20276505, -23139848, -22584790, -20180465, -18385327, -17744687, -17795563, -18689146, -20008562, -19856060, -17459376, -15114609, -15142917, -16502967, -16972255, -16914620, -17785567, -18504484, -16998809, -14403376, -13929680, -15844535, -17061915, -15815031, -13664701, -12648680, -13073587, -14255969, -15171173, -14544706, -12425849, -11123554, -12390665, -14521978, -14630007, -12783016, -11288208, -11009379, -11246365, -12084359, -13766906, -14899354, -14504908, -14542227, -16831975, -19020942, -17867013, -15171209, -15384109, -18079302, -18521474, -15941698, -15184128, -18510772, -21435108, -19583374, -15156406, -13137522, -14411614, -16072322, -16203893, -15174617, -13672921, -12139159, -11367008, -11832565, -12962292]
39969a2962292j064770r01097n97646K34181J156813J512566J318002N14696j138825
39960a1928372k508818j681828P41272J718573N12379M5514J704055K607510O72534
39951h117181j472924r52349N95239M46827l75193K36309J089321K70433p34656
39942i014174P7187R34911n04974k284590j381088O47041N10794n78832O84300
39933a0909425K857819J634649k304330l734417j233882J066164Q04217M97693
39925a1321512J764784K009579m81997k611299r02422L065657M709636K280454
39917a487120j625536l483267k280033L5216Q96363j907o50099J24443R15260
39908g556680K95051o58905l17402O14400M62224m97359q49375n49084k88029
$$ y = [-12962292, -14027062, -14928159, -15525805, -15291624, -14134811, -12622245, -11304243, -10789547, -11928372, -14437190, -16119018, -15377746, -13659173, -13146794, -13101280, -11397225, -8789715, -8117181, -9590105, -10542454, -9947215, -9500388, -9875581, -9639272, -8549951, -8279518, -9014174, -8936987, -8002076, -8507050, -10791640, -12172728, -11525687, -11014893, -11593725, -10909425, -8051606, -6416957, -8721287, -12455704, -13689586, -12623422, -11819205, -11321512, -9556728, -7547149, -8029146, -10640445, -11542867, -8477210, -3767574, -1487120, -3112656, -6595923, -8875956, -8840740, -7944377, -7946284, -8596383, -8471940, -7556680, -7261629, -7920534, -8237936, -7623536, -7161312, -7658671, -8508046, -9057130, -9345159]
39899i345159L38165J621373K101964O87915j007212j054339l71008p07574j219921
39890h955796k66860J017890N27685q19422o30999N65249L76748r05470q49051
39881i940026N78554J035941J54101m6102Q87210J206713N28381M48904J150997
39872c995327P20949j431667l260466k854125m06813K618899M350076L174173
39864a084301j93242k282367j009008J079089N95782j298686j021397J329833
39856c884297K338244R64500n50299j132865j832558k410076j371697L89093K92373
39847g197582j244048j108986J055126K093778P58919m98547j84672Q2742o20292
39838f863562p12029L36528N44477p52345j296724N3783J185873N48653k01633
$$ y = [-9345159, -9006994, -7385621, -5283657, -4595742, -5602954, -6657293, -7028301, -7735875, -8955796, -9222656, -8204766, -7677081, -8496503, -9127502, -8562253, -8185505, -9090975, -9940026, -9361472, -8325531, -8171430, -8217532, -7330322, -6123609, -5595228, -5146324, -3995327, -3274378, -4706045, -7966511, -10820636, -11227449, -8608550, -4258474, -1084301, -1277543, -3559910, -4568918, -3489829, -2894047, -4192733, -5214130, -3884297, -1546053, -581553, -1131852, -2264717, -4097275, -6507351, -7879048, -7489955, -7197582, -8441630, -9550616, -8495490, -6401712, -5642793, -6141340, -6326012, -6243270, -6863562, -7575591, -7239063, -6694586, -7446931, -8743655, -8689872, -7503999, -6955346, -7156979]
39829g156979N58795J580539J309166O07470P42821R37294k8943j580273k328175
39820e358285j783590j82607J697466K182433L65988j682333j064936J385926
39812d439938J867321o42841k922644k605246j037102J36592J392763K655976
39804e595119K008443o60690k105439l71675J935591J633273l99942j231950l14392
39795e101900P01045Q25305J44040j087420j933280j014793J171783K054786O19877
39786c620557q50230k95313J070671J093022j1566o55700l93019L58489J351314
39777a952889J725233J82178k504837l376750j390111P57021Q45003N50506K068153
39768c096493L775338K623073p08938k529215j401453L20008J99132j429871k622381
$$ y = [-7156979, -6598184, -5017645, -3708479, -3101009, -2358188, -1420894, -1449837, -3030110, -5358285, -7141875, -7324482, -5627016, -3444583, -3078595, -4760928, -5825864, -4439938, -2572617, -3215458, -6138102, -8743348, -9780450, -9643858, -8251095, -5595119, -3586676, -4247366, -6352805, -6724480, -4788889, -3155616, -3555558, -4787508, -5101900, -4400855, -3575550, -3431510, -4518930, -6452210, -7467003, -6295220, -4240434, -3620557, -4470787, -4766100, -3695429, -2602407, -2613973, -3269673, -3662692, -3304203, -1952889, -227656, -45478, -2550315, -5927065, -7317176, -6560155, -5715152, -5164646, -3096493, 678845, 3301918, 2592980, 63765, -1337688, -1017680, -818548, -2248419, -4870800]
39759d870800k177245n01653R64762J161225N51786L22700M69450m722q91618
39750d976115p13845N96831J138568J49669n38018M52802J642666J088706n74448
39741a733184j347071p47975K29288R01704J130067P61412O8675j83370N3791
39732h66663m6270o14676q24114n72834n93654n78839M94292J781049J152351
39723f69358r30669j386171M67352J445872j51514j509869k26879J369678K95572
39714a295986j794097j449626P29135J383170L5195p57787p3514M43116j7091
39705b797485n17322p06190j018651p71413R79953K836887K273267m33428k240254
39696b394636j572201J8506P52474P27828N46351K6870q56774j364895j059818
$$ y = [-4870800, -7048045, -7549698, -6584936, -5423711, -4871925, -4549225, -4079775, -4084497, -4976115, -5689960, -5093129, -3954561, -3804892, -4342910, -3890108, -2247442, -1158736, -1733184, -3080255, -3828230, -3598942, -2697238, -1567171, -805759, -737084, -920454, -866663, -912933, -1527609, -2351723, -2924557, -3518211, -4097050, -3602758, -1821709, -669358, -1600027, -2986198, -2518846, -1072974, -1224488, -2734357, -2961236, -1591558, -1295986, -3090083, -4539709, -3810574, -2427404, -2392209, -3149996, -3223510, -2780394, -2797485, -3314807, -4020997, -5039648, -5811061, -4831108, -1994221, 279046, -154382, -2394636, -3966837, -3948331, -3195857, -2468029, -1921678, -1894808, -2751582, -4116477, -5176295]
39687e176295l74241K11978N93473O37753L40973K15996N91364Q86345N03917
39678a568737j36022m28226o49467j088938j091320l12825J20635o48782j293555
39669g097237o6139K187985K838907J049457j283294k118963j266060J98557J171539
39660d385248J153005O28297P01673J640004K229691J261143r56642l087507l898745
39651d714329k599288M60228K932242K321057m09617j399132O35979K222981M98190
39642e1689k112532j697486R79696J963093L31860j069402n64745M67965O80671
39633a072569L96972j05244j039501j595058o88400O28222K40841j406551j631430
39624f272718K20188J742784J304089N7443o98929j360759k049549j444719Q17315
$$ y = [-5176295, -5550536, -5338558, -4745085, -4107332, -3766359, -3550363, -2958999, -2072654, -1568737, -1704759, -2132985, -2782452, -3871390, -4962710, -5275535, -5154900, -5803682, -7097237, -7163376, -4975391, -2136484, -1087027, -2370321, -4489284, -5755344, -5556787, -4385248, -3232243, -2603946, -1902273, -262269, 1967422, 3228565, 2271923, -815584, -4714329, -7313617, -6853389, -3921147, -1600090, -2009707, -3408839, -2772860, -549879, -51689, -2164221, -3861707, -2882011, -918918, -587058, -1656460, -2221205, -1753240, -1072569, -675597, -780841, -1820342, -3415400, -4103800, -3475578, -3234737, -4641288, -6272718, -6052530, -4309746, -3005657, -2948214, -3647143, -5007902, -7057451, -8502170, -7684855]
39615g684855K669873K222386L16935r00745o35601M96199J747857K388002J680318
39606B300369j02004j421677j165780J628N92259N0554q36324q44747M24543J828904
39596H27725J735753L57013j38306R37997R22019k213350n505256m382454P7311
39587g381548J819342j288356l974580j591529K657169K763956p79479k129815
39579i904840M99440K305420r9085l177477j945260K475104M657160K559369n19287
39570c149456j387731p02659l72560l36010K22798O45365K2459p37984k73219
39561f068997P41593O29086m52899r07910m05781R5028N69301J625337K305825
39552a869417J107090q09026o71122J247464J610708m46134j686659l43298P53741
$$ y = [-7684855, -5014982, -2792596, -2475661, -3376406, -4012007, -3515808, -1767951, 620051, 2300369, 2198365, 776688, -389092, -387464, 204795, 255349, -580975, -1425722, -1001179, 827725, 2563478, 2920491, 2782185, 3720182, 4642201, 2428851, -3076405, -7458859, -7381548, -5562206, -6850562, -10825142, -12416671, -9759502, -6995546, -7775025, -9904840, -9405400, -7099980, -7199065, -10376542, -12321802, -9846698, -5189538, -2630169, -3149456, -4537187, -5239846, -5612406, -5948416, -5725618, -5080253, -5057794, -5795778, -6068997, -5327404, -4698318, -5151217, -6059127, -6464908, -6369880, -5800579, -4175242, -1869417, -762327, -1571353, -2242475, -995011, 615697, 169563, -1517096, -1860394, -1106653]
39543a106653p40435k307171q76558J643776J421495r70110j775968k35147Q77083
39534d069688K38059n58051l93331L7034K78303M98425P8744j357568k151395
39525g399468q25039Q41077L51020r37953J59178K849786L264325J008529k21925
39516i10470Q01399Q35645j727910l627921j985608J314188L096511L201280K731144
39507C728258J330871r61617k054356q71511L85255k98316j443665r17169L22121
39498g80129K43110n91664m36472K97504J29060n13016l22416J09323n82632j638099
39488d085431j176349O02412J700915J235053l0606j296187j959673j251400M55223
39479e806043J204051K44371l97441O26177J066425j260202l881368k799020J048944
$$ y = [-1106653, -1847088, -4154259, -5030817, -3387041, -1965546, -2935656, -4711624, -4946771, -4069688, -3831629, -4389680, -4783011, -4745977, -4467674, -3969249, -3890505, -5248073, -7399468, -8224507, -7383430, -7032410, -7970363, -7811185, -4961399, -1697074, -688545, -910470, -109071, 726574, -1001336, -4629257, -6614865, -5300677, -2204166, 997114, 3728258, 5059129, 4097512, 2043156, 1171645, 1556900, 1258584, -185081, -1102250, -780129, -537019, -1128683, -1565155, -1267651, -1138591, -1651607, -1974023, -1864700, -2447332, -4085431, -5261780, -4659368, -2958453, -1723400, -1754006, -3050193, -5009866, -6261266, -5806043, -4601992, -4357621, -4755062, -4128885, -3062460, -4322662, -8204030, -11003050, -9954106]
39470i954106K969158J649388L63246Q25002Q51399n99474r78405R15775J910518
39461b047499m15471l151175k388969N54238J404272l53972j332375j3452J474307
39452f270096J393441M91339m37935j639526k212372k76064L203782M020286M15810
39443a311335l567260l280053J08126J752570L10031r40119Q5173J356354P51353
39434d735160m36904j08838R96884Q11123m34554p10591L64686J040157L83981
39425b829216m14800k32598J96694l24122j306320j071211P49573K236419J383164
39416a612417j056179k053106k15744J942097J166710j836656l163835j224663
39408h053793J193777J370128M55079Q70458K135921J977346K28908j141703j190986
$$ y = [-9954106, -6984948, -5335560, -4972314, -4147312, -3295913, -3895387, -4873792, -3958017, -2047499, -2462970, -5614145, -8003114, -7448876, -6044604, -6398576, -7730951, -7744403, -6270096, -4876655, -4385316, -4823251, -6462777, -8675149, -8951213, -5747431, -1727145, -1311335, -4878595, -8158648, -8050522, -6297952, -5987921, -6928040, -6842867, -5486513, -4735160, -5172064, -5280902, -4284018, -3472895, -3907449, -4618040, -4253354, -3213197, -2829216, -3244016, -3476614, -3279920, -3604042, -4910362, -5981573, -5232000, -2995581, -1612417, -2668596, -4721702, -4937446, -2995349, -1828639, -3665295, -6829130, -8053793, -6860016, -5489888, -5034809, -4164351, -2028430, -51084, 177824, -963879, -2154865]
39399b154865o83689j20509N58986P05700k87142j287719p70499N04924N91798
39390b943015k26273J10976J625525J938591J79904j600850j692093p44716K82566
39381c069385J536361K585227J938376m19410k317826k477150k022726j800641
39373f047174q18030J125520J997495P67144m27961L16202J442904P66238o40615
39364a518277n21801L47883m01092k137502j861811P02891K214888N97781k088008
39355d665048k736705r38627J477933K878678K677745J108891p61138j610215
39347b568486j174935l99655l8316N8013R3041j80799p30793r65698o79137m38859
39337g025624n19819k58871Q15635J828442J452187k04430j441084r63261M81140
$$ y = [-2154865, -2838554, -2959063, -2400077, -1694377, -1981519, -3269238, -4039737, -3534813, -2943015, -3169288, -3058312, -1432787, 505804, 685708, -915142, -2607235, -3351951, -3069385, -1533024, 1052203, 2990579, 2571169, 253343, -2223807, -4246533, -6047174, -6865204, -5739684, -3742189, -2975045, -3403006, -3086804, -1643900, -877662, -1518277, -2040078, -1692195, -2093287, -4230789, -6092600, -5389709, -3174821, -2577040, -4665048, -7401753, -8340380, -6862447, -3983769, -1306024, -197133, -958271, -2568486, -3743421, -4143076, -4181392, -4123379, -4030338, -4211137, -4941930, -5907628, -6586765, -7025624, -7545443, -7804314, -6988679, -5160237, -3708050, -3912480, -5353564, -6316825, -5835685]
39328e835685R56945k80272j766994j470448P77652K851910K452382l95495l055510
39319e765515k808213R2521K408267J700581m96237q13543R95169J711343j39713
39310c115340j744494n86948J292274P46765j063554p82030J098298J059473j039163
39301d134719j523427N48818J649812J64932p18596Q69464J525679j419532m336414
39292g373983k670123J400238K228502m34496j667597L32837J980349Q44432p83725
39283f143566n09616L24296k29655j041657p7109J891059K415772J120294K2382
39274b227800M02120J100638L79957j465227k264215q81487R03122O14437j212854
39265d651309j550354M95859K041527Q22450j217515j093844M86266O09601r16694
$$ y = [-5835685, -4878740, -5159012, -6926006, -8396454, -7618802, -4766892, -2314510, -2710005, -5765515, -8573728, -8481207, -6072940, -4372359, -4868596, -5682139, -4686970, -2975627, -3115340, -4859834, -5446782, -4154508, -3407743, -4471297, -5253327, -4155029, -3095556, -4134719, -5658146, -5109328, -3459516, -3294584, -4013180, -3143716, -1618037, -3037569, -7373983, -10044106, -8643868, -6415366, -6849862, -8517459, -8184622, -6204273, -5359841, -6143566, -6653182, -6328886, -6558541, -7600198, -7677307, -5786248, -3370476, -2250182, -2227800, -1825680, -725042, -345085, -1810312, -4074527, -4956014, -4052892, -3438455, -4651309, -6201663, -5705804, -3664277, -2841827, -4059342, -5153186, -4666920, -4057319, -4974013]
39256d974013j455055J08809J953104K253812R93670j041812k731615k475914
39248g369014p4506J816145Q78038r46533j26976K429709K274783j338193l716309
39239f172856j744173J620023K250619O43969j59340L71025N39464p3934m23972
39230c149175k29818O56K98811P36731O25234k01620n47164J82435O53832j35613
39220a765691r61321o12132k24155j055024j620130J01517K801470L276781J149740
39211A091055q36538j070381p40876j031353j349358j030977n60818k79527K91193
39202e517580J115958J283835O28590J75197L74418M13827r4699k97156K57046
39193a660564O23380M6847p55201q72295n90811m88862k51729M54399Q76182K16205
$$ y = [-4974013, -6429068, -6320259, -4367155, -2113343, -1119673, -2161485, -4893100, -7369014, -7443520, -5627375, -4749337, -5695870, -5822846, -3393137, -1118354, -2456547, -6172856, -7917029, -6297006, -4046387, -3402418, -3561758, -3190733, -2651269, -2725203, -3149175, -3378993, -3378337, -3079526, -2342795, -1717561, -1919181, -2466345, -2283910, -1630078, -1765691, -2727012, -3339144, -3563299, -4618323, -6238453, -6136936, -3335466, -58685, 1091055, 254517, -815864, -1556740, -2588093, -3937451, -4968428, -5529246, -5808773, -5517580, -4401622, -3117787, -2489197, -2314000, -1939582, -1525755, -1620454, -1917610, -1660564, -1037184, -990337, -1745538, -2617833, -3208644, -3697506, -3949235, -3494836, -2618654, -2402449]
39183b402449q95401j182712m55043N32024J365494J932595J669096L06123r76635
39174a06908p72492K14514j92342k288212l552092k004078R88553K571887J978139
39165c163031P38158P8756j85568m05272l93604j89234k10691l52928n9720M56627
39155c686507K59978o86544j159776m61703N91610J049955J001541O90156j94750
39146b596040j362455j404005K11219J756510J433403m801n39095K8431K88380
39137b188453k8843J61764Q12530M49659j077577j757375l70574J484677J580290
39128i33902o8797j751735k368724j932676o85374R19465J891257J600133P41104
39119b589249M49041P19182O09799j70205p78029m27668N49311J023574K49137
$$ y = [-2402449, -3297850, -4480562, -4935605, -4403581, -3038087, -1105492, 563604, 869727, -106908, -879400, -664886, -857228, -3145440, -6697532, -8701610, -7713057, -5141170, -3163031, -2424873, -2346117, -2531685, -2936957, -3330561, -3519795, -3730486, -4083414, -4143134, -3686507, -3426529, -4113073, -5272849, -5734552, -5142942, -4092987, -3091446, -2401290, -2596040, -3958495, -5362500, -5151281, -3394771, -1961368, -1966169, -2505264, -2476833, -2188453, -2217296, -2055532, -1243002, -793343, -1870920, -3628295, -3998869, -2514192, -933902, -1002699, -2754434, -5123158, -7055834, -7741208, -6821743, -4930486, -3330353, -2589249, -2140208, -1421026, -811227, -981432, -1759461, -2187129, -1637818, -614244, -365107]
39110c65107j231784j867124o83175J307040J924011M14870j432449j410647L42637
39101c001728J523068N01833j737615k755285j405262Q86213J679393K71245j447345
39092e485483j175263J068511L007926K817753J013579n85873j068016j011849
39084a418715j185339j344583o57769Q20003J650283O26589j273518j650665J36772
39075d296942J766713J031364r52779j361581J19297R39073k49358j474449n34235
39066e012897J587391K129029M55447j246274j067363K97627Q42585k042p82221
39057b798718j22584J365667J939334J129898J95400K1205n1105n80765p25492
39048C72840M4802L38108j051354k511901j637145O96104J207462p25304j961472
$$ y = [-365107, -1596891, -3464015, -4147190, -2840150, -916139, -501269, -1933718, -3344365, -3001728, -1478660, -976827, -2714442, -5469727, -6874989, -5988776, -4309383, -4038138, -5485483, -6660746, -5592235, -2584309, 233444, 1247023, 661150, -406866, -1418715, -2604054, -3948637, -4606406, -3786403, -2136120, -1509531, -2783049, -4433714, -4296942, -2530229, -1498865, -2451644, -3813225, -3693928, -2754855, -3004213, -4478662, -5012897, -3425506, -1296477, -841030, -2087304, -3154667, -2857040, -2014455, -2016497, -2798718, -2921302, -1555635, 383699, 1513597, 1708997, 1730202, 1679097, 1098332, 372840, 417642, 755750, -295604, -2807505, -4444650, -3748546, -2541084, -3266388, -5227860]
39039e227860m29756J808795J876876J10073j134090r80387m12876k44194l22160
39030d955579j05005Q79482K316573K527298J84881k989766l454884o79404J700247
39021d576157R67723r87312j079496L34305R03001M13636M24869J028710R50081
39012a620640J27148m24395o61890j052999q85808M86936J572766O05811j199264
39003c052335j096974R20310K151291J265211m17775j595170k156187j713797
38995e695426K16642K368851K692514J359286L21213J0735o85047j368378m55728
38986a235338J248543J007242j125881j848470m3827J211962j67690j874691j360219
38977d188369N2327Q6760m10412M66999J896988J887851Q06460K46873j9145r10929
$$ y = [-5227860, -5657616, -3848821, -1971945, -1861872, -2995962, -3976349, -4389225, -4633419, -4955579, -5060584, -4181102, -1864529, 662769, 847650, -2142116, -5597000, -6276404, -4576157, -3608434, -4595746, -5675242, -5340937, -4437936, -4024300, -3599431, -2570721, -1620640, -1493492, -1917887, -2579777, -3632776, -4518584, -4031648, -2458882, -1853071, -3052335, -4149309, -3228999, -1077708, 187503, -230272, -1825442, -3981629, -5695426, -5478784, -3109933, -417419, 941867, 1263080, 1273815, 588768, -779610, -1235338, 13205, 1020447, -105434, -1953904, -1997731, -785769, -953459, -2828150, -4188369, -4136042, -4049282, -4459694, -3992695, -2095707, -207856, 598604, 845477, 826332, -84597]
38967h4597j368779l8325J582090R99372j093569j777278n46960K28003o54385
38958b754428j757342j718204p40094P59574K449950L005586J372412p84472o87070
38949h54088J236060J625139n97066k439126j511278N09429R51644J61032J16062
38940h02192Q76181Q97785j73431j234466j636511j555389r46044K62321J307305
38931c004441J351873P54814L38148p5417r50797j409662j82063J869180K194088
38922H85723J34157j741596j057237R93974J384856l23366j312333L87986K871022
38913B223186K724007m46802l467071l575481j485573J93707M31423L94193J067903
38904a940508J759625J404964L35049j68804K50630M97191l69532j595454j519679
$$ y = [-84597, -1453376, -1491701, 90389, 1089761, -3808, -1781086, -2328046, -2100043, -2754428, -4511770, -6229974, -6970068, -6210494, -3760544, -754958, 617454, -167018, -854088, 381972, 2007111, 1410045, -1029081, -2540359, -2030930, -1079286, -918254, -802192, 73989, 971774, 798343, -436123, -2072634, -3628023, -4574067, -4311746, -3004441, -1652568, -897754, -559606, -635023, -1585820, -2995482, -3177545, -1308365, 885723, 1019880, -721716, -1778953, -784979, 599877, 276511, -1035822, -647836, 2223186, 4947193, 4500391, 1033320, -2542161, -4027734, -3834027, -3402604, -3008411, -1940508, -180883, 1224081, 1559130, 1390326, 1640956, 2138147, 1768615, 173161, -1346518]
38895a346518J24352J531558J058505m78178q53225L73633J164735L0021j684730
38886g9847j775847m43029J59633o89059j234684p4387J596277J720995L83412
38877d36536m07427L00650J113617N12332q01425r86082K7004L13286j010074
38868a374655k157869j282979N70682R81679j06603m71564N97293J144032m6099
38859b146083j312442q51943M39518O99727N6147j56235J92418M76376R78560
38850a623957J859756J592536r48801l641645l290395l43332J542141P25391o52977
38841d781283o11527L5322L8138q4888L07626M52774j21969l25650N98562J674503
38831b818392J978480J943600J656047R3606k334191k915371n32107J791216R44558
$$ y = [-1346518, -1222166, 309392, 1367897, 889719, 36494, 410127, 1574862, 1604883, -79847, -1855694, -2298723, -2139090, -2828149, -4062833, -4137220, -2540943, -819948, -436536, -843963, -543313, 570304, 1082636, 281211, -704871, -677867, -364581, -1374655, -3532524, -4815503, -4244821, -3263142, -3369745, -3841309, -3244016, -2099984, -2146083, -3458525, -4310468, -3870950, -3171223, -3115076, -3271311, -3078893, -2602517, -1623957, 235799, 1828335, 879534, -2762111, -6052506, -6395838, -4853697, -4128306, -4781283, -5392810, -5357488, -5319350, -5404238, -5096612, -4643838, -4765807, -5091457, -4492895, -2818392, -839912, 1103688, 2759735, 2853341, 519150, -2396221, -2928328, -1137112, -192554]
38822a92554j570138k121447n64049K84205j49137L64980K077704K075093p86504
38813e81847l248877k118219J149882K737507J609698j03337q06928r53991j035974
38804c352086l79453J323216K780938K472101O10413j112919j504448q79654j54948
38795a96840K82114M32047J10786o79719j180408o81884K01660K06404n60214
38786b066054o69327J82384M79415l94768n70881J361099L278107J991657j761817
38777A829815l645964j510674J700700K090662j23417j519238l50320J495501
38769c2935J370921q10116k744326k564183q05738N00059L24839k77072K49106
38760d789445J828087K818200J993071j83281k216885k933087k151441n80797
$$ y = [-192554, -1762692, -3884139, -4448188, -4163983, -4313120, -3948140, -1870436, 204657, -581847, -3830724, -5948943, -4799061, -2061554, -451856, -555193, -1362121, -2316112, -3352086, -3731539, -2408323, 372615, 2844716, 3455129, 2342210, 837762, -41892, -196840, 85274, 517321, 628107, -51612, -1232020, -1913904, -1712244, -1505840, -2066054, -2735381, -2552997, -2073582, -2468350, -3039231, -1678132, 1599975, 3591632, 1829815, -1816149, -3326823, -1626123, 464539, 341122, -1178116, -1528436, -32935, 1337986, 527870, -2216456, -4780639, -5586377, -5086318, -4761479, -5038551, -4789445, -2961358, -143158, 1849913, 1666632, -550253, -3483340, -5634781, -6215578]
38752f215578P85045J442319J556923J305997N22835o17875j204142o66916K05319
38743b886073K56781l82856o63831l42488j00390o778P13843J989383K280221
38734H57812N11182k136995l254156j785373R10227K443018J590029p04092k321828
38725c890176k000182l46181J099863J408441P56570r172Q983R10021J463471
38716e98362M18100j249165r69764J474783K593142p7201l552520k984759J110442
38707c835304L180809P31547k044427p86579K454283K595584p13795k803003r88177
38698b209062J893981J907154p86478k803571k031978M38748K201295J974129
38690E84218K73143j397895j806321r03122L06359Q76894P72384M30507j52230
$$ y = [-6215578, -5430533, -3988214, -2431291, -1125294, -602459, -1220334, -2424476, -3091392, -2886073, -2629292, -3012148, -3675979, -4018467, -4118857, -4125635, -3411792, -1422409, 857812, 1368994, -768001, -4022157, -5807530, -4897303, -2454285, -864256, -1568348, -3890176, -5890358, -6236539, -5136676, -3728235, -2971665, -2980837, -2971854, -2061833, -598362, -180262, -1429427, -2399191, -924408, 1668734, 1591533, -1960987, -4945746, -3835304, -654495, 77052, -1967375, -2753954, -299671, 2295913, 1582118, -1220885, -2209062, -315081, 1592073, 805595, -1997976, -4029954, -3591206, -1389911, 584218, 857361, -540534, -2346855, -3249977, -2943618, -2066724, -1294340, -863833, -1016063]
38681a016063j232167k257571j962584j27383J527701J251369l53209j084907
38673e254814j26323J132528J346859P54147J03468l45250k39695P06593J383776
38664e38711K14117j780489j503962J222047K397206M678k018894J85716L508249
38655A689957K338775k082657l196006M28827K999438J089827j363577m64854
38647A439730J267405P9163k323345k180732k49874J19474r80491q84588L40216
38638c373042K19588j313724j728754k45156J304448J826847J946254J773826
38630D10287O95160o67627r11484j24459N33418R07538J258724O87517j182997
38621A606077k194245m84661J811109J293101j194277j807064N3976J100728j52560
$$ y = [-1016063, -2248230, -4505801, -6468385, -6595768, -5068067, -3816698, -4169907, -5254814, -5381137, -4248609, -2901750, -2147603, -2044135, -2389385, -2629080, -1922487, -538711, -324594, -2105083, -3609045, -2386998, 10208, 14886, -2004008, -1818292, 1689957, 4028732, 1946075, -1249931, -821104, 2178334, 3268161, 1904584, 1439730, 2707135, 2786298, 462953, -1717779, -1967653, -1848179, -2828670, -3713258, -3373042, -3153454, -4467178, -6195932, -6441088, -5136640, -3309793, -1363539, 410287, 1105447, 437820, -473664, -598123, -64705, 842833, 2101557, 2789074, 1606077, -588168, -1072829, 738280, 2031381, 837104, -969960, -915984, 184744, 32184]
38612C2184j496958j511500j598243k296780j639661J070444L350555L207704
38604h82255J685020K91573r66883j646544m46610J636264J391327j399146k675937
38595c013191m92729J353486n36331l208633j995872J810300L045461P55398j018215
38586c300326p7640J145596K69829j531774j932910n60208J363127K478472J887524
38577b58310K3218j072744j17410J216087O11946j059792j039802O05840R64878
38568a26089p25827j656074j55724J537315J059713m43236p84250m12781r04587
38559b611540j593055p30396J049310J458214L42545j54997O59895R49715k46752
38550h77061j158474l00855Q27151J53646j377813j196758O01527J200732l63256
$$ y = [32184, -1464774, -2976274, -4574517, -6871297, -8510958, -7440514, -4089959, -882255, 802765, 1094338, 127455, -1519089, -1965699, -329435, 1061892, -337254, -3013191, -3505920, -2152434, -2688765, -5897398, -7893270, -6082970, -3037509, -2282111, -3300326, -3377966, -2232370, -1962541, -3494315, -5427225, -5987433, -4624306, -2145834, -258310, -235092, -1307836, -1425246, -209159, 402787, -657005, -1696807, -1090967, -126089, -851916, -2507990, -2663714, -1126399, -66686, -509922, -1294172, -1706953, -2611540, -4204595, -4934991, -3885681, -2427467, -2084922, -2239919, -1580024, -630309, -877061, -2035535, -2336390, -1509239, -1355593, -2733406, -3930164, -3328637, -2127905, -2491161]
38541b491161j366846M25385K992693K773375j60856k316317j772057k59128J68465
38532b006447k6897L98034R37168L51604j017182j756726j530406j129359q10983
38523f591194p7605J034861J732514J585427R61586L96676K38336O15412J036636
38514I32649N39179q76766j643924o59875P62299N79328q00241r86677O95569
38505a458459K064023J280089o30717j512748r19744l6874J70392m28160j506416
38496b978614k178097j310288Q92355K328120J334697r36020j884988q61440L91823
38487e202452O57652Q17101J853025K828318K135409m9385j862419k025110r62242
38478a810103K21520Q24849N00189p91802k243961k450968r84372P88548J301041
$$ y = [-2491161, -3858007, -3432622, -439929, 2333446, 2172590, -143727, -1915784, -2174912, -2006447, -2033344, -1635310, -698142, -346538, -1363720, -3120446, -4650852, -5780211, -6591194, -6668799, -5633938, -3901424, -2315997, -1354411, -957735, -719399, -103987, 932649, 1471828, 595062, -1048862, -1708737, -946438, -367110, -1167351, -2154028, -1458459, 605564, 1885653, 1254936, -257812, -1177556, -1214430, -1044038, -1472198, -2978614, -5156711, -6466999, -5574644, -3246524, -1911827, -2847847, -4732835, -5594275, -5202452, -4544800, -3727699, -1874674, 953644, 3089053, 3039668, 1177249, -847861, -1810103, -1588583, -763734, -263545, -1055347, -3299308, -5750276, -6734648, -5946100, -4645059]
38469d645059Q35140R25663J823395J902407J68858j826943j778002K70597J939165
38460c84779J554561r5971j290827j414373q54305M5829R28879J055742J57804
38451b97440p31537m46410N25363O37076l73195j075463n65972K56239K50877
38442a820462l36642o54664n95453l92341J57101R53108J025723K8402n97910
38433b233138M38234J952909J835065L77528k18308M96876O31152n71623j338713
38424A369982n24171L06465m41913j677510j497508j99626N25583J87412m96635
38415b447921j021151q57187Q45831L438847M093300J227700k601810l691133
38407a013524j958147q8700Q89344J892295K423591Q07674k040662k832083p46818
$$ y = [-4645059, -3809919, -2884256, -1060861, 841546, 1010404, -816539, -2594541, -2323944, -384779, 1169782, 1073811, -217016, -1631389, -2485694, -2439865, -1510986, -455244, -297440, -1028977, -1475387, -950024, -312948, -686143, -1761606, -2327578, -2071339, -1820462, -2157104, -2811768, -3407221, -3799562, -3642461, -2689353, -1663630, -1635228, -2233138, -1794904, 158005, 1993070, 2370598, 2152290, 2649166, 3280318, 2708695, 1369982, 845811, 1152276, 710363, -967147, -2464655, -2664281, -2138698, -1951286, -2447921, -3469072, -4326259, -3480428, -41581, 4051719, 5279419, 2677609, -1013524, -2971671, -3060371, -2171027, -278732, 2144859, 2952533, 911871, -1920212, -2667030]
38398b667030J267512J080650L3832k59428m94480j283654j216573M86097J952256
38389a100818J569463N95396N63031M08635j173473k646005j919054n1447M56586
38380c297686k54116k03922O13910N80238p5600L66960J487723R63108j203147
38371a022532k065195l02785J592538J088014q92798j818551r61740N77914J687536
38362b117599J628363j5611k291354k894617p62305K092988K737277Q40294j198256
38353a980820j404054l34947J62729n04100r84986J41491K223294K997670J456921
38344A773198o74004j226452n16298m97526j497178j788582o01513N20566K28416
38335d279373n84285n46662j22380m34904q24222L29035K603230L439125J592000
$$ y = [-2667030, -1399518, -318868, -285036, -544464, -1038944, -2322598, -3539171, -3053074, -1100818, 468645, 1064041, 1627072, 2035707, 862234, -1783771, -3702825, -3754272, -3297686, -3551802, -3755724, -3141814, -2561576, -2637176, -2270216, -782493, 180615, -1022532, -3087727, -3390512, -1797974, -709960, -1602758, -3421309, -4383049, -3805135, -2117599, -489236, -504847, -2796201, -5690818, -6453123, -4360135, -1622858, -782564, -1980820, -3384874, -3719821, -3557092, -4061192, -5046178, -4904687, -2681393, 316277, 1773198, 1099194, -127258, -643556, -1141082, -2638260, -4426842, -5028355, -4507789, -4279373, -4863658, -5410320, -5532700, -5967604, -6791826, -6462791, -3859561, -420436, 1171564]
38326A171564r53534j580460m33565K38706l60398n13812R60089K277445J010278
38317A816313j934415k934366o22130K015192J863840Q5613L939J774231K169231
38308D237448k41577k673994k159794K63261J323718J32913j100753n69312P96407
38299H317R05934o47008j998726j166620J410405K920989J429802j287845j624136
38290d8888R26979K693961Q65580k386670l047924j047518J79579o42249j065201
38281c572351K82610J080699m05720j659464J75569K961902K300015j365037k902166
38272c103943j98606K728907K067497l26155p13821M32379L4126j793534j913994
38263b787144L02999J740731N25284j191803q22171R71278J853560J120072k37423
$$ y = [1171564, 218030, -1362430, -1795995, -1557289, -1917687, -2431499, -1471410, 806035, 1816313, -118102, -3052468, -3674598, -1659406, 204434, 290047, 293986, 2068217, 4237448, 3995871, 1321877, -837917, -574656, 749062, 881975, -218778, -788090, 8317, 914251, 267243, -1731483, -2898103, -1487698, 1433291, 2863093, 1575248, -48888, 878091, 3572052, 4437632, 2050962, -996962, -2044480, -1864901, -2507150, -3572351, -3289741, -2209042, -2614762, -4274226, -4098657, -1136755, 1163260, -201777, -3103943, -3302549, -573642, 1493855, 1167700, 453879, 886258, 920384, -873150, -2787144, -2484145, -743414, -218130, -1409933, -2232104, -1260826, 592734, 1712806, 1475383]
38254A475383j329474j746078j222365j80307K67971j98228n11333J65950J238775
38245b039706J749721J525129O84443o47354j535353p63879J021583J503618P9092
38236A577294r41026L2423J177012L19129j252427q31366J132267J637261j60268
38227B690299j886186j779969q13920k64819M15799K000959L413086K806715J31690
38218F713654k447237k739680q79155O47959k92738k744806l555494j359206J631151
38209e025552K638473J673079N44871n1545n95684r13287l71816O25974J148693
38200c26794J247785J378089J081402o333p56256j67619N62124j39114j299618
38191A573666r59384K36872J14223r30543m34837J521815J946125j34943j937036
$$ y = [1475383, 145909, -1600169, -2822534, -3002841, -2734870, -2933098, -3444431, -3278481, -2039706, -289985, 1235144, 1919587, 1272233, -263120, -1026999, -5416, 1498202, 1577294, 636268, 668691, 1845703, 2164832, 912405, 81039, 1213306, 2850567, 2690299, 804113, -975856, -1789776, -2054595, -1638796, 362163, 3775249, 6581964, 6713654, 4266417, 1526737, 647582, 1295541, 1002803, -1742003, -5297497, -6656703, -5025552, -2387079, -714000, -169129, -220674, -816358, -1729645, -2101461, -1475487, -326794, 920991, 2299080, 3380482, 3374149, 2617893, 2450274, 3012398, 2873284, 1573666, 614282, 851154, 965377, 34834, -400003, 1121812, 3067937, 2932994, 995958]
38182I95958j348361J38619M74243J16048K52196M66910M2132m71079n71544p49054
38172f53932q40166L16170K271791K561773N45747r76724j4558J372187N73552
38163E155840j244615j326376M2775L57487q37513j624683j024493P8852Q83505
38154D60779J235545P66156m46802j048711k67452L61723o33167j741840p08762
38145b022531J299397J129855j095117j778484N66651K956561K466079K71725
38137C794136o26255L70786J456989J309562J98105j078207j947057k034149j296525
38128A47385j46365Q47828J196194N86821o53966j412204r41372k4511l7803r57597
38118a395590j344093l32571J350705K420637K215229R34367m00995m37720J030253
$$ y = [995958, -352403, -213784, 260459, 376507, 628703, 1095613, 1137745, 666666, 95122, -653932, -1494098, -1177928, 1093863, 3655636, 4201383, 3224659, 3210101, 4582288, 5155840, 3911225, 2584849, 2627624, 2985111, 2147598, 522915, -501578, -422726, 460779, 1696324, 2462480, 2015678, 966967, 699515, 1061238, 428071, -1313769, -2022531, -723134, 406721, -688396, -2466880, -1900229, 1056332, 3522411, 3794136, 3167881, 3538667, 4995656, 6305218, 6503323, 5425116, 3478059, 1443910, 147385, 1020, 848848, 2045042, 2631863, 1977897, 565693, -375679, -400190, -437993, -1395590, -2739683, -3072254, -1721549, 699088, 2914317, 3848684, 3447689, 3009969, 4040222]
38109D040222K302903J617542n15521k058073k181819j741988j261079l05848
38101a03661R18285J205130K14305p84059o84001J82002J019846J516654J340381
38092D824882J20737j419064j669251k62459J177759J168249J57166m98465k66268
38083C333286M85919J068268O02884j179946k772485k014681Q87785L056431K551719
38074F019180O18682p32718j432719k022778j569563P15952L077231L051909J086326
38065H811502j21024M27894J063175L99781r25865j716778j558402m64821J175680
38056G091142K204453J811680R33954Q79602R92481j64422j726836j405440N55926
38047A1172540J429734N12617K21457J631051K423300J024313n56664j91471J239313
$$ y = [4040222, 6343125, 7960667, 7445146, 5387073, 3205254, 1463266, 202187, -103661, 814624, 2019754, 2234059, 1450000, 765999, 948001, 1967847, 3484501, 4824882, 4945619, 3526555, 1857304, 1594845, 2772604, 3940853, 4098019, 3599554, 3333286, 3819205, 4887473, 5490357, 4310411, 1537926, -476755, 411030, 3467461, 6019180, 6637862, 5905144, 4472425, 2449647, 880084, 1596036, 4673267, 7725176, 8811502, 8690478, 9118372, 10181547, 10581328, 9655463, 7938685, 6380283, 5915462, 7091142, 9295595, 11107275, 12041229, 12920831, 13913312, 13748890, 12022054, 10616614, 11172540, 12602274, 13114891, 13336348, 14967399, 17390699, 18415012, 17858348, 17666877, 18906190]
38038A8906190K492237M275161O191991N356036J671870p5403J332001k058408
38030C8091675j6236026l1636687l1432018j3934343L931229Q631240N150518
38023c7434412M598867O804710M716966q34278k320641J324850L494640J595965
38015a8053333L78957K364472L622035J637003j62524Q89286J946760M41972j018969
38006g954341K20304J723060N17085j305237l59800J979451K204134P20308L89924
37997a865112J069427M87954q84274o70908O21492L27934j330307j484333J65962
37988c562165Q71599n1366q9512J545969K215239O97864k69228J397152L418322
37979F173874K854247P40180j07811J74996o08716k387632k972725k217914k554970
$$ y = [18906190, 21398427, 25673588, 31865579, 37221615, 38893485, 38818082, 40150083, 38091675, 21855649, -9781038, -41213056, -55147399, -51216170, -42584930, -37434412, -32835545, -26030835, -21313869, -22148147, -24468788, -23143938, -19649298, -18053333, -17674376, -15309904, -11687869, -10050866, -10213390, -9324104, -7377344, -6935372, -7954341, -7734037, -6010977, -5493892, -6799129, -7158929, -5179478, -2975344, -2255036, -1865112, -795685, -307731, -1192005, -1862913, -1241421, -913487, -2243794, -3728127, -3562165, -2690566, -2741932, -2831444, -1285475, 929764, 1627628, 1358400, 2755552, 6173874, 9028121, 9768301, 9660490, 9835486, 9226770, 6839138, 3866413, 1648499, -906471]
37970i06471m683640n773044l611177l10752M63811j214528j707581O91497L063477
37961a3988408K044115j171045k334504k3622K554492K196334r5372j045913K41971
37952a1621952J590056J189883j95482q10601k80230L84955M50627K82703N24939
37943h485102R81364P83425k87275j190768q60305L59607J259119J393888J156802
37934d889245N38302p58578j976793j746921k51863P18941M63992L41282J183486
37925f377397J651548N49383r22551r90102o4714K18482k39658j51565P73653
37916e552921J352193P13996o20555j338520m62521J516405K442699P73631j747272
37907b922865j841882L40945J022015j090588k158095N78664L620999K435011
$$ y = [-906471, -5590111, -11363155, -14974332, -15285084, -14821273, -16035801, -17743382, -17051885, -13988408, -11944293, -13115338, -15449842, -15473464, -12918972, -10722638, -10818010, -11863923, -11621952, -10031896, -8842013, -9037495, -9848096, -10128326, -9743371, -9292744, -9010041, -8485102, -7503738, -6720313, -7007588, -8198356, -9058661, -8699054, -7439935, -6046047, -4889245, -4350943, -5109521, -7086314, -8833235, -9085098, -8366157, -7902165, -7560883, -6377397, -4725849, -4176466, -5099017, -6089119, -6153833, -5935351, -6175009, -6326574, -5552921, -4200728, -3486732, -4107287, -5445807, -5908328, -4391923, -1949224, -1175593, -2922865, -4764747, -4423802, -3401787, -4492375, -6650470, -6071806, -2450807, -15796]
37899a5796j128603j905065J03166L86142j730078j988345Q39318K415856L84441
37890b638964j570930m52224P00260j414234l724528j464950L398673M421129
37882b745768L54763l029031j386446K556566L531180O29551k570835l014234
37874e674254j169139N27555P54941L02568L52928O67698L25714k96125M7291
37865d160823R93681O45471j125488j770815O583J682061O21349j484692j002556
37856e595229J836151L030390Q37485j665291j251893R26909J462726l62374k004006
37847b785132j433348N12951J791394J678890Q94990J07385o18794j143019j099903
37838b094586o41078l81414k21438O77724K052411K062238N5887j560650m40696
$$ y = [-15796, -1144399, -3049464, -2946298, -2560156, -4290234, -6278579, -5439261, -3023405, -2638964, -4209894, -4662118, -3961858, -5376092, -9100620, -10565570, -7166897, -2745768, -2391005, -5420036, -6806482, -4249916, -718736, -89185, -2660020, -5674254, -6843393, -6315838, -5560897, -5258329, -4905401, -4237703, -3911989, -4208114, -4160823, -3167142, -2521671, -3647159, -5417974, -5411391, -3729330, -3107981, -4592673, -5595229, -3759078, -728688, 108797, -1556494, -2808387, -1881478, -418752, -781126, -2785132, -4218480, -3705529, -1914135, -235245, 659745, 767130, 148336, -994683, -2094586, -2735664, -3117078, -3338516, -2660792, -608381, 1453857, 1509744, -50906, -491602]
37829d91602J714849J261363j607914k764998n44263J583310O36014j193020n75529
37820a981790J157736M01932k239292k486302P98772L662262K905293K58573r79926
37811A497258o02304n48012j242979j353444l86203N40160M83065j32700l38314
37802b083473J11939N26921J14413r44642j361298j62795J737349K168261L12709
37793D19384j961135k091036J26454K239606K052015J81573r20277k23726O92062
37784E14920J88374q62909m98696R76043J152806o59451j986277p58519J514168
37775d19541J934063K97464j066461q12255J30987N28495K17171n16873j311893
37766a018843j366334j44277J445641J893121J114724L29748O8829j40720k47859
$$ y = [-491602, 1223247, 2484610, 876696, -1888302, -2432565, -849255, -213241, -1406261, -1981790, -824054, -422122, -2661414, -5147716, -4348944, -686682, 2218611, 2477184, 1497258, 894954, 346942, -896037, -2249481, -2635684, -2095524, -1612459, -1745159, -2083473, -1971534, -1444613, -1330200, -2274842, -3636140, -3798935, -2061586, 106675, 419384, -1541751, -3632787, -3506333, -1266727, 785288, 966861, 46584, -177142, 514920, 703294, -159615, -658311, 317732, 1470538, 811087, -1175190, -1933709, -419541, 1514522, 1811986, 745525, -66730, 64257, 592752, 809923, 293050, -1018843, -2385177, -2529454, -1083813, 809308, 1924032, 2253780, 2322609, 2181889, 1934030]
37757A934030K62633O52814n64674k780479l147824n11141K437656K592836N30221
37748A406072p97627m32610j73522j168872k016539j080882Q29205J466678K94680
37739a673417p42486K3795J473404J129649j125201k398591p02823J916403J932720
37730a66547p46098k642050j493648J115092K565385K437772J681507M99982j101014
37721B150381k013819j307593j7537K11019l45284j96471O12659N86303m83966
37712h04308j058592m88345j8793m27050o29280K25982J027852N53794l73535
37703a992275l13158L16612J44786n44074l26693N47956K79164j266940j883830
37694e038452m70787J112005J061339M20093Q58699J502948O64174n60967K50322
$$ y = [1934030, 2196663, 2849477, 2284803, -495676, -3643500, -4154641, -1716985, 875851, 1406072, 608445, 175835, 2313, -1166559, -3183098, -4263980, -3434775, -1968097, -1673417, -2415903, -2392108, -918704, 210945, -914256, -3312847, -4015670, -2099267, -166547, -912645, -3554695, -5048343, -3933251, -1367866, 1069906, 2751413, 3251395, 2150381, 136562, -1171031, -1188568, -977549, -1322833, -1519304, -906645, -320342, -804308, -1862900, -2351245, -2370038, -2797088, -3426368, -3200386, -2172534, -1618740, -1992275, -2305433, -1988821, -1844035, -2388109, -2714802, -2166846, -1887682, -3154622, -5038452, -5509239, -4397234, -3335895, -2915802, -2057103, -554155, 110019, -450948, -200626]
37685b00626K248393J913937j158112k929615j104281R77252m52319l397704l044432
37676g147507Q29902L691489K943803N82784j077301k165291k676233j177318
37668f195672J861277K911768K84348k579922j758234J423929K688026J191982
37660a72498j00551L69820R64455L64300m98663p00369o89287n66512M82633K091764
37650A545092K352045O47225j176077j554028j180483j104630q25715K54904J166871
37641A25204P89389k90679p53712l59664K93174P06349L47364r95331j963771
37632b101677o50939K097230K738297P687k647510j890295O41879J239358j96489
37623g62459r32332l34977n1384j04086J073915K880978K820899P99405o39993
$$ y = [-200626, 2047767, 3961704, 2803592, -126023, -1230304, -253052, -705371, -4103075, -7147507, -6317605, -2626116, 317687, 900471, -176830, -2342121, -5018354, -6195672, -4334395, -1422627, -1138279, -3718201, -5476435, -4052506, -1364480, -172498, -273049, 96771, 1061226, 1425526, 926863, 226494, -462793, -1029305, -546672, 1545092, 3897137, 4544362, 3368285, 1814257, 633774, -470856, -1296571, -1041667, 125204, 914593, 623914, -129798, -489462, -196288, 510061, 857425, -137906, -2101677, -2752616, -655386, 2082911, 2090598, -556912, -2447207, -1805328, -565970, -762459, -1694791, -2029768, -2081152, -2185238, -1111323, 1769655, 4590554, 5389959, 4749966]
37614D749966p50626j339660k485248j732451J160714K829243J470309m62402
37606C439845p44439o53224j372361j145745Q87855J804297m33691k726735j387679
37597b331877J905388L071059K017403J397686J180437m17688k218539j684543
37589B919326j57549r84919l047759j973816K136764M159365J997681n57249m99942
37580C991902L49348o3992o07608m34271r39546j871540n48679K425489K214595
37571D515698k055846m033450J55803M599538K349158l221002l550161J615411
37563C75149M342924J197499k492345k020562M04058J028660J61964m77197j199947
37554A320203k171273j660444P66385K525066J891926O28341N75209O66480l53224
$$ y = [4749966, 3999340, 2659680, 174432, -1558019, -397305, 2431938, 3902247, 3439845, 2695406, 2042182, 669821, -475924, 411931, 2216228, 1782537, -944198, -2331877, -426489, 2644570, 4661973, 6059659, 7240096, 6822408, 4603869, 2919326, 2761777, 1776858, -1270901, -3244717, -1107953, 3051412, 5049093, 4491844, 3991902, 4341250, 4277258, 3669650, 3235379, 2295833, 424293, -124386, 2301103, 4515698, 2459852, -1573598, -1417795, 3181743, 5530901, 2309899, -1240262, 375149, 4718073, 5915572, 3423227, 1402665, 1806723, 2835383, 2997347, 2520150, 1320203, -851070, -2511514, -1745129, 779937, 2671863, 3300204, 3875413, 4541893, 4188669]
37545D188669j171967m35785N54115K44120m15917j44510L2703j023119j876665
37536d8356q47241Q72060J263541Q68491J211237J603299O94388l79945J77186
37527E414660J240059O58660m89459L64913K176727J531852j192269j871464M62049
37518H295728J826685Q4120j410571K76562K505813J577644j101210j709040l46878
37509I998853l2715r29092l95613J708710K440748R29722j06293Q61720J631246
37500A6107286K65924j500657j126277P38778J438691K1314k211214l713762l605534
37491F414549j685004Q58835J782406L96107j164656q07641N73360R20345N61359
$$ y = [4188669, 3016702, 2580917, 3135032, 3379152, 2963235, 2818725, 2851428, 1828309, -48356, -895597, -23537, 1240004, 2108495, 3319732, 4923031, 5617419, 5237474, 5414660, 6654719, 7313379, 6823920, 7188833, 9365560, 10897412, 9705143, 7833679, 8295728, 10122413, 10206533, 8795962, 9072524, 11578337, 13155981, 12054771, 10345731, 9998853, 9966138, 9037046, 8641433, 10350143, 12790891, 13720613, 13614320, 14476040, 16107286, 16373210, 14872553, 13746276, 14485054, 15923745, 15945059, 13733845, 10020083, 6414549, 4729545, 5588380, 7370786, 7766893, 6602237, 5794596, 6367956, 7288301, 7849660]
$$ [...]
##END NTUPLES=NMR SPECTRUM
##END=
