##TITLE=31Pdec_LR-729-B-R4-1
 , 124 sc
 11.11.2021
##JCAMPDX= 6.0         $$ Bruker NMR JCAMP-DX V2.0
##DATA TYPE= NMR SPECTRUM
##DATA CLASS= NTUPLES
##ORIGIN= UXNMR, Bruker Analytische Messtechnik GmbH
##OWNER= root
$$ XWIN-NMR		Version 3.5
$$ Thu Nov 11 11:31:44 2021 Russian Standard Time (UT+4h)  she@DPX200
##.OBSERVE FREQUENCY= 81.013821
##.OBSERVE NUCLEUS= ^31P
##.ACQUISITION MODE= SIMULTANEOUS
##.ACQUISITION SCHEME= undefined
##.AVERAGES= 124
##.DIGITISER RES= 16
##SPECTROMETER/DATA SYSTEM= spect
##.PULSE SEQUENCE= zgpg30
##.SOLVENT NAME= Acetone
##.SHIFT REFERENCE= (INTERNAL, Acetone, 0, 248.564)
##AUDIT TRAIL= $$ (NUMBER, WHEN, WHO, WHERE, WHAT)
$$ ##TITLE= Audit trail, XWIN-NMR		Version 3.5
$$ ##JCAMPDX= 5.01
$$ ##ORIGIN= Bruker BioSpin GmbH
$$ ##OWNER= she
$$ F:/spectra/data/she/nmr/P31/1/pdata/1/auditp.txt
$$ ##AUDIT TRAIL=  $$ (NUMBER, WHEN, WHO, WHERE, WHAT)
(   1,<2021-11-11 11:30:44.96 +0400>,<she>,<DPX200>,
      <continue with go, POWCHK disabled, PULCHK disabled
       configuration hash MD5:
       00 E9 B6 7A A2 85 ED C7 34 08 36 98 17 FE 4E 26
       data hash MD5: 32K
       58 97 90 F9 6B C7 82 2C 89 44 35 8F 35 B0 F8 0B>)
(   2,<2021-11-11 11:30:48.18 +0400>,<she>,<DPX200>,
      <Start of raw data processing
       efp BC_mod = 2 LB = 1 FT_mod = 6 PKNL = 1 PHC0 = -8820.227 PHC1 = 77.86938 SI = 64K 
       data hash MD5: 64K
       44 5B 4F 03 48 21 34 28 5D 11 AE 7E ED EC 68 FC>)
(   3,<2021-11-11 11:31:04.12 +0400>,<she>,<DPX200>,
      <pk PHC0 = 4.859474 PHC1 = -4.2 
       data hash MD5: 64K
       2C 6E 2A D0 7C CF 28 6F 51 45 3A A0 D4 E6 B1 1E>)
$$ ##END=
$$ 
$$ hash MD5
$$ 8E DB 71 D9 9C 8A A8 B0 95 75 CE C6 55 AC 45 A4
##$RELAX= 
##$RELAX= 
##$RELAX= 
##$RELAX= 
##$RELAX= 
##$RELAX= 
##$RELAX= 
##$RELAX= 
$$ Bruker specific parameters
$$ --------------------------
##$DU= <F:/spectra>
##$EXPNO= 1
##$NAME= <P31>
##$PROCNO= 1
##$TYPE= <nmr>
##$USER= <she>
##$AMP= (0..31)
100 100 100 100 100 100 100 100 100 100 100 100 100 100 100 100 100 100 
100 100 100 100 100 100 100 100 100 100 100 100 100 100 
##$AQSEQ= 0
##$AQ_mod= 1
##$AUNM= <au_zg>
##$AUTOPOS= <>
##$BF1= 81.014009
##$BF2= 200.13
##$BF3= 200.13
##$BF4= 200.13
##$BF5= 200.13
##$BF6= 200.13
##$BF7= 200.13
##$BF8= 200.13
##$BYTORDA= 1
##$CFDGTYP= 0
##$CFRGTYP= 5
##$CHEMSTR= <none>
##$CNST= (0..31)
1 1 145 1 1 1 1 1 1 1 1 1 1 1 1 1 1 1 1 1 1 1 1 1 1 1 1 1 1 1 1 1 
##$CPDPRG= <waltz16>
##$CPDPRG1= <>
##$CPDPRG2= <waltz16>
##$CPDPRG3= <>
##$CPDPRG4= <mlev>
##$CPDPRG5= <mlev>
##$CPDPRG6= <mlev>
##$CPDPRG7= <mlev>
##$CPDPRG8= <mlev>
##$CPDPRGB= <>
##$CPDPRGT= <>
##$D= (0..31)
0 1 0 0 0 0 0 0 0 0 0 0.03 2e-05 3e-06 0 0 0 0 0 0 0 0 0 0 0 0 0 0 0 0 
0 0 
##$DATE= 1636615639
##$DBL= (0..7)
120 120 120 11 120 120 24 19 
##$DBP= (0..7)
150 150 150 150 150 150 150 150 
##$DBP07= 0
##$DBPNAM0= <>
##$DBPNAM1= <>
##$DBPNAM2= <>
##$DBPNAM3= <>
##$DBPNAM4= <>
##$DBPNAM5= <>
##$DBPNAM6= <>
##$DBPNAM7= <>
##$DBPOAL= (0..7)
0.5 0.5 0.5 0.5 0.5 0.5 0.5 0.5 
##$DBPOFFS= (0..7)
$$ [...]
##$SUBNAM2= <"">
##$SUBNAM3= <"">
##$SUBNAM4= <"">
##$SUBNAM5= <"">
##$SUBNAM6= <"">
##$SUBNAM7= <"">
##$SUBNAM8= <"">
##$SUBNAM9= <"">
##$SW= 501.771253377433
##$SWIBOX= (0..15)
0 1 3 0 0 0 0 0 0 0 0 0 0 0 0 0 
##$SW_h= 40650.406504065
##$TD= 32768
##$TD0= 1
##$TE= 0
##$TE2= 300
##$TE3= 300
##$TEG= 300
##$TL= (0..7)
0 120 53 12 22 120 120 120 
##$TP= (0..7)
150 150 150 150 150 150 150 150 
##$TP07= 0
##$TPNAME0= <>
##$TPNAME1= <>
##$TPNAME2= <>
##$TPNAME3= <>
##$TPNAME4= <>
##$TPNAME5= <>
##$TPNAME6= <>
##$TPNAME7= <>
##$TPOAL= (0..7)
0.5 0.5 0.5 0.5 0.5 0.5 0.5 0.5 
##$TPOFFS= (0..7)
0 0 0 0 0 0 0 0 
##$TUNHIN= 0
##$TUNHOUT= 0
##$TUNXOUT= 0
##$USERA1= <user>
##$USERA2= <user>
##$USERA3= <user>
##$USERA4= <user>
##$USERA5= <user>
##$V9= 5
##$VALIST= <valist>
##$VCLIST= <CCCCCCCCCCCCCCC>
##$VD= 0
##$VDLIST= <DDDDDDDDDDDDDDD>
##$VPLIST= <PPPPPPPPPPPPPPP>
##$VTLIST= <TTTTTTTTTTTTTTT>
##$WBST= 1024
##$WBSW= 4
##$XGAIN= (0..3)
0 0 0 0 
##$XL= 0
##$YL= 0
##$YMAX_a= 8701
##$YMIN_a= -17142
##$ZGOPTNS= <>
##$ZL1= 120
##$ZL2= 120
##$ZL3= 120
##$ZL4= 120
##$ABSF1= 0
##$ABSF2= 0
##$ABSG= 0
##$ABSL= 0
##$ALPHA= 0
##$AQORDER= 0
##$ASSFAC= 0
##$ASSFACI= 0
##$ASSFACX= 0
##$ASSWID= 0
##$AUNMP= <proc_1d>
##$AZFE= 0.1
##$AZFW= 0.5
##$BCFW= 0
##$BC_mod= 2
##$BYTORDP= 0
##$COROFFS= 0
##$CY= -3
##$DATMOD= 1
##$DC= 0
##$DFILT= <>
##$DTYPP= 0
##$F1P= 0
##$F2P= 0
##$FCOR= 1
##$FTSIZE= 65536
##$FT_mod= 6
##$GAMMA= 0
##$GB= 0
##$INTBC= 1
##$INTSCL= 5.30512e-09
##$ISEN= 30
##$LB= 1
##$LEV0= 0
##$LPBIN= 0
##$MAXI= 10000
##$MC2= 0
##$MEAN= 0
##$ME_mod= 0
##$MI= 50
##$NCOEF= 0
##$NC_proc= -6
##$NLEV= 6
##$NOISF1= 182.463
##$NOISF2= 159.3651
##$NSP= 0
##$NTH_PI= 0
##$NZP= 0
##$OFFSET= 248.5645
##$PC= 4
##$PHC0= -8815.367
##$PHC1= 73.66938
##$PH_mod= 1
##$PKNL= yes
##$PPARMOD= 0
##$PSCAL= 0
##$PSIGN= 0
##$REVERSE= no
##$SF= 81.014009
##$SI= 65536
##$SIGF1= 159.3651
##$SIGF2= -187.1042
##$SINO= 113.3802
##$SIOLD= 16384
##$SREGLST= <1H.CDCl3>
##$SSB= 0
##$STSI= 65536
##$STSR= 0
##$SW_p= 40650.406504065
##$SYMM= 0
##$S_DEV= 0
##$TDeff= 32768
##$TDoff= 0
##$TI= <>
##$TILT= no
##$TM1= 0
##$TM2= 0
##$TOPLEV= 0
##$USERP1= <user>
##$USERP2= <user>
##$USERP3= <user>
##$USERP4= <user>
##$USERP5= <user>
##$WDW= 1
##$XDIM= 65536
##$YMAX_p= 514346024
##$YMIN_p= -70571228
$$ End of Bruker specific parameters
$$ ---------------------------------
##NTUPLES= NMR SPECTRUM
##VAR_NAME=  FREQUENCY,     SPECTRUM/REAL,   SPECTRUM/IMAG
##SYMBOL=    X,             R,               I
##VAR_TYPE=  INDEPENDENT,   DEPENDENT,       DEPENDENT
##VAR_FORM=  AFFN,          ASDF,            ASDF
##VAR_DIM=   65536,         65536,           65536
##UNITS=     HZ,            ARBITRARY UNITS, ARBITRARY UNITS
##FACTOR=    0.620285442955139, 1,           1
##FIRST=     20137.2065510759, 0,            0
##LAST=      -20513.1999529892, 0,           0
##MIN=       -20513.1999529892, -70571228,   0
##MAX=       20137.2065510759, 514346024,    0
$$ Real data points
##PAGE= N=1
##DATA TABLE= (X++(R..R)), XYDATA
$$ [...]
39354H367542q63869k093957j355596m75720q28740j239586j26231J595578J525748
39345D505169o51190k431377j754000N55686K384804K874244K214901M41385j832574
39336F307048k743069j369392L73747L46458l11729Q38623K847462K336232q04854
39327G820526k652836j179199Q39110M95929j105947j528225p77611k90J020569
39318B932026K581925L416807K541863P76875j212484l778414n586231l627536
39310a955169J509159M258067J577846j873682n70930L349893M000939J337998
39302A1634121O9765N74856j418498n780479o386791j012419L946359K604314
39294D231228j798547k212628J879323M589620K414920j728034l202225j093411
$$ plain form
39354 8367542 7503673 5409716 4054120 3578400 2749660 1510074 1383843 2979421 4505169
39345 4505169 3853979 1422602 -331398 224288 2609092 5483336 7698237 8139622 6307048
39336 6307048 3563979 2194587 2568334 2914792 2603063 3441686 6289148 8625380 7820526
39327 7820526 5167690 3988491 4827601 5323530 4217583 2689358 1911747 1911457 2932026
39318 2932026 5513951 8930758 11472621 12249496 11037012 7258598 1672367 -1955169
39310 -1955169 -446010 3812057 5389903 3516221 2945291 6295184 10296123 11634121
39302 11634121 11703886 12278742 10860244 5079765 -1307026 -2319445 1626914 4231228
39294 4231228 2432681 220053 2099376 6688996 9103916 7375882 4173657 3080246
39286C080246J767690K431009P37341r40857p45213L64191L35553o20980n05809
39277E903171Q05162J098227l56760j346411l36618J085912J061224K88520J5008
39268H217435m85914j972756k779607j212913J049072J126056l73877k54275J796490
39259E109711K233978p41073l728890k537228J859977M500908K991442K05654
39251I894479k26561J130295J024705j128143k106192K76414L465805L196926
39243A5527728r13423m936218n485458k994594M804J849434K186838J153499m94572
39234E898038j307025n19366P59648O88197r98885k485686j893846M94389K393977
39225C029441K059560L12058o29624j11315M13788L3114j69917O47735J163315
$$ plain form
39286 3080246 4847936 7278945 8016286 7075429 6330216 6694407 7029960 6408980 5903171
39277 5903171 6708333 7806560 7449800 6103389 5766771 6852683 7913907 8202427 8217435
39268 8217435 7731521 5758765 2979158 1766245 2815317 3941373 3567496 3313221 5109711
39259 5109711 7343689 6602616 2873726 336498 2196475 6697383 9688825 9894479
39251 9894479 9667918 10798213 11822918 10694775 8588583 8864997 12330802 15527728
39243 15527728 14614305 9678087 4192629 1198035 1202839 3052273 5239111 6392610 5898038
39234 5898038 4591013 4071647 4831295 5519492 4520607 2034921 141075 635464 3029441
39225 3029441 5089001 5401059 4771435 4660120 5073908 5107022 4937105 5584840 6748155
39216F748155M4396j382637j008293M47079M05119j421867k724275k436850j881296
39207c210469j598718j87761K485080L803643J999728r40303j902675n33482J218028
39198A133071J949484J546857M06207n54462l08841O33142M47867j055887j702887
39189B494551n38939L38825l99138m74923J859533L505128Q44315l343933k886941
39180A398478K046126M280956L71456l882131k236433K574379L460694j76161
39172G837364k428910n79191J555986Q37078m75834K16145Q81162j177836l788396
39163B877568k924279O35550K330535P99041o96059p9334O76416k08830j100711
39154B309897j12511J544652J814887J053867O15336K34175o41666p37251J010284
$$ plain form
39216 6748155 6792551 5409914 4401621 4848700 5253819 3831952 1107677 -1329173 -3210469
39207 -3210469 -4809187 -4996948 -2511868 1291775 3291503 2351200 448525 -84957 1133071
39198 1133071 3082555 4629412 5035619 4481157 4172316 4805458 5253325 4197438 2494551
39189 2494551 1955612 2294437 1895299 1420376 3279909 6785037 7629352 4285419 1398478
39180 1398478 3444604 7725560 8097016 4214885 1978452 4552831 8013525 7837364
39172 7837364 5408454 4829263 6385249 7222327 6746493 6962638 7843800 6665964 2877568
39163 2877568 -46711 588839 2919374 3718415 3022356 2943022 3619438 3410608 2309897
39154 2309897 2197386 3742038 5556925 6610792 7226128 7460303 6818637 6081386 7091670
39145G091670K728442J924299m31750j150140L87780J643276R99082l54717q60756
39136A1977186n24109j4159K37108j34391q73101p16116O99512J365177l66344
39127A1650763k532859k029099L82212J074249o35402j618223l54270Q17785P0267
39118F825423j063801q73286j23687K64898J033896K237571K151927L95118r52067
39109I895992j113446j967403l593812k673742J597112M289172J698567k254416
39101E878024j794905J597473J939887j351209l036161j091427N63775n40770
39093B164687j492806J79592J943107P80896j586389j544295R31243K889288K801627
39084G066950J529757K4367j514440k720948l047085k378569q26811J327491K921736
$$ plain form
39145 7091670 9820112 11744411 11312661 10162521 10550301 12193577 13192659 12837942 11977186
39136 11977186 11453077 11438918 11676026 11541635 10668534 9952418 10651930 12017107 11650763
39127 11650763 9117904 7088805 7471017 8545266 7909864 6291641 5937371 6755156 6825423
39118 6825423 5761622 4888336 4764649 5029547 6063443 8301014 10452941 10848059 9895992
39109 9895992 8782546 6815143 3221331 547589 2144701 6433873 8132440 5878024
39101 5878024 4083119 5680592 7620479 6269270 3233109 2141682 2705457 2164687
39093 2164687 671881 851473 2794580 3575476 1989087 444792 1376035 4265323 7066950
39084 7066950 8596707 8621074 7106634 4385686 1338601 -1039968 -1866779 -539288 2382448
39075B382448K456655K21334j444600j017205L14253O39491j4761k13092O95767
39066D020290K075250K920358K360022J01774k669575l656085j763372J443310
39058D831972L338820K786855O27374j574460k627277k279640j340125p78273
39050B985246n28925P9122Q23211Q46988M81677J008955K110005J639024r32184
39041H513119k918145k038144J37961O38070l67530k57078J413619K040389J90526
39032G352787k014536k017908l36342P26429N76173O04600J420029J676228J65812
39023H153272k111934k898450j320546J138491K317400J509909k36097j500678
39015E051367j759565j426452j044340o02986L13615J624672K243436J124779
$$ plain form
39075 2382448 4839103 5060437 3615837 2598632 2912885 3552376 3537615 3324523 4020290
39066 4020290 6095540 9015898 11375920 11477694 8808119 5152034 3388662 4831972
39058 4831972 8170792 10957647 11585021 10010561 7383284 5103644 3763519 2985246
39050 2985246 2456321 2535443 3358654 4205642 4687319 5696274 7806279 9445303 8513119
39041 8513119 5594974 3556830 3694791 4332861 3965331 3708253 5121872 7162261 7352787
39032 7352787 5338251 3320343 2984001 3710430 4286603 4891203 6311232 7987460 8153272
39023 8153272 6041338 3142888 1822342 2960833 5278233 6788142 6552045 5051367
39015 5051367 3291802 1865350 821010 218024 531639 2156311 4399747 5524526
39007E524526j044449k078898q40814J195242J789472O76228o41007j201418j219148
38998B159734p79729L05303J253655P65304p67160j215887L19130K048479J964638
38989F053467M02091q99194r93353L4952J627683K389062P95581k152304k748824
38980D509161O43054M146124K802706k320503n118516k805302O09348P68146q03729
38971B430489p4145K452202K446737j026497l449794j457060K003710J931383
38963E257025j436158l194672j123551J300025M14570k250453k610487n3552K265454
38954a431799K342271J360664P11718J1812j042010j492433j049980q73151j106819
38945b569727r0550K343806L477612J917118M74246J683821K978837N46177l842557
$$ plain form
39007 5524526 4480077 2401179 1560365 2755607 4545079 5221307 4580300 3378882 2159734
38998 2159734 1380005 1685308 2938963 3704267 2937107 1721220 2040350 4088829 6053467
38989 6053467 6455558 5556364 4563011 4597963 6225646 8614708 9410289 7257985 4509161
38980 4509161 5152215 9298339 12101045 9780542 4662026 1856724 2466072 3234218 2430489
38971 2430489 2356344 4808546 7255283 6228786 2778992 1321932 3325642 5257025
38963 5257025 3820867 626195 -497356 802669 1217239 -1033214 -3643701 -3697253 -1431799
38954 -1431799 910472 2271136 2982854 2994666 1952656 460223 -589757 -1462908 -2569727
38945 -2569727 -2660277 -316471 3161141 5078259 5552505 7236326 10215163 10761340 6918783
38936F918783m925686k093732R4961k02505L13465K990095L787277L31095k928465
38927D285288j352432K251599K177903r92561j934837L63483J621381J89798m64223
38918F145399J420526K376239k88339l547130l140902K22478K552978K201223
38910G942472O53238o38928j292267r84188K7614K28045j113933k139157q41908
38901A840988J553041K091744M44918p95358j72952P63376K91485q52028q47094
38892D318120M99026J678875J560069N09198m98920j135561j635319j779457q87429
38883B628602O99152J144689n02715k128990q22958K683942M320200K177063q62966
38874I336019j488470m06195j03530m09015M43017J651020N49786k588023m023497
$$ plain form
38936 6918783 1993097 -100635 -5674 -208179 105286 3095381 6882658 7213753 4285288
38927 4285288 2932856 5184455 7362358 6369797 4434960 4798443 6419824 6609622 6145399
38918 6145399 7565925 9942164 9653825 6106695 2965793 3188271 5741249 7942472
38910 7942472 8595710 7956782 6664515 5680327 5707941 5935986 4822053 2682896 1840988
38901 1840988 3394029 5485773 5930691 5135333 4962381 5725757 6017242 5165214 4318120
38892 4318120 4817146 6496021 8056090 8565288 8066368 6930807 5295488 3516031 2628602
38883 2628602 3327754 4472443 3969728 1840738 1017780 3701722 8021922 10198985 9336019
38874 9336019 7847549 7441354 7337824 6928809 7371826 9022846 9572632 6984609 2961112
38865B961112j802903J311694J687499m60040j940398r32246J231534K191926
38857D248178J247807k50938p31384k69088k18166r88999j264549j44226J124357
38848B752992R22195k06270n62292j37112l59981j299439j373934r6659R87633
38839F27133P30782r282M0570P71688J251289J017550K53198m97898n41287K45914
38829C889657R84776R72285Q54672J400404J712506L93953j891770k982917k221742
38820C111824r64997j87620L81694P42067M07031j08476L11238J279935J242456
38811F215152K0873j027227j292561j114567r1738K020215L119226R30618k627024
38802F152967l139968k29581J796336P16066p37859l41968P9014r65308j323486
$$ plain form
38865 2961112 1158209 2469903 4157402 3697362 1756964 824718 2056252 4248178
38857 4248178 5495985 5245047 4513663 4244575 4026409 3037410 1772861 1628635 2752992
38848 2752992 3675187 3468917 2906625 2769513 2409532 1110093 -263841 -360500 627133
38839 627133 1357915 1348633 1389203 2160891 3412180 4429730 4682928 4185030 3643743 3889657
38829 3889657 4874433 5846718 6701390 8101794 9814300 10208253 8316483 5333566 3111824
38820 3111824 2146827 1959207 2340901 3082968 3489999 3381523 3692761 4972696 6215152
38811 6215152 6236025 5208798 3916237 2801670 2709932 4730147 7849373 8779991 6152967
38802 6152967 3012999 2783418 4579754 5295820 4557961 4215993 4295007 3329699 2006213
38793B006213M90021J825638L98703j470232r88069K99034K3079j72558J862222
38784D274051L594816J603015j890803k107126M12089J038958r04366j583524
38776D437110Q8322Q44339n34861j027288Q76158K352377J217334o18879q43710
38767F790902k43338l82865q12582n02478L81416J470504K677535K961968J179357
38758A3520419j355554j986463p37208j35282q69935j218651r92807j804633k784039
38749A635847q40125L379668M770762J332926k270849j731117O77165N31450j822343
38740E663384k934319j962673n80627O80519K142238K755076J672147N11951Q85136
38731H832832J341743m8642j900423j785491o27880j023222k489956k429999r79786
$$ plain form
38793 2006213 2496234 4321872 4720575 3250343 2262274 2561308 2584387 2411829 4274051
38784 4274051 7868867 9471882 7581079 5473953 5886042 6925000 6020634 4437110
38776 4437110 4525432 5369771 4834910 3807622 4683780 7036157 8253491 7634612 6790902
38767 6790902 6547564 6164699 5352117 4849639 5231055 6701559 9379094 12341062 13520419
38758 13520419 12164865 10178402 9441194 9305912 8435977 7217326 6224519 4419886 1635847
38749 1635847 795722 4175390 8946152 10279078 8008229 6277112 6954277 7485727 5663384
38740 5663384 2729065 766392 185765 866284 3008522 5763598 7435745 7947696 8832832
38731 8832832 10174575 10125933 8225510 6440019 5812139 4788917 2298961 -131038 -1110824
38722a110824p29197j831192j515119J034926L043748K408375M93107n40958n71702
38713F81164l62005J96356J161095J497733M90792p77877o22773J015361K344313
38704E624159J628324r16969l086223k775621l07667J824057J816843M30639m34138
38695C803404j09386N89858O79773j25263j160590j033345Q98518K966521K569112
38686I078602l07608k589771k031746k0052O25788q13404k719609l139598j212982
38677c130380K027477L856897K610106K84859r4798M96050j409116m800159m026732
38668d185796K154557O890143M604453q21468k425700m87485j31668j805115j519557
38659B272364Q47868R82719j934423l473233j296974J574255K320518J906726
$$ plain form
38722 -1110824 -1840021 -3671213 -5186332 -4151406 -1107658 1300717 1793824 1252866 681164
38713 681164 319159 515515 1676610 3174343 3665135 2887258 2264485 3279846 5624159
38704 5624159 7252483 6335514 3249291 473670 166003 1990060 3806903 4237542 3803404
38695 3803404 3694018 4283876 4963649 4838386 3677796 2644451 3542969 6509490 9078602
38686 9078602 8770994 6181223 4149477 4129425 4755213 3941809 1222200 -1917398 -3130380
38677 -3130380 -1102903 2753994 5364100 5648959 5554161 6050211 4641095 -159064 -4185796
38668 -4185796 -2031239 4858904 9463357 8641889 6216189 5728704 5597036 3791921 2272364
38659 2272364 3120232 4102951 2168528 -1304705 -2601679 -1027424 1293094 3199820
38651C199820J492366J39624k002879k571616r32477N64593P04602Q93521J397640
38642B885194M83421j298269p03940K387127L507873M32723l083796l210882j256333
38633A43118J25202J416729L131756K550091j712262n325740l584184J353590
38625a901700L605225K043117M98173P18938M33934j557441l055826k189223m5207
38616a450010J415367J607372Q87821j25246n10559O6198N47102k5300q35206
38607A577539o36316J61416M92979O78387J478714K091929J214891o35031j776244
38598D648264j595156n31659R97773K040784J105711j296697j995842M95464K971151
38589F839793J901496j077960j742186J03231Q04573r73974k563059j957605l29182
$$ plain form
38651 3199820 4692186 4831810 2828931 257315 -675162 -110569 594033 1487554 2885194
38642 2885194 3368615 2070346 1366406 3753533 7261406 7694129 4610333 1399451 143118
38633 143118 268320 1685049 4816805 7366896 5654634 328894 -3255290 -1901700
38625 -1901700 1703525 3746642 4244815 4963753 5397687 3840246 784420 -1404803 -1450010
38616 -1450010 -34643 1572729 2460550 2335304 1824745 1890943 2438045 2412745 1577539
38607 1577539 941223 1102639 1595618 2274005 3752719 5844648 7059539 6424508 4648264
38598 4648264 3053108 2521449 3519222 5560006 6665717 5369020 3373178 3868642 6839793
38589 6839793 8741289 7663329 5921143 6024374 6828947 5854973 3291914 1334309 1005127
38580A005127O93288R26538L18662j131042j752722K71558L287058L393615M5670
38571G057752k838650k354629m6903J309707J291981O93965l94459j618076j730033
38562A370655n56599L00434l6250m30412J2705M49573J39929k09455K0022L65433
38552A426035O03087J077261J235591K12084q01735K30819K116684J307114k016742
38543E390198l028728L24781L307654J286320l033921l702130k69797K392433
38535B666810J640578k85159q12239j28891N98165Q32052J23277j390370j910621
38526A333602K4221K599979K487551m64999l003461l022358j620136l87431N04209
38517a548823R25360K55733q35586m94286J415496K683299K001571P16076L05403
$$ plain form
38580 1005127 1698415 2624953 2943615 1812573 59851 331409 3618467 7012082 7057752
38571 7057752 4219102 1864473 1817570 3127277 4419258 5113223 4718764 3100688 1370655
38562 1370655 814056 1114490 1078240 647828 660533 1110106 1250035 1040580 1060602 1426035
38552 1426035 2029122 3106383 4341974 4554058 3752323 3983142 6099826 7406940 5390198
38543 5390198 2361470 2686251 5993905 7280225 4246304 544174 274377 2666810
38535 2666810 4307388 4022229 3209990 3081099 3679264 4511316 4634593 3244223 1333602
38526 1333602 1357823 3957802 6445353 5980354 2976893 -45465 -1665601 -2053032 -1548823
38517 -1548823 -623463 -367730 -1203316 -1697602 -282106 2401193 4402764 5118840 5424243
38508E424243K76686j56080l59516K03552N12480l24223j425793j734939j725741
38499F90669j831886q19271J999087M209994K791972j249503l553236k040857
38491A96969O92764J526727R35138J193636K213073J685366j023887l491787l413741
38482E14258j533890k99300n64854r11620J00454K124977L554496L141029J051269
38473G176819j179258j900285j080763l75807p26213o69887J437614M102189L958995
38464A0743404O78418j990325j305649P82936J020022k66316m96598M14854J15797
38455I696543j734540k521041q28012J372717J812432Q03464k34037r57703j363686
38446F046137q41498L55522M93670q91817j383488P66062K968821J391772k904024
$$ plain form
38508 5424243 5700929 5544849 5185333 5388885 5901365 5577142 4151349 2416410 690669
38499 690669 -1141217 -1960488 38599 4248593 7040565 5791062 2237826 196969
38491 196969 889733 2416460 3351598 4545234 6758307 8443673 7419786 3927999 514258
38482 514258 -1019632 -1318932 -1883786 -2795406 -2694952 -569975 2984521 6125550 7176819
38473 7176819 5997561 4097276 3016513 2640706 1914493 1244606 2682220 6784409 10743404
38464 10743404 11421822 9431497 8125848 8908784 9928806 9662490 9165892 9580746 9696543
38455 9696543 7962003 5440962 4612950 5985667 7798099 8601563 8367526 7409823 6046137
38446 6046137 5204639 5560161 6053831 5162014 3778526 4544588 7513409 8905181 6001157
38437F001157m589256j504317K076302J586299j360946j834173Q11819K245253
38429C432138J35336k216192j112831J779773K083146n90237k304221r20276J125882
38420A412518J163124J48199K12154Q97274M84489o09685o37815K12174J76346
38411C458778q92584j419481j078028j112168j464337m51397J913471L037290
38403A991544J514318o31424j104428n98204r22133j657111j051519Q04404J983834
38394C29281J456682K7132j109360j279890k81974J173666J503586J34894j274346
38385F79671r84047K08697L19658n20591m05746Q71333J207744l40920j736659
38376g00860q30009J551117K779605J714399m18881j802900j615035j81007J524766
$$ plain form
38437 6001157 1411901 -92416 1983886 3570185 2209239 375066 1186885 3432138
38429 3432138 3567474 1351282 238451 2018224 4101370 3511133 1206912 286636 1412518
38420 1412518 2575642 2723841 2935995 3833269 4317758 3708073 3070258 3282432 3458778
38411 3458778 2566194 1146713 68685 -1043483 -2507820 -2959217 -1045746 1991544
38403 1991544 3505862 2874438 1770010 1171806 249673 -1407438 -2458957 -1654553 329281
38394 329281 1785963 1813095 703735 -576155 -858129 315537 1819123 1954017 679671
38385 679671 -304376 -95679 223979 -296612 -702358 168975 1376719 1035799 -700860
38376 -700860 -1530869 20248 2799853 4514252 4095371 2292471 677436 496429 2021195
38367B021195K453042K037306M92814j220084j791689o58762Q35822L43126k377081
38358B135689m198315k192635K137967M336007K610997l39493j493367r78604
38350B018246m00792j39248O4351j55773n71678L76148L005482M640976K858724
38341A1696436p20027k471548j684600o58566n80118m56679j7270l25662j007037
38332C774929j95892J707468J564201j486221l700322j954306J371306J946164
38324C027327j218n00326J685816L319815J861610r53939k031940j035590J6195
38315E387750j98935j135470j532407p45647O96023J457105P43550o85610j444853
38306B541506j204206n78837K04219J195714J628685O47360q84510j115951N5385
$$ plain form
38367 2021195 4474237 6511543 7004357 5784273 3992584 3333822 4169644 4512770 2135689
38358 2135689 -2062626 -4255261 -2117294 2218713 4829710 4490217 2996850 2018246
38350 2018246 1617454 1478206 1542557 1386784 815106 1191254 4196736 8837712 11696436
38341 11696436 10976409 8504861 6820261 6161695 5581577 5124898 5107628 4781966 3774929
38332 3774929 3579037 5286505 6850706 5364485 1664163 -290143 1081163 3027327
38324 3027327 3026109 2525783 4211599 7531414 9393024 8439085 6407145 5371555 5387750
38315 5387750 5188815 4053345 2520938 1775291 2471314 3928419 4671969 3986359 2541506
38306 2541506 1337300 758463 962682 2158396 3787081 4434441 3549931 2433980 2489365
38297B489365Q40606M22178j12999j20369k66700k77377J407564M244095M715220
38288A3341583J222536k623131k621417K0931P86337j363460l155651k500448
38280C107280r00692r908N60587J040007M24894r99450j023546Q87063J974705
38271E060940J59206k614957l174405j414948M15841J165910J219635P83366N4762
38262A655350Q8872J247127J724174m7566k397451k389188j58520J472251J329397
38253B524446Q32216O30204l60443j876239j645892P14176K204651Q62988j059226
38244B826881q32788L15867l11184j884151j380688J007022J875014J13426j495047
38235B34352j045439j81047m28197l39514J309135K448928R72007j163238o70814
$$ plain form
38297 2489365 3329971 3752149 3639150 3518781 3252081 2974704 4382268 8626363 13341583
38288 13341583 14564119 11940988 9319571 9340502 10126839 8763379 5607728 3107280
38280 3107280 2206588 2196680 2757267 3797274 4222168 3222718 2199172 3086235 5060940
38271 5060940 5220146 2605189 -569216 -1984164 -1568323 -402413 817222 1600588 1655350
38262 1655350 1744222 2991349 4715523 4667957 2270506 -118682 -277202 1195049 2524446
38253 2524446 3356662 3986866 3626423 1750184 104292 818468 3023119 3886107 2826881
38244 2826881 1994093 2309960 1998776 114625 -1266063 -259041 1615973 1729399 234352
38235 234352 -811087 -992134 -1420331 -1759845 -450710 1998218 2970225 1806987 1136173
38226A136173J608072J848064o57380k439399j343604N35829O35951m38649p97309
38217H7748l40307K6666M70501J592088K906958L452755K889506J099887j761734
38208A0424068l965929l147152M8091J685026r5668k019850p46047J601619Q88009
38199D672167j960901k279989N24991J820584o22985k848957r75189K749207L439102
38190D518030M98644k368200k617926j216705n8768M21489Q58855J696074K567403
38181D298896K432395P55539j245379j644941m55912K99596k76235p04550l6336
38172C423073K21664j103335k157129o91940J944412K304635j67794k322604j637287
38163a86305Q45347K405851J769178k29505j820445j635373K05345K010486K171206
$$ plain form
38226 1136173 2744245 4592309 3934929 1495530 151926 687755 1323706 885057 87748
38217 87748 -252559 -225893 244608 1836696 4743654 8196409 11085915 12185802 10424068
38208 10424068 6458139 3310987 3359078 5044104 4948436 2928586 2182539 3784158 4672167
38199 4672167 2711266 431277 956268 2776852 2153867 -695090 -1670279 1078928 4518030
38190 4518030 5016674 2648474 30548 -1186157 -1244925 -823436 35419 1731493 4298896
38181 4298896 6731291 7486830 6241451 4596510 4140598 4440194 4163959 3459409 3423073
38172 3423073 3644737 2541402 384273 -307667 1636745 3941380 3773586 1450982 -186305
38163 -186305 659042 3064893 4834071 4604566 2784121 1148748 1354093 3364579 5535785
38154E535785Q85663l98814r33956j132269j344923j281724p06885J41712R08040
38145A672629J281973R20741j74815j324246j714983j129790J17423J437474J857425
38136B943831N65238j729209k841105j503136Q76154J766193L71216j795635k660362
38127d006815j299709J382011L076156K046705o49104j937050m54512J709673
38119a32645J921817L17512r85675p64844M81301J455864P57858j909631m191714
38110c050157k782383J782533M448706K088242j846741k318691q8045J94440k100534
38101c672630k674891M94407L872525L740814J016473j134347j467416o16112
38093d41177O36358J334603O17303p09840q04016K00972K13940r63005p96620
$$ plain form
38154 5535785 6421448 6022634 5088678 3956409 2611486 1329762 622877 764589 1672629
38145 1672629 2954602 3875343 3700528 2376282 661299 -468491 -351068 1086406 2943831
38136 2943831 3509069 1779860 -1061245 -2564381 -1688227 77966 449182 -1346453 -4006815
38127 -4006815 -5306524 -3924513 -848357 1198348 549244 -1387806 -1842318 -132645
38119 -132645 1789172 2106684 1121009 356165 837466 2293330 3051188 1141557 -3050157
38110 -3050157 -5832540 -4050007 398699 2486941 640200 -1678491 -1766536 -1572096 -3672630
38101 -3672630 -6347521 -5853114 -1980589 1760225 2776698 1642351 174935 -441177
38093 -441177 195181 1529784 2147087 1437247 633231 834203 1048143 85138 -711482
38084g11482J541974L074499J560120p28901o01481J024615R39668j153203k643022
38075B302787k298550j307107m46004O95511J643061J114534l46396m88844J032203
38066A901195J635338k48553k404420j984644J45483P71594n88494q56691J682921
38057E3729M267632L395317q0943k280555j914015j407891k167007k165762J24251
38048b175244K437551J980160j96592j072559k79969L53406N86062J487869K165513
38039E286197O76129j902982k280529k52947P59878o00015j414984M05855K547705
38030C224307K113583l5252j248782r44110j74885M81439M83554j082041l380717
38021e62904l462350k20519L302254L739850J543164p70764k219859k804023j713007
$$ plain form
38084 -711482 830492 3904991 5465111 4736210 4134729 5159344 6099012 4945809 2302787
38075 2302787 4237 -1302870 -1748874 -1053363 589698 1704232 1357836 868992 1901195
38066 1901195 3536533 3287980 883560 -1101084 -955601 -184007 -772501 -1629192 53729
38057 53729 4321361 7716678 7635735 5355180 3441165 2033274 -133733 -2299495 -2175244
38048 -2175244 262307 2242467 2045875 973316 693347 1046753 1632815 3120684 5286197
38039 5286197 5962326 4059344 1778815 1525868 2285746 1685731 270747 676602 3224307
38030 3224307 5337890 5302638 4053856 3109746 2934861 3416300 3899854 2817813 -562904
38021 -562904 -4025254 -4245773 -943519 2796331 4339495 3568731 1348872 -1455151 -3168158
38012c168158R83193K797660J969457M13112O03537J423373M82426j207149q44438
38003C453013J024639J193874p63466j814693n14313R55782N84870p17216j190391
37994B212099o40423J31215N28686K97188j78798P1428R10188N19108j535417
37985B315274k293064M97235L732760K535940k161044m330035j596034J580020
37977B81052J089740r90271n80890J913978K844903R65321j495402k451569k001142
37968d24280j214038q06333r42623j202950q92962R1515J178563K020710K591737
37959C99339K437920J150938m20694j008961r66594j605972k498054j763157N84850
37950c690385K148083J753509R46552Q50877L15128j251163j924488l54470J420155
$$ plain form
38012 -3168158 -2184965 612695 2582152 2995264 3598801 5022174 5504600 4297451 3453013
38003 3453013 4477652 5671526 4908060 3093367 2579054 3534836 4119706 3402490 2212099
37994 2212099 1571676 1702891 2231577 2528765 2349967 2421395 3331583 3850691 2315274
37985 2315274 22210 519445 4252205 6788145 4627101 297066 -1298968 281052
37977 281052 1370792 380521 -200369 1713609 4558512 5523833 4028431 1576862 -424280
37968 -424280 -1638318 -2444651 -3387274 -4590224 -5483186 -5391671 -4213108 -2192398 399339
37959 399339 2837259 3988197 3567503 2558542 1591948 -14024 -2512078 -4275235 -3690385
37950 -3690385 -1542302 211207 1157759 2008636 2323764 1072601 -851887 -1206357 213798
37941B13798P47353j631380k722914j264860J437804L496704L488261R41088k305453
37932B400401k775800M01050L413033K375861j415124l624425k920133j542338
37924c687475p42809M50440J892287J684644j27308p03013J155214K676153J251977
37915C850110j531717k372870j007499L6932n56179j511592j286308O4742J367620
37906b946761J509257L50987p32988K6681K162749K640682k09859l579492l373441
37897d152185Q6731K406125J280302p87030r21141P9028J47393k55989L73673
37888a743093J169457K90136j294357r31251J099242J687801N390j102025L8313
37879g80387J174578J69216j298103o97934J097492J528384N90769K92308J020718
$$ plain form
37941 213798 961151 -670229 -3393143 -4658003 -3220199 276505 3764766 4705854 2400401
37932 2400401 -375399 25651 3438684 5814545 4399421 774996 -2145137 -3687475
37924 -3687475 -4430284 -3979844 -2087557 -402913 -530221 -1233234 -78020 2598133 3850110
37915 3850110 2318393 -54477 -1061976 -1025044 -1581223 -3092815 -4379123 -4314381 -2946761
37906 -2946761 -1437504 -1086517 -1819505 -1792824 369925 3010607 2800748 -778744 -4152185
37897 -4152185 -4065454 -1659329 -379027 -1166057 -2087198 -2008170 -1860777 -2116766 -1743093
37888 -1743093 -573636 -283500 -1577857 -2509108 -1409866 277935 283325 -818700 -780387
37879 -780387 394191 563407 -734696 -1432630 -335138 1193246 1784015 2076323 3097041
37870C097041J432495J191538R98068N15597r28189k133403j470252q8631m81685
37861B132579k066617j799092N26215J508695k81674j887840r60017N47814K66121
37852b013816l57781Q85927K359327J130398j480505j344923J857520L720099
37844D756246J560858j855492k608312p63828Q46806R60418O04353N35349K73434
37835D309832m10583q19263n32040j30038k65147q01533j281539j539610j392912
37826b862833m45324J065098J825765R06051o71483j073709k88494n8813q82897
37817b486639r94699N80185J852362P04368j503901j691553L04540J636459R22898
37808f75980p7335J17105M41569k57550r62518m85298K50559k4173m62147L49965
$$ plain form
37870 3097041 4529536 5721074 6719142 7234739 6306550 4173147 2702895 2614264 2132579
37861 2132579 65962 -1733130 -1206915 301780 20106 -1867734 -2827751 -2279937 -2013816
37852 -2013816 -2371597 -1485670 873657 2004055 523550 -821373 1036147 4756246
37844 4756246 6317104 4461612 1853300 1089472 1936278 2896696 3501049 4036398 4309832
37835 4309832 3899249 3079986 2547946 2417908 2152761 1351228 69689 -1469921 -2862833
37826 -2862833 -3308157 -2243059 -417294 488757 -182726 -1256435 -1544929 -1603742 -2486639
37817 -2486639 -3481338 -2901153 -1048791 -344423 -1848324 -3539877 -3235337 -1598878 -675980
37808 -675980 -753315 -636210 -194641 -452191 -1414709 -1900007 -1649448 -1673621 -2135768 -1785803
37798a785803J571384J268232l03083j013137j94829O96409P88719P55123O39142
37789B422157p58418l141933l653907n62440L473197M225704J361892j350102
37781B016150j337544j89515l52296j206306n79823J195472J485937m79481k199735
37772a647141j483466O01198J669094J322258Q56481P72054M69903p3237j59774
37763B327370J12135k37303j348244j980143j166889M69337J535047J478216J050886
37754B240412J342816K379784K779271J356307r38175j797007o81622K51855p14505
37745F219136k284373k174443m37951J052769J441346J222532N41043p01330j550514
37736C328215r57340K47103L18168p25493j274002o02283O71703J977738K643077
$$ plain form
37798 -1785803 -214419 1053813 750730 -262407 -457236 239173 1027892 1783015 2422157
37789 2422157 1663739 -1478194 -5132101 -5694541 -2221344 2004360 3366252 2016150
37781 2016150 678606 489091 136795 -1069511 -1649334 -453862 1032075 552594 -1647141
37772 -1647141 -3130607 -2529409 -860315 461943 1318424 2090478 2560381 2487144 2327370
37763 2327370 2439505 2202202 853958 -1126185 -2293074 -1823737 -288690 1189526 2240412
37754 2240412 3583228 5963012 8742283 10098590 9160415 7363408 6681786 6933641 6219136
37745 6219136 3934763 1760320 1322369 2375138 3816484 5039016 5580059 4878729 3328215
37736 3328215 2370875 2617978 2936146 2210653 936651 334368 1006071 2983809 5626886
37727E626886J314977j933355l902021j796650K218347L474192J356095m73412
37719E885059k43135j0031q92146j088989l4804N2218j320446j334646Q64637
37710A877717J824882k84336j854381J90968K690935J274971k175451k487253
37702A058052N31137K319153J007721o74003p79156n78971j047399j094578l41009
37693D00947k49614j335580j933471p60007J378060L021160L378920K097848l63923
37684E634340k160819j816015m13558j10643q81048r59401r2595K23862l54642
37675i30519m90461K66669P91347N99485N52950R82166J087768N15903k22221
37666C153087r25020j567602j313720L39504J836922J254554o26538j336547m46052
$$ plain form
37727 5626886 6941863 5008508 1106487 -690163 1528184 5002376 6358471 5885059
37719 5885059 5641924 5631893 4739747 3650758 3615954 3668172 2347726 1013080 1877717
37710 1877717 3702599 3418263 1563882 1754850 4445785 5720756 3545305 1058052
37702 1058052 1589189 3908342 4916063 4242060 3462904 2883933 1836534 741956 400947
37693 400947 151333 -1184247 -3117718 -3877725 -2499665 521495 3900415 5998263 5634340
37684 5634340 3473521 1657506 1243948 1133305 252257 -707144 -799739 -575877 -930519
37675 -930519 -1420980 -1154311 -362964 236521 789471 1771637 2859405 3375308 3153087
37666 3153087 2228067 660465 -653255 -313751 1523171 2777725 2151187 814640 368588
37657C68588L42221M73865R31257J459651O45805j003451j380686o04789r87421
37648B45040k429451j760696J771950M180498K307565j483111k995420j934094
37640b097719q50622m41916O23882K233655K447316N66399j728359k521722j496920
37631c266006K91964J418443J174787M08592O00931J570810J351623q13463k908811
37622a71130k855040j237091K69566J614752L334441M056214J865419k100678
37614D776453m137943k628811n3473N96826l59318m99375Q12414J631574N53843
37605F92190j017002p95765J017591J922807P89141m57579R4390J226280N97106
37596D069159j182819j269376P34127J857961M04048j398079j096262J47055r9598
$$ plain form
37657 368588 710809 1184674 2115931 3575582 4221387 3217936 1837250 1232461 245040
37648 245040 -2184411 -3945107 -2173157 2007341 4314906 2831795 -163625 -2097719
37640 -2097719 -2948341 -3390257 -2766375 -532720 1914596 2480995 752636 -1769086 -3266006
37631 -3266006 -2974042 -1555599 -380812 27780 628711 2199521 3551144 2737681 -171130
37622 -171130 -3026170 -4263261 -3993695 -2378943 955498 5011712 6877131 4776453
37614 4776453 638510 -1990301 -2043774 -1446948 -1806266 -2305641 -1493227 138347 692190
37605 692190 -324812 -1120577 -102986 1819821 2608962 2151383 2245773 3472053 4069159
37596 4069159 2886340 1616964 2351091 4209052 4613100 3215021 2118759 2265814 2166216
37587B166216j236773p75599J098680J402262q78868k736850j151226K686113
37579E73955M732857K841890j139971l734409l341780j283486J01277l5441n74327
37570a859435k32624P76426J268123P83151L1237k43414j21887r2154l37166p09356
37560g37099j011248r90741l53549Q22843J787720J627456K28478j433999k099136
37551b159275j294751L05759J403447J057848m04493j398930n82435J397855K353542
37542F78567J214661o18152j347049j137236j066719p96633N74828J931432J116804
37533E50503j342927k317431o29216J283672J424906R81680J256957R55884q46872
37524A317156j852709n6127K133371J212333j603413k207279k79701N37501r38370
$$ plain form
37587 2166216 929443 153844 1252524 2654786 1775918 -960932 -2112158 573955
37579 573955 5306812 8148702 7008731 3274322 -67458 -1350944 -1249667 -1285108 -1859435
37570 -1859435 -2092059 -1315633 -47510 735641 766878 523464 401577 309423 -27743 -737099
37560 -737099 -1748347 -2739088 -3092637 -2269794 -482074 1145382 1373860 -60139 -2159275
37551 -2159275 -3454026 -3148267 -1744820 -686972 -1091465 -2490395 -3072830 -1674975 678567
37542 678567 1893228 1275076 -71973 -1209209 -2275928 -3072561 -2497733 -566301 550503
37533 550503 -792424 -3109855 -3739071 -2455399 -1030493 -48813 1208144 2164028 1317156
37524 1317156 -535553 -591680 1541691 2754024 1150611 -1056668 -1336369 -798868 -1737238
37515a737238j635668J47919J749283P01191j290817j302837N12725J869525J648395
37506F62478L52089j132020j696484m80206J549663K043135M07331j160834q39740
37497b94588M14979Q14595L18663l5087J32177O01225R74139L61361j618023l092933
37487a423492j610061J738282K812661L91582j586875Q7562K907172K646324j28320
37478E834835j269772O50000K923100L066720J448784l92678j511901j561177
37470I187911r76352j002200j999453k442862j273423j15672r53509k663818k512135
37461d751513l95630J235420J343042J287258J828096K018217J486058J108413
37453E159361P70791q89906l520379m326637j783843J857344L314965K087231
$$ plain form
37515 -1737238 -3372906 -3224987 -1475704 -774513 -2065330 -3368167 -2855442 -985917 662478
37506 662478 1014567 -117453 -1813937 -2294143 -744480 1298655 1705986 545152 -294588
37497 -294588 120391 934986 1253649 1218562 1350739 1951964 2926103 3287464 1669441 -1423492
37487 -1423492 -3033553 -1295271 1517390 1908972 322097 409659 3316831 5963155 5834835
37478 5834835 4565063 5215063 8138163 11204883 12653667 12260989 10749088 9187911
37470 9187911 8211559 7209359 5209906 2767044 1493621 1377949 424440 -2239378 -4751513
37461 -4751513 -5147143 -3911723 -2568681 -1281423 546673 2564890 4050948 5159361
37453 5159361 5930152 5040246 1519867 -2806770 -4590613 -2733269 581696 2668927
37445B668927J55634q73772r52161p80969r78999j508389j382399J74370J959382
37436a518376J670782p35402k305737j004833J278440J493262j60522r95736k39708
37427b517830J91570n17396m38207J691092L763829L039129J32299j933428j897107
37418A513951j234128j155956r21289K98920J754606K307792J964406J261766
37410E790068K56470q93523j363927p90634j43069l69721q89352n87436K71980
37401A280856L73280o73389j710265j350725O05815K819285L302820J419987q87287
37392E180377j048118Q28138K294159K414146K718380L494889K427432j024453
37384A7284950l248596j712701L47361j402979n322578o192229l200066l46612
$$ plain form
37445 2668927 2824561 1950789 998628 217659 -761340 -2269729 -3652128 -3477758 -1518376
37436 -1518376 152406 -582996 -2888733 -3893566 -2615126 -1121864 -1282386 -2278122 -2517830
37427 -2517830 -2326260 -2843656 -3281863 -1590771 2173058 5212187 5344486 3411058 1513951
37418 1513951 279823 -876133 -1797422 -1498502 256104 2563896 4528302 5790068
37410 5790068 6046538 5153015 3789088 2998454 2855385 2485664 1596312 1008876 1280856
37401 1280856 1654136 980747 -729518 -2080243 -1474428 1344857 4647677 6067664 5180377
37392 5180377 4132259 4960397 7254556 9668702 12387082 15881971 18309403 17284950
37384 17284950 14036354 12323653 12671014 11268035 5945457 -246772 -3446838 -3793450
37376c793450M05273R45793J906324J263900r37476j604408J51427J434311P79173
37367E50867L11369J030460P68912j053112j525914L54206J252163n76238j808950
37358f96237l1497J648440J64507j879393r69281J040564P09712o06812J00283
37349e19714J239681k04974j956256J61593L888921L006121k326884n067196j970989
37340c749697K041978K121285O0233j98158J174203J443406p0866j782959k231849
37331a192424r55512J287297K386488R45962j312663j558307p8933M18039n23078
37322e83131p01091L71142O25196m11195o06994N92364R08582m77457j221396
37313a503980q0218Q36327L8277o87663J67512R82116J83990q10778m42427J33053
$$ plain form
37376 -3793450 -3388177 -2442384 -536060 727840 -209636 -1814044 -1662617 -228306 550867
37367 550867 862236 1892696 2661608 1608496 82582 436788 1688951 1112713 -696237
37358 -696237 -727734 920706 1085213 -794180 -1763461 -722897 -13185 -619997 -519714
37349 -519714 719967 514993 -1441263 -1279670 2609251 5615372 3288488 -1778708 -3749697
37340 -3749697 -1707719 413566 473799 275641 1449844 2893250 2822384 1039425 -1192424
37331 -1192424 -2147936 -860639 1525849 2471811 1159148 -399159 -478092 -60053 -583131
37322 -583131 -1284222 -913080 -287884 -699079 -1306073 -713709 194873 -282584 -1503980
37313 -1503980 -1584198 -747871 -709594 -1397257 -1229745 -247629 -63639 -874417 -1316844 -1183791
37303a183791k38604j5086J915784L078753R62534k367316k991807r66278L90276
37294a415535J0960l9299J113920J751040R54401J55930L70307N46493k19204
37285C229013j044062j045430r02229j293902j327605o4317J507032J704504P34985
37276A497989L33421R96956J335811N72666k0826P38286J740142J151505o49324
37267G696626j631743j217690p02442o20315j33947N10826l31205k426821k852363
37258a709074k97882K378023K211989L87120k99931L3148l58350r65774k12686
37249A166583Q99174L11518r92921n71951O96002K2284j627116m67633L198980
37240B634920M438671J330983k005172k002465m49084k53147q95089r90243j309960
$$ plain form
37303 -1183791 -1422395 -1437481 478303 3557056 4519590 2152274 -839533 -1805811 -1415535
37294 -1415535 -1404575 -1443874 -329954 1421086 2375487 2531417 2901724 3448217 3229013
37285 3229013 2184951 1139521 237292 -1056610 -2384215 -2448532 -941500 763004 1497989
37276 1497989 1831410 2828366 4164177 4736843 4716017 5454303 7194445 8345950 7696626
37267 7696626 6064883 4847193 4144751 3524436 3390489 3901315 3570110 1143289 -1709074
37258 -1709074 -2006956 371067 2583056 2970176 2670245 2703393 2345043 1379269 1166583
37249 1166583 2065757 2377275 1384354 812403 1508405 1530689 -96427 -564060 2634920
37240 2634920 7073591 8404574 6399402 4396937 3947853 3694706 2799617 1809374 499414
37231D99414k140140j418044J255156K459735L23673j664116j74502K290240J908183
37222C339599K90512J118785K749879O95202l891685n030664j322940J905353
37214a45959J056704j070323j123701l23120p88654j240577P4564J554705R66741
37205a039620n20892m39668Q78860J539958J602200K051358J902085l3883j739121
37196D201277l98380K400543K226192j247570l368952j691003N15211R2958j008770
37187A721506N1823J556023M85820j488507n75737K096220J754313j936187l922727
37178b57453j896647L39531k53014j118030O27233K855871K440695P11613M72498
37169C922297Q37418k61129j284653P7712J674290J0369l179120l277525n11517
$$ plain form
37231 499414 -1640726 -3058770 -1803614 656121 979794 -684322 -858824 1431416 3339599
37222 3339599 3630111 4748896 7498775 8193977 4302292 -728372 -2051312 -145959
37214 -145959 910745 -159578 -1283279 -1606399 -2395053 -3635630 -3561066 -2006361 -1039620
37205 -1039620 -1560512 -2000180 -1121320 418638 2020838 4072196 5974281 5940398 4201277
37196 4201277 3802897 6203440 8429632 7182062 3813110 2122107 2637318 2730276 1721506
37187 1721506 1773329 3329352 3815172 2326665 1750928 3847148 5601461 3665274 -257453
37178 -257453 -2154100 -1814569 -2067583 -3185613 -2558380 297491 2738186 3449799 3922297
37169 3922297 4759715 4498586 3213933 3291645 4965935 4976304 1797184 -1480341 -1991858
37160a991858O91052n91148j000323K07659R1247j370995l34009L476473M895790
37151D073888J558395k004254j709507K36708M91838K32496J378020J960244N8589
37142F276417j692675m43086J549167Q66079j000845o38089J077511J065598o7075
37133F993002L28487J391123M19818j436151q51822J328509J164953j421503k444251
37124E472165o67183Q98353Q06738J060496K191115J755524o42686j753797j82782
37115H937943J013192l08853j536214J70222K909795K969897L54723j752518j511694
37106A1246493J53568J531541J584059M54916j82070J364399L950808M179242
37098B4282956J069169k075517k176924n15028j16345j045223j139988r2731K81595
$$ plain form
37160 -1991858 -1300806 -1891954 -2892277 -2684618 -2593371 -3964366 -4298375 -821902 4073888
37151 4073888 5632283 3628029 1918522 2155230 2647068 2879564 4257584 6217828 6276417
37142 6276417 4583742 4140656 5689823 6555902 5555057 4916968 5994479 7060077 6993002
37133 6993002 7321489 8712612 9132430 7696279 6844457 8172966 9337919 7916416 5472165
37124 5472165 4804982 5703335 6510073 7570569 9761684 11517208 10874522 9120725 8937943
37115 8937943 9951135 9642282 8106068 8276290 11186085 14155982 14510705 12758187 11246493
37106 11246493 11400061 12931602 14515661 14970577 14788507 16152906 20103714 24282956
37098 24282956 25352125 23276608 21099684 20584656 20468311 19423088 18283100 18190369 18471964
37089A8471964o72285j683787k009017k192296k237885j357765M7404L99975l45743
37080H420565j92256J546552K467652N07096k443015k776176k65087J700499R52071
37071I917901j035142k223854k791944l230542k165615J249348M412779M004476
37063H137407R77732n40282O01581J061132j379667m098914l595904n37682J716828
37054B342231J866909J315099J134740R13027K74630l92548o97235n35179L2545
37045F254219L97875k04455j119830n04094J691472K685406N87998k480316l246685
37036D061590j859440r34535j079051m90347J255848K156189J077002m59656o85215
37027C042385J42175O78595J71202j353337l105700l358686r00839K758683M250402
$$ plain form
37089 18471964 17799679 16115892 14106875 11914579 9676694 8318929 8366333 8766308 8420565
37080 8420565 8228309 9774861 12242513 12749609 10306594 7530418 7265331 8965830 9917901
37071 9917901 8882759 6658905 3866961 636419 -1529196 -279848 4132931 8137407
37063 8137407 9115139 8574857 9176438 10237570 8857903 4758989 1163085 625403 2342231
37054 2342231 4209140 5524239 6658979 7572006 7846636 7454088 6756853 6221674 6254219
37045 6254219 6652094 6447639 5327809 4823715 6515187 9200593 9788591 7308275 4061590
37036 4061590 2202150 1267615 188564 -301783 954065 3110254 4187256 3727600 3042385
37027 3042385 3184560 3863155 4034357 2681020 -424680 -3783366 -4684205 -1925522 2324880
37018B324880K236800r16684k217220j470842n22067k41735P4166P06844O97650
37009F71792l68321j034303K41694K421759K682900L12794j896191j412642M24255
37000B043737O33985p46122j096072J48698O79983l68225p55154Q24375K209134
36991C574339J314486n00820r71442n48486r40200j869300j831968p02794N80222
36982a895963J561757J741128L27246j691102j561013R77037K144894l41379l018059
36973a755454j633861K105600L151656P25922j394976j228970m82769l15722L48858
36964d79716J840610K753585K441689J572300K57983j584358k635530j900619
36956B265944r81794j389404j229836J381960L573976J661256j807145j417355
$$ plain form
37018 2324880 4561680 3644996 1427776 -43066 -565133 -806868 -732702 -25858 671792
37009 671792 303471 -730832 -489138 1932621 4615521 4928315 3032124 1619482 2043737
37000 2043737 2677722 1931600 835528 984226 1664209 1295984 540830 1365205 3574339
36991 3574339 4888825 4388005 3416563 2868077 1927877 58577 -1773391 -2476185 -1895963
36982 -1895963 -334206 1406922 1734168 43066 -1517947 -540910 1603984 1262605 -1755454
36973 -1755454 -3389315 -1283715 1867941 2593863 1198887 -30083 -512852 -828574 -479716
36964 -479716 1360894 4114479 6556168 8128468 8386451 6802093 4166563 2265944
36956 2265944 1284150 -105254 -1335090 46870 3620846 5282102 3474957 2057602
36948B057602J563356O55738m242377n196297J035337O690869M300021k368083
36940D496166m700578j540437J513032J647800R22886N65349n69739k156429k109634
36931a931584m71115L76058k71111n20038O31327J772318J627584Q77299P83325
36922B874063J493628K109743J602125j85288j942676k078743r47026n85664j664681
36913F75481k443338j634991k98692L22030P18250J357449J151691m38238j670198
36904b260556q99657Q95933J744656J240316j6177j568371k199800l38126K782199
36895f19583L194182j28344k709716q97629K267689J729118j543244k381014P4926
36886a013615J380413n91361k463795j227754J234553J717739L77517n70913m24714
$$ plain form
36948 2057602 3620958 4276696 34319 -5161978 -4126641 2564228 6864249 4496166
36940 4496166 -204412 -1744849 -231817 1415983 2338869 2904218 2334479 178050 -1931584
36931 -1931584 -2402699 -2026641 -2297752 -2817790 -2186463 -414145 1213439 2090738 2874063
36922 2874063 4367691 6477434 8079559 7894271 5951595 3872852 2925826 2340162 675481
36913 675481 -1767857 -3402848 -3701540 -3379510 -2661260 -1303811 -152120 -590358 -2260556
36904 -2260556 -3160213 -2264280 -519624 720692 704515 -863856 -3063656 -3401782 -619583
36895 -619583 2574599 2446255 -263461 -1161090 1106599 2835717 1292473 -1088541 -1013615
36886 -1013615 366798 -224563 -2688358 -3916112 -2681559 -963820 -586303 -1157216 -1581930
36877a581930k6124J28708J6194m64658q99778m01876P89129J071070j67767j281793
36867b818825n87309J243748K175764J411265l5543q24361n12623L43022P44602
36858A139740J98010o73865r01412n57222n82863j087945q65466Q03441K723881
36849A96299L107216J925142R35558J228922J645495M00976k097413l289873j822568
36840B229754L10895L46392j256750j433076P93206K571357J324691j401487k122074
36831A362908k34923J515069R78765r79606k177469j697486l38722N43826L15369
36822g12269k86389J24730J676917K553550J144776j547039k881262j837333n5651
36813a819970N09302j98290q44368m54333Q50172K141725K258689P28796j395126
$$ plain form
36877 -1581930 -1608054 -1479346 -1463152 -1927810 -2827588 -3229464 -2440335 -1369265 -1537032 -2818825
36867 -2818825 -3406134 -2162386 13378 1424643 1389100 564739 52116 395138 1139740
36858 1139740 1337750 663885 -237527 -794749 -1377612 -2465557 -3331023 -2527582 196299
36849 196299 3303515 5228657 6164215 7393137 9038632 9439608 7342195 4052322 2229754
36840 2229754 2540649 2887041 1630291 197215 990421 3561778 4886469 3484982 1362908
36831 1362908 1127985 2643054 3621819 2642213 464744 -1232742 -1571464 -1027638 -712269
36822 -712269 -998658 -873928 802989 3356539 4501315 2954276 73014 -1764319 -1819970
36813 -1819970 -1310668 -1508958 -2353326 -2807659 -1957487 184238 2442927 3171723 1776597
36804A776597k207286j038011O13226R28759J45670O3393J224631J891944N78901
36795C977824j453213j647486K74901J817176J060849r88460k109112j594860
36787f62381l07507Q45527J304728O83110n47840j016271k92757J76662o89247
36778e05976j594521q51594P56699J323978J094321J707906K722880J981686m37459
36769F197920j808375j032986k75819j060199j642942k20277J675102J435089
36761C267513o06741j935002j623135q95452m00238O30450K195866K600094Q11457
36752D044812j471029j518899R12867L007977K279801l44379j795774p90363P91567
36743E116580N77831j431015l105099k444276N84626L626856L657961M41734k329398
$$ plain form
36804 1776597 -430689 -1468700 -855474 73285 218955 282348 1506979 3398923 3977824
36795 3977824 2524611 877125 1152026 2969202 4030051 3041591 932479 -662381
36787 -662381 -969888 -124361 1180367 1863477 1315637 299366 6609 183271 -505976
36778 -505976 -2100497 -2952091 -2195392 -871414 222907 1930813 4653693 6635379 6197920
36769 6197920 4389545 3356559 3080740 2020541 377599 157322 1832424 3267513
36761 3267513 2660772 725770 -897365 -1792817 -2193055 -1562605 633261 3233355 4044812
36752 4044812 2573783 1054884 1967751 4975728 7255529 6911150 5115376 4325013 5116580
36743 5116580 5694411 4263396 1158297 -1285979 -701353 2925503 6583464 7025198 4695800
36734D695800j360753J534141J990816k88248j542886n03487J44266l52590O82035
36725D999094L104756K613090j385218l274610m40772K204475J565144K095450
36717A1481409O163559P855418M440501L976286J0902254J4931865Q324124K880471
36709G0955887J1261862K3032024K4884559L4736852P8273068J29557140J19000451
36702D91701843K2644181r0802766j33889755r8759052m8499494k8420639k6965937
36695H7008381j9819985r501809p994627j0878690q025229k248841j325035l380545
36687B3833620k841242j450084k806236l924539j384296J143892l01470k052640
36679A0217005N57167M252336L057449j860939m449184k698685K97471J638960
$$ plain form
36734 4695800 3335047 4869188 6860004 6571756 5028870 4525383 4669649 4317059 4999094
36725 4999094 8103850 10716940 9331722 6057112 5616340 7820815 9385959 11481409
36717 11481409 17644968 25500386 29940887 33917173 44819427 59751292 68075416 70955887
36709 70955887 82217749 105249773 130134332 164871184 243144252 372701392 491701843
36702 491701843 514346024 423543258 289653503 190894451 142394957 113974318 87008381
36695 87008381 67188396 57686587 49691960 38813270 30788041 28539200 27214165 23833620
36687 23833620 20992378 19542294 16736058 12811519 11427223 12571115 12269645 10217005
36679 10217005 10774172 15026508 18083957 16223018 11773834 9075149 9372620 11011580
36671A1011580O29222k007886l712130j710179K570919M134403J424540j327088
36663A1013381o89468J515415K463411K411062K240092J381496L32832J000252
36655B1668473L108507M895333P782062J3931489J8407537J2203600l901158j6909810
36647F1186033j7628387j1411615p657829o543353l446788K74989l0017k980338
36639A1762695l171570l18392J032279n14532j997056j879756j393426q77495
36631B642747L80960J481115J158781M82657P60046P07018p21185j309064N22044
36622F105119J742897n40591l236196j754037K006940K379635q53433k453180
36614C397154m49273J527498J138969N35919J196555Q96046j817437m225125l214893
$$ plain form
36671 11011580 11640802 9632916 5920786 4210607 6781526 10915929 12340469 11013381
36663 11013381 10323913 11839328 14302739 16713801 18953893 20335389 20668221 21668473
36655 21668473 24776980 29672313 37454375 51385864 69793401 81997001 78095843 61186033
36647 61186033 43557646 32146031 24488202 17944849 14498061 14773050 14743033 11762695
36639 11762695 8591125 8272733 9305012 8790480 6793424 4913668 3520242 2642747
36631 2642747 3023707 4504822 5663603 6146260 6906306 7613324 6892139 5583075 6105119
36622 6105119 7848016 7307425 4071229 2317192 4324132 6703767 5850334 3397154
36614 3397154 2947881 4475379 5614348 6150267 7346822 8242868 6425431 2200306 -1014587
36605a014587K06985K436355J642939q69721k502479j741214M40460J483493L57582
36596D39813r66304m41703Q34084M09680j401963j779488L50993K700540K766221
36587B911873Q65251p17202o31741K12283J35015q53550r28561O02977J594065
36578C190410J49454j881651j480907L95677K31407j749351j554911J492879K982524
36569A775531P50272j311524P3282K032746P95147j786971j717355M91309J561882
36560B664319J227996J403835J658248K94342j580692j556398l34652n39611k101122
36551A136265k600249j343964K80941J538906K355323J811417m02260k319560
36543D56819k164476r18310q8930Q10800K084297K056200L41480l92004Q36423
$$ plain form
36605 -1014587 -807602 1628753 3271692 2401971 -100508 -1841722 -1401262 82231 439813
36596 439813 -526491 -968194 -134110 275570 -1126393 -2905881 -2554888 145652 2911873
36587 2911873 3777124 3059922 2428181 2640464 2775479 1921929 993368 1596345 3190410
36578 3190410 3339864 1458213 -22694 372983 604390 -1144961 -2699872 -1206993 1775531
36569 1775531 2525803 1214279 1287561 3320307 4115454 2328483 611128 1102437 2664319
36560 2664319 3892315 5296150 6954398 7248740 5668048 4111650 3776998 3237387 1136265
36551 1136265 -1463984 -2807948 -2527007 -988101 1367222 3178639 2776379 456819
36543 456819 -1707657 -2625967 -2714897 -1904097 180200 2236400 2577880 2185876 3022299
36534C022299O97861k413132m148929j121605K386050R87574k506663j865118
36526d961663J664271J773414j480549j842864J812262L445145M48560k151509
36518a292933n68289K064418K003717N89819K92625L87327j74908q7543J178964
36509D393197J464343l71022k289007k482113j546914m7174K293566L963222K447011
36500G825109j208822k899044j564728k88229m29875J14678J521130O67882k659660
36491A078441l885926q93516K135578J469827n48327l86037P44955N4017j559890
36482a790878j695531q18101m91176L2230J786136L139543K267580L49792o06978
36473B172617q07082r97124m81206O83501N24773j215377j593886O22267K220091
$$ plain form
36534 3022299 3720160 1307028 -2841901 -3963506 -1577456 -589882 -3096545 -4961663
36526 -4961663 -3297392 -1523978 -3004527 -4847391 -3035129 410016 858576 -1292933
36518 -1292933 -1861222 203196 2206913 2796732 3089357 3476684 3301776 3214233 4393197
36509 4393197 5857540 5486518 3197511 715398 -831516 -878690 1414876 5378098 7825109
36500 7825109 6616287 3717243 2152515 1864286 1434411 1549089 3070219 3738101 1078441
36491 1078441 -2807485 -3701001 -1565423 -95596 -643923 -1029960 -285005 -230988 -1790878
36482 -1790878 -3486409 -4304510 -4795686 -4763456 -2977320 162223 2429803 2779595 2172617
36473 2172617 1365535 368411 -112795 570706 1095479 -119898 -1713784 -1091517 1128574
36464A128574R03400n54938O04055J885950J39578k239558j273477J336321J025672
36455B955577j611299k091792k11609k12179k727579l239446J8383K699845J448159
36446b971940p81387O7167K573967K528346k79529k079099r59687R53988J363525
36437D15351R01718J225986J972022J421306n09277j793111j120531K80904N35556
36428C329924l38889j027207j082694r03035l22973Q44294J420940K26407j498395
36419F48372j449192J01873P00291k01988n66738L91745R43361L26511J74205
36410A068440J099692J153026n15882j611383m74245J023600P73812j24918J50729
36401B542871P79615K62180n59810m33183m74000j819292k530258m69585K318182
$$ plain form
36464 1128574 2031974 1477036 2081091 3967041 4106619 1867061 593584 1929905 2955577
36455 2955577 1344278 -747514 -959123 -1171302 -3898881 -7138327 -7119944 -4420099 -2971940
36446 -2971940 -3753327 -3686160 -1112193 1416153 1136624 -942475 -1902162 -948174 415351
36437 415351 1317069 2543055 4515077 5936383 5427106 3633995 2513464 2794368 3329924
36428 3329924 2991035 1963828 881134 -21901 -344874 499420 1920360 2146767 648372
36419 648372 -800820 -698947 1344 -200644 -767382 -375637 567724 894235 1068440
36410 1068440 2168132 3321158 2805276 1193893 719648 1743248 2517060 2392142 2542871
36401 2542871 3322486 3584666 3024856 2591673 2117673 298381 -2231877 -2701462 -383280
36392c83280K100461n39051j335018R60610K497740J66253l620764m112847n44571
36383d810467K992734K875267L27756p97961K57031K75666k218476l617546p74550
36374e490546K824844J596406k781778l048858K146783N605249K832293j220763
36366B463630r45056J013870l69170l174088k382479P73999J119978j096937r58505
36357c554758K018830L102789P53036j254330r31177p09683j594004r60039J715628
36348a413708K679287J78394k059528p16585J907959J833190p45216k651565k338867
36339c326639p01733Q10862J047400q7662p02058J003617L215814K247564j481497
36330B025668l174348q26306J680853J039090l35302Q76599K848967J934299q53276
$$ plain form
36392 -383280 1717181 1178130 -156888 803722 3301462 3467715 -153049 -4265896 -4810467
36383 -4810467 -1817733 1057534 1385290 587329 844360 1120026 -1098450 -4715996 -5490546
36374 -5490546 -2665702 -1069296 -3851074 -6899932 -4753149 852100 3684393 2463630
36366 2463630 1518574 2532444 2163274 -1010814 -3393293 -2619294 -1499316 -2596253 -3554758
36357 -3554758 -1535928 1566861 2319897 1065567 134390 -575293 -2169297 -3129336 -1413708
36348 -1413708 1265579 1443973 -615555 -1332140 575819 2409009 1663793 -987772 -3326639
36339 -3326639 -4028372 -3217510 -2170110 -2257772 -2959830 -1956213 1259601 3507165 2025668
36330 2025668 -1148680 -1974986 -294133 744957 409655 1286254 4135221 6069520 5216244
36321E216244j731613p23749j091193k955257k816433N9410J795820J95146j397209
36312c448834O38361M152849M060934k51778l955099l261059P3603J851038R56768
36303H16783j12918O09031J964071J679342l97245k187979k082390p08648K11610
36294b08343J23777J16426J124321K293540J904115j47792j867066j727082o55515
36285I56381l88875q40590o92402J44503O07551N20668M01359k72072j971978
36276a535455k736899k99559L331992L543123K03152j598837K79111J359001j621020
36267I24609m403459j915886K906418L458143p9764j681499L52895J450662o47119
36258C65000k267055n72288J933797K208230J186682Q16943N65507m44778j126469
$$ plain form
36321 5216244 3484631 2760882 1669689 -1285568 -4102001 -4042591 -2246771 -2051625 -3448834
36312 -3448834 -2810473 1342376 5403310 5151532 1196433 -2064626 -1991023 -139985 816783
36303 816783 703865 1312896 3276967 4956309 4559064 2371085 288695 -419953 -208343
36294 -208343 -84566 31860 1156181 3449721 5353836 5206044 3338978 1611896 956381
36285 956381 567506 -273084 -965486 -820983 -213432 307236 708595 436523 -1535455
36276 -1535455 -4272354 -4571913 -1239921 2303202 2506354 907517 1186628 2545629 924609
36267 924609 -3478850 -5394736 -2488318 969825 890061 -791438 -438543 1012119 365000
36258 365000 -1902055 -2474343 -540546 1667684 2854366 3671309 4236816 3792038 2665569
36249B665569o97372m07558r54035r25933L39355J107805K22669r40721j080431
36240f70652q22483n88879M10414J664446J121662r63785j471099M64996J550487
36231F95107j66782j825174p00690J158052P72506o77734n47777L81330j47521
36222a058683j396685j226163j33689K45769O61433K221612K905627N55261k426286
36213C48196k137026M60160J209629k80108o61705P14587R67883n04050r22357
36204h04791L12654L72273j268648j199043J662582L256489Q29316k274715j869049
36195i82932P14044J458151l2781j154676j116058j079771r06802L74325J693218
36186a033282J150804l34905l8923J961066K528861L41568k055801k181655j008017
$$ plain form
36249 2665569 1968197 1560639 606604 -319329 20026 1127831 1350500 409779 -670652
36240 -670652 -1493135 -2082014 -1671600 -7154 1114508 150723 -1320376 -855380 695107
36231 695107 528325 -1296849 -1997539 -839487 -66981 -744715 -1292492 -911162 -1058683
36222 -1058683 -2455368 -3681531 -3815220 -3569451 -2908018 -686406 2219221 2774482 348196
36213 348196 -1788830 -1328670 -119041 -399149 -1060854 -346267 621616 117566 -804791
36204 -804791 -492137 -119864 -1388512 -2587555 -924973 2331516 3160832 886117 -982932
36195 -982932 -268888 1189263 1156482 1806 -1114252 -2194023 -3100825 -2726500 -1033282
36186 -1033282 117522 -217383 -256306 1704760 4233621 4575189 2519388 337733 -670284
36177f70284p53053j170603k08995K282773L516313J107910l401176n519013k755610
36168g571738K132749M070972J676032j354154j350484Q83779K205621J805048
36160B497825J281205J149498K01381j721657k971035k573826j268977L33931
36152c071655K297258L506530J986245j663152l705894k006598Q76485J487126
36144b93655K76077j01674M79949L5342j297412j208823M83733J090062m65268
36135a001669j614624j93335K104686K315011L47395j489602j776776r08542L38696
36126a878760J449119J896852J508448P66569J38568k14486J37185J367630K025719
36117G196844K62814k819165l556466q90053J524794N18715j938304k216838p37339
$$ plain form
36177 -670284 -1423337 -2593940 -2802935 -520162 2996151 4104061 702885 -4816128 -7571738
36168 -7571738 -5438989 -1368017 308015 -1046139 -2396623 -1512844 692777 2497825
36160 2497825 3779030 4928528 5129909 3408252 437217 -2136609 -3405586 -3071655
36152 -3071655 -774397 2732133 4718378 3055226 -650668 -2657266 -1780781 -293655
36144 -293655 -17578 -119252 360697 396039 -901373 -2110196 -1626463 -536401 -1001669
36135 -1001669 -2616293 -2809628 -704942 1610069 1957464 467862 -1308914 -2217456 -1878760
36126 -1878760 -429641 1467211 2975659 3742228 3880796 3666310 3803495 5171125 7196844
36117 7196844 7459658 4640493 1084027 193974 1718768 2237483 299179 -1917659 -2654998
36108b654998l84951r91871O1250K437283K773506M20876j165449M2520J650469
36099B188635J051899q11825j909299k343619k839078k488740m69669J820676
36091e801020K574994K070601J486536P50323n00814j211209k57129J436475J979706
36082B528463J032396k27798r06933q80284k54465N17661P39629M99659N93326
36073C641654Q60375J52293j306676j521795J19345J420125P10559n26718l81374
36064C167788K35403l93961j346234o31093J052277J302014L2520o28485j64327
36055B625902l10692j680229k578397j819974m02213L52614M35107L47940L17417
36046b712525P01807J632089K061304Q69214r19773r40144J046561K392314J077556
$$ plain form
36108 -2654998 -3039949 -4031820 -3970570 -1533287 1240219 1661095 495646 538166 2188635
36099 2188635 3240534 2428709 519410 -1824209 -4663287 -7152027 -7621696 -5801020
36091 -5801020 -3226026 -1155425 331111 1081434 580620 -630589 -887718 548757 2528463
36082 2528463 3560859 3333061 2426128 1545844 1291379 1809040 2548669 3048328 3641654
36073 3641654 4502029 4654322 3347646 1825851 1945196 3365321 4075880 3549162 3167788
36064 3167788 3403191 3009230 1662996 1031903 2084180 3386194 3418714 2790229 2625902
36055 2625902 2315210 634981 -1943416 -3763390 -4165603 -3812989 -3377882 -3029942 -2712525
36046 -2712525 -2010718 -378629 1682675 2551889 1632116 691972 1738533 4130847 5208403
36037E208403j616307k939871k000096k77744M41124j20780p11527j08250J261130
36028h63918J815995J230444J028227J759967J349776j591708m335656l131527
36020b738400R03977K704467M30518k059974j258129J082122J438487k9633o84433
36011b10998j26172j97134j057443o50878J578729L184251J992657r06033k635788
36002I71191j945862r2599J089190J009819L05449k49124l94894j63370M52430
35993I82230J239649J485049O09442q40353j440968m66391J141050J688483M52923
35984D851114j678359l128386l035779j756691r0890J583364K974392L195140
35976B913905J670645k53629l09097J395956J939531j91319k383174j608223Q24861
$$ plain form
36037 5208403 3592096 652225 -1347871 -1625615 -1184491 -1305271 -2016798 -2125048 -863918
36028 -863918 952077 2182521 3210748 4970715 6320491 4728783 393127 -2738400
36020 -2738400 -1834423 870044 1300562 -759412 -2017541 -935419 503068 473435 -210998
36011 -210998 -337170 -534304 -1591747 -2242625 -663896 2520355 4513012 3606979 971191
36002 971191 -974671 -1067270 21920 1031739 1337188 1088064 693170 529800 982230
35993 982230 2221879 3706928 4316370 3476017 2035049 1568658 2709708 4398191 4851114
35984 4851114 3172755 44369 -2991410 -4748101 -4838991 -3255627 -281235 2913905
35976 2913905 4584550 4330921 4021824 5417780 7357311 7165992 4782818 3174595 3999456
35967C999456J259434o36155j799392j081347o07919j196381n65897K170270M065061
35958E607130K903110Q68785O87387J222954N43217M66606L405478O919644P207720
35949B9832031P107402J3864562K7495314L7581561L4910109K1457411N151932
35942A77400322j0297811k4620623l3825319l2079376k1142802j0926364q022496
35935C6485531q791390o843436k580028p59609k084256k941953k101479j953722
35927H429658k943690k191598Q15110K035030q67219m040904k860177J095898
35919e27892K643210P25921r42144k61237P76421N03989L03783J314632J781148
35910F317831j083k406918k621318o99493P42474K08531j143289j442749l03787
$$ plain form
35967 3999456 5258890 4622735 2823343 1741996 1134077 -62304 -628201 1542069 5607130
35958 5607130 8510240 9379025 10066412 11289366 11832583 12299189 15704667 22624311 29832031
35949 29832031 36939433 50803995 78299309 115880870 150790979 172248390 177400322
35942 177400322 167102511 142481888 108656569 76577193 55434391 44508027 36485531
35935 36485531 27694141 20850705 18270677 17511068 15426812 12484859 10383380 8429658
35927 8429658 5485968 3294370 4109480 6144510 5277291 1236387 -1623790 -527892
35919 -527892 2115318 2841239 1899095 1637858 2414279 2918268 3222051 4536683 6317831
35910 6317831 6316748 3909830 1288512 589019 1331493 1540024 396735 -1046014 -1349801
35901a349801R64015Q14324o47508j298932N29848L299764L629090P93700k143229
35892D591271k603284j669767j411781j295929J77396J904340J454660p10982
35884D35924j512861O7486J506700P09718j102838j704749r75212j84876K78083
35875b482625Q31727J291635R87551j50085j511290k324246j741476O47360L604649
35866h46800M546016K213104j528464l567056k773267n52282J180742J544969
35858B16962P13507m41273q30509j12985R37907J541890J850777K094306J596056
35849G566638j66380k098868k534301j527173p26412j021434j669534j803333
35841c980797j423514p00112L80790J375952J608684J272370J110264R44933K9598
$$ plain form
35901 -1349801 -385786 428538 -218970 -1517902 -988054 2311710 5940800 6734500 4591271
35892 4591271 1987987 318220 -1093561 -2389490 -2212094 -307754 1146906 435924
35884 435924 -1076937 -1009451 497249 1206967 104129 -1600620 -2575832 -2760708 -2482625
35875 -2482625 -1650898 -359263 628288 478203 -1033087 -3357333 -5098809 -4451449 -846800
35866 -846800 3699216 5912320 4383856 816800 -1956467 -2508749 -1328007 216962
35858 216962 930469 489196 -341313 -454298 483609 2025499 3876276 5970582 7566638
35849 7566638 7400258 5301390 2767089 1239916 513504 -507930 -2177464 -3980797
35841 -3980797 -5404311 -6104423 -5723633 -4347681 -2738997 -1466627 -356363 588570 618168
35832F18168j054157p52291P95614J531532O51196k31261j26284l71059j670726
35823f09268k058875k15966J564736Q18100o89166K68313K636614K468639n13931
35814C669196k401195j517422o40236j478867j595517P03781K541711R90307j738445
35805a466687j603475Q87552J790071J17561r86678N32177K780408L028161J075023
35796F154113j366445k722599k270410l55459J462252J653651M86481m40444m62623
35787B138517m72886j173913j920771j706866n18436O18167O10931n48717j424180
35778d398154n48156J510636K535487J633579M22209L69852O29219o0689r98056
35769A095927r48691m52741n31612n16977L60177O49966j028281k570463q75649
$$ plain form
35832 618168 -435989 -1188280 -392666 1138866 1790062 1558801 1432517 1061458 -609268
35823 -609268 -2668143 -2884109 -1319373 -501273 -1190439 -922126 1714488 4183127 3669196
35814 3669196 1268001 -249421 -889657 -2368524 -3964041 -3260260 -718549 271758 -1466687
35805 -1466687 -3070162 -2182610 -392539 -274978 -1261656 -729479 2050929 5079090 6154113
35796 6154113 4787668 2065069 -205341 -560800 901452 2555103 3041584 2601140 2138517
35787 2138517 1665631 491718 -1429053 -3135919 -3654355 -3036188 -2425257 -2973974 -4398154
35778 -4398154 -4946310 -3435674 -900187 733392 1155601 1525453 2154672 2093983 1095927
35769 1095927 147236 -305505 -837117 -1354094 -993917 -343951 -1372232 -3942695 -4818344
35760d818344K825961M039293J502080j307600j775234j261051j352591r67148
35752c114634P08765J818782R60073q5185N70236J553510Q36139m14126J87654
35743C021214J942977K129093N13074m94755M344J71247j187353k589784k200589
35734A309468m05874R41698P99614k42176p89787m371J427212J809066M21311
35725E266161j435637k053657j358967l99677M87757J552314K068878P55750j865872
35716C017050l195169j699271P40321J038376r72190k262658q43583J355912J299883
35707a521329n53033q76105J274444K698566R25351j799847j948709j33647K69133
35698a665176j222459j771374k68113J151826J254210J477905K262862J424375
$$ plain form
35760 -4818344 -1992383 2046910 3548990 2241390 466156 -794895 -2147486 -3114634
35752 -3114634 -2405869 -587087 372986 287801 858037 2411547 3247686 2833560 3021214
35743 3021214 4964191 7093284 7606358 7111603 7115947 7287194 6099841 3510057 1309468
35734 1309468 903594 1845292 2644906 2402730 1612943 1608572 3035784 4844850 5266161
35725 5266161 3830524 1776867 417900 18223 505980 2058294 4127172 4882922 3017050
35716 3017050 -178119 -1877390 -1137069 -98693 -1070883 -3333541 -4177124 -2821212 -1521329
35707 -1521329 -2074362 -2950467 -1676023 1022543 1947894 148047 -1800662 -1934309 -1665176
35698 -1665176 -2887635 -4659009 -4927122 -3775296 -2521086 -1043181 1219681 2644056
35690B644056j680591l741601k005946J434394K710730J343799m71850j678369
35682a445378k330466j476021J509309M452247M417922J663706j057123k302752
35674C431444k396292j188358J368797L107957J678361j379194k075593J70057
35666B717179J594532j12231k430626k052917M40647K032089J537446L42922j28562
35657C940479L823k91713j612542l167659l135563p77985J953622K256168L6160
35648g95210j850336j300368N74313J371586N18252m87391k43671R52008J531842
35639B71025N08301j125320j418732j53962O70756r5291p53793M83854K218040
35630F04878J855949j24599r51911j75130q6003j245238j229065R19380K409457
$$ plain form
35690 2644056 963465 -2778136 -4784082 -3349688 -638958 704841 232991 -1445378
35682 -1445378 -3775844 -5251865 -3742556 709691 5127613 6791319 5734196 3431444
35674 3431444 1035152 -153206 1215591 4323548 6001909 4622715 2547122 2717179
35666 2717179 4311711 4199480 1768854 -284063 156584 2188673 3726119 4069041 3940479
35657 3940479 3944302 3652589 2040047 -1127612 -4263175 -5041160 -3087538 -831370 -795210
35648 -795210 -2645546 -3945914 -3371601 -2000015 -1481763 -1969154 -2212825 -1260817 271025
35639 271025 779326 -345994 -1764726 -1918688 -1247932 -1343223 -2097016 -1613162 604878
35630 604878 2460827 2336228 1384317 1209187 1123184 -122054 -1351119 -431739 1977718
35621A977718J000159j201377r25975J250520K045209N24637q94532l35048J087463
35612D528774J209879m00119k283753k848217j845940m83658j15536o65678p42290
35603c646538M06104J742128J873355R87451M06378N38560L83653p17358j770197
35594B03536j328269K95534R68520o27256k940523l132798o02698K212895K844398
35585b106661J438784j56110p76370n30299r43J72259k70968m95274N96154K184347
35575E4919J907997n16848k146666j001382Q13161N92723n30527J26416J852592
35566A152385J798591R7332m93759L87288M34446n12229m252J881872J655487
35557F397161j648715l977676k120941J585633L095919K091715P87179n2283r48372
$$ plain form
35621 1977718 2977877 1776500 850525 2101045 4146254 4670891 3776359 3441311 4528774
35612 4528774 5738653 5338534 3054781 206564 -1639376 -2123034 -2238570 -2904248 -3646538
35603 -3646538 -3240434 -1498306 375049 1362500 1768878 2307438 2691091 1973733 203536
35594 203536 -1124733 -829199 139321 -487935 -3428458 -6561256 -7163954 -4951059 -2106661
35585 -2106661 -667877 -823987 -1600357 -2130656 -2131599 -1959340 -2230308 -2725582 -2129428 54919
35575 54919 1962916 1446068 -700598 -1701980 -888819 -296096 -826623 -700207 1152385
35566 1152385 2950976 3048308 2554549 2941837 3376283 2864054 2859802 4741674 6397161
35557 6397161 4748446 770770 -1350171 235462 3331381 5423096 6210275 6157992 5209620
35548E209620j552337j353204j092346j395377j457665o94361P4757M55235J269251
35539e36427K142210J064520j830855l090667r20062J644953J355848l53789l79495
35530i03764Q14610P45650m47037q69532p11291j267125j495001M15004K985777
35521g32709K944821K80304j785683j489332O7273J621380K613760K017763l79834
35512E157743k207928j319398N24239K79374j244673j017130N21083K88924j399147
35503d16913j028699J536693K251836q4152j468198M72662K327669N99026k609937
35494A579987l037309l31765K471833L200486J700503j115093l270618k870149
35486a672125q17444j8873p83802k78767K141631L176540J255372m82569J63859
$$ plain form
35548 5209620 3657283 2304079 1211733 -183644 -1641309 -2335670 -2260913 -1805678 -536427
35539 -536427 1605783 2670303 839448 -2251219 -3171281 -1526328 -170480 -524269 -903764
35530 -903764 -89154 656496 209459 -660073 -1371364 -2638489 -4133490 -3718486 -732709
35521 -732709 2212112 2492416 706733 -782599 -715326 906054 3519814 5537577 5157743
35512 5157743 2949815 1630417 2154656 2434030 1189357 172227 693310 982234 -416913
35503 -416913 -1445612 91081 2342917 2258765 790567 1263229 3590898 4189924 1579987
35494 1579987 -1457322 -1789087 682746 3883232 5583735 4468642 1198024 -1672125
35486 -1672125 -2489569 -2508442 -3292244 -3571011 -1429380 1747160 3002532 2519963 2683822
35477B683822M46381j776103l096296l70543K626623P77581l227558k659859K082224
35468b513728M004485R83665j433067p7283R73537j337163l224257j151707J409534
35459b365984J04974k241712l53059L998507M419557K95535k437167r80957P48869
35450A188563k24243j080177R25120L013284J591509j355866j401204J097009
35442C753995J818604m38628k246672j380453N3779l63679j543182j036715J172357
35433b10594K953716K808418R52451j344457k465134j539724K76250P06697o80193
35424A457430j692872o20628J298802J803327P66188j40102j18458K5923m80031
35415B299579j285749j463853n41405Q18451J107150k59176j583637q27598J044845
$$ plain form
35477 2683822 3130203 1354100 -1742196 -2112739 513884 1291465 -1936093 -4595952 -2513728
35468 -2513728 1490757 2474422 1041355 964072 1937609 600446 -2623811 -3775518 -2365984
35459 -2365984 -2261010 -4502722 -4855781 -857274 3562283 3857818 1420651 439694 1188563
35450 1188563 964320 -115857 809263 3822547 5414056 4058190 2656986 3753995
35442 3753995 5572599 5133971 2887299 1506846 1560625 1196946 -346236 -1382951 -210594
35433 -210594 2743122 5551540 6503991 5159534 2694400 1154676 1430926 2137623 1457430
35424 1457430 -235442 -856070 442732 2246059 3012247 2872145 2753687 2779610 2299579
35415 2299579 1013830 -450023 -991428 -172977 934173 674997 -908640 -1736238 -691393
35406f91393R27843j566840k866313o30731K524807K876905P89072q46603j340197
35397h23450j942321k299214r34765J373009K231562J402367P59157Q22242N54820
35388A143407K06962Q24293J204471o82801l152655k133391K088547M052528R24145
35379D475506l140732l148179j81592J226053J4482q63193M47449K395328K717700
35370C942822J189727o51266j451884j463783j981495l028334k566464M77199
35362e533478L547000L440260J120038J47044P95577L5690k333513k578167L46712
35353a012837K096838l04854l409922k627050J013807L239750K821648J626606
35345C443986O60571k76448p81160q24320j688071l254231k805596N75773L285718
$$ plain form
35406 -691393 236450 -1330390 -4196703 -4827434 -2302627 574278 1363350 516747 -823450
35397 -823450 -2765771 -5064985 -5999750 -4626741 -2395179 -992812 -233655 588587 1143407
35388 1143407 1350369 2174662 3379133 2696332 -456323 -2589714 -501167 3551361 4475506
35379 4475506 1334774 -1813405 -1994997 -768944 -754462 -1617655 -1170206 1225122 3942822
35370 3942822 5132549 4481283 3029399 1565616 -415879 -3444213 -6010677 -5533478
35362 -5533478 -1986478 1453782 2573820 2720864 3516441 3552131 1218618 -1359549 -1012837
35353 -1012837 1084001 779147 -2630775 -5257825 -4244018 -1004268 1817380 3443986
35345 3443986 4104557 3828109 3046949 2222629 534558 -2719673 -5525269 -4949496 -1663778
35336a663778K314411J36022M82430K104998J431187r79518j757761p04185l02296
35327A061510o85375k16926K09178j218556k483769l42429L149448K891270o98740
35318A665611j929914P28556K209756l87234l019307j588932J820241L005760
35310B504537J630350r4122j109345j069066N13677K252341J343151j777762k840192
35301A353569r1242K651762K009150J21163L98626J906384J856771N39155l31345
35292A0413993j433597l698339m707026j905530K214297K896529J96144j333786
35284B642685K54250K036045J568395L00955K23794N53384j66451j063270l63659
35275E986128J467729K165963Q74499q22529j333013j078132j132811r61166N76309
$$ plain form
35336 -1663778 650633 786655 1269085 3374083 4805270 3825752 2067991 1363806 1061510
35327 1061510 376135 159209 368387 -850169 -3333938 -3676367 -526919 2364351 1665611
35318 1665611 -264303 464253 2674009 2286775 -732532 -2321464 -501223 2504537
35310 2504537 4134887 4040765 2931420 1862354 2376031 4628372 5971523 4193761 1353569
35301 1353569 1262327 3914089 5923239 6044402 6443028 8349412 10206183 10745338 10413993
35292 10413993 8980396 5282057 575031 -1330499 883798 3780327 3976471 2642685
35284 2642685 2896935 4932980 6501375 6802330 7026124 7579508 7413057 6349787 5986128
35275 5986128 7453857 9619820 10494319 9671790 8338777 7260645 6127834 5166668 5742977
35266E742977K219157J025051k799309m668420j737165K257047J951652j688512
35258B302478l023526m46256J870429J211095j79154j96668k20294j189888j235618
35249a107402J72569L68642j345362j425624J648437L699146J611799r61874K83001
35240B943332K827771J910239j043446j195942J218946K221873J970022L787462
35232A4640257O161875L654303l387849p534788m897224n41601k87783k692276
35224E114914k985156o63350J038579N66948p39064j389266j077248k18124K94613
35215e7154j78447q57838m51361O45256R36025N15106P31757J244800L82600j337967
35205A572777j378053M60681J249161l78374k049779j613542j41904P19793J465600
$$ plain form
35266 5742977 7962134 8987185 6187876 1519456 -217709 2039338 3990990 2302478
35258 2302478 -721048 -1167304 703125 1914220 1735066 1538398 1318104 128216 -1107402
35249 -1107402 -934833 -566191 -1911553 -3337177 -1688740 2010406 3622205 2660331 2943332
35240 2943332 5771103 7681342 6637896 5441954 6660900 8882773 10852795 14640257
35232 14640257 20802132 24456435 21068586 13533798 8636574 8094973 7807190 5114914
35224 5114914 2129758 1466408 2504987 3071935 2332871 943605 -133643 -351767 -57154
35215 -57154 -235601 -1093439 -1544800 -899544 36481 551587 1283344 2528144 2910744 1572777
35205 1572777 194724 655405 1904566 1526192 -523587 -2137129 -2279033 -1559240 -93640
35196i3640K798837L531399K522047P19447n17200j319369k047971k014807r12867
35187B665876J95692N10240M36623J57786o82686j259332o1379K070498K193622
35178F226940l56206k681849k642418j467086o89242K83130J736231K015993N06155
35169B931648p03607k92987J07428o28137p50654P38875J490874j23800j646850
35160A122790o82917P87511J41793r25005L12733K069109R06098j866426k070026
35151b04340K91038J300768j11689j033380k20063K40633n43138q41365j80524
35142a302060j60720o11547M84354K273173J196789k490806l507024M68914M374940
35133G26013L085019q25003j269115K084229L847700J197830k605002l409396
$$ plain form
35196 -93640 2705197 6236596 8758643 9478090 8960890 7641521 5593550 3578743 2665876
35187 2665876 2861568 3371808 3808431 3966217 3283531 2024199 1962820 4033318 6226940
35178 6226940 5870734 3188885 546467 -920619 -1609861 -1326731 409500 2425493 2931648
35169 2931648 2228041 1935054 2042482 1414345 663691 1402566 2893440 2769640 1122790
35160 1122790 439873 1227384 1369177 444172 756905 2826014 3732112 1865686 -204340
35151 -204340 86698 1387466 1275777 242397 22334 262967 -280171 -1121536 -1302060
35142 -1302060 -1462780 -2074327 -1589973 683200 1879989 -610817 -4117841 -3648927 726013
35133 726013 3811032 2986029 1716914 3801143 7648843 8846673 6241671 2832275
35125B832275j228118J065210J571460N07158r61931j730881j283810r8140O85237
35116A358460M14574l54565n23358J94307Q43510M45175n67132q64845k45624
35107G00502N558p07442j195320o66051l96744j361466j704701O54728L811387
35098h59549L660160p0922l059897k494259n42614j48329n50808M68768K279171
35089a318279K440165Q00614l96858j32903J63276p87138k191728k425344j047892
35080d896087Q83846J951373J670743R12139Q47617J440802J604438Q99057N039
35071E318967p53466j892803l045706k405897O14359L440613L037769j3901k142313
35062B157622j429192L15200O09627l76173p77698j01946M01516J50716K07802
$$ plain form
35125 2832275 1604157 2669367 4240827 4747985 3786054 2055173 771363 673223 1358460
35116 1358460 1773034 1418469 895111 1089418 1932928 2378103 1810971 946126 700502
35107 700502 706060 -1382 -1196702 -1862753 -2259497 -3620963 -5325664 -4670936 -859549
35098 -859549 2800611 2729689 -330208 -2824467 -3367081 -3515410 -4066218 -3597450 -1318279
35089 -1318279 1121886 1922500 1525642 1392739 1556015 768877 -1422851 -3848195 -4896087
35080 -4896087 -4012241 -2060868 -390125 522014 1369631 2810433 4414871 5313928 5318967
35071 5318967 4565501 2672698 -373008 -2778905 -2164546 1276067 4313836 4299935 2157622
35062 2157622 728430 1043630 1653257 1277084 499386 397440 798956 949672 1157474
35053A157474J209980J844151Q00988p53667o45577P78838J011122n15074j535714
35044C352521j166280j677515l853731m025949M25430N321868M576021o05814
35036B346551l205743q55759J480175M40644p34403Q99339K294254K95429j850338
35027A110149K30256L858871K989314j916224m403658j984190P72482J5130k098908
35018a426778j871058N26195K446940K466032P13795j952522l562643k181875
35010d841914J157229K844011J218070j385092k141900j096545O9554M56537k1542
35001c741592j080324j615265o94393N42985L07443l68606J156827L948863L719682
34992B175620k17793k814535q78127J744502O23468j752604l79211L372794L705751
$$ plain form
35053 1157474 2367454 4211605 5012593 4258926 3613349 4392187 5403309 4888235 3352521
35044 3352521 2186241 508726 -3345005 -7370954 -6945524 -1623656 2952365 2346551
35036 2346551 -859192 -1714951 -234776 205868 -528535 370804 2665058 2960487 1110149
35027 1110149 1340405 5199276 8188590 6272366 1868708 -115482 657000 672130 -1426778
35018 -1426778 -3297836 -2771641 -324701 2141331 2855126 902604 -2660039 -4841914
35010 -4841914 -3684685 -840674 377396 -1007696 -3149596 -4246141 -4176587 -3720050 -3741592
35001 -3741592 -4821916 -6437181 -7131574 -6588589 -6281146 -6649752 -5492925 -1544062 2175620
34992 2175620 1957827 -856708 -1734835 9667 633135 -1119469 -1498680 1874114 5579865
34983E579865j55270l059974k458137j386782j821136j297185J429367L004709
34975a64543J219739o41183O48766K352945L19832l520127l712675J96431L161635
34966a39180K345572K37053m99856n62589r76455p00256O16748R14270p95775
34957D39532k067303p86309J158750R53621m33290q3176J660407J648046p01523
34948A788755k231776r44679J163631J477208L32980m56945n66786p04647o60666
34939h02925K24193J462602J910709J293780O1678j489918k764482k534634o07611
34930c246608J049951O50067o16798j72196J903073K724414P67687k028209l085915
34921b054534k222197q22924L61823J247068J453373P87947j059j38452M6496
$$ plain form
34983 5579865 5424595 2364621 -93516 -1480298 -3301434 -4598619 -3169252 -164543
34975 -164543 1055196 414013 1062779 3415724 3735556 215429 -3497246 -3300815 -139180
34966 -139180 2206392 2443445 1943589 1381000 404545 -295711 321037 1235307 439532
34957 439532 -1627771 -2414080 -1255330 -301709 -734999 -818175 842232 2490278 1788755
34948 1788755 -443021 -1387700 -224069 1253139 1586119 1129174 562388 -142259 -802925
34939 -802925 -578732 883870 2794579 4088359 4150037 2660119 -104363 -2638997 -3246608
34930 -3246608 -2196657 -1546590 -2163388 -2335584 -432511 2291903 3059590 1031381 -2054534
34921 -2054534 -4276731 -5099655 -4737832 -3490764 -2037391 -1249444 -1250503 -1388955 -1342459
34912a342459j41526n25920n54413l99829m65291l53323M48687J289525J109973
34903i34576K31712o6151K69682m3901j134004j123440J015478L097960K139551
34894C452311j252618l008569q14971K538654K642298o84405l224662k106233
34886b458195O40814J445674J01318q45136l71193P9910l08769m72468J16156
34877b071889K72772n79139j118082m70229K43821K38388P37148K281624K603359
34868B137773N9295k608474j566207K032978L268025O93910j753724j021404Q44958
34859B087130O76435r65795j590754j019406q83887j356804j130373J07303J401610
34850b674541K160927K261416J271364o65340j993104j631323q37843j196155
$$ plain form
34912 -1342459 -1483985 -2009905 -2564318 -2964147 -3429438 -3782761 -3334074 -2044549 -934576
34903 -934576 -702864 -769015 -499333 -543234 -1677238 -2800678 -1785200 1312760 3452311
34894 3452311 2199693 -808876 -1623847 914807 3557105 2872700 -351962 -2458195
34886 -2458195 -1817381 -371707 -270389 -1115525 -1486718 -1406808 -1715577 -2188045 -2071889
34877 -2071889 -1799117 -2378256 -3496338 -3966567 -3722746 -3484358 -2747210 -465586 2137773
34868 2137773 2197068 -411406 -1977613 55365 3323390 4017300 2263576 1242172 2087130
34859 2087130 2763565 1797770 207016 -812390 -1696277 -3053081 -4183454 -4076151 -2674541
34850 -2674541 -513614 1747802 3019166 2353826 360722 -1270601 -2108444 -3304599
34842c304599j684902k37175K400700L279185J755699M08453P25427P99421j107824
34833C034385l137703k331183Q02791K700271J428404j110182k031138r45141
34825a589496L25916N57674L30386M70581N83958J476o46081k27602P69999O55680
34815A232491o42641j108543J30047J139958L15008p57130J87637K216449K557221
34806E270497Q46575q50864j596359k045411j757705M11079K954154K481834j046676
34797D667124l332998j675545J224428J544930k85381j123884m2287J039838O12840
34788B629065p24942j336523j42584K088351K704183J03500l145606k844415O61574
34779g397K469880N36589j287767q5449J064093j090660l525810j891258J530642
$$ plain form
34842 -3304599 -4989501 -5226676 -2825976 453209 2208908 2617361 3342788 4142209 3034385
34833 3034385 -103318 -2434501 -1631710 1068561 2496965 1386783 -644355 -1589496
34825 -1589496 -1263580 -705906 -375520 95061 679019 680495 34414 -193188 576811 1232491
34815 1232491 589850 -518693 -388646 751312 1066320 309190 496827 2713276 5270497
34806 5270497 6117072 5266208 3669849 1624438 -133267 277812 3231966 5713800 4667124
34797 4667124 1334126 -341419 883009 2427939 2142558 1018674 976387 2016225 2629065
34788 2629065 1904123 567600 425016 2513367 5217550 5321050 2175444 -668971 -7397
34779 -7397 2462483 2999072 1711305 1625856 2689949 1599289 -1926521 -3817779 -2287137
34770b287137J409383j332591j109115K319808L177123k37212k421296j4413K706262
34761B210812J371023j387611j058822J205272J409824k02692k52428J455102
34753D750480J674182p83089l242797k981997k21645K610816K932517J08145l142250
34744A704362k968636N08415K555189L46271k548311j375214K435490L328612
34736C986178j42286l620162l524961j246295J96976L08791L37977P29290J076912
34727a897580J254784J285630Q97476N7076o13967n13873J22919L47239m90249
34718D49455j662640j419419O91939K373877J210775j489755k046358R6134J459543
34709c36449K66714o72101Q43999K100149O6079k777885j918762J805023L313323
$$ plain form
34770 -2287137 -877754 -2210345 -3319460 -999652 2177471 1940259 -481037 -495450 2210812
34761 2210812 3581835 2194224 1135402 2340674 3750498 3547806 3295378 4750480
34753 4750480 6424662 5641573 2398776 -583221 -804866 1805950 4738467 4846612 1704362
34744 1704362 -1264274 -755859 1799330 2145601 -402710 -1777924 657566 3986178
34736 3986178 3843892 223730 -3301231 -4547526 -4350550 -4041759 -3703782 -2974492 -1897580
34727 -1897580 -642796 642834 1540310 1597386 983419 469546 592465 939704 449455
34718 449455 -1213185 -2632604 -1940665 433212 1643987 154232 -1892126 -1795992 -336449
34709 -336449 -69735 -741836 102163 2202312 2268391 -509494 -2428256 -623233 2690090
34700B690090R57218j746247j993755q16923J45743Q92815J218985K16286j435846
34691A28366j763502p19435j27940j39844Q65759K458127K011255p21951k594825
34682f03990j858711m59550j90003l4922J018797J833212J565743J224941J148790
34673C644307N8707j753264j731126M91777J533895l75414k035513l77769K281826
34664A737426J828758j208316k718950j073762J379054K083732P78125j158539
34656A647528j886262n14085J370453J159660q16856j392237J54533N52675j571461
34647a296052k522383K34721K869890J059226k498538k290809R37087J912609
34639a594249O4613j07818K309085K827870l31456k960514k013677j70624k98137
$$ plain form
34700 2690090 3647308 1901061 -92694 -909617 -763874 128941 1347926 1564212 128366
34691 128366 -1635136 -2354571 -2482511 -2622355 -1756596 701531 2712786 1990835 -603990
34682 -603990 -2462701 -2922251 -3112254 -3147176 -2128379 -295167 1270576 2495517 3644307
34673 3644307 3703014 1949750 218624 710401 2244296 1868882 -166631 -544400 1737426
34664 1737426 3566184 2357868 -361082 -1434844 -55790 2027942 2806067 1647528
34656 1647528 -238734 -752819 617634 1777294 960438 -431799 -277266 275409 -1296052
34647 -1296052 -3818435 -3583714 -713824 345402 -2153136 -4443945 -3506858 -1594249
34639 -1594249 -1529636 -1637454 671631 3499501 3168045 207531 -1806146 -1976770 -2274907
34630b274907o33157Q69058J946712J00126k276227j432506J524869K522652J015156
34621A361776P6768P45468P08860j013046k042569o81101J106760P96103o87169
34612C71850n32031J368369K084420J93616j816038j207436P54258P13641j465081
34603D65568k442294p42355J003309N16894o65140m47675J35630m35915n50802
34594c162780J629349L811874K625324n25402j595848p77381j602258l585756
34586c182878k248526K506197M763860J885878r61869N81231K804478N59091l601230
34577C106232l411330Q97176L142765Q18742k061055j882037J75005J522549J483041
34568C791088J39399k259411l642559j520115K635545L903933N38980l145194
$$ plain form
34630 -2274907 -2908064 -2039006 -92294 7832 -2268395 -3700901 -2176032 346620 1361776
34621 1361776 1438544 2184012 2892872 1879826 -162743 -843844 262916 1059019 371850
34612 371850 -160181 1208188 3292608 3486224 1670186 462750 1217008 1930649 465568
34603 465568 -1976726 -2719081 -1715772 -1198878 -1864018 -2311693 -2176063 -2611978 -3162780
34594 -3162780 -1533431 2278443 4903767 4378365 2782517 2005136 402878 -3182878
34586 -3182878 -5431404 -2925207 1838653 3724531 2762662 3343893 6148371 6707462 3106232
34577 3106232 -305098 592078 3734843 4553585 2492530 610493 785498 2308047 3791088
34568 3791088 3930487 1671076 -1971483 -3491598 -856053 3047880 3586860 441666
34560D41666k714309L95822J630151n9461j645637j111265K06809N92993N02418
34551a760813R89052J502194R08882k75487m58422M58233Q31420J8007l36462
34542A876604J114890K951812K840959R10360q23111j788414l040465m150127
34534a07492k943204O71442L381287K645041j5185j656307j789334j622127j356505
34525b792384n81033J55863M61704J359423L135924L550701R39971k372331k940726
34516I17112j286232o08436j328081r62027Q06477J324384p2640n57613J206031
34507e61025K419505O49140k228818l030581j617526J45794J425893J949319P62315
34498h5984j745768k549797J62631L373878K793534j006985l464020k447350k21902
$$ plain form
34560 441666 -2272643 -1876821 -246670 -306131 -1951768 -3063033 -2856224 -2263231 -1760813
34551 -1760813 -771761 730433 1639315 1363828 905406 1363639 2195059 2213066 1876604
34542 1876604 2991494 5943306 8784265 9694625 8871514 7083100 4042635 -107492
34534 -107492 -3050696 -2379254 1002033 3647074 3631889 1975582 186248 -1435879 -2792384
34525 -2792384 -3373417 -3217554 -2755850 -1396427 1739497 5290198 6230169 3857838 917112
34516 917112 -369120 -977556 -2305637 -3267664 -2461187 -1136803 -1209443 -1767056 -561025
34507 -561025 1858480 2507620 278802 -2751779 -4369305 -4223511 -2797618 -848299 -85984
34498 -85984 -1831752 -4381549 -4218918 -845040 1948494 941509 -2522511 -4969861 -5191763
34489e191763R96321J690706K403025J977074J67683q40857L23831J648582P21630
34480C896232j414523j928503n56311L75850k42868j066289q80110r4388P19956
34471a190954J663432K282444J522827k46706j076179l69704n5489j364677k364095
34462a199101q52055J760038K138145j17059k049586j675751q5877J080114J637237
34453F36105J575010K97374j588430j954944k38498J102315R5158j514137q74091
34444b464138J399320K032276O9067j722952r48248J159864J756123K47391j277319
34435B51384j007206L97073R26674r231p96056L1985J483884J409733k39855j243505
34425A204880n05106M09714J19793k51891O60146J659322Q46787q66662q70636
$$ plain form
34489 -5191763 -4195442 -2504736 -101711 1875363 2043046 1202189 1526020 3174602 3896232
34480 3896232 2481709 553206 -3105 372745 129877 -936412 -1816522 -1910910 -1190954
34471 -1190954 472478 2754922 4277749 4031043 2954864 2585160 2529671 1164994 -1199101
34462 -1199101 -2051156 -291118 1847027 1729968 -319618 -1995369 -2081246 -1001132 636105
34453 636105 2211115 2508489 920059 -1034885 -1273383 -171068 -75910 -1590047 -2464138
34444 -2464138 -1064818 967458 1036525 -686427 -1634675 -474811 1281312 1528703 251384
34435 251384 -755822 -358749 567925 558694 -237362 -205377 1278507 2688240 2448385 1204880
34425 1204880 699774 1109488 1229281 977390 1637536 3296858 4143645 3276983 2406347
34416B406347R13405J687050K015k156335k430966j247138o08932j081223j392199
34407c907976m92859J064976J797135Q90384r25992k134223k028947j145233m4866
34398f927601J352582K704255K743743J040889p03552o14406P79327J464914Q60174
34389B700325R3193k24890o16948j169479j132765l11055O42075J449029K272194
34380C701679K496168J094240j418116k880978j956071K98482J689130R74089
34372C998623j273033l056903k495019J07276K203120K053853R68396J030489
34364C536802J660720O87311j765677l085565j966451k0773Q24426N04664o9434
34355C06023l09853J4351N69688L00102j088260k012186j133408L18684N93529
$$ plain form
34416 2406347 3319752 5006802 5008817 2852482 421516 -825622 -1434554 -2515777 -3907976
34407 -3907976 -4400835 -3335859 -1538724 -648340 -1574332 -3708555 -5737502 -6882735 -6927601
34398 -6927601 -5575019 -2870764 -127021 913868 210316 -404090 375237 1840151 2700325
34389 2700325 2793518 2568628 1951680 782201 -350564 -661619 -19544 1429485 3701679
34380 3701679 6197847 7292087 5873971 2992993 1036922 1335404 3024534 3998623
34372 3998623 2725590 -331313 -2826332 -2719056 -515936 1537917 2506313 3536802
34364 3536802 5197522 5884833 4119156 1033591 -932860 -953633 -129207 375457 306023
34355 306023 -3830 10521 580209 880311 -207949 -2220135 -3353543 -3034859 -2441330
34346b441330N48915J693604K414011K69770k763508k380901O84973J087588k200411
34337c087289l543350J33942L837567K443261j101604r72001K130198K950260
34329B790984N22189j289379q79119m83677q56158r711J999062K129412l35367
34320C588236j927181m32318J476301M94936k230947l067575j243232M92276N0072
34311b799432j355109j261344N54631J796663R34128m31130J18870J775174J235609
34302E68060k049672m247775k445910J062312K348503J470240J219650J834482
34294b40110R25889j641325k638853j65138L317873L929863Q06265l202153m397383
34285c305072j785034J606224J782160j065391k233699J066163N194483M800004
$$ plain form
34346 -2441330 -1892415 -198811 2215200 2484970 -278538 -2659439 -1974466 -886878 -3087289
34337 -3087289 -6630639 -6496697 -2659130 -215869 -1317473 -2289474 -159276 2790984
34329 2790984 3313173 2023794 1144675 660998 -195160 -204871 1794191 3923603 3588236
34320 3588236 1661055 1228737 2705038 3199974 969027 -2098548 -3341780 -2849504 -2799432
34311 -2799432 -4154541 -5415885 -4861254 -3064591 -2130463 -2561593 -2442723 -667549 568060
34302 568060 -1481612 -5729387 -8175297 -7112985 -4764482 -3294242 -2074592 -240110
34294 -240110 685779 -955546 -3594399 -3759537 -441664 3488199 4294464 1092311 -3305072
34285 -3305072 -5090106 -3483882 -1701722 -2767113 -5000812 -3934649 1259834 6059838
34277F059838K23692l390174l245613j239799L48285J382939J731191M59358j777538
34268E52179k633119j392262J36748O28815N80816L53601k97820m92887Q79850
34259a684079K294701J141596j405653j176182K197336L669995J88746m350933
34251H75527m648481j238912J322680J083138j62768p68292p61763k32931Q57321
34242c674481J575551R98133n6596j57146M09723K70442n68625p39936K11911
34233a731024J215747J359997Q96185M01113j13214r27627j836179j940096n81103
34224c256201J340660J825309L78272r07147l51423M35016r54914l287850k985864
34215g764142K27623K507184J500299n17387m57083J501503L148788L118794J239192
$$ plain form
34277 6059838 6283530 2893356 -352257 -1592056 -1243771 139168 1870359 2329717 552179
34268 552179 -2080940 -3473202 -3336454 -2707639 -2126823 -1773222 -2071042 -2563929 -1684079
34259 -1684079 610622 1752218 346565 -829617 1367719 5037714 5226460 875527
34251 875527 -3772954 -5011866 -3689186 -2606048 -2768816 -3537108 -4298871 -4531802 -3674481
34242 -3674481 -2098930 -1100797 -1157393 -1314539 -904816 -634374 -1202999 -1942935 -1731024
34233 -1731024 -515277 844720 1740905 2142018 2028804 1101177 -735002 -2675098 -3256201
34224 -3256201 -1915541 -90232 288040 -619107 -970530 -535514 -1490428 -4778278 -7764142
34215 -7764142 -7536519 -5029335 -3529036 -4046423 -4503506 -3002003 146785 3265579 4504771
34206D504771j644787l240629j792217P90786Q85852j134626j128772J779770
34198i79852L221218Q37902j589147o65288R56205l0476j158046J056642L671087
34189E320245J501028l509920m396070k1894L194937J177484k511161l102557
34181b347908j083220L00581P5992m44057r1598J392560L043716K611840p88316
34172B669590m037132l189777O59488K413492L14565j849901r77332J106657J546489
34163a343861Q03928N89475N36628l15867j043670m01387Q68368J355209J028789
34154B077612L53691q44700k100866j867495J091J274069N18885p36802p19229
34145b043744j31818j90901j41500Q53931J332183j71928k018645j654071K35041
$$ plain form
34206 4504771 2859984 -380645 -2172862 -1382076 -496224 -1630850 -2759622 -979852
34198 -979852 2241366 3079268 1490121 824833 1781038 1750562 592516 1649158 5320245
34189 5320245 6821273 3311353 -1084717 -1106611 2088326 3265810 754649 -2347908
34181 -2347908 -3431128 -3130547 -3054555 -3498612 -3590210 -2197650 846066 3457906 2669590
34172 2669590 -1367542 -4557319 -3897831 -1484339 -1169774 -3019675 -3997007 -2890350 -1343861
34163 -1343861 -539933 49542 586170 270303 -773367 -1174754 -306386 1048823 2077612
34154 2077612 2431303 1586603 -514263 -2381758 -2380667 -1106598 -587713 -1324515 -2043744
34145 -2043744 -2175562 -2366463 -2507963 -1654032 -321849 -493777 -2512422 -4166493 -3931452
34136c931452Q80535K7292N4059J553112K131201M95242j152023m64546J328223
34127I21643J150630j446880l604987k943364l99076J376616J333755O02934L23511
34118b685218L81061M37287O66504P82506j45311j775913j940687L22835K596376
34109a360560K129871j11904j072495l09642Q3913l11376J47772J220311N23009
34100I38899j796072k235044M17601K558540J405948n36270O2046J691071R10153
34091C416872j459885j699448M69919J538381M8591j446508r22289K57301K36867
34082D39801n02520p42828p55821j283590j729285q97065J104624K710024K515539
34073H58879Q01597n11685J39153J782775J777026m73944k176971r75445J410981
$$ plain form
34136 -3931452 -3050917 -3023625 -2969566 -1416454 714747 1209989 57966 -406580 921643
34127 921643 2072273 625393 -2979594 -5922958 -6322034 -4945418 -3611663 -3008729 -2685218
34118 -2685218 -2304157 -1866870 -1200366 -417860 -563171 -2339084 -4279771 -3956936 -1360560
34109 -1360560 769311 657407 -415088 -724730 -640817 -952193 -804421 415890 938899
34100 938899 -857173 -3092217 -2674616 -116076 1289872 753602 815648 2506719 3416872
34091 3416872 1956987 257539 727458 2265839 2314430 867922 -54367 202934 439801
34082 439801 -62719 -805547 -1561368 -2844958 -4574243 -5471308 -4366684 -1656660 858879
34073 858879 1660476 1148791 1287944 3070719 4847745 4373801 2196830 1221385 2632366
34064B632366J619634l90003j618482q58718j67669j025493j874751p95592J451656
34055a027052K629685J994404P12495O3467K18994M14447j62177j359361k004244
$$ plain form
34064 2632366 4252000 3861997 2243515 1384797 1217128 191635 -1683116 -2478708 -1027052
34055 -1027052 1602633 3597037 4309532 4372999 4591993 5006440 4844263 3484902 1480658
$$ [...]
##END NTUPLES=NMR SPECTRUM
##END=
