##TITLE=31Pdec_LR-729-B-R3-1
 , 24 sc
 9.11.2021
##JCAMPDX= 6.0         $$ Bruker NMR JCAMP-DX V2.0
##DATA TYPE= NMR SPECTRUM
##DATA CLASS= NTUPLES
##ORIGIN= UXNMR, Bruker Analytische Messtechnik GmbH
##OWNER= root
$$ XWIN-NMR		Version 3.5
$$ Tue Nov  9 12:09:42 2021 Russian Standard Time (UT+4h)  she@DPX200
##.OBSERVE FREQUENCY= 81.013821
##.OBSERVE NUCLEUS= ^31P
##.ACQUISITION MODE= SIMULTANEOUS
##.ACQUISITION SCHEME= undefined
##.AVERAGES= 24
##.DIGITISER RES= 16
##SPECTROMETER/DATA SYSTEM= spect
##.PULSE SEQUENCE= zgpg30
##.SOLVENT NAME= CDCl3
##.SHIFT REFERENCE= (INTERNAL, CDCl3, 0, 248.564)
##AUDIT TRAIL= $$ (NUMBER, WHEN, WHO, WHERE, WHAT)
$$ ##TITLE= Audit trail, XWIN-NMR		Version 3.5
$$ ##JCAMPDX= 5.01
$$ ##ORIGIN= Bruker BioSpin GmbH
$$ ##OWNER= she
$$ F:/spectra/data/she/nmr/P31/1/pdata/1/auditp.txt
$$ ##AUDIT TRAIL=  $$ (NUMBER, WHEN, WHO, WHERE, WHAT)
(   1,<2021-11-09 12:08:19.71 +0400>,<she>,<DPX200>,
      <created by zg, POWCHK disabled, PULCHK disabled
       configuration hash MD5:
       00 E9 B6 7A A2 85 ED C7 34 08 36 98 17 FE 4E 26
       data hash MD5: 32K
       4A 3D 0A 3C C1 08 28 71 A2 77 C1 2C E2 2C 83 32>)
(   2,<2021-11-09 12:08:22.89 +0400>,<she>,<DPX200>,
      <Start of raw data processing
       efp BC_mod = 2 LB = 1 FT_mod = 6 PKNL = 1 PHC0 = -8842.109 PHC1 = 117.6694 SI = 64K 
       data hash MD5: 64K
       A5 52 F1 96 87 94 85 AE DE 23 1D 88 28 A9 FF AA>)
(   3,<2021-11-09 12:08:47.67 +0400>,<she>,<DPX200>,
      <pk PHC0 = -38.55301 PHC1 = 101.8 
       data hash MD5: 64K
       E7 C2 6D ED D5 16 91 BC E9 19 14 CC F6 9A 82 B2>)
$$ ##END=
$$ 
$$ hash MD5
$$ 68 0E 07 EC DF 07 BF 8A 2B 8B 32 75 C4 9D AB 6D
##$RELAX= 
##$RELAX= 
##$RELAX= 
##$RELAX= 
##$RELAX= 
##$RELAX= 
##$RELAX= 
##$RELAX= 
$$ Bruker specific parameters
$$ --------------------------
##$DU= <F:/spectra>
##$EXPNO= 1
##$NAME= <P31>
##$PROCNO= 1
##$TYPE= <nmr>
##$USER= <she>
##$AMP= (0..31)
100 100 100 100 100 100 100 100 100 100 100 100 100 100 100 100 100 100 
100 100 100 100 100 100 100 100 100 100 100 100 100 100 
##$AQSEQ= 0
##$AQ_mod= 1
##$AUNM= <au_zg>
##$AUTOPOS= <>
##$BF1= 81.014009
##$BF2= 200.13
##$BF3= 200.13
##$BF4= 200.13
##$BF5= 200.13
##$BF6= 200.13
##$BF7= 200.13
##$BF8= 200.13
##$BYTORDA= 1
##$CFDGTYP= 0
##$CFRGTYP= 5
##$CHEMSTR= <none>
##$CNST= (0..31)
1 1 145 1 1 1 1 1 1 1 1 1 1 1 1 1 1 1 1 1 1 1 1 1 1 1 1 1 1 1 1 1 
##$CPDPRG= <waltz16>
##$CPDPRG1= <>
##$CPDPRG2= <waltz16>
##$CPDPRG3= <>
##$CPDPRG4= <mlev>
##$CPDPRG5= <mlev>
##$CPDPRG6= <mlev>
##$CPDPRG7= <mlev>
##$CPDPRG8= <mlev>
##$CPDPRGB= <>
##$CPDPRGT= <>
##$D= (0..31)
0 1 0 0 0 0 0 0 0 0 0 0.03 2e-05 3e-06 0 0 0 0 0 0 0 0 0 0 0 0 0 0 0 0 
0 0 
##$DATE= 1636445299
##$DBL= (0..7)
120 120 120 11 120 120 24 19 
##$DBP= (0..7)
150 150 150 150 150 150 150 150 
##$DBP07= 0
##$DBPNAM0= <>
##$DBPNAM1= <>
##$DBPNAM2= <>
##$DBPNAM3= <>
##$DBPNAM4= <>
##$DBPNAM5= <>
##$DBPNAM6= <>
##$DBPNAM7= <>
##$DBPOAL= (0..7)
0.5 0.5 0.5 0.5 0.5 0.5 0.5 0.5 
##$DBPOFFS= (0..7)
$$ [...]
##$SUBNAM2= <"">
##$SUBNAM3= <"">
##$SUBNAM4= <"">
##$SUBNAM5= <"">
##$SUBNAM6= <"">
##$SUBNAM7= <"">
##$SUBNAM8= <"">
##$SUBNAM9= <"">
##$SW= 501.771253377433
##$SWIBOX= (0..15)
0 1 3 0 0 0 0 0 0 0 0 0 0 0 0 0 
##$SW_h= 40650.406504065
##$TD= 32768
##$TD0= 1
##$TE= 0
##$TE2= 300
##$TE3= 300
##$TEG= 300
##$TL= (0..7)
0 120 53 12 22 120 120 120 
##$TP= (0..7)
150 150 150 150 150 150 150 150 
##$TP07= 0
##$TPNAME0= <>
##$TPNAME1= <>
##$TPNAME2= <>
##$TPNAME3= <>
##$TPNAME4= <>
##$TPNAME5= <>
##$TPNAME6= <>
##$TPNAME7= <>
##$TPOAL= (0..7)
0.5 0.5 0.5 0.5 0.5 0.5 0.5 0.5 
##$TPOFFS= (0..7)
0 0 0 0 0 0 0 0 
##$TUNHIN= 0
##$TUNHOUT= 0
##$TUNXOUT= 0
##$USERA1= <user>
##$USERA2= <user>
##$USERA3= <user>
##$USERA4= <user>
##$USERA5= <user>
##$V9= 5
##$VALIST= <valist>
##$VCLIST= <CCCCCCCCCCCCCCC>
##$VD= 0
##$VDLIST= <DDDDDDDDDDDDDDD>
##$VPLIST= <PPPPPPPPPPPPPPP>
##$VTLIST= <TTTTTTTTTTTTTTT>
##$WBST= 1024
##$WBSW= 4
##$XGAIN= (0..3)
0 0 0 0 
##$XL= 0
##$YL= 0
##$YMAX_a= 3500
##$YMIN_a= -5279
##$ZGOPTNS= <>
##$ZL1= 120
##$ZL2= 120
##$ZL3= 120
##$ZL4= 120
##$ABSF1= 0
##$ABSF2= 0
##$ABSG= 0
##$ABSL= 0
##$ALPHA= 0
##$AQORDER= 0
##$ASSFAC= 0
##$ASSFACI= 0
##$ASSFACX= 0
##$ASSWID= 0
##$AUNMP= <proc_1d>
##$AZFE= 0.1
##$AZFW= 0.5
##$BCFW= 0
##$BC_mod= 2
##$BYTORDP= 0
##$COROFFS= 0
##$CY= -3
##$DATMOD= 1
##$DC= 0
##$DFILT= <>
##$DTYPP= 0
##$F1P= 0
##$F2P= 0
##$FCOR= 1
##$FTSIZE= 65536
##$FT_mod= 6
##$GAMMA= 0
##$GB= 0
##$INTBC= 1
##$INTSCL= 5.30512e-09
##$ISEN= 30
##$LB= 1
##$LEV0= 0
##$LPBIN= 0
##$MAXI= 10000
##$MC2= 0
##$MEAN= 0
##$ME_mod= 0
##$MI= 50
##$NCOEF= 0
##$NC_proc= -7
##$NLEV= 6
##$NOISF1= 182.463
##$NOISF2= 159.3651
##$NSP= 0
##$NTH_PI= 0
##$NZP= 0
##$OFFSET= 248.5645
##$PC= 4
##$PHC0= -8880.662
##$PHC1= 219.4694
##$PH_mod= 1
##$PKNL= yes
##$PPARMOD= 0
##$PSCAL= 0
##$PSIGN= 0
##$REVERSE= no
##$SF= 81.014009
##$SI= 65536
##$SIGF1= 159.3651
##$SIGF2= -187.1042
##$SINO= 113.3802
##$SIOLD= 16384
##$SREGLST= <1H.CDCl3>
##$SSB= 0
##$STSI= 65536
##$STSR= 0
##$SW_p= 40650.406504065
##$SYMM= 0
##$S_DEV= 0
##$TDeff= 32768
##$TDoff= 0
##$TI= <>
##$TILT= no
##$TM1= 0
##$TM2= 0
##$TOPLEV= 0
##$USERP1= <user>
##$USERP2= <user>
##$USERP3= <user>
##$USERP4= <user>
##$USERP5= <user>
##$WDW= 1
##$XDIM= 65536
##$YMAX_p= 399139499
##$YMIN_p= -164974996
$$ End of Bruker specific parameters
$$ ---------------------------------
##NTUPLES= NMR SPECTRUM
##VAR_NAME=  FREQUENCY,     SPECTRUM/REAL,   SPECTRUM/IMAG
##SYMBOL=    X,             R,               I
##VAR_TYPE=  INDEPENDENT,   DEPENDENT,       DEPENDENT
##VAR_FORM=  AFFN,          ASDF,            ASDF
##VAR_DIM=   65536,         65536,           65536
##UNITS=     HZ,            ARBITRARY UNITS, ARBITRARY UNITS
##FACTOR=    0.620285442955139, 1,           1
##FIRST=     20137.2065510759, 0,            0
##LAST=      -20513.1999529892, 0,           0
##MIN=       -20513.1999529892, -164974996,  0
##MAX=       20137.2065510759, 399139499,    0
$$ Real data points
##PAGE= N=1
##DATA TABLE= (X++(R..R)), XYDATA
$$ [...]
##PAGE= N=2
##DATA TABLE= (X++(I..I)), XYDATA
$$ plain form
39301 839733 196827 22741 -719566 -1582032 -2279502 -3161442 -3981994 -4215674 -4428321 -5507442
39291 -5507442 -6852220 -7063195 -6035484 -4768368 -3652931 -2535002 -1817718 -1891038 -2156154
39282 -2156154 -2151050 -2746982 -4533891 -6005728 -5355313 -3347604 -2381057 -3185306 -4340650
39273 -4340650 -4675437 -4350861 -3837341 -3370205 -3172082 -3012166 -2096577 -494537 234352
39264 234352 -916929 -2788495 -3809510 -4134655 -4569436 -4817770 -4582151 -4939034 -6557752
39255 -6557752 -7915200 -7445441 -6058791 -5214663 -4106131 -1583007 664807 268517 -1560225
39246 -1560225 -1683734 -365193 -919138 -3942635 -5958110 -4713443 -2181189 -911248
39238 -911248 -627653 -143807 144789 -346219 -716094 -222624 180733 -285410 -431543 975222
$$ packed form
39301H39733o42906j74086p42307q62466o97470q81940q20552k33680k12647j079121
39291e507442j344778k10975J027711J267116J115437J117929P17284p3320k65116
39282b156154N104n95932j786909j471837O50415K007709R66547q04249j155344
39273d340650l34787L24576N13520M67136J98123J59916R15589J602040P28889
39264B34352j151281j871566j021015l25145m34781k48334K35619l56883j618718
39255f557752j357448M69759J386650Q44128J108532K523124K247814l96290j828742
39246a560225j23509J318541n53945l023497k015475J244667K532254J269941
39238i11248K83595M83846K88596m91008l69875M93470M03357m66143j46133J406765
$$ plain form
39228 975222 2750338 2654093 513002 -1615137 -2066134 -1192964 -551700 -1269652 -3132521
39219 -3132521 -4877053 -5461262 -4997560 -4165966 -3180253 -2086657 -1541698 -2097170 -3023191
39210 -3023191 -3131121 -2532804 -2230001 -2248300 -1801590 -1155420 -1456966 -2533853 -2755512
39201 -2755512 -1576501 -459311 -574100 -1173403 -1103556 -552834 -326850 -445163 -412796
39192 -412796 -213979 -333843 -1148573 -2447008 -3134519 -1802482 1469688 4324463 4449914
39183 4449914 2387916 580783 -26166 -645708 -2107846 -3736276 -4961257 -6006223
39175 -6006223 -6548946 -5678206 -3707490 -2106706 -1165826 127089 1348919 442363 -2490718
39166 -2490718 -3851905 -1136622 3081391 4177825 1274382 -2275080 -3385634 -2036789
$$ packed form
39228I75222J775116r6245k141091k128139m50997Q73170O41264p17952j862869
39219c132521j744532n84209M63702Q31594R85713J093596N44959n55472r26021
39210c023191j07930N98317L02803j8299M46710O46170l01546j076887k21659
39201b755512J179011J117190j14789n99303O9847N50722K25984j18313L2367
39192d12796J98817j19864q14730j298435o87511J332037L272170K854775J25451
39183D449914k061998j807133o06949o19542j462138j628430j224981j044966
39175f006223n42723Q70740J970716J600784R40880J292915J221830r06556k933081
39166b490718j361187K715283M218013J096434k903443l549462j110554J348845
$$ plain form
39158 -2036789 19795 1277541 1080478 -257046 -1682246 -2677869 -4078229 -6564088
39150 -6564088 -8769102 -8494731 -6028329 -4655471 -6829010 -10709367 -11895085 -8571255
39142 -8571255 -3626826 -953389 -826779 -621525 508269 346681 -2164141 -4215747 -2997394
39133 -2997394 -311694 -181594 -2834575 -4523900 -3254582 -1261666 -1104581 -2369786
39125 -2369786 -3364678 -3423385 -2373153 -251897 1279335 -81093 -3508690 -5078384 -3258045
39116 -3258045 -1410782 -2551496 -4619969 -4134079 -2048866 -2086475 -4727860 -6860716 -6809515
39107 -6809515 -6005410 -5643423 -4990506 -3435199 -1450032 887049 3817320 6062571 5645879
39098 5645879 3022885 889815 281559 -608308 -2917687 -5049663 -5429590 -4991626 -5201638
$$ packed form
39158b036789K056584J257746j97063j337524j425200r95623j400360k485859
39150f564088k205014K74371K466402J372858k173539l880357j185718L323830
39142h571255M944429K673437J26610K05254J129794j61588k510822k051606J218353
39133b997394K685700J30100k652981j689325J269318J992916J57085j265205
39125b369786r94892n8707J050232K121256J531232j360428l427597j569694J820339
39116c258045J847263j140714k068473M85890K085213l7609k641385k132856N1201
39107f809515Q04105L61987O52917J555307J985167K337081K930271K245251m16692
39098E645879k622994k133070o08256q89867k309379k131976l79927M37964k10012
$$ plain form
39089 -5201638 -5476724 -4520625 -2914120 -2398663 -3256270 -4009836 -3374268 -1364738 1105496
39080 1105496 2746537 2480170 468616 -1759888 -2904412 -3170615 -3407594 -3726617 -3841183
39071 -3841183 -4084227 -4940038 -5896659 -5861649 -4674573 -3349734 -2812440 -3095230 -3761133
39062 -3761133 -4447638 -4936982 -5237465 -5648924 -6339578 -6955449 -7091723 -6924987 -6741057
39053 -6741057 -6063724 -4224777 -1914981 -1049792 -2414037 -4261352 -4250565 -2347918 -686010
39044 -686010 -621642 -1200461 -1022334 -511290 -1281994 -3788798 -6724479 -8648501 -9227878
39035 -9227878 -8798117 -7697777 -6422281 -5647182 -5587273 -5851595 -6218704 -6822379 -7176035
39026 -7176035 -6025904 -3154735 -610962 -772427 -3292182 -5233644 -4531583 -2279168
$$ packed form
39089e201638k75086R56099J606505N15457q57607p53566O35568K009530K470234
39080A105496J641041k66367k011554k228504j144524k66203k36979l19023j14566
39071c841183k43044q55811r56621L5010J187076J324839N37294k82790o65903
39062c761133o86505m89344l00483m11459o90654o15871j36274J66736J83930
39053f741057O77333J838947K309796Q65189j364245j847315J0787J902647J661908
39044f86010O4368n78819J78127N11044p70704k506804k935681j924022n79377
39035i227878M29761J100340J275496P75099N9909k64322l67109o03675l53656
39026g176035J150131K871169K543773j61465k519755j941462P02061K252415
$$ plain form
39018 -2279168 -1058575 -1856245 -3436367 -4286202 -4215458 -3955737 -3948236 -4062220 -4250679 -4844994
39008 -4844994 -5915128 -6701901 -6252884 -4669061 -3201801 -2817827 -3047126 -2667681 -1286967
38999 -1286967 244259 911175 546612 -313522 -1177931 -1948365 -2685747 -3275774 -3420119
38990 -3420119 -2956755 -2114222 -1351683 -1018899 -1330107 -2485598 -4334001 -5880329 -5795163
38981 -5795163 -3897477 -1763060 -1301452 -2834646 -4959397 -6129048 -5927336 -4924513
38973 -4924513 -3853681 -3089172 -2616745 -2326615 -2313919 -2682594 -2971997 -2296538 -547849
38964 -547849 994409 1043187 34381 -516595 -332984 -768044 -2419001 -3659082 -2683042
38955 -2683042 -217727 1154994 75264 -2407836 -4516164 -5273515 -4392358 -2217945
$$ packed form
39018b279168J220593p97670j580122q49835P0744K59721P501j13984j88459n94315
39008d844994j070134p86773M49017J583823J467260L83974k29299L79445J380714
38999a286967J531226O66916l64563q60134q64409p70434p37382n90027j44345
38990c420119M63364Q42533P62539L32784l11208j155491j848403j546328Q5166
38981e795163J897686K134417M61608j533194k124751j169651K01712J002823
38973d924513J070832P64509M72427K90130J2696l68675k89403O75459J748689
38964e47849J542258M8778j008806n50976J83611m35060j650957j240081R76040
38955b683042K465315J372721j079730k483100k108328p57351Q81157K174413
$$ plain form
38947 -2217945 -241927 -183980 -1806718 -2992097 -2774819 -2635024 -3536073 -3670410 -1452323
38938 -1452323 863012 -176652 -3612606 -4826807 -2296884 184955 -574965 -2670532
38930 -2670532 -2849990 -1577820 -1164601 -1346386 -506928 394242 -764310 -2841133 -2697853
38921 -2697853 -696868 -544185 -3060106 -4536549 -2809022 -758771 -1335284 -2778697
38913 -2778697 -2047278 -142394 -238893 -2327695 -3540721 -2876552 -2044817 -2001246 -2001834 -2157831
38903 -2157831 -3713872 -6213818 -7304550 -6306055 -5376741 -5932772 -6365378 -4975913 -3033485
38894 -3033485 -2703732 -3424011 -2862545 -820877 335944 -702336 -2323952 -2536882 -1738141
38885 -1738141 -1772714 -3260962 -5149218 -6421378 -7038167 -7261054 -7062866 -6366099 -5148914
$$ packed form
38947b217945J976018N7947j622738j185379K17278J39795r01049j34337K218087
38938a452323K315335j039664l435954j214201K529923K481839p59920k095567
38930b670532j79458J272170M13219j81785Q39458R01170j158552k076823J43280
38921b697853K000985J52683k515921j476443J727527K050251n76513j443413
38913b778697P31419J904884r6499k088802j213026O64169Q31735M3571n88j55997
38903b157831j556041k499946j090732R98495R29314n56031m32606J389465J942428
38894c033485L29753p20279N61466K041668J156821j038280j621616k12930P98741
38885a738141l4573j488248j888256j272160o16789k22887J98188O96767J217185
$$ plain form
38876 -5148914 -3298021 -1113402 181870 -386702 -1749289 -1666866 28166 762021 -1015895
38867 -1015895 -3089253 -2470224 125218 1372339 336472 -510768 465193 1630248 966173
38858 966173 -896254 -1935557 -1352671 284723 1966089 2268715 223410 -2640615 -3027479
38849 -3027479 -212560 2265168 1206731 -1764737 -2732040 -927003 1223143 2356808
38841 2356808 3189572 3693264 2729878 943238 823209 2811156 4111884 2865827 1088482
38832 1088482 1525932 3497727 4214949 3095031 2300505 3256728 4821879 5323611 4687948
38823 4687948 3666132 2170960 -284667 -2915766 -3861215 -2529268 -773597 -793932 -2377195
38814 -2377195 -3387094 -2812237 -1845699 -1539042 -959602 1162271 4060951 5691846 5291885
$$ packed form
38876e148914J850893K184619J295272n68572j362587Q2423J695032P33855j777916
38867a015895k073358O19029K595442J247121j035867q47240R75961J165055o64075
38858I66173j862427j039303N82886J637394J681366L02626k045305k864025l86864
38849c027479K814919K477728j058437k971468r67303J805037K150146J133665
38841B356808Q32764N03692r63386j786640j20029J987947J300728j246057j777345
38832A088482M37450J971795P17222j119918p94526R56223J565151N01732o35663
38823D687948j021816j495172k455627k631099r45449J331947J755671k0335j583263
38814b377195j009899N74857R66538L06657N79440K121873K898680J630895l99961
$$ plain form
38805 5291885 3768919 1877443 -443194 -2757786 -3594640 -2023738 840780 2672565
38797 2672565 2337463 1147498 1270529 2758375 3027633 316061 -3209891 -3882055 -1858478
38788 -1858478 -1189262 -3709886 -6008501 -4610621 -1374255 -475737 -1975200 -2279136 -144175
38779 -144175 1787567 1586222 506316 35653 -396970 -1532007 -2592282 -2766992 -2464352
38770 -2464352 -2135539 -1589189 -1103855 -1394489 -2004031 -1696795 -807570 -987720 -2256267
38761 -2256267 -2796535 -2149488 -1813466 -2003104 -984697 1206820 1709117 -790515 -3758554
38752 -3758554 -4856945 -5097402 -5660937 -4968603 -2061017 175065 -1018329 -3497254 -3518506
38743 -3518506 -1851990 -2133227 -4452296 -5336153 -3667432 -2015544 -1817121 -1499162 -181200
$$ packed form
38805E291885j522966j891476k320637k314592q36854J570902K864518J831785
38797B672565l35102j189965J23031J487846K69258k711572l525952o72164K023577
38788a858478O69216k520624k298615J397880L236366Q98518j499463l03936K134961
38779a44175J931742k01345j079906m70663m32623j135037j060275j74710L02640
38770b464352L28813N46350M85334k90634o09542L07236Q89225j80150j268547
38761b256267n40268O47047L36022j89638J018407K191517N02297k499632k968039
38752c758554j098391k40457n63535O92334K907586K236082j193394k478925k1252
38743c518506J666516k81237k319069q83857J668721J651888J98423L17959J317962
$$ plain form
38734 -181200 575569 -178122 -1252423 -1897347 -2899201 -4153376 -4162295 -3014033 -2876692
38725 -2876692 -4317024 -5069009 -3855804 -2541022 -2827135 -3523971 -2923756 -1438300 -104541
38716 -104541 1109842 1787716 512089 -2165144 -3006471 -812106 898515 -1077452 -4488505
38707 -4488505 -5118598 -3252314 -2509761 -3726420 -4524784 -4327700 -5133843 -7013483 -7247077
38698 -7247077 -5021175 -3093643 -3300975 -3886591 -3100800 -2286938 -3139642 -4514976 -4432047
38689 -4432047 -3204933 -2189314 -1194606 348450 1127255 -394878 -2918680 -3520467 -1563432
38680 -1563432 847162 2038614 2181421 1587521 -94908 -2438634 -3873422 -3638984 -2816932
38671 -2816932 -2663488 -2960327 -2771352 -2010195 -1418985 -1386378 -1458490 -1012477 -143039 255705
$$ packed form
38734a81200P56769p53691j074301o44924j001854j254175q919J148262J37341
38725b876692j440332p51985J213205J314782k86113o96836O00215J485456J333759
38716a04541J214383O77874j275627k677233q41327K194365J710621j975967l411053
38707d488505o30093J866284P42553j216659p98364J97084q06143j879640k33594
38698g247077K225902J927532k07332n85616P85791Q13862q52704j375334Q2929
38689d432047J227114J015619R94708J543056P78805j522133k523802o01787J957035
38680a563432K410594J191452J42807n93900j682429k343726j434788K34438Q22052
38671b816932J53444k96839J88975P61157N91210L2607p2112M46013Q69438L98744
$$ plain form
38661 255705 -535083 -2028865 -2953042 -2858308 -2645222 -3131670 -3907604 -4218756 -4143651 -4091980
38651 -4091980 -3979503 -3827630 -4240769 -5132771 -4995036 -2928503 -464971 406715 142343
38642 142343 452229 1027595 175767 -1576208 -1623206 499971 2094052 1558034 794379
38633 794379 1743238 3093921 2573338 524608 -1031527 -1398749 -1149988 -365575 955213
38624 955213 1729499 1009214 -441050 -1392831 -1914246 -2308554 -1736945 119658 1490019
38615 1490019 922583 -162394 24004 85361 -2221676 -5176970 -4741508 -947616 1561489
38606 1561489 261829 -1919542 -1650081 -70040 -238824 -2317734 -3931511 -3696301 -2141037
38597 -2141037 -271349 999685 1010170 341820 539029 1686424 1719517 -504319 -2984329
$$ packed form
38661B55705p90788j493782r24177R4734K13086m86448p75934l11152P5105N1671
38651d091980J12477J51873m13139q92002J37735K066533K463532Q71686k64372
38642A42343L09886N75366q51828j751975m6998K123177J594081n36018p63655
38633G94379R48859J350683n20583k048730j556135l67222K48761P84413J320788
38624I55213P74286p20285j450264r51781n21415l94308N71609J856603J370361
38615A490019n67436j084977J86398O1357k307037k955294M35462L793892K509105
38606A561489j299660k181371K69461J580041j68784k078910j613777K35210J555264
38597b141037J869688J271034J0485o68350J97209J147395L3093k223836k480010
$$ plain form
38588 -2984329 -3075745 -957931 989962 1152773 -394729 -2605959 -3614048 -1701680 2038843
38579 2038843 3561700 660631 -3410888 -3746655 -252051 2641549 2275226 596663
38571 596663 338612 1359971 1990503 1748638 1158200 287259 -1061368 -2427903 -3002653
38562 -3002653 -2541285 -1558452 -969551 -1527291 -2978083 -3890797 -3116554 -1268936 103529
38553 103529 519563 639605 624119 -179026 -1830006 -3352253 -3906774 -3421705 -2121566
38544 -2121566 -554612 113631 -761816 -1963290 -1725747 -356584 155111 -776065 -1533080
38535 -1533080 -883636 630886 2353549 4313626 5525438 3935127 -338864 -3779677
38527 -3779677 -3476231 -794481 906949 710986 9189 -723854 -2126946 -3414607 -2590111
$$ packed form
38588b984329r1416K117814J947893J62811j547502k211230j008089J912368L740523
38579B038843J522857k901069m071519l35767L494604K893600l66323j678563
38571E96663k58051J021359O30532k41865n90438q70941j348627j366535n74750
38562c002653M61368R82833N88901n57740j450792r12714P74243J847618J372465
38553A03529M16034J20042j5486q03145j650980j522247n54521M85069J300139
38544b121566J566954O68243q75447j201474K37543J369163N11695r31176p57015
38535a533080O49444J514522J722663J960077J211812j590311m273991l440813
38527c779677L03446K681750J701430j95963p01797p33043j403092j287661Q24496
$$ plain form
38518 -2590111 357336 2787979 2714956 1049748 -133209 -64267 703722 1435158 1577589
38509 1577589 957900 243528 445794 1629288 2919138 3854598 4608379 4797703 3611743
38500 3611743 1580878 609684 1395189 2275495 1713362 538229 382025 1124414 1508885
38491 1508885 1322250 1168613 809318 -290617 -1191448 -383934 1613546 2782295 2965229
38482 2965229 4233349 7014415 8421672 6341924 3188001 2915677 5347248 6442470
38474 6442470 4221084 1483694 1535157 3592571 4424119 3065352 1436991 686726 -502524
38465 -502524 -3141266 -5505506 -5207843 -2701910 -827808 -1088443 -2202366 -2645532 -2771996
38456 -2771996 -3448997 -4193890 -4157306 -3739666 -3460216 -2256290 809439 3781846 3586807
$$ packed form
38518b590111K947447K430643p3023j665208j182957O8942P67989P31436J42431
38509A577589o19689p14372K02266J183494J289850R35460P53781J89324j185960
38500C611743k030865r71194P85505Q80306n62133j175133j56204P42389L84471
38491A508885j86635j53637l59295j099935r00831Q07514J997480J168749J82934
38482B965229J268120K781066J407257k079748l153923k72324K431571J095222
38474F442470k221386k737390N1463K057414Q31548j358767j628361p50265j189250
38465e02524k638742k364240K97663K505933J874102k60635j113923m43166j26464
38456b771996o77001p44893L6584M17640K79450J203926L065729K972407j95039
$$ plain form
38447 3586807 731461 -772521 883405 2687211 1620549 -797526 -1437578 -657327
38439 -657327 -1003141 -2306612 -2011316 30467 1007591 -137824 -1109229 -526580 -429079
38430 -429079 -2591709 -5070287 -4870378 -2297600 -284570 -408725 -1508755 -1606437 173380
38421 173380 2903641 4145867 2040179 -2029327 -4353921 -3502610 -2111103 -2648908 -3667408
38412 -3667408 -2589846 -204831 759992 225488 411142 1460961 1057020 -1325179 -3187884
38403 -3187884 -2984501 -2381085 -3212711 -4646083 -4945844 -4101639 -3097033 -2144514 -1192785
38394 -1192785 -882259 -1482422 -1884328 -1017525 526242 1436465 1483285 1295327 1050793
38385 1050793 490800 -219932 -553693 -296290 292237 603786 -142532 -2082910 -4004000
$$ packed form
38447C586807k855346j503982J655926J803806j066662k418075o40052P80251
38439f57327l45814j303471K95296K041783R77124j145415r71405N82649R7501
38430d29079k162630k478578J99909K572778K013030j24155j100030r7682J779817
38421A73380K730261J242226k105688m069506k324594Q51311J391507n37805j018500
38412c667408J077562K385015R64823n34504J85654J049819m03941k382199j862705
38403c187884K03383O03416q31626j433372k99761Q44205J004606R52519R51729
38394a192785L10526o00163m01906Q66803J543767R10223M6820j87958k44534
38385A050793n59993p10732l33761K57403N88527L11549p46318j940378j921090
$$ plain form
38376 -4004000 -4513170 -3968635 -3867850 -4236408 -3533161 -1660731 -831837 -2250344 -4061085
38367 -4061085 -4280789 -3832762 -4558348 -5865795 -5895396 -4887538 -4682073 -5431734 -5412274
38358 -5412274 -3938074 -2127509 -830164 -39226 -321148 -2402335 -5039543 -5703837 -4045571
38349 -4045571 -2546371 -2995574 -4381310 -5113318 -5212100 -5103328 -4203209 -2245788 -504180
38340 -504180 -160075 -654897 -975697 -1313021 -2043283 -2354981 -1570121 -821945 -1666036 -3757490
38330 -3757490 -5550868 -6594960 -7375645 -7468575 -5835123 -2868010 -439555 148435 -1079840
38321 -1079840 -3740656 -7107222 -9363074 -8888062 -6620758 -5270125 -5693454 -5966237 -4767194
38312 -4767194 -3581782 -4123396 -5358980 -5140898 -3734241 -3460826 -5081322 -6632430 -6328985
$$ packed form
38376d004000n09170N44535J00785l68558P03247J872430Q28894j418507j810741
38367d061085k19704M48027p25586j307447k9601J007858K05465p49661J9460
38358e412274J474200J810565J297345P90938k81922k081187k637208o64294J658266
38349d045571J499200m49203j385736p32008r8782J08772R00119J957421J741608
38340e04180L44105m94822l20800l37324p30262l11698P84860P48176q44091k091454
38330c757490j793378j044092p80685r2930J633452K967113K428455N87990j228275
38321a079840k660816l366566k255852M75012K267304J350633m23329k72783J199043
38312d767194J185412n41614j235584K18082J406657K73415j620496j551108L03445
$$ plain form
38303 -6328985 -4967932 -4465987 -5021056 -5003075 -3528542 -2043009 -2606549 -4885919 -5887854
38294 -5887854 -3429872 711101 2476570 521493 -1996646 -1610766 803592 1412805
38286 1412805 -1097055 -3751816 -3594953 -1643651 -898735 -1789572 -1992031 -561011 342462
38277 342462 -1031961 -2793406 -1789192 1741942 4290179 3844560 2222224 1908588 2728557
38268 2728557 3077879 2651023 1948007 403044 -2537888 -5170567 -5050770 -2763995 -1571519
38259 -1571519 -2800595 -4137963 -3497276 -2108071 -2126212 -3221168 -3616269 -3114056 -2948164
38250 -2948164 -3478486 -3935565 -3871798 -3274637 -1902025 -50365 771393 -413080 -2351024
38241 -2351024 -3249621 -3224204 -3119760 -2028391 1250593 4864570 5291546 2423387 186619
$$ packed form
38303f328985J361053N01945n55069J7981J474533J485533n63540k279370j001935
38294e887854K457982M140973J765469j955077k518139L85880K414358O09213
38286A412805k509860k654761J56863J951302P44916q90837k02459J431020R03473
38277C42462j374423j761445J004214L531134K548237m45619j622336l13636Q19969
38268B728557L49322m26856p03016j544963k940932k632679J19797K286775J192476
38259a571519j229076j337368O40687J389205j8141j094956l95101N02213J65892
38250b948164n30322m57079O3767N97161J372612J851660Q21758j184473j937944
38241b351024q98597K5417J04444J091369L278984L613977M26976k868159k236768
$$ plain form
38232 186619 1143782 3277622 3512038 1846084 96782 -1357396 -3266087 -5238498 -5979153
38223 -5979153 -5202745 -3745133 -2317004 -1333134 -1181251 -1446093 -752217 1292302 2864384
38214 2864384 2105763 -205983 -1713864 -1595185 -958027 -541447 147988 1312349 2101979
38205 2101979 1889876 1207024 864592 809772 281081 -1154193 -2811881 -3167780 -1423137
38196 -1423137 1077791 1924262 631361 -572519 148774 1576832 1347915 -478580 -1705685
38187 -1705685 -1339045 -444413 412949 2283662 5447666 7740725 6836944 3314447 -6580
38178 -6580 -1412949 -1656599 -1943690 -1962240 -813290 895960 1382317 284755 -542170
38169 -542170 231514 1207266 492651 -847329 -97423 2520925 3567277 1561375 -547795
$$ packed form
38232A86619R57163K133840K34416j665954j749302j454178j908691j972411p40655
38223e979153P76408J457612J428129R83870J51883k64842O93876K044519J572082
38214B864384p58621k311746j507881J18679O37158M16580O89435J164361P89630
38205B101979k12103o82852l42432n4820n28691j435274j657688l55899J744643
38196a423137K500928Q46471j292901j203880P21293J428058k28917j826495j227105
38187a705685L66640Q94632Q57362J870713L164004K293059r03781l522497l321027
38178f580j406369k43650k87091j8550J148950J709250M86357j097562q26925
38169e42170P73684R75752p14615j339980P49906K618348J046352k005902k109170
$$ plain form
38160 -547795 67425 1765796 1336059 -782298 -1460445 83727 1620422 1873808 1834840
38151 1834840 1927432 1016048 -999842 -2332449 -2067837 -1454013 -1436952 -1200217 -352316
38142 -352316 -300490 -1785680 -2913884 -1578238 1424973 3499523 3544836 2553364 1729270
38133 1729270 1621102 2540899 4196574 5087926 3744351 790246 -1257276 -635970 1747811
38124 1747811 3302762 2407939 -35075 -1671200 -1257933 126072 620181 -221280 -1357108
38115 -1357108 -1813797 -1393959 -285452 954049 1405464 920784 722463 1509590 1734602
38106 1734602 -228203 -2824960 -2947131 -786451 58236 -1906767 -3655565 -2354025
38098 -2354025 404889 1337257 96911 -1406230 -2459356 -3538402 -4190110 -3743285 -3283179
$$ packed form
38160e47795O15220J698371m29737k118357o78147J544172J536695K53386l8968
38151A834840R2592r11384k015890j332607K64612O13824J7061K36735Q47901
38142c52316N1826j485190j128204J335646L003211K074550M5313r91472q24094
38133A729270j08168R19797J655675Q91352j343575k954105k047522O21306K383781
38124A747811J554951q94823k443014j636125M13267J384005M94109q41461j135828
38115a357108m56689M19838J108507J239501M51415m84680j98321P87127K25012
38106A734602j962805k596757j22171K160680Q44687j965003j748798J301540
38098b354025K758914R32368j240346j503141j053126j079046o51708M46825M60106
$$ plain form
38089 -3283179 -4275734 -5843230 -5931926 -4654090 -3857989 -3731081 -2644519 -490414 603682
38080 603682 -462288 -2151003 -2737621 -2282599 -1333896 283016 2247437 3091304 2095971
38071 2095971 496891 -409546 -1127892 -2677242 -4542453 -5337753 -4791249 -3723097 -2554817
38062 -2554817 -1161689 56139 278672 -406446 -808856 -142485 955340 1312721 640671
38053 640671 -407986 -1267061 -1900948 -2235280 -1892788 -924804 -157771 -31551 355981
38044 355981 1822779 3051623 1770677 -1659547 -3863193 -2800310 -649461 -607026 -2437101
38035 -2437101 -3560722 -3357628 -3437124 -4121363 -3911001 -2790534 -2822932 -4362932 -4767394
38026 -4767394 -2715195 -1049160 -2681233 -5701902 -5702233 -1885533 2248828 3873396 3377539
$$ packed form
38089c283179r92555j567496q8696J277836P96101J26908J086562K154105J094096
38080F03682j065970j688715n86618M55022R48703J616912J964421Q43867r95333
38071B095971j599080r06437p18346j549350j865211p95300N46504J068152J168280
38062b554817J393128J217828K22533o85118m02410O66371J097825L57381o72050
38053F40671j048657q59075o33887l34332L42492R67984P67033J26220L87532
38044C55981J466798J228844j280946l430224k203646J062883K150849M2435j830075
38035b437101j123621K03094p9496o84239K10362J120467l2398j540000m04462
38026d767394K052199J666035j632073l020669l31L816700M134361J624568m95857
$$ plain form
38017 3377539 1812336 -935330 -4133392 -5067594 -2163010 2117729 3636220 1376493
38009 1376493 -1748342 -2694993 -1411160 101537 671781 1093054 2612209 4874174 5915374
38000 5915374 4500094 1920967 428542 45690 -1343486 -4082773 -4984114 -1471375
37992 -1471375 3909155 5976719 3612325 910065 1045497 2213640 1479882 -202257
37984 -202257 85203 1958607 2012988 -891266 -3917593 -4479891 -3463435 -3109550 -3881908
37975 -3881908 -4813344 -5277042 -5022521 -3819918 -2373851 -2311347 -3905755 -5024386 -3814078
37966 -3814078 -1286641 420897 1221750 2389409 3475351 2544849 -376067 -2597154
37958 -2597154 -2422942 -1485833 -2024874 -3379150 -3101676 -853143 906201 415002 -933139
$$ packed form
38017C377539j565203k747666l198062r34202K904584M280739J518491k259727
38009A376493l124835r46651J283833J512697N70244M21273J519155K261965J041200
38000E915374j415280k579127j492425l82852j389176k739287r01341L512739
37992a471375N380530K067564k364394k702260J35432J168143p33758j682139
37984b02257K87460J873404N4381k904254l026327n62298J016456L53885p72358
37975c881908r31436m63698K54521J202603J446067O2504j594408j118631J210308
37966c814078K527437J707538Q00853J167659J085942r30502k920916k221087
37958b597154J74212R37109n39041j354276K77474K248533J759344m91199j348141
$$ plain form
37949 -933139 -750819 772104 1133003 -697092 -2460879 -1535020 1494459 3601194 3083776
37940 3083776 1006646 -890268 -1952980 -2034955 -991921 405746 560688 -880110 -2245695
37931 -2245695 -2186132 -1610498 -2077863 -3380721 -4156875 -3984770 -3362183 -2385115 -1057698
37922 -1057698 -305757 -992734 -2271047 -2464357 -1322255 -843 754644 858972 -164747
37913 -164747 -2605426 -5167840 -6086305 -5582495 -5304786 -5405469 -4419825 -2281682 -967727
37904 -967727 -1334233 -1690154 -765132 115883 -450788 -1126822 249187 3049499 4458964
37895 4458964 3322193 1435682 889385 1626177 2045299 1060950 -899901 -2536453 -3046601
37886 -3046601 -2788007 -2361822 -1419124 597516 2586021 2274906 -701049 -3747085 -4518748
$$ packed form
37949i33139J82320J522923L60899j830095j763787R25859L029479K106735n17418
37940C083776k077130j896914j062712q1975J043034J397667J54942j440798j365585
37931b245695N9563N75634m67365j302858p76154J72105O22587R77068J327417
37922a057698P51941o86977j278313j93310J142102J321412P55487J04328j023719
37913a64747k440679k562414r18465N03810K77709j00683R85644K138143J313955
37904i67727l66506l55921R25022Q81015n66671o76034J376009K800312J409465
37895D458964j136771j886511n46297P36792M19122r84349j960851j636552n10148
37886c046601K58594M26185R42698K016640J988505l11115k975955l046036p71663
$$ plain form
37877 -4518748 -3830541 -3853449 -4684991 -4749748 -3766141 -2954385 -2612508 -1938598 -1316144 -2087383
37867 -2087383 -3448961 -2517734 970667 2840146 -59138 -4728382 -5778760 -3042555
37859 -3042555 -1361412 -2849008 -3852096 -1230510 2409796 2856336 692336 -355047
37851 -355047 364819 275419 -991107 -661516 1913178 3289162 1008318 -2806974 -5049523
37842 -5049523 -5715998 -5944187 -4959496 -2185434 61504 -265969 -926440 1346660 4854802
37833 4854802 4894375 1355657 -665799 1251800 3258626 1669493 -1285251 -1423543 800695
37824 800695 1527230 -445342 -2533190 -2612737 -1205211 471245 1908067 2483332 1554964
37815 1554964 31417 83104 2509594 5620413 7313993 7195840 6119194 4760552 3557358
$$ packed form
37877d518748O88207k2908q31542o4757R83607Q11756L41877O73910O22454p71239
37867b087383j361578R31227L488401J869479k899284m669244j050378K736205
37859c042555J681143j487596j003088K621586L640306M46540k164000j047383
37851c55047P19866q9400j266526L29591K574694J375984k280844l815292k242549
37842e049523o66475k28189R84691K774062K246938l27473o60471K273100L508142
37833D854802L9573l538718k021456J917599K006826j589133k954744j38292K224238
37824H00695P26535j972572k087848p9547J407526J676456J436822N75265r28368
37815A554964j523547N1687K426490L110819J693580j18153j076646j358642j203194
$$ plain form
37806 3557358 3303971 4607989 6725135 7796146 6680880 4144547 1791305 253002
37798 253002 -756005 -912090 642418 3154230 3864517 1255440 -2483121 -4090633 -3438824
37789 -3438824 -2881328 -3152431 -2874113 -2119673 -2965681 -5293385 -5337498 -757502 5197773
37780 5197773 7272869 4477406 341068 -1878447 -1731253 -206330 1500434 2024565
37772 2024565 867771 -486320 -133747 1702278 3134331 3141157 2013198 -26514 -2533805
37763 -2533805 -3675097 -1888514 1179431 1872895 -814558 -4036410 -5184763 -4803120
37755 -4803120 -4314008 -3227493 -589791 2344716 3126023 1247028 -1395566 -2889271
37747 -2889271 -2867556 -1991107 -1150077 -1144246 -2066392 -2821534 -2029263 386009 3000786 4373761
$$ packed form
37806C557358k53387J304018K117146J071011j115266k536333k353242j538303
37798B53002j009007j56085J554508K511812P10287k609077l738561j607512O51809
37789c438824N57496k71103K78318P54440q46008k327704m4113M579996N955275
37780E197773K075096k795463m136338k219515J47194J524923J706764N24131
37772B024565j156794j354091L52573J836025J432053O826j127959k039712k507291
37763b533805j141292J786583L067945O93464k687453l221852j148353L81643
37755d803120M89112J086515K637702K934507P81307j878995k642594j493705
37747b889271K1715Q76449Q41030N831r22146p55142P92271K415272K614777J372975
$$ plain form
37737 4373761 4311252 3627323 3075221 2708287 2105191 1049455 -77691 -624803 -304870
37728 -304870 647303 1825994 2882982 3543315 3849469 4352450 5467294 6491432 5948148
37719 5948148 3416348 564569 -343645 1102367 3113952 3899377 3583575 3503528 4079441
37710 4079441 4285300 3345851 2040113 1635688 2126796 2493274 2421151 2620914 3378789
37701 3378789 3993667 4028690 3943684 3847386 2804462 412638 -1882791 -2333324 -1141093
37692 -1141093 92827 648248 961700 943541 -230396 -2328384 -3584112 -2763103 -709596
37683 -709596 868665 1361477 1302680 1127470 733704 32606 -698731 -1003315 -558617 484020
37673 484020 1333926 1148990 87022 -639430 -185530 809597 1143541 898312 1505987
$$ packed form
37737D373761o2509o83929n52102l66934o03096j055736j127146n47112L19933
37728c04870R52173J178691J056988O60333L06154N02981J114844J024138n43284
37719E948148k531800k851779r08214J446012K011585P85425l15802q0047N75913
37710D079441K05859r39449j305738m04425M91108L66478p2123J99763P57875
37701C378789O14878L5023q5006r6298j042924k391824k295429m50533J192231
37692a141093J233920N55421L13452j8159j173937k097988j255728Q21009K053507
37683g09596J578261M92812n8797j75210l93766p01098p31337l04584M44698J042637
37673D84020Q49906j84936j061968p26452M53900R95127L33944k45229O07675
$$ plain form
37664 1505987 3644422 5842507 6078651 4497797 3397730 4220550 5724195 5984093 5147598
37655 5147598 4730966 4811848 3853165 1412342 -869632 -1561202 -1022646 39109 1777524
37646 1777524 3791914 4291831 2446641 272644 256923 2059125 3487974 3827345 3950915
37637 3950915 3794454 2351336 224122 -351146 1327490 3246592 3381559 1900311 89180
37628 89180 -1216643 -1496530 -593865 258973 -868111 -3863473 -6002499 -5188221 -2435805
37619 -2435805 -125129 791578 690099 -76178 -854816 -295937 1899438 3724874 3221795
37610 3221795 1444766 1120482 2667686 3611952 2178345 -398808 -1815642 -1492641 -538622
37601 -538622 63645 251913 390557 825519 1778095 3124963 4266819 4508416 3664488
$$ packed form
37664A505987K138435K198085K36144j580854j100067Q22820J503645K59898q36495
37655E147598m16632Q0882r58683k440823k281974o91570N38556J061755J738415
37646A777524K014390M99917j845190k173997j5721J802202J428849L39371J23570
37637C950915j56461j443118k127214n75268J678636J919102J34967j481248j811131
37628H9180j305823k79887R02665Q52838j127084k995362k139026Q14278K752416
37619b435805K310676R16707j01479p66277p78638N58879K195375J825436n03079
37610C221795j777029l24284J547204R44266j433607k577153j416834L23001R54019
37601e38622O02267J88268J38644M34962R52576J346868J141856K41597q43928
$$ plain form
37592 3664488 2286428 1296551 1245573 1751209 1773605 645523 -1217625 -2706069 -2948583
37583 -2948583 -1845481 -73288 1249502 1378742 835166 1079138 2771920 4694347 5064885
37574 5064885 3749513 2374763 2178515 2565697 2214585 967735 -131323 -455006 -581090
37565 -581090 -1183416 -1818402 -1522082 -335619 638553 822406 904316 1506326 1974217 1447789
37555 1447789 549285 674962 1690382 1817671 365165 -760271 551795 3456261 4859334
37546 4859334 3267053 556583 -684320 -451079 -708299 -2037894 -2704416 -1587526 -296913
37537 -296913 -769663 -1916180 -1018518 1814422 3382989 2326251 1425353 3102778 5175838
37528 5175838 4094353 766745 -489254 1691685 4129832 4326293 3714798 4307895 5195368
$$ packed form
37592C664488j378060r89877n0978N05636K2396j128082j863148j488444k42514
37583b948583J103102J772193J322790J29240n43576K43972J692782J922427L70538
37574E064885j315372j374750j96248L87182l51112j246850j099058l23683j26084
37565e81090o02326o34986K96320J186463R74172J83853Q1910O02010M67891n26428
37555A447789q98504J25677J015420J27289j452506j125436J312066K904466J403073
37546D859334j592281k710470j240903K33241k57220j329595o66522J116890J290613
37537b96913m72750j146517Q97662K832940J568567j056738r00898J677425K073060
37528E175838j081485l327608j255999K180939K438147J96461o11495N93097Q87473
$$ plain form
37519 5195368 4579099 3120782 2853373 4044955 5233816 5513947 5019535 3851431 2122233
37510 2122233 562260 -194903 -414435 -434948 28036 746623 422878 -1258589 -2212671
37501 -2212671 -456799 2810025 4628589 4266203 3757202 4624294 5979513 6080080 4222235
37492 4222235 885552 -2670623 -4793647 -4622746 -3077109 -1828349 -1530867 -1935344 -2998997
37483 -2998997 -4398644 -4621741 -2568465 107125 367079 -2208574 -4712654 -4704138 -2913459
37474 -2913459 -1464299 -1075310 -1033736 -688533 48339 870915 1114355 404091 -408976
37465 -408976 36267 1692194 3076876 3456185 3648872 4152334 4005058 2455294 504046
37456 504046 -342224 -21936 337853 25995 -602769 -602570 737104 2911092 4110322 3178143
$$ packed form
37519E195368o16269j458317k67409J191582J188861K80131m94412j168104j729198
37510B122233j559973p57163k19532k0513M62984P18587l23745j681467r54082
37501b212671J755872L266824J818564l62386n09001Q67092J355219J00567j857845
37492D222235l336683l556175k123024J70901J545637J248760K97482m04477j063653
37483b998997j399647k23097K053276K675590K59954k575653k504080Q516J790679
37474b913459J449160L88989M1574L45203P36872Q22576K43440p10264q13067
37465d08976M45243J655927J384682L79309J92687N03462j47276j549764j951248
37456E04046q46270L20288L59789l11858o28764J99J339674K173988J199230r32179
$$ plain form
37446 3178143 1493677 1360625 2612930 2933922 1797903 1405113 2661435 3100056 809395
37437 809395 -2039822 -2218217 -101158 1570428 2091590 2722043 3176526 1752619 -1074274
37428 -1074274 -2468739 -1231748 715093 1435247 1040585 31061 -1787734 -3704565
37420 -3704565 -3867362 -1979133 -162297 127427 -9482 570251 912243 151701 -278504
37411 -278504 1057290 2801372 2891705 2112498 2691581 4254580 4358328 2816976 2174465
37402 2174465 3292820 3639673 1388214 -1379171 -1491181 1164957 4257349 6196077
37394 6196077 6599717 4984975 1666739 -734629 405000 3805780 5466730 4349923
37386 4349923 3953050 6796259 10291338 10751431 9178544 9220492 10399554 7951611 297550
$$ packed form
37446C178143j684466j33052J252305L20992j136019l92790J256322M38621k290661
37437H09395k849217j78395K117059J671586N21162O30453M54483j423907k826893
37428a074274j394465J236991J946841P20154l94662j009524j818795j916831
37420c704565j62797J888229J816836K89724j36909N79733L41992p60542m30205
37411b78504J335794J744082R0333p79207N79083J562999J03748j541352o42511
37402B174465J118355L46853k251459k767385j12010K656138L092392J938728
37394F196077M03640j614742l318236k401368J139629L400780J660950j116807
37386D349923l96873K843209L495079M60093j572887M1948J179062k447943p654061
$$ plain form
37377 297550 -7488795 -10065151 -8574448 -7911951 -9469625 -10389118 -9005903 -6981146 -5709088
37368 -5709088 -4266497 -2193169 -1253541 -2501147 -3867863 -2908623 -438458 748784
37360 748784 -196519 -1588437 -1906394 -1143453 229919 1799300 2649747 1891451 113447
37351 113447 -886077 -263033 796333 509154 -1524165 -3944115 -4913470 -3830371 -1915649
37342 -1915649 -728117 -128447 1233484 3133280 3191414 315870 -2890197 -3192695 -1086340
37333 -1086340 328045 117320 264110 1598637 2107325 410518 -1693756 -1893338 -665082
37324 -665082 -16760 -249103 102234 1796051 3948791 5198203 4736879 2747372 741719
37315 741719 684815 2678890 4284473 3395280 1157589 680316 3225714 6942264 9158060
$$ packed form
37377B97550p786345k576356J490703O62497j557674r19493J383215K024757J272058
37368e709088J442591K073328R39628j247606j366716R59240K470165J187242
37360G48784r45303j391918l17957P62941J373372J569381Q50447p58296j778004
37351A13447r99524O23044J059366k87179k033319k419950r69355J083099J914722
37342a915649J187532N99670J361931J899796N8134k875544l206067l02498K106355
37333a086340J414385k10725J46790J334527N08688j696807k104274j99582J228256
37324f65082O48322k32343L51337J693817K152740J249412m61324j989507k005653
37315G41719n6904J994075J605583q89193k237691m77273K545398L716550K215796
$$ plain form
37306 9158060 8844991 7009560 5598094 5808290 6735510 6135722 3244700 40233 -1283853
37297 -1283853 -1085590 -1099287 -1549448 -1465469 -1166195 -1912984 -3125596 -2559058 144869
37288 144869 2510021 2814884 2338577 2666465 2982187 2002631 747013 895455 1659648
37279 1659648 1080936 -185117 605999 3788984 6227712 5741122 4074391 3877167 4764095
37270 4764095 4484611 2662740 1035151 574236 595827 625852 1115211 2039808 2596106
37261 2596106 2715333 3227358 4090936 4245438 3788248 4229690 5608742 5672597 3580436
37252 3580436 2081679 3514149 5683027 5074991 2769540 3055323 6506774 8800403
37244 8800403 7187396 3988398 2122190 1160548 154875 644284 3604429 6394864
$$ packed form
37306I158060l13069j835431j411466K10196R27220n99788k891022l204467j324086
37297a283853J98263j3697m50161Q3979K99274p46789j212612N66538K703927
37288A44869K365152L04863m76307L27888L15722r79556j255618J48442P64193
37279A659648n78712j266053P91116L182985K438728m86590j666731j97224Q86928
37270D764095k79484j821871j627589m60915K1591L0025M89359R24597N56298
37261B596106J19227N12025Q63578J54502m57190M41442J379052O3855k092161
37252C580436j498757J432470K168878o08036k305451K85783L451451K293629
37244H800403j613007l198998j866208r61642j005673M89409K960145K790435
$$ plain form
37236 6394864 6400263 5304543 5835761 6407657 3652191 -1045283 -2708082 -325167 1779589
37227 1779589 879049 -656632 -334695 470136 -95760 -750067 268540 1866604 2284019
37218 2284019 2133063 2478805 2291617 840229 352555 2769836 5675010 5388324 2911630
37209 2911630 2560455 5124819 6772690 5256639 3031808 2806704 3652686 3613703 3225243
37200 3225243 3917291 5040128 5068838 4350077 4234066 4473068 3807891 2527530 2209933
37191 2209933 3119556 3878941 3799448 3717685 4216094 4643924 4412400 3863595 3259119 2210801
37181 2210801 928638 908192 3247205 6836552 9155596 8624813 5709254 2250729 265591
37172 265591 699521 2523058 3565482 3036864 2573301 3773302 5512197 5369731 3348670
$$ packed form
37236F394864N399j095720N31218N71896k755466m697474j662799K382915K104756
37227A779589r00540j535681L21937Q04831n65896o54307J018607J598064M17415
37218B284019j50956L45742j87188j451388m87674K417281K905174k86686k476694
37209B911630l51175K564364J647871j516051k224831k25104Q45982l8983l88460
37200C225243O92048J122837K8710p18761j16011K39002o65177j280361l17597
37191B209933R09623P59385p9493q1763M98409M27830k31524n48805o04476j048318
37181B210801j282163k0446K339013L589347K319044n30783k915559l458525j985138
37172B65591M33930J823537J042424n28618m63563J200001J738895j42466k021061
$$ plain form
37163 3348670 2106619 3154980 4853832 5083640 4063245 3137583 2351361 1093459 98384
37154 98384 712650 2586231 3980277 4221558 4130896 4114151 3647731 2789822 2358879 2247879
37144 2247879 1411963 129934 363140 2826880 5419447 5932282 4912068 4289363 4379431
37135 4379431 4127138 3598801 4161008 6131076 7872664 7659274 5486621 2858093 1521647
37126 1521647 2328614 4467461 5887274 5345125 3930715 3632753 4580898 4994493 4020500
37117 4020500 3165454 4114634 6191571 7120235 5884765 3865656 3205297 4698677 7257783
37108 7257783 8906120 8306492 5865634 3518536 3048055 4397984 5858193 6000818 5097416
37099 5097416 4431907 4644869 5299411 5927293 6803948 8370476 10271697 11409088 10977680
$$ packed form
37163C348670j242051J048361J698852K29808j020395r25662p86222j257902r95075
37154I8384O14266J873581J394046K41281r0662j6745m66420q57909m30943j11000
37144B247879q35916j282029K33206K463740K592567N12835j020214o22705R0068
37135D379431k52293n28337N62207J970068J741588k13390k172653k628528j336446
37126A521647Q06967K138847J419813n42149j414410k97962R48145M13595r73993
37117D020500q55046R49180K076937R28664j235470k019109o60359J493380K559106
37108G257783J648337n99628k440858k347098m70481J349929J460209J42625r03402
37099E097416o65509K12962O54542O27882Q76655J566528J901221J137391m31408
$$ plain form
37090 10977680 9347691 7901363 7841791 8981838 9962286 10003624 9975895 10947996 12152234
37081 12152234 11840867 10193689 9535968 10896116 12166905 11131025 8783498 7718182
37073 7718182 8339932 8921474 8726732 8653978 9035229 9245853 9548222 10828815 12209902
37064 12209902 11608278 9426152 8936936 11652229 14867282 15670894 15115098 15979186 18077306
37055 18077306 18608235 16474739 13753351 12890160 14229913 16352944 17514959 16833151
37047 16833151 15094882 14166682 14882297 16167864 16895363 17333970 17704910 16955044 14836195
37038 14836195 13779515 16217954 20832092 23981544 24392715 23829058 23441517 22554101 21513185
37029 21513185 22529125 26161801 29470893 29654460 27727670 26383695 25419071 21827378
$$ packed form
37090A0977680j629989j446328n9572J140047R80448M1338k7729R72101J204238
37081A2152234l11367j647178o57721J360148J270789j035880k347527j065316
37073G718182O21750N81542j94742p2754L81251K10624L02369J280593J381087
37064A2209902o01624k182126m89216K715293L215053Q03612n55796Q64088K098120
37055A8077306N30929k133496k721388q63191J339753K123031J162015o81808
37047A6833151j738269r28200P15615J285567P27499M38607L70940p49866k118849
37038A4836195j056680K438439M614138L149452M11171n63657l87541q87416j040916
37029B1513185J015940L632676L309092J83567j926790j343975r64624l591693
$$ plain form
37021 21827378 14282633 5268424 -2000183 -7189525 -12093850 -17124460 -20367158 -20575591
37013 -20575591 -19581842 -20254861 -22717526 -24367623 -23612044 -21646102 -20076997 -18896651
37005 -18896651 -17883839 -17918523 -19196931 -19921938 -18760152 -16973881 -15904295 -14148336
36997 -14148336 -10240828 -6641892 -7180618 -11016746 -13141655 -11210916 -8058634 -6648137
36989 -6648137 -6420735 -6150844 -6697130 -8588878 -9859151 -8838176 -6811687 -5664605 -5190402
36980 -5190402 -4979695 -6376594 -9670428 -11720084 -9871025 -6455272 -5661850 -7290594
36972 -7290594 -7689840 -6056307 -5219081 -5964399 -5262624 -1654931 1614134 1272602 -1134613
36963 -1134613 -1803669 -28124 1752604 1983093 1398528 872993 159332 -981522 -1911414
$$ packed form
37021B1827378p544745r014209p268607n189342m904325n030610l242698k08433
37013b0575591R93749o73019k462665j650097P55579J965942J569105J180346
37005a8896651J012812l4684j278408p25007J161786J786271J069586J755959
36997a4148336L907508L598936n38726l836128k124909J930739L152282J410497
36989f648137K27402K69891n46286j891748j270273J020975K026489J147082M74203
36980e190402K10707j396899l293834k049656J849059L415753P93422j628744
36972g290594l99246J633533Q37226p45318P01775L607693L269065l41532k407215
36963a134613o69056J775545J780728K30489n84565n25535p13661j140854r29892
$$ plain form
36954 -1911414 -1843742 -778315 404772 562200 -607904 -1906345 -1843947 -724584 -332196
36945 -332196 -1071009 -1056041 756424 2172749 539761 -3078486 -4935004 -3595154 -1503872
36936 -1503872 -1180104 -2113063 -2448766 -1856053 -1215945 -806219 -516727 -1049428 -3026029
36927 -3026029 -5074892 -4648360 -1373282 1704899 1320148 -2077595 -4680899 -3754294 -762618
36918 -762618 705869 -409501 -1527949 -364908 1662753 1614404 -362256 -1030228 1200155
36909 1200155 4078975 5153588 5264727 6414656 7885142 7180817 4165716 1598626
36901 1598626 1397825 2567712 3297954 3263348 3194290 3663321 4915885 6695513 7904189
36892 7904189 7693298 6967244 7194126 7669023 6104052 2410817 -581624 -1283498 -1672928
$$ packed form
36954a911414O7672J065427J183087J57428j170104j298441O2398J119363L92388
36945c32196p38813J4968J812465J416325j632988l618247j856518J339850K091282
36936a503872L23768r32959l35703N92713O40108M09726K89492n32701j976601
36927c026029k048863M26532L275078L078181l84751l397743k603304R26605K991676
36918g62618J468487j115370j118448J163041K027661m8349j976660o67972K230383
36909A200155K878820J074613J11139J149929J470486p04325l015101k567090
36901A598626k00801J169887P30242l4606o9058M69031J252564J779628J208676
36892G904189k10891p26054K26882M74897j564971l693235k992441p01874l89430
$$ plain form
36883 -1672928 -3639229 -5333401 -3829155 111166 2883024 2940728 2061999 1945942 2268310
36874 2268310 2471319 3034606 4062681 4434590 3362827 1515769 -151024 -1456928 -2138320
36865 -2138320 -1126968 2209161 6693621 10080353 10932454 9374976 6435030 3204199
36857 3204199 550257 -750352 -24 2765647 5982887 7274715 5798479 3395697
36849 3395697 2487517 3234003 3840997 3300443 2387172 1884120 1345952 269733 -625892
36840 -625892 -183889 1666326 3784052 4873576 4366039 2772576 1541092 2049181 4222816
36831 4222816 6449115 7267882 6874038 6535516 6830121 7125514 6830359 6437004 6817667
36822 6817667 7898032 8753871 8929394 8871636 8974603 9122659 9428390 10188874 10491210
$$ packed form
36883a672928j966301j694172J504246L940321K771858N7704q78729j16057L22368
36874B268310K03009N63287J028075L71909j071763j847058j666793j305904o81392
36865b138320J011352L336129M484460L386732Q52101j557478k939946l230831
36857C204199k653942j300609P50328K765671L217240J291828j476236k402782
36849C395697r08180P46486O06994n40554r13271n03052n38168j076219q95625
36840f25892M42003J850215K117726J089524n07537j593463j231484N08089K173635
36831D222816K226299Q18767l93844l38522K94605K95393k95155l93355L80663
36822F817667J080365Q55839J75523n7758J02967J48056L05731P60484L02336
$$ plain form
36813 10491210 8450881 4258322 1498751 3199182 7466464 9654152 8428127 6778390
36805 6778390 6965747 7731465 7415955 6710856 6706013 6832971 6586242 7003089 8507863 9358976
36795 9358976 8237985 6513826 6019769 6504576 7248670 9043304 12107790 14021644 12613879
36786 12613879 9493545 7941815 8494406 9291777 9653535 10441606 11627753 12200636 12098719
36777 12098719 12093242 12310208 12650676 13709225 15513437 16596587 16058347 14984251 14153059
36768 14153059 12562524 10308944 10150245 13268644 16210588 15616551 13505259 13884309
36760 13884309 16445980 18069242 18539725 19902392 21638445 21471319 19995155 19822280
36752 19822280 20999379 21637170 21891081 22875252 23197564 21394578 20005433 21899968 24499694
$$ packed form
36813A0491210k040329m192559k759571J700431M267282K187688j226025j649737
36805F778390J87357P65718l15510p05099m843J26958k46729M16847J504774Q51113
36795I358976j120991j724159m94057M84807P44094J794634L064486J913854j407765
36786A2613879l120334j551730N52591P97371L61758P88071J186147N72883j01917
36777A2098719n477K16966L40468J058549J804212J083150n38240j074096q31192
36768A4153059j590535k253580j58699L118399K941944n94037k111292L79050
36760A3884309K561671J623262M70483J362667J736053j67126j476164j72875
36752A9822280J177099O37791K53911R84171L22312j802986j389145J894535K599726
$$ plain form
36743 24499694 23637469 21269948 22603236 27080025 29554877 29343254 30317974 32661501
36735 32661501 32758516 31213225 32492535 36155612 37025683 34889652 35344057 39922535 44095088
36726 44095088 46152036 49183330 53384555 55748933 57875148 63935772 71019059 73134955
36718 73134955 74176773 82909569 95773283 101788144 104305952 116374508 133229594 137488911
36710 137488911 137632375 163920567 205346768 189826274 68943368 -100447123 -207052257
36703 -207052257 -209853786 -167365987 -144859786 -142994961 -132382564 -111574370 -98668623
36696 -98668623 -94070785 -85123593 -73207301 -69074069 -70355929 -66215047 -57686887 -53999576
36688 -53999576 -54188955 -50100384 -43247408 -42027727 -45293332 -44218771 -38474070 -36017136
$$ packed form
36743B4499694q62225k367521J333288M476789K474852k11623R74720K343527
36735C2661501R7015j545291J279310L663077Q70071k136031M54405M578478M172553
36726D4095088K056948L031294M201225K364378K126215O060624P083287K115896
36718G3134955J041818Q732796J2863714O014861K517808J2068556J6855086M259317
36710A37488911J43464K6288192M1426201j5520494j20882906j69390491j06605134
36703b07052257k801529M2487799K2506201J864825J0612397K0808194J2905747
36696i8668623M597838Q947192J1916292M133232j281860M140882Q528160L687311
36688e3999576j89379M088571O852976J219681l265605J074561N744701K456934
$$ plain form
36680 -36017136 -37883253 -36867525 -31374424 -28026822 -29546244 -31142976 -30145977 -29185271
36672 -29185271 -28616826 -25213318 -19825241 -17642977 -19296515 -19687909 -17005110 -15103711
36664 -15103711 -15503523 -14694681 -11263796 -8535992 -8109228 -7398240 -5393865 -4192337 -3082284
36655 -3082284 1505668 7320510 4995874 -9873298 -29006730 -40759523 -42895581 -41413774
36647 -41413774 -40519879 -39359663 -36827517 -34294364 -33160739 -32865043 -32070543 -30347616
36639 -30347616 -28399297 -27217007 -26882568 -26289996 -24703654 -23050423 -22395294 -21855921 -19975965
36630 -19975965 -17685529 -17510877 -19773413 -21858089 -21699258 -20123208 -19286601 -20236550 -22150611
36621 -22150611 -22821665 -20363687 -15800680 -13061216 -14615720 -18162279 -19760295 -18994925
$$ packed form
36680c6017136j866117J015728N493101L347602j519422j596732R96999R60706
36672b9185271N68445L403508N388077K182264j653538l91394K682799J901399
36664a5103711l99812Q08842L430885K727804M26764P10988K004375J201528J110053
36655c082284M587952N814842k324636j4869172j9133432j1752793k136058J481807
36647d1413774Q93895J160216K532146K533153J133625K95696P94500J722927
36639c0347616J948319J182290L34439N92572J586342J653231O55129N39373J879956
36630a9975965K290436J74652k262536k084676J58831J576050Q36607r49949j914061
36621b2150611o71054K457978M563007K739464j554504l546559j598016P65370
$$ plain form
36613 -18994925 -18271543 -18126808 -16830619 -14423840 -13496855 -15231947 -17599997 -18360214 -17491204
36604 -17491204 -16049642 -14897430 -15060585 -17028078 -19058299 -18367677 -14763721 -11236400
36596 -11236400 -10310178 -11469450 -12623731 -12498469 -11228306 -10039482 -10438755 -12360127
36588 -12360127 -13500832 -12170819 -10152863 -10512274 -13046211 -14505153 -13242890 -10952313
36580 -10952313 -9489142 -8588531 -7424370 -6198000 -5356041 -4939227 -5169949 -6122009 -6753334
36571 -6753334 -6026590 -4894064 -5242214 -7061597 -8746909 -9811310 -10788749 -10825625 -8528211
36562 -8528211 -5396714 -4996970 -7756623 -9764922 -8219373 -5245441 -4453143 -6080758
36554 -6080758 -7729189 -8172444 -8157776 -8363210 -8529447 -8374332 -8125254 -8149877 -8556388 -9013524
$$ packed form
36613a8994925P23382J44735J296189K406779R26985j735092k368050p60217Q69010
36604a7491204J441562J152212j63155j967493k030221O90622L603956L527321
36596a1236400R26222j159272j154281J25262J270163J188824l99273j921372
36588a2360127j140705J330013K017956l59411k533937j458942J262263K290577
36580a0952313J463171R00611J164161J226370Q41959M16814k30722r52060o31325
36571f753334P26744J132526l48150j819383j685312j064401r77439l6876K297414
36562h528211L131497L99744k759653k008299J545549K973932P92298j627615
36554f080758j648431m43255J4668k05434j66237J55115K49078k4623m06511m57136
$$ plain form
36544 -9013524 -8987454 -8539115 -8471169 -9012016 -9101527 -8060241 -7058359 -7460891 -8680930
36535 -8680930 -9457558 -10159066 -11506131 -12027591 -9706417 -5698723 -3451600 -4271419 -6575594
36526 -6575594 -9151891 -11843372 -13211566 -11455186 -8191906 -7385397 -9502490 -10688852
36518 -10688852 -9125187 -7942885 -9521423 -11003376 -8934875 -5219438 -4420267 -7042354
36510 -7042354 -9422832 -9380281 -8421295 -8420986 -9015191 -8846060 -7534350 -5846681 -4876940 -5222169
36500 -5222169 -6485352 -7800602 -8858337 -9579560 -9006778 -6246409 -2728998 -1388422
36492 -1388422 -2833595 -4494854 -4577153 -4499341 -5924066 -7753328 -8202274 -7900446 -8476813
36483 -8476813 -9503720 -9391968 -8381505 -8176274 -9063208 -9542136 -8654549 -6968942 -5420322
$$ packed form
36544i013524K6070M48339O7946n40847q9511J041286J001882m02532j220039
36535h680930p76628p01508j347065n21460K321174M007694K247123q19819k304175
36526f575594k576297k691481j368194J756380L263280Q06509k117093j186362
36518a0688852J563665J182302j578538j481953K068501L715437P99171k622087
36510g042354k380478M2551R58986L09n94205J69131J311710J687669R69741l45229
36500e222169j263183j315250j057735p21223N72782K760369L517411J340576
36492a388422j445173j661259q2299P7812j424725j829262m48946L01828n76367
36483h476813j026907J11752J010463K05231q86934m78928Q87587J685607J548620
$$ plain form
36474 -5420322 -4590253 -4858009 -5949045 -6626644 -6029239 -5004689 -5040954 -6228976 -7306979
36465 -7306979 -7412498 -6913671 -6782451 -7745741 -9620157 -11094063 -10889769 -9479541 -8642989
36456 -8642989 -8938748 -8908960 -7380052 -5111305 -3347551 -2229516 -1667019 -2297491 -4275503
36447 -4275503 -6338303 -7329870 -7550693 -7542551 -6887244 -5451803 -4433624 -4695497 -5266068
36438 -5266068 -4957148 -4318206 -4493012 -5222553 -5495131 -5221315 -4909279 -4695416 -4908079
36429 -4908079 -6297966 -8368364 -8956905 -7068618 -4642211 -3797079 -3966603 -3761722 -3874265
36420 -3874265 -5476158 -7199600 -6835041 -5226229 -5337599 -7727674 -9867340 -9946948 -8650623
36411 -8650623 -7068079 -5524845 -4744724 -5536633 -6847304 -6605604 -5020014 -4517524 -5763832
$$ packed form
36474e420322Q30069k67756j091036o77599N97405J024550l6265j188022j078003
36465g306979j05519M98827J31220r63290j874416j473906K04294J410228Q36552
36456h642989k95759K9788J528908K268747J763754J118035N62497o30472j978012
36447d275503k062800r91567k20823Q142O55307J435441J018179k61873n70571
36438e266068L08920O38942j74806p29541k72578K73816L12036K13863k12663
36429d908079j389887k070398n88541J888287K426407Q45132j69524K04881j12543
36420c874265j601893j723442L64559J608812j11370k390075k139666p9608J296325
36411h650623J582544J543234P80121p91909j310671K41700J585590N02490j246308
$$ plain form
36402 -5763832 -6455422 -5165309 -3716321 -4079753 -5272390 -5426806 -4996498 -5368774 -5618460
36393 -5618460 -3561510 249418 2313046 608466 -2819354 -4755465 -4724008 -4542816 -5028136
36384 -5028136 -5136438 -4342097 -3857803 -4527556 -5061828 -4007872 -2503505 -2980511 -5439929
36375 -5439929 -7314991 -7298550 -6816832 -6790333 -5630035 -2462033 -96227 -1812789 -6302624
36366 -6302624 -8869424 -7422668 -4467178 -2940514 -2883461 -3138947 -3807450 -5314739 -6725806
36357 -6725806 -6888043 -6391918 -6748412 -8068156 -9032717 -9014928 -8795733 -8899096 -8488730
36348 -8488730 -6687351 -4138115 -2255508 -1453360 -1298271 -2032884 -4179794 -6410193 -6059644
36339 -6059644 -3060776 -1179775 -3048449 -5827314 -5105969 -1873406 -1249061 -4280608
$$ packed form
36402e763832o91590J290113J448988l63432j192637j54416M30308l72276k49686
36393e618460K056950L810928K063628j704580l427820j936111L1457J81192m85320
36384e028136j08302P94341M84294o69753n34272J053956J504367m77006k459418
36375e439929j875062J6441M81718K6499J160298L168002K365806j716562m489835
36366f302624k566800J446756K955490J526664N7053k55486o68503j507289j411067
36357f725806j62237M96125l56494j319744r64561J7789K19195j03363M10366
36348h488730J801379K549236J882607Q02148J55089p34613k146910k230399L50549
36339f059644K998868J881001j868674k778865P21345L232563O24345l031547
$$ plain form
36331 -4280608 -6012905 -3452779 -647314 -2417565 -6772996 -7982777 -4854137 -1319390
36323 -1319390 -19963 112783 134777 -791908 -2917407 -4923656 -6200125 -7351647 -7997985
36314 -7997985 -6886521 -4700459 -3856010 -4738763 -4957553 -3302696 -1669913 -1801590 -2746792
36305 -2746792 -3061533 -3092421 -3359367 -2940259 -1478946 -867785 -2711021 -5579810 -6956402
36296 -6956402 -6718695 -6551200 -6890064 -6746618 -6034677 -5869189 -6599654 -7333915 -7471871
36287 -7471871 -7213609 -6562017 -5308541 -4065687 -3791470 -4039415 -3220985 -1171791 13753
36278 13753 -1285028 -3784172 -4931711 -4290150 -3717362 -4315351 -4936252 -4362681 -3426058
36269 -3426058 -3566961 -4273455 -3785329 -2040151 -950921 -1464937 -2275477 -2187814 -1844580
$$ packed form
36331d280608j732297K560126K805465j770251m355431j209781L128640L534747
36323a319390J299427J32746K1994r26685k125499k006249j276469j151522o46338
36314g997985J111464K186062Q44449q82753k18790J654857J632783j31677r45202
36305b746792l14741l0888k66946M19108J461313O11161j843236k868789j376592
36296f956402K37707J67495l38864J43446P11941J65488p30465p34261j37956
36287g471871K58262O51592J253476J242854K74217k47945Q18430K049194J185544
36278A3753j298781k499144j147539O41561N72788n97989o20901N73571R36623
36269c426058j40903p06494M88126J745178J089230n14016q10540Q7663L43234
$$ plain form
36260 -1844580 -1911771 -1492066 -210409 -205283 -3448878 -7999510 -9778330 -7945765 -5790363
36251 -5790363 -5937181 -7361529 -8043821 -8000237 -8045198 -7562010 -5607554 -3054825 -1607089
36242 -1607089 -1319931 -991697 -727086 -2137646 -5542323 -8588399 -8797581 -6721017 -5332120
36233 -5332120 -6364828 -8382942 -8937905 -7606491 -5774015 -4120555 -2168733 -405679
36225 -405679 -600314 -2797644 -3976509 -1814349 1511677 1867394 -1091180 -3562415 -3178329
36216 -3178329 -2008274 -2824533 -4903913 -5594610 -4443264 -3353075 -3241114 -2888711 -1512336
36207 -1512336 -611393 -1990908 -4793870 -6045228 -4392036 -2048657 -1979524 -3893966 -4705972
36198 -4705972 -3001003 -1085286 -1621303 -3942765 -5389640 -5127953 -4627436 -4929723 -5477158
$$ packed form
36260a844580o7191M19705J281657N126l243595m550632j778820J832565K155402
36251e790363j46818j424348o82292M3584m4961M83188J954456K552729J447736
36242a607089K87158L28234K64611j410560l404677l046076k09182K076564J388897
36233e332120j032708k018114n54963J331414J832476J653460J951822J763054
36225d05679j94635k197330j178865K162160L326026L55717k958574k471235L84086
36216c178329J170055q16259k079380o90697J151346J090189J11961L52403J376375
36207a512336R00943j379515k802962j251358J653192K343379O9133j914442q12006
36198d705972J704969J915717n36017k321462j446875K61687N00517l02287n47435
$$ plain form
36189 -5477158 -5570085 -5213820 -4417626 -3197350 -2377397 -2921848 -4312655 -4920068 -4076379
36180 -4076379 -2554464 -1109578 67674 617352 283134 -197129 -77292 -274012 -2183852
36171 -2183852 -4948610 -6071627 -4989237 -3828879 -4135158 -5015067 -5211614 -4894783 -4540926
36162 -4540926 -4038330 -3788960 -4708083 -6253198 -6594591 -5729672 -6018581 -8245074 -9691438
36153 -9691438 -8122562 -5340271 -4258031 -4443117 -3620528 -2203496 -2803158 -5576146 -7425700
36144 -7425700 -6425523 -4302349 -3470931 -3795179 -3711107 -2989461 -2704558 -3234082 -3851223
36135 -3851223 -4172143 -4716447 -5645360 -5874555 -4281509 -1463996 610727 797013 -235381
36126 -235381 -1430134 -2673127 -3978597 -4448331 -3326662 -1436893 -246025 13989 20282
$$ packed form
36189e477158r2927L56265P96194J220276Q19953n44451j390807o07413Q43689
36180d076379J521915J444886J177252N49678l34218m80263J19837j96720j909840
36171b183852k764758j123017J082390J160358l06279q79909j96547L16831L53857
36162d540926N02596K49370r19123j545115l41393Q64919k88909k226493j446364
36153i691438J568876K782291J082240j85086Q22589J417032n99662k772988j849554
36144g425700J000177K123174Q31418l24248Q4072P21646K84903n29524o17141
36135c851223l20920n44304r28913k29195J593046K817513K074723J86286j032394
36126b35381j194753j242993j305470m69734J121669J889769J190868K60014O293
$$ plain form
36117 20282 -220274 -1089429 -2058189 -2411288 -2784498 -4055893 -5197300 -4526931 -2792028
36108 -2792028 -2340952 -3188711 -2853925 -644605 949010 232341 -1219258 -1581146 -1649076
36099 -1649076 -2838204 -4503532 -5169264 -4674369 -3508098 -1805212 -415987 -908444 -2938652
36090 -2938652 -3821440 -2459686 -1304329 -2299004 -3420273 -2038938 541928 1300729 613612
36081 613612 1430649 4123158 5823100 4984780 3441699 3259252 3952264 3695841 1720146
36072 1720146 -1099438 -3031721 -2771493 -734714 1203161 1857433 1819010 1810316 1447237
36063 1447237 740382 1054506 2803755 3763206 1845318 -1613727 -3542186 -3191539 -2393008
36054 -2393008 -2528526 -3255585 -3619999 -2719971 -53288 3263678 4785261 3869555 3016013
$$ packed form
36117B0282k40556q69155r68760l53099l73210j271395j141407O70369J734903
36108b792028M51076q47759L34786K209320J593615p16669j451599l61888o7930
36099a649076j189128j665328o65732M94895J166271J702886J389225m92457k030208
36090b938652q82788J361754J155357r94675j121269J381335K580866P58801o87117
36081F13612Q17037K692509J699942q38320j543081j82447O93012k56423j975695
36072A720146k819584j932283K60228K036779J937875O54272l8423q694l63079
36063A447237p06855L14124J749249R59451j917888l459045j928459L50647P98531
36054b393008j35518p27059l64414R00028K666683L316966J521583r15706q53542
$$ plain form
36045 3016013 4142476 5300614 3656494 172324 -1713902 -1042141 76907 168528 -171876
36036 -171876 -129411 600757 2462220 5084454 6424940 5271688 3696243 4416366 6651337
36027 6651337 7382361 5866992 4013108 3049689 2732024 3095540 4126834 4542422 3721030
36018 3721030 3647345 5823662 7764471 6328846 3163574 2525962 4676599 6007211 5116456
36009 5116456 4075222 4036083 4372590 5897909 9820789 13485836 12587304 8147288 5805622
36000 5805622 7290557 8260963 6064456 3911776 5055309 7937743 9730092 10277699
35992 10277699 10175651 9056751 7855455 8714644 10941726 11319913 9814093 10141079 13246665
35983 13246665 15617752 15833152 16978270 20361346 22891978 23281743 24628827 28047934
$$ packed form
36045C016013J126463J158138j644120l484170j886226O71761J119048R1621l40404
36036a71876M2465P30168J861463K622234J340486j153252j575445P20123K234971
36027F651337P31024j515369j853884r63419l17665L63516J031294M15588q21392
36018C721030p3685K176317J940809j435625l165272o37612K150637J330612q90755
36009E116456j041234l9139L36507J525319L922880L665047q98532m440016k341666
36000E805622J484935R70406k196507k152680J143533K882434J792349N47607
35992A0277699j02048j118900j201296Q59189K227082L78187j505820L26986L105586
35983A3246665K371087K15400J145118L383076K530632L89765J347084L419107
$$ plain form
35975 28047934 30263476 30479027 32536995 37101835 39754024 40483783 45624506 55649379
35967 55649379 62334606 64775277 74150584 90134260 86411625 40054237 -30995675 -81322991
35959 -81322991 -88898968 -73506245 -62731542 -60319147 -56180749 -49171904 -45363095 -44203955
35951 -44203955 -40408338 -34635109 -31743029 -31824333 -31327931 -30106887 -30177684 -30236108 -27892116
35942 -27892116 -24864707 -24035007 -23727417 -20614436 -16161754 -14578637 -15958607 -16673540
35934 -16673540 -15389510 -13952713 -13275592 -12681549 -12567032 -13840380 -15381482 -15385195 -14393789
35925 -14393789 -14089812 -14326527 -14216278 -14587044 -16268089 -17520244 -16375774 -14032337 -12776029
35916 -12776029 -12167923 -10607171 -9009493 -9316672 -10755115 -11181674 -10814915 -11016195 -10845430
$$ packed form
35975B8047934K215542K15551K057968M564840K652189P29759N140723J0024873
35967E5649379O685227K440671R375307J5983676l722635m6357388p1049912n0327316
35959h1322991p575977J5392723J0774703K412395M138398P008845L808809J159140
35951d4203955L795617N773229K892080q1304M96402J221044p0797n8424K343992
35942b7892116L027409Q29700L07590L112981M452682J583117j379970p14933
35934a6673540J284030J436797O77121N94043J14517j273348j541102l713R91406
35925a4393789L03977k36715J10249l70766j681045j252155J144470K343437J256308
35916a2776029O08106J560752J597678l07179j438443m26559L66759k01280J70765
$$ plain form
35907 -10845430 -8850471 -6956918 -8090597 -10758912 -10746195 -8017966 -7149348 -10309809
35899 -10309809 -14261465 -15445537 -14140856 -12236324 -10388790 -8947426 -8716075 -9275967
35891 -9275967 -9042032 -8100611 -8448919 -10415241 -11572895 -10460040 -8728489 -8154485 -8057657
35882 -8057657 -7381712 -7001156 -7961912 -9287603 -9551799 -9195167 -9390555 -9746642 -8927980
35873 -8927980 -6789164 -4455245 -2948993 -2863802 -4564243 -7479388 -9846418 -10341378 -9599705
35864 -9599705 -9269079 -9945580 -10737285 -10486447 -8889013 -6782172 -5648374 -6332824 -8006193
35855 -8006193 -8951712 -8499863 -7523729 -7038633 -7234760 -7950562 -8990728 -9699758 -9290226
35846 -9290226 -7969345 -6784265 -6077003 -5159841 -3825412 -2940149 -2965589 -3053808 -2423942
$$ packed form
35907a0845430J994959J893553j133679k668315J2717K728229Q68618l160461
35899a0309809l951656j184072J304681J904532J847534J441364K31351n59892
35891i275967K33935R41421l48308j966322j157654J112855J731551N74004R6828
35882h057657O75945L80556r60756j325691k64196L56632j95388l56087Q18662
35873h927980K138816K333919J506252Q5191j700441k915145k367030m94960P41673
35864i599705L30626o76501p91705K50838J597434K106841J133798o84450j673369
35855h006193r45519M51849R76134M85096j96127p15802j040166p09030M09532
35846i290226J320881J185080P07262R17162J334429Q85263k5440q8219O29866
$$ plain form
35837 -2423942 -1749062 -2304523 -4254794 -6389455 -7191236 -5958339 -3458518 -1567584 -1493584
35828 -1493584 -2332195 -2351875 -1648126 -2053861 -4081955 -5687825 -5104924 -3480115 -3196078
35819 -3196078 -4454666 -5169792 -3984602 -1915920 -774637 -1064096 -1994330 -2939648 -4163185
35810 -4163185 -6108951 -8443967 -10136948 -10371306 -9058516 -6600240 -3773770 -1842375
35802 -1842375 -1745660 -2686338 -2578751 -772835 656926 -500233 -3602546 -6137792 -6875687
35793 -6875687 -6402626 -5268235 -3661371 -2559099 -2962135 -3945104 -3599173 -2055980 -1357826
35784 -1357826 -2074976 -2533973 -2015206 -2075584 -3559127 -4834126 -4597109 -4142058 -4911465
35775 -4911465 -5795320 -5115702 -3729641 -3750022 -5217677 -6300986 -6102324 -5274005 -4450822
$$ packed form
35837b423942O74880n55461j950271k134661q01781J232897K499821J890934P4000
35828a493584q38611j9680P03749m05735k028094j605870N82901J624809K84037
35819c196078j258588p15126J185190K068682J141283k89459r30234r45318j223537
35810d163185j945766k335016j692981k34358J312790K458276K826470J931395
35802a842375R6715r40678J07587J805916J429761j157159l102313k535246p37895
35793f875687M73061J134391J606864J102272m03036r82969L45931J543193O98154
35784a357826p17150m58997N18767o0378j483543j274999K37017M55051p69407
35775d911465q83855O79618J386061k0381j467655j083309J98662Q28319Q23183
$$ plain form
35766 -4450822 -3882254 -4018379 -4778674 -4945072 -3920926 -3133847 -3804744 -4481322 -3282112
35757 -3282112 -1660905 -2805111 -6470843 -8735926 -7529924 -5249948 -4544420 -4385310
35749 -4385310 -2496855 416015 1526709 13464 -2062581 -2791540 -2390078 -1933195 -1683271
35740 -1683271 -1378424 -1296299 -2183179 -4194879 -6316949 -7124096 -6231582 -4768983 -4062478
35731 -4062478 -4053087 -3625102 -2390178 -1248289 -963805 -1180851 -1452450 -2285316 -4039400
35722 -4039400 -5361225 -4271913 -1099156 1038678 -371115 -4179262 -7136440 -8056699
35714 -8056699 -8755310 -10553981 -11800653 -10410934 -7587082 -6641291 -8248297 -9253022
35706 -9253022 -7016039 -2971321 -484496 -651313 -1909782 -2813623 -3271693 -3415213 -3044695
$$ packed form
35766d450822N68568j36125p60295j66398J024146P87079o70897o76578J199210
35757c282112J621207j144206l665732k265083J206002K279976P05528J59110
35749d385310J888455K912870J110694j513245k076045p28959M01462M56883K49924
35740a683271L04847Q2125q86880k011700k122070q07147Q92514J462599P06505
35731d062478R391M27985J234924J141889K84484k17046k71599q32866j754084
35722d039400j321825J089312L172757K137834j409793l808147k957178r20259
35714h056699o98611j798671j246672J389719K823852R45791j607006j004725
35706i253022K236983M044718K486825j66817j258469r03841m58070j43520L70518
$$ plain form
35697 -3044695 -2368790 -1965667 -1801292 -1341080 -738440 -851150 -1866117 -2848960 -2946939
35688 -2946939 -2313134 -1659787 -1552733 -2220526 -3367191 -4095439 -3701352 -2664593 -2275246
35679 -2275246 -3222780 -5020773 -6663901 -7272349 -6376423 -4417924 -2886642 -3115928 -4841385
35670 -4841385 -6515939 -6952937 -6141033 -4802297 -3901768 -4229663 -5546645 -6360073 -5391770
35661 -5391770 -3049864 -789940 414946 195738 -1625243 -4218179 -5430921 -4041715
35653 -4041715 -1662090 -567374 -439595 430124 1492406 603013 -1795213 -2663907 -1240782
35644 -1240782 -405211 -1819135 -3184424 -2426598 -1317915 -2056383 -3037133 -1590715 1059043
35635 1059043 1439042 -734617 -2588514 -2995528 -3625883 -5028561 -5400515 -4110770 -3201518
$$ packed form
35697c044695O75905M03123J64375M60212O02640j12710j014967r82843r7979
35688b946939O33805O53347J07054o67793j146665p28248L94087J036759L89347
35679b275246r47534j797993j643128o08448Q95926J958499J531282k29286j725457
35670d841385j674554m36998Q11904J338736R00529l27895j316982q13428R68303
35661e391770K341906K259924J204886k19208j820981k592936j212742J389206
35653d041715K379625J094716J27779Q69719J062282q89393k398226q68694J423125
35644a240782Q35571j413924j365289P57826J108683p38468r80750J446418K649758
35635A059043L79999k173659j853897m07014o30355j402678l71954J289745R09252
$$ plain form
35626 -3201518 -4059097 -5238727 -5047225 -4073428 -3685797 -3927995 -4353993 -5213071 -6304246
35617 -6304246 -6239763 -4461890 -2636357 -2406405 -2990889 -2750423 -2016757 -2340466 -3669080
35608 -3669080 -4445301 -4263352 -4310120 -4954256 -4862193 -3222077 -1301349 -804696 -1721203
35599 -1721203 -2783368 -3346171 -3805145 -4484799 -5001535 -4786417 -3781780 -2570368 -1950007
35590 -1950007 -2173301 -2520672 -2102730 -1326489 -1833516 -4272247 -6794249 -7009138 -5229709
35581 -5229709 -4223620 -5304947 -6289839 -4594908 -1188968 397998 -1365545 -4329950
35573 -4329950 -5768230 -5413065 -4683622 -4405741 -4484179 -4840282 -5380511 -5522989 -4789135
35564 -4789135 -3554775 -2524378 -2015225 -2429281 -4472241 -7668236 -9483080 -7723863
$$ packed form
35626c201518q57579j179630J91502R73797L87631k42198m25998q59078j091175
35617f304246O4483J777873J825533K29952n84484K40466P33666l23709j328614
35608c669080p76221J81949m6768o44136R2063J640116J920728M96653r16507
35599a721203j062165n62803m58974o79654n16736K15118J004637J211412O20361
35590a950007k23294l47371M17942P76241n07027k438731k522002k14889J779429
35581e229709J006089j081327r84892J694931L405940J586966j763543k964405
35573d329950j438280L55165P29443K77881p8438l56103n40229j42478P33854
35564d789135J234360J030397N09153m14056k042960l195995j814844J759217
$$ plain form
35556 -7723863 -3677715 -1130261 -1916987 -3919075 -4049572 -1906158 463792 1461707 1373737
35547 1373737 1178020 1011395 327209 -743432 -908307 788278 3204354 3920522 2230927
35538 2230927 120809 -684245 -1372915 -4013256 -7681282 -8956717 -6418516 -2533967
35530 -2533967 -440424 -623258 -1574877 -2086191 -1814141 -932637 -355894 -1209053 -3045995
35521 -3045995 -3675151 -1838501 951387 2363358 2064234 1405760 1234545 1371334 1585863
35512 1585863 1746231 1420827 391961 -894237 -2182299 -3902521 -5981545 -7345406
35504 -7345406 -7765780 -8758156 -10932235 -11917211 -9366636 -5023849 -2905786 -3818766 -4723455
35495 -4723455 -3705099 -2349649 -2255109 -2290330 -1127891 -77201 -1164030 -3965025 -6420897
$$ packed form
35556g723863M046148K547454p86726k002088j30497K143414K369950R97915q7970
35547A373737j95717j66625o84186j070641j64875J696585K416076P16168j689595
35538B230927k110118q05054o88670k640341l668026j275435K538201L884549
35530b533967K093543j82834r51619n11314K72050Q81504N76743q53159j836942
35521c045995o29156J836650K789888J411971k99124o58474j71215J36789K14529
35512A585863J60368l25404j028866j286198j288062j720222k079024j363861
35504g345406m20374r92376k174079r84976K550575M342787K118063r12980r04689
35495d723455J018356J355450R4540l5221J162439J050690j086829k800995k455872
$$ plain form
35486 -6420897 -7665913 -8199645 -8219312 -7622032 -6967159 -6729608 -6116451 -4172525 -1613796
35477 -1613796 -123538 -211180 -1012610 -1647538 -1509410 -34479 2168938 2717257 -14559
35468 -14559 -4184345 -6381162 -5917717 -4946322 -4539218 -3578124 -2039443 -2135323 -4531206
35459 -4531206 -6223377 -4642237 -1807068 -1499329 -3634129 -4646713 -2994897 -992048
35451 -992048 -698260 -1010983 -233063 794156 119565 -2080019 -3682875 -3554253 -2706581
35442 -2706581 -2602503 -3469007 -4399421 -4361869 -3118982 -1751370 -2040174 -4519046 -7246240
35433 -7246240 -7469385 -4750275 -1631568 -757656 -1962463 -2857314 -1959957 -414742 -392777
35424 -392777 -2370061 -4645381 -5539253 -5371333 -5703139 -7019586 -8090164 -7745733 -6346270
$$ packed form
35486f420897j245016n33732j9667N97280O54873K37551O13157J943926K558729
35477a613796J490258q7642q01430o34928J38128J474931K203417N48319k731816
35468a4559m169786k196817M63445R71395M07104R61094J538681r5880k395883
35459d531206j692171J581140K835169L07739k134800j012584J651816K002849
35451i92048K93788l12723P77920J027219o74591k199584j602856J28622Q47672
35442b706581J04078q66504r30414L7552J242887J367612k88804k478872k727194
35433g246240k23145K719110L118707Q73912j204807q94851Q97357J545215K1965
35424c92777j977284k275320q93872J67920l31806j316447j070578L44431J399463
$$ plain form
35415 -6346270 -4971514 -3987183 -3236491 -2961351 -3355143 -3547117 -2421374 -574436 -107764
35406 -107764 -1920063 -4320563 -5138167 -4365413 -3766085 -4417634 -5622896 -6002765 -4847749
35397 -4847749 -2557553 -478882 -158465 -1970098 -4433432 -5525653 -4769344 -3553872
35389 -3553872 -3389822 -4337785 -5207210 -4881255 -3379410 -1883884 -1632106 -2554204 -3290907
35380 -3290907 -2856091 -1774688 -1065014 -790582 -554302 -776047 -2065913 -3631893 -4007913
35371 -4007913 -3502056 -4076185 -6138826 -7323942 -5786899 -3217541 -2725584 -4529749 -5667937
35362 -5667937 -3837125 70477 3322978 3889860 1561197 -2091782 -4577609 -4538743 -3322529
35353 -3322529 -3384596 -4889194 -5408990 -3654911 -1735922 -2144514 -3792397 -3328944 -128275
$$ packed form
35415f346270J374756R84331P50692K75140l93792j91974J125743J846938M66672
35406a07764j812299k400500q17604P72754N99328o51549j205262l79869J155016
35397d847749K290196K078671L20417j811633k463334j092221P56309J215472
35389c553872J64050r47963q69425L25955J501845J495526K51778r22098p36703
35380c290907M34816J081403P09674K74432K36280k21745j289866j565980l76020
35371d007913N05857n74129k062641j185116J537043K569358M91957j804165j138188
35362e667937J830812L907602L252501N66882k328663l652979k485827L8866J216214
35353c322529o2067j504598n19796J754079J918989m08592j647883M63453L200669
$$ plain form
35344 -128275 2400537 1249516 -2272368 -4448080 -3840188 -2384993 -2225503 -3213996 -3966284
35335 -3966284 -4020593 -3985130 -4201868 -4204237 -3367899 -1575118 611040 2136703 2264344 1623871
35325 1623871 1821712 3262802 4126483 2836518 1000347 1852238 5471310 7807268 5845987
35316 5845987 1924980 710459 2887391 4522172 2773410 -376916 -1252733 597986
35308 597986 2450544 2425177 1515365 1547752 2589626 3038969 1604850 -1391591 -4435562
35299 -4435562 -6129832 -6118666 -4965394 -3354262 -1617470 -20906 908716 766802 -130781
35290 -130781 -999330 -1553882 -2297411 -3507588 -4309154 -3490098 -1344362 101296 -647404
35281 -647404 -2556962 -3274874 -2156067 -901446 -897297 -1226072 -308681 1392880 1726950
$$ packed form
35344a28275K528812j151021l521884k175712O07892J455195J59490r88493p52288
35335c966284n4309L5463k16738k369Q36338J792781K186158J525663J27641o40473
35325A623871J97841J441090Q63681j289965j836171Q51891L619072K335958j961281
35316E845987l921007j214521K176932J634781j748762l150326q75817J850719
35308E97986J852558k5367r09812L2387J041874M49343j434119k996441l043971
35299d435562j694270J1166J153272J611132J736792J596564R29622j41914q97583
35290a30781q68549n54552p43529j210177q01566Q19056K145736J445658p48700
35281f47404j909558p17912J118807J254621M149l28775R17391J701561L34070
$$ plain form
35272 1726950 -321593 -3390525 -5428505 -5657599 -4724075 -3807719 -3796561 -4512351 -4526069
35263 -4526069 -2588462 476270 2218114 1368594 -635959 -1511743 -713298 556796 1177898
35254 1177898 943865 -23496 -1592678 -3287276 -4414454 -4747360 -4656182 -4513265 -4333275
35245 -4333275 -3935904 -3022479 -1161149 1702570 4553810 5718926 4489165 2091582
35237 2091582 438501 -148852 -1310053 -4286011 -7811162 -9410467 -8639027 -7613265
35229 -7613265 -7850598 -8166636 -6971384 -5223866 -5018415 -6075545 -6256305 -5445113 -5933627
35220 -5933627 -8124503 -8905357 -6248235 -2934911 -2966367 -5904384 -7838474 -7087809 -5724465
35211 -5724465 -5559369 -5823168 -5528125 -5306424 -5668755 -5770442 -5332765 -5680603 -7181707
$$ packed form
35272A726950k048543l068932k037980k29094R33524R16356J1158p15790j3718
35263d526069J937607L064732J741844q49520k004553q75784P98445J270094O21102
35254A177898k34033r67361j569182j694598j127178l32906R1178J42917J79990
35245d333275L97371R13425J861330K863719K851240J165116j229761k397583
35237B091582j653081n87353j161201k975958l525151j599305P71440J025762
35229g613265k37333l16038J195252J747518K05451j057130j80760Q11192m88514
35220e933627k190876p80854K657122L313324l1456k938017j934090P50665J363344
35211e724465J65096k63799K95043K21701l62331j01687M37677l47838j501104
$$ plain form
35202 -7181707 -7672378 -5716278 -3835000 -5550133 -9864990 -11867347 -9282695 -5535435
35194 -5535435 -4875597 -6747509 -7208810 -4645281 -1513608 -561995 -1667956 -3184754 -4582599
35185 -4582599 -6282063 -7851857 -8068972 -6722272 -5090114 -4273421 -3845887 -2566869 -38972
35176 -38972 2498758 2769022 -816395 -7177382 -12393036 -12686350 -8164202 -2890986 -785596
35167 -785596 -2092034 -4228407 -5066143 -4426557 -3062043 -1488394 45533 1215814 1640781
35158 1640781 1197824 362181 13236 398923 502295 -685030 -2387382 -2791335 -1622374
35149 -1622374 -373619 321205 1424162 2729634 1881031 -1920919 -5438130 -5312568 -2826688
35140 -2826688 -1721105 -2600440 -3135264 -3034083 -4481332 -7256589 -7841515 -4990100 -2313279
$$ packed form
35202g181707m90671J956100J881278j715133m314857k002357K584652L747260
35194e535435O59838j871912m61301K563529L131673R51613j105961j516798j397845
35185d582599j699464j569794k17115J346700J632158Q16693M27534J279018K527897
35176c8972K537730K70264l585417o360987n215654k93314M522148N273216K105390
35167g85596j306438k136373q37736O39586J364514J573649J533927J170281M24967
35158A640781m42957q35643l48945L85687J03372j187325j702352m03953J168961
35149a622374J248755O94824J102957J305472q48603l801950l517211J25562K485880
35140b826688J105583q79335n34824J01181j447249k775257n84926K851415K676821
$$ plain form
35131 -2313279 -2936442 -4820595 -4337360 -1962329 -1035944 -2469589 -4095112 -4547595 -4693155
35122 -4693155 -5255673 -5567282 -4965036 -3568682 -1564430 687888 1925773 1003933 -1306401
35113 -1306401 -2944833 -2982752 -2223361 -1682608 -1829537 -3005586 -5068170 -6777756 -6978781
35104 -6978781 -6195774 -5666595 -5224126 -3866572 -2062173 -1393735 -1907804 -1975281 -1083805
35095 -1083805 -615223 -1325537 -2238147 -2826186 -4048152 -6013778 -6788756 -5241542 -3321399
35086 -3321399 -3526444 -5428229 -6737503 -6738801 -6454288 -6133497 -4999734 -3356773 -2674123
35077 -2674123 -3248403 -3714072 -3331660 -2928423 -2963046 -2567880 -1539133 -1429354 -3056280
35068 -3056280 -4426394 -3285029 -852758 -517182 -2888745 -4792638 -4025499 -2647610
$$ packed form
35131b313279o23163j884153M83235K375031R26385j433645j625523m52483j45560
35122d693155n62518l11609O02246J396354K004252K252318J237885r21840k310334
35113a306401j638432l7919P59391N40753j46929j176049k062584j709586k01025
35104f978781P83007N29179M42469J357554J804399O68438n14069o7477Q91476
35095a083805M68582p10314r12610n88039j221966j965626p74978J547214J920143
35086c321399k05045j901785j309274j298K84513L20791J133763J642961O82650
35077b674123n74280m65669L82412M03237l4623L95166J028747J09779j626926
35068c056280j370114J141365K432271L35576k371563j903893P67139J377889
$$ plain form
35060 -2647610 -3649257 -6094617 -6285376 -3261346 -408365 -947039 -3982965 -6275734
35052 -6275734 -6358483 -5335782 -4565904 -4234517 -3911445 -3176730 -1811029 -405677 -446039
35043 -446039 -2492468 -4522180 -3788317 -689258 927216 -1624124 -6202317 -8242844
35035 -8242844 -6181763 -2889852 -1707373 -2628615 -3241123 -2409344 -1605117 -2567820 -4840235
35026 -4840235 -6390377 -6137655 -4937009 -4100261 -3827316 -3469970 -2705842 -1883454 -1532512
35017 -1532512 -2010122 -3392976 -5291251 -6947610 -7860071 -8116974 -7913401 -7174209 -6021223
35008 -6021223 -5086831 -4768237 -4590564 -3958012 -3099894 -2469679 -1629143 163744 2363339
34999 2363339 3323768 2375688 760165 38565 319048 589372 258892 -210011 32986
$$ packed form
35060b647610j001647k445360j90759L024030K852981n38674l035926k292769
35052f275734q2749J022701P69878L31387L23072P34715J365701J405352m0362
35043d46039k046429k029712P33863L099059J616474k551340m578193k040527
35035h242844K061081L291911J182479r21242o12508Q31779Q04227r62703k272415
35026d840235j550142K52722J200646Q36748K72945L57346P64128Q22388L50942
35017a532512m77610j382854j898275j656359r12461k56903K03573P39192J152986
35008f021223R34392L18594J77673O32552Q58118O30215Q40536J792887K199595
34999B363339R60429r48080j615523p21600K80483K70324l30480m68903K42997
$$ plain form
34990 32986 1288194 2893400 3649241 2906080 1230645 -342430 -1581139 -2942084 -4219500
34981 -4219500 -4311647 -2929597 -1774109 -2919157 -6065953 -8384992 -7611755 -4731285 -2789379
34972 -2789379 -3218674 -4422196 -4428042 -3749887 -4251544 -5824103 -6160322 -4104808 -1320858
34963 -1320858 236083 727851 1013757 560962 -1208436 -2732782 -1970950 263656 1132521
34954 1132521 -83587 -1159996 -714152 -402494 -2245288 -5647165 -8365489 -9050391 -7707189
34945 -7707189 -4965635 -2129627 -868686 -1587884 -2821415 -3163885 -2993273 -3457166 -4693739
34936 -4693739 -5968294 -6674858 -6361139 -4795455 -2921583 -2555336 -3980713 -5043188 -3988011
34927 -3988011 -1991927 -1244312 -1728180 -2028300 -2368583 -4112821 -6418925 -6320351 -3030220
$$ packed form
34990C2986J255208J605206P55841p43161j675435j573075j238709j360945j277416
34981d219500r2147J382050J155488j145048l146796k319039P73237K880470J941906
34972b789379m29295j203522n846O78155n01657j572559l36219K055514K783950
34963a320858J556941M91768K85906m52795j769398j524346P61832K234606Q68865
34954A132521j216108j076409M45844L11658j842794l401877k718324o84902J343202
34945g707189K741554K836008J260941p19198j233531l42470J70612m63893j236573
34936d693739j274555p06564L13719J565684J873872L66247j425377j062475J055177
34927c988011J996084P47615m83868l00120l40283j744238k306104R8574L290131
$$ plain form
34918 -3030220 209591 50509 -2832593 -5134249 -5287190 -4619568 -4605997 -4808870 -4056998
34909 -4056998 -2488168 -1440344 -1631974 -2333261 -2575662 -2478503 -2703470 -3062376 -2767826
34900 -2767826 -2023862 -2002326 -2754670 -2586893 -573765 1561413 1605850 4173 -922335
34891 -922335 -329220 558696 977865 1523491 2159237 1540205 -636442 -2352274 -1712030
34882 -1712030 489729 1911824 1498556 23805 -1433860 -2409634 -2965610 -3603530 -4744285
34873 -4744285 -5635492 -4709218 -1957508 176353 -290879 -2025356 -2205645 -508862 853401
34864 853401 743808 237879 -163007 -1745337 -4707496 -6405386 -4606613 -1043513 616559
34855 616559 -402709 -1489550 -700156 1045763 2187530 2711292 3021536 2318044 -297182
$$ packed form
34918c030220L239811j59082k883102k301656j52941O67622J3571k02873P51872
34909d056998J568830J047824j91630p01287k42401R7159k24967l58906K94550
34900b767826P43964K1536p52344J67777K013128K135178M4437j601677r26508
34891i22335N93115Q87916M19169N45626O35746o19032k176647j715832O40244
34882a712030K201759J422095m13268j474751j457665r75774n55976o37920j140755
34873d744285q91207R26274K751710K133861m67232j734477j80289J696783J362263
34864H53401j09593n05929m00886j582330k962159j697890J798773L563100J660072
34855F16559j019268j086841P89394J745919J141767N23762L10244p03492k615226
$$ plain form
34846 -297182 -3863532 -6124020 -5895052 -4050936 -2335538 -1815341 -2285733 -2671933 -2164339
34837 -2164339 -1184736 -809890 -1125928 -1059432 -292634 -172210 -1675096 -3504257 -3722628
34828 -3722628 -2610632 -2110912 -2720361 -2957939 -2165487 -1727921 -2575362 -3312798 -2364819
34819 -2364819 -725954 -753140 -2759569 -4528553 -4235640 -2468974 -1037920 -857936 -1549362
34810 -1549362 -2434637 -3292714 -4273639 -5360996 -5995845 -5441675 -3737151 -2004810 -1372696
34801 -1372696 -1750007 -2137251 -1994689 -1713302 -1757918 -2002233 -2103726 -2005545 -1831494 -1761663
34791 -1761663 -2238612 -3690958 -5590132 -6383690 -5186020 -3214559 -2533207 -3374009 -3881610
34782 -3881610 -2955671 -2094488 -3273694 -5819780 -6974114 -5420816 -2732604 -1068755
$$ packed form
34846b97182l566350k260488K28968J844116J715398N20197m70392l86200N07594
34837b164339R79603L74846l16038O6496P66798J20424j502886j829161k18371
34828c722628J111996M99720o09449k37578P92452M37566q47441p37436R47979
34819b364819J638865k7186k006429j768984K92913J766666J431054J79984o91426
34810a549362q85275q58077r80925j087357o34849N54170J704524J732341O32114
34801a372696l77311l87244J42562K81387m4616k44315j01493R8181J74051O9831
34791a761663m76949j452346j899174p93558J197670J971461O81352q40802n07601
34782c881610R25939Q61183j179206k546086j154334J553298K688212J663849
$$ plain form
34774 -1068755 -897594 -1553734 -2590603 -3541063 -3480248 -2140491 -769613 -666324 -1394756
34765 -1394756 -1617896 -1214186 -1288203 -2325017 -3504152 -3755168 -2625457 -429496 1599466
34756 1599466 1868365 160691 -1856629 -2937104 -3972753 -5822952 -6796743 -4907419
34748 -4907419 -1784357 -1057189 -2872130 -3570253 -1634735 -322730 -2530636 -6199702
34740 -6199702 -7434742 -5850040 -3999970 -3224177 -2967600 -3082049 -3935706 -4778311 -4469361
34731 -4469361 -3495659 -3135802 -3069372 -2015543 -409204 -114525 -1421703 -2461335 -1931793
34722 -1931793 -628135 95480 -104078 -770646 -1173618 -641853 441384 405056 -1451434
34713 -1451434 -3024049 -1929702 564137 762331 -2133280 -4732393 -4344498 -2438465
$$ packed form
34774a068755J71161o56140j036869r50460O0815J339757J370878J03289p28432
34765a394756k23140M03710p4017j036814j179135k51016J129711K195961K028962
34756A599466K68899j707674k017320j080475j035649j850199r73791J889324
34748d907419L123062P27168j814941o98123J935518J312005k207906l669066
34740f199702j235040J584702J850070P75793K56577j14449q53657q42605L08950
34731d469361R73702L59857O6430J053829J606339K94679j307178j039632N29542
34722a931793J303658P23615j99558o66568m02972N31765J083237l6328j856490
34713a451434j572615J094347K493839J98194k895611k599113L87895J906033
$$ plain form
34705 -2438465 -1679734 -1906815 -1315733 -54602 -55570 -1859207 -3861695 -4769144 -4960558
34696 -4960558 -4967225 -4094479 -1531820 1882193 4064547 3966118 2811895 2547003 3257787
34687 3257787 2960643 346833 -3044347 -4345835 -2706245 -32032 1543823 1710813
34679 1710813 1147884 -115870 -2410300 -4945432 -5814388 -3983952 -875405 729548
34671 729548 -364694 -2393338 -2823658 -1524974 -611451 -1177787 -1852440 -1356208 -838723
34662 -838723 -2077078 -4419988 -5429454 -4153371 -2035814 -693813 -342933 -469898 -652639
34653 -652639 -499494 135159 767750 939275 958678 1090657 686864 -525656 -1055766 542885
34643 542885 2878759 2911442 37708 -3028767 -3766328 -2355312 -342249 1277597 2073277
$$ packed form
34705b438465P58731k27081N91082J261131r68j803637k002488r07449j91414
34696d960558o667Q72746K562659L414013K182354r8429j154223k64892P10784
34687C257787k97144k613810l391180j301488J639590K674213J575855J66990
34679A710813n62929j263754k294430k535132q68956J830436L108547J604953
34671G29548j094242k028644m30320J298684R13523n66336o74653M96232N17485
34662h38723j238355k342910j009466J276083K117557J342001L50880j26965j82741
34653f52639J53145O34653O32591J71525J9403J31979m03793j212520n30110J598651
34643E42885K335874L2683k873734l066475p37561J411016K013063J619846P95680
$$ plain form
34634 2073277 2004559 1826735 2178792 2061209 57143 -2764761 -3514171 -1676976 -197682
34625 -197682 -1287459 -3514551 -4506332 -4321921 -4339696 -4723053 -5013057 -5646254 -6781538
34616 -6781538 -6940985 -4988688 -2438638 -1632412 -2372608 -2486755 -1248266 -176416 -597388
34607 -597388 -2251564 -4379039 -6549584 -8070582 -7837099 -5441413 -2068730 -15080
34599 -15080 -981697 -4162867 -6299136 -5028730 -2218036 -2022174 -5210850 -7934132 -7302558
34590 -7302558 -5347544 -5188698 -5905838 -4541363 -1410711 419096 121521 -252117 21762
34581 21762 -703658 -2714246 -3715915 -2570193 -1239009 -1512456 -2387802 -2332662 -1848866
34572 -1848866 -1984598 -2281605 -2087146 -2191044 -3233455 -4029093 -3489691 -2778105 -3308428
$$ packed form
34634B073277o8718j77824L52057j17583k004066k821904p49410J837195J479294
34625a97682j089777k227092r91781J84411j7775l83357k90004o33197j135284
34616f781538j59447J952297K550050Q06226p40196j14147J238489J071850m20972
34607e97388j654176k127475k170545j520998K33483K395686L372683K053650
34599a5080r66617l181170k136269J270406K810694J95862l188676k723282O31574
34590g302558J955014J58846p17140J364475L130652J829807k97575l73638K73879
34581B1762p25420k010588j001669J145722J331184k73447q75346N5140M83796
34572a848866j35732k97007J94459j03898j042411p95638N39402P11586n30323
$$ plain form
34563 -3308428 -3888420 -2520750 -209292 92291 -1737684 -2416621 -300229 1909282 1208466
34554 1208466 -1255546 -2153590 -923743 24134 -430415 -495513 1310795 3707571 4713546
34545 4713546 4364560 3694779 2357884 -552646 -3864875 -4861167 -2870763 -494310 -415494
34536 -415494 -2345743 -4061693 -4351480 -3771392 -3162305 -2597695 -1678462 -181437 1519537
34527 1519537 2459342 1950822 642469 1060 430067 768385 106785 -919948 -1348112
34518 -1348112 -1337680 -1468087 -1577208 -1445598 -1697417 -2634846 -3027772 -1795882 -334003
34509 -334003 -1119513 -4021666 -6075601 -5478726 -3910857 -3786728 -4724082 -4394905 -2227119
34500 -2227119 -546712 -1679314 -4908238 -7074491 -6058026 -3078707 -1147144 -1513036
$$ packed form
34563c308428n79992J367670K311458L01583j829975o78937K116392K209511p00816
34554A208466k464012q98044J229847R47877m54549o5098J806308K396776J005975
34545D713546l48986o69781j336895k910530l312229r96292J990404K376453P8816
34536d15494j930249j715950k89787N80088O09087N64610R19233J497025J700974
34527A519537R39805n08520j308353o41409M29007L38318o61600j026733m28164
34518a348112J0432j30407j09121J31610k51819r37429l92926J231890J461879
34509c34003p85510k902153k053935N96875J567869J24129r37354L29177K167786
34500b227119J680407j132602l228924k166253J016465K979319J931563l65892
$$ plain form
34492 -1513036 -2477716 -1998486 -472925 95468 -888449 -1911609 -1765243 -1187609 -1350835
34483 -1350835 -1824659 -1254292 439375 1819800 1911032 1239862 510776 -613843 -2434272
34474 -2434272 -3740210 -2946894 -586545 950306 568039 -283180 -350645 -720708 -2492114
34465 -2492114 -3902702 -2442191 859945 2241141 467247 -1638141 -1683353 -792081 -731412
34456 -731412 -751215 359076 1190758 -388504 -3417054 -4799899 -3679117 -2266842 -2286284
34447 -2286284 -2940120 -2939453 -2583920 -2849692 -3637059 -3916087 -3134613 -1945309 -1662550 -3003704
34437 -3003704 -5231787 -6814499 -7008075 -6226326 -4911659 -3245420 -2230447 -3350442
34429 -3350442 -6165138 -7841877 -6508109 -3754446 -2301439 -2514709 -2991642 -3279292 -3823014
$$ packed form
34492a513036r64680M79230J525561N68393r83917j023160J46366N77634j63226
34483a350835m73824N70367J693667J380425R1232o71170p29086j124619j820429
34474b434272j305938P93316K360349J536851l82267q51219o7465l70063j771406
34465b492114j410588J460511L302136J381196j773894k105388m5212Q91272O0669
34456g31412j9803J110291Q31682j579262l028550j382845J120782J412275j9442
34447b286284o53836O67L55533k65772p87367k79028P81474J189304K82759j341154
34437c003704k228083j582712j93576P81749J314667J666239J014973j119995
34429c350442k814696j676739J333768K753663J453007k13270m76933k87650n43722
$$ plain form
34420 -3823014 -4208221 -3825849 -3629190 -4814355 -6177477 -5315904 -2435157 -525474 -1408174
34411 -1408174 -3719361 -5237441 -5261406 -4153318 -2319621 -438583 522645 119349 -1363858
34402 -1363858 -3267357 -4341983 -3142482 -128472 1661290 83064 -2837299 -3495776
34394 -3495776 -1784041 -686976 -1285048 -1545572 -359571 627393 140507 -836464 -1504339
34385 -1504339 -2747461 -4734650 -5597175 -4197383 -2080977 -1068253 -831926 -370391 -2215
34376 -2215 -315737 -771062 -773807 -660550 -555743 16195 449150 -843204 -3456288 -4545979
34366 -4545979 -2966730 -1411517 -2347768 -4104655 -3532336 -702407 1720343 2312252 1431107
34357 1431107 -740558 -3790145 -5631194 -4472481 -1905828 -1308608 -3223248 -4873588
$$ packed form
34420c823014l85207L82372J96659j185165j363122Q61573K880747J909683q82700
34411a408174k311187j518080k3965J108088J833697J881038R61228m03296j483207
34402a363858j903499j074626J199501L014010J789762j578226k920363o58477
34394c495776J711735J097065n98072k60524J186001R86964m86886r76971o67875
34385a504339j243122j987189q62525J399792K116406J012724K36327M61535L68176
34376b215l13522m55325k745J13257J04807N71938M32955j292354k613084j089691
34366d545979J579249J555213r36251j756887N72319K829929K422750N91909q81145
34357A431107k171665l049587j841049J158713K566653N97220j914640j650340
$$ plain form
34349 -4873588 -4453650 -3368700 -3480893 -4285676 -4117516 -2848143 -2009348 -2638344 -3969663
34340 -3969663 -4462185 -3706562 -2748459 -2358109 -1830429 -448215 657741 -197632 -2494191
34331 -2494191 -4124550 -4643411 -5357983 -5983639 -4427008 -981996 675487 -1278283 -3734386
34322 -3734386 -3487081 -2235508 -3294197 -5660024 -5525255 -2420922 345192 954875 859173
34313 859173 1140911 759533 -764766 -1954795 -1791221 -1234914 -1359246 -1814819 -1966806
34304 -1966806 -2063856 -2661601 -3940754 -5627086 -6593344 -5198034 -1507916 1677619 1927056
34295 1927056 385520 -368967 -597869 -2484735 -5553531 -6614385 -4663063 -2496700
34287 -2496700 -2529152 -3886096 -4699477 -4621855 -3894800 -2354396 -595932 1537 -580043
$$ packed form
34349d873588M19938J084950j12193q04783J68160J269373Q38795o28996j331319
34340c969663m92522P55623R58103L90350N27680J382214J105956q55373k296559
34331b494191j630359n18861p14572o25656J556631L445012J657483j953770k456103
34322c734386K47305J251573j058689k365827J34769L104333K766114O09683r5702
34313H59173K81738l81378j524299j190029J63574N56307j24332m55573j51987
34304a966806r7050n97745j279153j686332r66258J395310L690118L185535K49437
34295A927056j541536p54487k28902j886866l068796j060854J951322K166363
34287b496700l2452j356944q13381P7622P27055J540404J758464N97469n81580
$$ plain form
34278 -580043 -910241 -826166 -1674596 -3012551 -2102566 1761051 5304513 5618040 3838671
34269 3838671 2395252 1292863 -177237 -587423 1267417 2937448 1129769 -2860504
34261 -2860504 -4361524 -1980654 519670 -272630 -3213038 -5269071 -5751061 -5851443 -5696195
34252 -5696195 -4265278 -1828470 -500594 -1830594 -4778189 -6702852 -6069452 -3755031
34244 -3755031 -1761649 -1141162 -1504744 -2122185 -2661659 -2793798 -1994816 -307959 1270054
34235 1270054 1795385 1464552 1195380 1400396 1709316 1771320 1798082 2160201 2702072 2754221
34225 2754221 2020029 1322520 1923924 3833723 5390965 5107413 3403322 1785997 878274
34216 878274 281036 -100374 53853 401169 91186 -918297 -1852925 -2376273 -2605839
$$ packed form
34278e80043l30198Q4075q48430j337955R09985L863617L543462L13527j779369
34269C838671j443419j102389j470100m10186J854840J670031j807679l990273
34261b860504j501020K380870K500324p92300k940408k056033m81990j00382J55248
34252e696195J430917K436808J327876j330000k947595j924663O33400K314421
34244c755031J993382O20487l63582o17441n39474j32139P98982J686857J578013
34235A270054N25331l30833k69172K05016L08920O2004K6762L62119N41871N2149
34225B754221p34192o97509O01404J909799J557242k83552j704091j617325r07723
34216H78274n97238l81410J54227L47316l09983j009483r34628n23348k29566
$$ plain form
34207 -2605839 -2091483 -460552 923703 25894 -2604759 -3766515 -1858585 745532
34199 745532 1068907 -397753 -907761 403303 1701197 1319695 -447433 -2446944 -4050641
34190 -4050641 -5125348 -5631032 -5585826 -4909016 -3316020 -875369 1477842 2582143 2229394
34181 2229394 1320292 794238 581015 -284388 -2297544 -4235637 -4057685 -1653640 343486
34172 343486 -156557 -1601537 -1161021 437789 -494389 -4793731 -8592335 -8755599 -6990077
34163 -6990077 -6200843 -5703975 -3456404 -880195 -1227531 -3954915 -4962027 -2707659 -223905
34154 -223905 -62357 -806208 -363043 304858 -839121 -3342554 -5244623 -6143961 -6711661
34145 -6711661 -6178066 -3162412 1168128 3474612 2400304 213093 -587236 -414720 -1078637
$$ packed form
34207b605839N14356J630931J384255q97809k630653j161756J907930K604117
34199G45532L23375j466660n10008J311064J297894l81502j767128j999511j603697
34190d050641j074707n05684M5206O76810J592996K440651K353211J104301l52749
34181B229394r09102n26054k13223q65403k013156j938093J77952K404045J997126
34172C43486n00043j444980M40516J598810r32178m299342l798604j63264J765522
34163f990077P89234M96868K247571K576209l47336k727384j007112K254368K483754
34154b23905J61548p43851M43165O67901j143979k503433j902069q99338n67700
34145f711661N33595L015654M330540K306484j074308k187211q00329J72516o63917
$$ plain form
34136 -1078637 -2712437 -3985762 -4412694 -4523452 -4158259 -2542513 -142343 1360663 1320765
34127 1320765 683838 -130281 -1954728 -4611528 -5977800 -4817172 -2767313 -1756258
34119 -1756258 -1242437 -231548 -149719 -2569736 -5411128 -5190807 -2500020 -1129569 -1642878
$$ packed form
34136a078637j633800j273325m26932j10758L65193J615746K400170J503006l9898
34127A320765o36927q14119j824447k656800j366272J160628K049859J011055
34119a756258N13821J010889Q1829k420017k841392K20321K690787J370451n13309
$$ [...]
##END NTUPLES=NMR SPECTRUM
##END=
