##TITLE=31Pdec_LR-726-OH-EtOAc
 , 124 sc
 1.7.2022
##JCAMPDX= 6.0         $$ Bruker NMR JCAMP-DX V2.0
##DATA TYPE= NMR SPECTRUM
##DATA CLASS= NTUPLES
##ORIGIN= UXNMR, Bruker Analytische Messtechnik GmbH
##OWNER= root
$$ XWIN-NMR		Version 3.5
$$ Fri Jul  1 13:49:38 2022 Russian Standard Time (UT+4h)  she@DPX200
##.OBSERVE FREQUENCY= 81.013821
##.OBSERVE NUCLEUS= ^31P
##.ACQUISITION MODE= SIMULTANEOUS
##.ACQUISITION SCHEME= undefined
##.AVERAGES= 124
##.DIGITISER RES= 16
##SPECTROMETER/DATA SYSTEM= spect
##.PULSE SEQUENCE= zgpg30
##.SOLVENT NAME= DMSO
##.SHIFT REFERENCE= (INTERNAL, DMSO, 0, 248.564)
##AUDIT TRAIL= $$ (NUMBER, WHEN, WHO, WHERE, WHAT)
$$ ##TITLE= Audit trail, XWIN-NMR		Version 3.5
$$ ##JCAMPDX= 5.01
$$ ##ORIGIN= Bruker BioSpin GmbH
$$ ##OWNER= she
$$ F:/spectra/data/she/nmr/P31/1/pdata/1/auditp.txt
$$ ##AUDIT TRAIL=  $$ (NUMBER, WHEN, WHO, WHERE, WHAT)
(   1,<2022-07-01 13:48:07.64 +0400>,<she>,<DPX200>,
      <continue with go, POWCHK disabled, PULCHK disabled
       configuration hash MD5:
       00 E9 B6 7A A2 85 ED C7 34 08 36 98 17 FE 4E 26
       data hash MD5: 32K
       01 A3 C1 B9 01 EF AE EB 40 B7 36 14 18 0B EF 4C>)
(   2,<2022-07-01 13:48:09.29 +0400>,<she>,<DPX200>,
      <Start of raw data processing
       efp BC_mod = 2 LB = 1 FT_mod = 6 PKNL = 1 PHC0 = -9920.788 PHC1 = 92.45601 SI = 64K 
       data hash MD5: 64K
       8A E1 FB BB 21 74 C4 7F F2 1C BE 59 B9 35 AB 33>)
(   3,<2022-07-01 13:48:43.50 +0400>,<she>,<DPX200>,
      <pk PHC0 = 217.118 PHC1 = -434.8 
       data hash MD5: 64K
       C5 F9 7C AD 8D 82 41 AA 47 BC 1B E0 CE EB 73 6A>)
$$ ##END=
$$ 
$$ hash MD5
$$ 95 33 97 BA 47 EC 49 68 0F 03 89 A3 89 29 45 62
##$RELAX= 
##$RELAX= 
##$RELAX= 
##$RELAX= 
##$RELAX= 
##$RELAX= 
##$RELAX= 
##$RELAX= 
$$ Bruker specific parameters
$$ --------------------------
##$DU= <F:/spectra>
##$EXPNO= 1
##$NAME= <P31>
##$PROCNO= 1
##$TYPE= <nmr>
##$USER= <she>
##$AMP= (0..31)
100 100 100 100 100 100 100 100 100 100 100 100 100 100 100 100 100 100 
100 100 100 100 100 100 100 100 100 100 100 100 100 100 
##$AQSEQ= 0
##$AQ_mod= 1
##$AUNM= <au_zg>
##$AUTOPOS= <>
##$BF1= 81.014009
##$BF2= 200.13
##$BF3= 200.13
##$BF4= 200.13
##$BF5= 200.13
##$BF6= 200.13
##$BF7= 200.13
##$BF8= 200.13
##$BYTORDA= 1
##$CFDGTYP= 0
##$CFRGTYP= 5
##$CHEMSTR= <none>
##$CNST= (0..31)
1 1 145 1 1 1 1 1 1 1 1 1 1 1 1 1 1 1 1 1 1 1 1 1 1 1 1 1 1 1 1 1 
##$CPDPRG= <waltz16>
##$CPDPRG1= <>
##$CPDPRG2= <waltz16>
##$CPDPRG3= <>
##$CPDPRG4= <mlev>
##$CPDPRG5= <mlev>
##$CPDPRG6= <mlev>
##$CPDPRG7= <mlev>
##$CPDPRG8= <mlev>
##$CPDPRGB= <>
##$CPDPRGT= <>
##$D= (0..31)
0 1 0 0 0 0 0 0 0 0 0 0.03 2e-05 3e-06 0 0 0 0 0 0 0 0 0 0 0 0 0 0 0 0 
0 0 
##$DATE= 1656668700
##$DBL= (0..7)
120 120 120 11 120 120 24 19 
##$DBP= (0..7)
150 150 150 150 150 150 150 150 
##$DBP07= 0
##$DBPNAM0= <>
##$DBPNAM1= <>
##$DBPNAM2= <>
##$DBPNAM3= <>
##$DBPNAM4= <>
##$DBPNAM5= <>
##$DBPNAM6= <>
##$DBPNAM7= <>
##$DBPOAL= (0..7)
0.5 0.5 0.5 0.5 0.5 0.5 0.5 0.5 
##$DBPOFFS= (0..7)
$$ [...]
##$SUBNAM2= <"">
##$SUBNAM3= <"">
##$SUBNAM4= <"">
##$SUBNAM5= <"">
##$SUBNAM6= <"">
##$SUBNAM7= <"">
##$SUBNAM8= <"">
##$SUBNAM9= <"">
##$SW= 501.771253377433
##$SWIBOX= (0..15)
0 1 3 0 0 0 0 0 0 0 0 0 0 0 0 0 
##$SW_h= 40650.406504065
##$TD= 32768
##$TD0= 1
##$TE= 0
##$TE2= 300
##$TE3= 300
##$TEG= 300
##$TL= (0..7)
0 120 53 12 22 120 120 120 
##$TP= (0..7)
150 150 150 150 150 150 150 150 
##$TP07= 0
##$TPNAME0= <>
##$TPNAME1= <>
##$TPNAME2= <>
##$TPNAME3= <>
##$TPNAME4= <>
##$TPNAME5= <>
##$TPNAME6= <>
##$TPNAME7= <>
##$TPOAL= (0..7)
0.5 0.5 0.5 0.5 0.5 0.5 0.5 0.5 
##$TPOFFS= (0..7)
0 0 0 0 0 0 0 0 
##$TUNHIN= 0
##$TUNHOUT= 0
##$TUNXOUT= 0
##$USERA1= <user>
##$USERA2= <user>
##$USERA3= <user>
##$USERA4= <user>
##$USERA5= <user>
##$V9= 5
##$VALIST= <valist>
##$VCLIST= <CCCCCCCCCCCCCCC>
##$VD= 0
##$VDLIST= <DDDDDDDDDDDDDDD>
##$VPLIST= <PPPPPPPPPPPPPPP>
##$VTLIST= <TTTTTTTTTTTTTTT>
##$WBST= 1024
##$WBSW= 4
##$XGAIN= (0..3)
0 0 0 0 
##$XL= 0
##$YL= 0
##$YMAX_a= 2770
##$YMIN_a= -3889
##$ZGOPTNS= <>
##$ZL1= 120
##$ZL2= 120
##$ZL3= 120
##$ZL4= 120
##$ABSF1= 0
##$ABSF2= 0
##$ABSG= 0
##$ABSL= 0
##$ALPHA= 0
##$AQORDER= 0
##$ASSFAC= 0
##$ASSFACI= 0
##$ASSFACX= 0
##$ASSWID= 0
##$AUNMP= <proc_1d>
##$AZFE= 0.1
##$AZFW= 0.5
##$BCFW= 0
##$BC_mod= 2
##$BYTORDP= 0
##$COROFFS= 0
##$CY= -3
##$DATMOD= 1
##$DC= 0
##$DFILT= <>
##$DTYPP= 0
##$F1P= 0
##$F2P= 0
##$FCOR= 1
##$FTSIZE= 65536
##$FT_mod= 6
##$GAMMA= 0
##$GB= 0
##$INTBC= 1
##$INTSCL= 5.30512e-09
##$ISEN= 30
##$LB= 1
##$LEV0= 0
##$LPBIN= 0
##$MAXI= 10000
##$MC2= 0
##$MEAN= 0
##$ME_mod= 0
##$MI= 50
##$NCOEF= 0
##$NC_proc= -7
##$NLEV= 6
##$NOISF1= 182.463
##$NOISF2= 159.3651
##$NSP= 0
##$NTH_PI= 0
##$NZP= 0
##$OFFSET= 248.5645
##$PC= 4
##$PHC0= -9703.67
##$PHC1= -342.344
##$PH_mod= 1
##$PKNL= yes
##$PPARMOD= 0
##$PSCAL= 0
##$PSIGN= 0
##$REVERSE= no
##$SF= 81.014009
##$SI= 65536
##$SIGF1= 159.3651
##$SIGF2= -187.1042
##$SINO= 113.3802
##$SIOLD= 16384
##$SREGLST= <1H.CDCl3>
##$SSB= 0
##$STSI= 65536
##$STSR= 0
##$SW_p= 40650.406504065
##$SYMM= 0
##$S_DEV= 0
##$TDeff= 32768
##$TDoff= 0
##$TI= <>
##$TILT= no
##$TM1= 0
##$TM2= 0
##$TOPLEV= 0
##$USERP1= <user>
##$USERP2= <user>
##$USERP3= <user>
##$USERP4= <user>
##$USERP5= <user>
##$WDW= 1
##$XDIM= 65536
##$YMAX_p= 556814048
##$YMIN_p= -27625915
$$ End of Bruker specific parameters
$$ ---------------------------------
##NTUPLES= NMR SPECTRUM
##VAR_NAME=  FREQUENCY,     SPECTRUM/REAL,   SPECTRUM/IMAG
##SYMBOL=    X,             R,               I
##VAR_TYPE=  INDEPENDENT,   DEPENDENT,       DEPENDENT
##VAR_FORM=  AFFN,          ASDF,            ASDF
##VAR_DIM=   65536,         65536,           65536
##UNITS=     HZ,            ARBITRARY UNITS, ARBITRARY UNITS
##FACTOR=    0.620285442955139, 1,           1
##FIRST=     20137.2065510759, 0,            0
##LAST=      -20513.1999529892, 0,           0
##MIN=       -20513.1999529892, -27625915,   0
##MAX=       20137.2065510759, 556814048,    0
$$ Real data points
##PAGE= N=1
##DATA TABLE= (X++(R..R)), XYDATA
$$ [...]
##PAGE= N=2
##DATA TABLE= (X++(I..I)), XYDATA
15105 -12034013 -10352183 -6196670 -1791054 3238852 8308955 10908041 9894086 6896140
15097 6896140 4022843 2075334 947845 205403 -626225 -1373199 -1338930 -765534 -1133063
15088 -1133063 -3163660 -5511235 -6198070 -4586499 -1684737 572289 596160 -968555 -1197789
15079 -1197789 1577198 5196187 6926811 7757479 9889009 11408159 8564817 3001146
15071 3001146 708599 2678049 2860673 -1909934 -5947783 -2931524 4501217 8268619
15063 8268619 4996687 -1597573 -6152106 -5905716 -1768772 1692795 -226391 -6113402
15055 -6113402 -8838802 -5162698 -836288 -1900216 -5213196 -3725391 1922720 4295385
15047 4295385 524752 -4280024 -5445456 -4234443 -3389748 -2650154 -1272952 -927258 -3039991
15038 -3039991 -5689127 -5767095 -3126383 -858313 -1728460 -4896714 -6258217 -2794814 3154905
15029 3154905 5660202 2138238 -3625024 -6742364 -6718152 -5485991 -3173199 617810
15021 617810 3864077 4614952 4571827 6048073 7193586 4915588 1102751 700657 4120221
15012 4120221 6662435 5547437 2731089 476783 -1152472 -1815677 -477164 1609072
15004 1609072 1550680 -822400 -3068911 -4709008 -7101611 -8472263 -4592154 3936726
14996 3936726 10233548 9499309 4598063 825943 -843616 -2382399 -4063613 -4564997
14988 -4564997 -3614644 -1968902 -174951 1251028 1958525 2526318 3101671 1808248 -2280448
14979 -2280448 -5403793 -3074294 2355890 3731172 -555888 -4463397 -4142317 -2993738
14971 -2993738 -3902406 -3479399 1222535 6480201 8093824 8415099 10824070 11996275 7104111
14962 7104111 -813510 -4708508 -4698750 -7252848 -13723809 -17556117 -14141875 -6873800 -1323931
14953 -1323931 1337860 2771587 3443430 2711314 522143 -2347569 -4031844 -1833413
14945 -1833413 4496224 10030596 8611084 38334 -9292662 -13100557 -10273049 -3848287
14937 -3848287 2107485 4911959 5259329 6356536 8976751 9300505 4811561 -400269
14929 -400269 -1164870 319309 -1873352 -6573413 -6297404 287379 4844155 1395403 -5246006
14920 -5246006 -7409258 -4957977 -2668290 -2150375 -2140180 -3252664 -6436728 -8781943 -6370856
14911 -6370856 -333962 4341855 5112929 3224057 234847 -2522050 -2163748 3288095
14903 3288095 10707353 14289983 12507733 9010417 6528733 4026839 784689 -878880
14895 -878880 867639 4061481 5474311 4475836 2486482 392677 -1427862 -1880385 -218013
14886 -218013 2231940 3290032 2688380 2037298 2059765 1509223 -575682 -2931239 -3615008
14877 -3615008 -2758094 -2223766 -2577986 -2163535 11769 2140239 2090660 932809 1647559
14868 1647559 4529471 6355511 4812458 1659179 280123 1531897 3208144 2740567
14860 2740567 -260348 -3347914 -3089935 1059127 5006494 4353410 383295 -1362521
14852 -1362521 1021722 3242024 1733567 -1160214 -1967579 -1886049 -3292004 -3928605 -510125
14843 -510125 3991235 3565090 -678856 -881343 5307678 9817819 5435288 -3562929 -7515536
14834 -7515536 -4557292 -1471313 -2671763 -4609638 -2535245 1984629 3577232 824617
14826 824617 -1989990 -911019 2569301 3946034 1863514 -551406 -563777 623202 680612
14817 680612 181756 1173028 3282351 4492628 4837954 5581245 5167902 583583 -6554287
14808 -6554287 -10194694 -8181453 -5657019 -7016062 -9027504 -6633367 -1887819 -939693
14800 -939693 -3944825 -4735056 -848073 2443103 333576 -4277865 -5101240 -766117 4617514
14791 4617514 7368065 7670130 7869075 9453996 11412176 10644335 5127459 -2463686 -6111922
14782 -6111922 -3060470 2617578 5113890 3918358 2882462 3382689 2435063 -1649777
14774 -1649777 -5578768 -5603150 -3257630 -3139383 -5880720 -7025558 -3591653 1524887 3730831
14765 3730831 2995467 3067016 5616998 8395135 9183591 8392252 6758973 3405822 -1892569
14756 -1892569 -6728428 -8726754 -8654386 -8445891 -7586310 -4680701 -1935227 -4009977 -11103460
14747 -11103460 -16415755 -13169216 -2730050 6726123 9195393 6318082 3648033 3678515
14739 3678515 4395094 3839941 3282404 4379031 5190978 2251122 -3456718 -6078470 -2134683
14730 -2134683 4601526 8014819 7225179 6049542 6598355 7465743 7629761 7711123 6960230
14721 6960230 3554703 -683314 -530153 4774634 7947544 2332567 -8306529 -13601228
14713 -13601228 -9364610 -1771184 1719286 992213 627906 2121480 2470742 -442866
14705 -442866 -4313206 -5145091 -2037433 1728715 1970028 -2374206 -8151440 -10758837 -8384387
14696 -8384387 -3670847 -754033 -576364 -59164 3375614 7554735 7687094 2662326 -2934821
14687 -2934821 -4049149 -589130 3784556 6570127 7823101 7694311 5569658 2143916
14679 2143916 65224 1274273 4728808 7524270 7687640 5643086 3508299 2965710
14671 2965710 3454013 2907221 550261 -2243270 -4418849 -6464792 -7719687 -5204190
14663 -5204190 1713849 7665587 6688822 405765 -3761160 -2333160 1141208 3205542
14655 3205542 5162125 8431599 10162752 7102834 803829 -4280712 -5854079 -4636445
14647 -4636445 -2335484 -837382 -1434189 -3252200 -4353255 -4902620 -6202302 -6491687 -2591821
14638 -2591821 3161973 3651001 -2658294 -8283731 -7658804 -5224109 -7183474 -11196503
14630 -11196503 -11325932 -8316827 -6993824 -7286973 -6227803 -5589289 -8402033 -10493127
14622 -10493127 -5706317 1887746 2130179 -4744147 -7535202 -2050452 2453651 -696205
14614 -696205 -4722847 -1663106 4372278 5064886 1440285 32323 1061710 185927 -1597123
14605 -1597123 660852 6301487 9328023 7539566 4261526 1649607 -1038931 -3107252
14597 -3107252 -2905899 -2250527 -3961659 -5473387 -1817372 4982396 7036621 2367822
14589 2367822 -1942039 -773103 2204275 2430503 2230303 5177006 8133476 5656844
14581 5656844 -817845 -4748953 -3840654 -1606701 -294367 1777093 5198644 7336203
14573 7336203 7142061 7505439 10049853 11362579 7993024 2418101 -320607 -384151 -2599036
14564 -2599036 -8085676 -11567220 -9160955 -4542463 -3636470 -6112129 -6827283 -4278214
14556 -4278214 -2355913 -3371629 -4493548 -3206903 -2033086 -4428755 -8828330 -10577097
14548 -10577097 -8314746 -4908817 -2794306 -1785671 -1467144 -2461927 -4367748 -4959861
14540 -4959861 -2977023 -216547 560044 -999219 -2665853 -2317877 215108 3736308
14532 3736308 6928255 8575580 7604078 4318945 1453842 2199876 6335866 9873130
14524 9873130 9861739 7936592 7170253 7174505 5403113 2156864 404133 856977 1374566
14515 1374566 1616123 3628788 6574717 6067346 1546799 -616600 4255923 11258444
14507 11258444 12014567 6408411 2504623 5356039 11131734 13222867 10114829 5582714
14499 5582714 3607867 4601416 5543248 3332149 -1538216 -5279739 -5283438 -2739014 11751
14490 11751 2327243 3956302 3758811 2126363 1848121 3723946 4337556 1604132 -829648
14481 -829648 807280 3654213 2697169 -598439 -676341 2711418 4495951 2973543 1301900
14472 1301900 412356 -1913439 -4165690 -1587244 4379386 5626891 97042 -3228385
14464 -3228385 2568760 11648679 14730161 12848879 13311923 16203938 14648978 7362215
14456 7362215 1755072 2898205 6532130 5995899 1079225 -3221871 -3419622 -20101
14448 -20101 4636660 8397917 10014665 9673276 8745702 8198533 7271569 4184638 -1464230
14439 -1464230 -6973021 -8264763 -4666009 -1064062 -2802491 -8539839 -11328786 -7579234
14431 -7579234 -1471726 1334827 875408 730351 1525617 713008 -2194807 -3967433 -1694209
14422 -1694209 3723010 8516175 9390933 6215333 2216540 960796 2751753 4914172
14414 4914172 5359411 4041803 1430537 -1495142 -2093829 1063732 4121937 1835113
14406 1835113 -3831138 -5401616 -1945347 -1477212 -7203835 -10062419 -2443474 8198959
14398 8198959 9614625 3308045 1021602 5468622 7394062 2157653 -3319951 -3281127
14390 -3281127 -1590837 -2551199 -2940642 571373 4127939 3798066 3488012 8248866 14515661
14381 14515661 14637134 8119277 1507414 -955838 -496758 926942 2924703 4764264
14373 4764264 5607549 6280677 7546166 7774647 5487121 2594123 1687699 1728328 29498
14364 29498 -2850760 -3823589 -1950065 604830 1325361 -1167505 -6450688 -10873585 -9724742
14355 -9724742 -3754210 45467 -1985365 -4046503 169448 6599473 6659743 1335789
14347 1335789 117884 6034450 11337236 10343926 7488482 8037707 8602459 3605884 -4002313
14338 -4002313 -5989586 -565657 5620107 6757820 4000396 1794031 2048426 3253557
14330 3253557 3075571 705440 -2317936 -3291329 -973599 3164929 6577352 7609102
14322 7609102 5591104 857624 -3999162 -4659247 708374 8151796 10979240 6614012
14314 6614012 -823903 -5326513 -5329085 -4057112 -4006740 -3362965 268900 4203279 2685790
14305 2685790 -4705363 -10858858 -10083108 -5760108 -5068788 -8917827 -12312058 -12821192 -12360118
14296 -12360118 -10968224 -5850535 1765034 5507130 3011362 677392 4791593 12012861
14288 12012861 13746363 7497189 -870354 -4880279 -3418970 414583 3114717 3322387
14280 3322387 2436675 2448215 2607476 37330 -5454157 -9782591 -9483235 -5767515 -1985281
14271 -1985281 385789 1473173 1562171 1754303 3080585 3450560 -446549 -6193407 -5887509
14262 -5887509 2947144 11893991 12155677 5895715 1233101 371824 -93001 -637544 991147
14253 991147 2939453 1115091 -2730269 -2881524 524716 1762047 -105989 66840 2976652
14244 2976652 2326800 -3842260 -7948470 -3942159 3685537 7536489 7677667 8209712 8713200
14235 8713200 6081133 1552635 -659854 21195 634408 -18117 -681491 -1002740 -1656671
14226 -1656671 -2276248 -2451234 -3246829 -4865752 -4919901 -2125599 637082 378896 -1255214
14217 -1255214 -1022499 431911 249383 -1416783 -2163767 -1780798 -1576193 -558535 3119404
14208 3119404 7584788 8596815 5396461 1242912 -1866466 -5129384 -9269650 -12536734
14200 -12536734 -13137367 -10942030 -6550661 -1423924 1040376 -2192339 -9536307 -15299084
14192 -15299084 -15394349 -10904886 -5777335 -2920113 -2968546 -5131572 -8366292 -12140794 -15868956
14183 -15868956 -17628970 -15166150 -9160060 -3591858 -1332089 -1139885 -506909 769596
14175 769596 1695716 2237438 2079995 -173738 -3983678 -5829522 -4130805 -2217359 -3006886
14166 -3006886 -4098901 -2503983 -883460 -3506143 -8496615 -10236062 -7858612 -5121331
14158 -5121331 -2945821 1215111 6625657 8403647 4485253 -1801478 -6880178 -9873698
14150 -9873698 -10282834 -7851037 -4968020 -4223667 -3815974 -712185 2545882 882378 -3991640
14141 -3991640 -5139158 -1826641 -982335 -5495240 -9583072 -8663700 -5539920 -3191910
14133 -3191910 326747 5386692 7214981 4031387 1260168 2283725 2761719 108971
14125 108971 160635 6607655 11888511 8250128 1035338 91704 3554279 2334085 -3092029
14116 -3092029 -3612636 2091426 5249764 2403252 927161 5880442 11847139 12339544
14108 12339544 8648914 4748535 1066129 -1831901 -324019 5931136 10276269 7329483
14100 7329483 907879 -1398568 1684683 5141888 5278758 2933091 471420 -973670
14092 -973670 -1709281 -2611607 -3487397 -2443539 1126601 3764458 1744580 -2891086 -4754502
14083 -4754502 -3470200 -3955384 -7601120 -9556413 -6757627 -2209903 1449296 5845769
14075 5845769 10530016 9910446 2313120 -4004010 -924884 8009379 13322692 12923492
14067 12923492 11859803 11669555 8719934 2539569 -2095286 -2202559 419075 3600843
14059 3600843 6496178 6956339 3345762 -781251 -92222 3915617 4239529 -872950 -5581903
14050 -5581903 -6400280 -6687580 -8280244 -6834229 -628052 3428577 -371895 -6538794
14042 -6538794 -6460435 -2251185 -3065156 -9458924 -11650733 -4889386 2596511 1464807 -5427833
14033 -5427833 -7435184 -437290 8833254 11821789 7201492 471196 -2571036 -709149
14025 -709149 2983501 4902672 4035035 1864696 465517 1419632 5208995 9802914 10804219
14016 10804219 5648631 -2448016 -7421723 -7475659 -6364835 -7106229 -8122112 -7347865 -6280193
14007 -6280193 -6589569 -5756725 -667423 5998641 8030494 4470298 1465761 3933504
13999 3933504 9280253 11704022 9718819 6547308 5035098 5266091 6359413 7811723
13991 7811723 8917113 8778394 7314903 5286108 3411787 2166562 1767058 1457442 -100017
13982 -100017 -2347929 -2176342 1850352 5653027 3517031 -3891222 -9043595 -6699367
13974 -6699367 -319090 3234386 2676217 2282575 4508001 7126475 7901367 7851368 8237482
13965 8237482 7622856 4344872 -269225 -3497293 -4430015 -3599673 -1308398 1205877 976590
13956 976590 -2746879 -5139772 -941468 7082254 9787631 3404193 -4933266 -6459616
13948 -6459616 -1819807 1502900 384959 -659030 2710287 8437399 11519243 10499368
13940 10499368 8083904 6888243 6840041 6464610 5180150 3854193 3584119 4485952 6035909
13931 6035909 8177251 10880087 12514351 10623040 5545570 1387682 1246194 2877999
13923 2877999 1803322 -2179640 -4709203 -2970002 987896 3497230 3067655 351920
13915 351920 -2884203 -3948704 -1234093 2864010 3939726 1819433 1574269 6212029
13907 6212029 11658984 12268380 8723089 6302672 6638167 5740806 607678 -6049672 -9356307
13898 -9356307 -8319306 -6489752 -7298726 -9829181 -9534092 -3497846 5218695 10016890
13890 10016890 8228202 4167997 3173605 4835148 5017333 2864623 1622417 2620445
13882 2620445 2783025 -294691 -4201873 -5171400 -3563946 -3098626 -5384348 -7634726 -6243774
13873 -6243774 -1386224 2702891 2085649 -2434883 -5965258 -5114055 -1681809 784037
13865 784037 2652407 7074764 13311843 15579709 10828904 4132361 2504122 5387632
13857 5387632 5799810 538030 -5317445 -5430944 -144682 4907996 5715285 2876007 -781397
13848 -781397 -2860356 -2137778 1107183 5116472 7917280 8323699 5426992 -1058489 -8424255
13839 -8424255 -11209982 -7071441 -1225348 -1171405 -7244611 -12585142 -12840057 -10933498 -10481630
13830 -10481630 -9814215 -6298932 -2204589 -1210850 -2164073 -1826041 -1599001 -5283320 -11103286
13821 -11103286 -12499195 -7411098 -877797 2692533 4129293 4910941 4019659 2013188
13813 2013188 2531419 6112611 7497812 3240778 -2463767 -4133856 -3111776 -4139466
13805 -4139466 -7289133 -9117789 -9382481 -10552615 -12060123 -10823463 -6800609 -2801925
13797 -2801925 533842 4391845 7187721 6065277 2807385 2266233 4444125 4331070
13789 4331070 785627 -969121 1854965 4603551 2699848 -1256940 -2540119 -1993034
13781 -1993034 -3263039 -5439901 -4356204 -69282 2194236 -1034916 -7068544 -10011116
13773 -10011116 -6067120 3334439 11551566 11346199 2574226 -5854548 -5221965 2463099
13765 2463099 7074312 3387296 -3098890 -4756663 -1812346 -391209 -3261400 -6580718
13757 -6580718 -5405942 608835 7395646 10315714 7536983 1447183 -2764779 -1580994
13749 -1580994 3023730 5544638 3312939 -723952 -2417203 -1465738 -177655 836790
13741 836790 2687707 4855400 5218691 3482166 1443451 -425858 -3297737 -6326895
13733 -6326895 -6611375 -4213922 -3050955 -4502755 -4530990 -598679 2936977 1371838 -2000698
13724 -2000698 -512367 4977201 6916882 2492120 -2820012 -4241029 -3562703 -3658832 -3245267
13715 -3245267 -819920 1025318 -398014 -2946721 -2894442 -709011 143517 -1699000 -4845987
13706 -4845987 -7834547 -9309925 -7218481 -1255379 4855047 6640475 4034049 998912
13698 998912 783449 3608425 7901429 11337940 11470125 7780849 2750698 -831512 -2690261
13689 -2690261 -3607474 -3035365 -911242 -191846 -3788580 -9523035 -11985345 -9580632 -5804347
13680 -5804347 -2704477 2429115 11133500 18286179 17308220 9673577 4293759 6301271
13672 6301271 10601641 9436947 3249810 -590426 1243643 3970594 3076389 1317790
13664 1317790 3282672 6922195 6327194 1187889 -2716771 -2494172 -1634871 -3230472 -5277687
13655 -5277687 -5176949 -4038933 -3425768 -2007775 1134216 3634638 3854630 4168828 6324999
13646 6324999 7163980 3795451 -116684 987793 5651479 7224037 3666901 -491721
13638 -491721 -1909059 -2077661 -2271188 -715373 2861883 4673841 2013027 -2350792 -3820299
13629 -3820299 -1697178 1053167 1755381 -219864 -3748325 -6105844 -4504702 682003
13621 682003 5504286 6647017 4734194 2290550 173312 -2230271 -4594993 -5476096
13613 -5476096 -4137306 -1308670 1535032 2988268 2587053 1576882 1924967 3826292
13605 3826292 5173130 4399459 2849700 3042168 5156533 6686508 5716349 3420899 2537394
13596 2537394 3722039 4482546 2347240 -1710235 -4432672 -4621096 -4330822 -5234925 -6110500
13587 -6110500 -5355311 -3760831 -2574525 -739630 3058506 6986940 7972572 6250283
13579 6250283 4726694 4286394 3224458 1245457 253862 589068 123804 -1793085 -2830603
13570 -2830603 -1445880 865965 2382331 3178576 3071534 921267 -2313451 -3357582
13562 -3357582 -1677430 -1146384 -3805419 -5694717 -2984726 865062 -579962 -6709504
13554 -6709504 -9708564 -4762261 4167651 9898205 9595283 5245780 -157272 -4397031
13546 -4397031 -5755637 -3526132 1024580 5076954 6042680 3533286 73008 -999409
13538 -999409 645331 1553669 -1079098 -5324955 -6926773 -5005006 -2890619 -3462920 -6130364
13529 -6130364 -8683407 -9824257 -9298731 -7543143 -5883579 -5460054 -5571413 -4670522 -2979301
13520 -2979301 -2086987 -1995666 -1116526 518461 970329 100832 486389 3293111 6265399
13511 6265399 7553142 8451123 10063464 10355269 7578299 3943414 2362368 1850713 54563
13502 54563 -1812447 -1139324 733975 702087 311052 3622302 8483735 7131982 -2077176
13493 -2077176 -10278504 -9725914 -4259968 -2623756 -5653773 -6982719 -4257521 -2282225
13485 -2282225 -4545769 -7794502 -7210338 -2850743 1480062 3239780 3065566 3048673 4134301
13476 4134301 4690261 2324675 -1803465 -2596153 2207061 7052346 5098371 -1330943
13468 -1330943 -2751984 4215446 11674254 11261679 4994005 1376346 4367742 10382860
13460 10382860 13815753 11811663 5436787 -657356 -1511632 2356958 4539627 891324
13452 891324 -4646636 -5971153 -3654009 -2992479 -5294994 -6738128 -5154066 -2414814
13444 -2414814 78680 2983738 5314275 4218504 -40461 -3270997 -3082276 -1351800
13436 -1351800 332330 3004015 6090252 5819955 1104245 -3285968 -3197676 -923442 -386676
13427 -386676 -337834 2197144 4672540 2014312 -4158920 -6299665 -1926006 2436162 853571
13418 853571 -3658811 -4143266 462125 4631695 3628450 -1905002 -7885624 -10687770
13410 -10687770 -9658227 -7601374 -7951487 -10164512 -9795961 -5145311 -1257128 -3641217
13402 -3641217 -9855317 -12203338 -8244083 -3099976 -527370 2136688 7184874 10599591
13394 10599591 8286730 4131699 5034303 9774441 9989546 2493010 -6101877 -8870091
13386 -8870091 -6721870 -4193646 -2513349 -1095491 -1691867 -5730544 -9924992 -9813196
13378 -9813196 -6650187 -5893297 -8825722 -10183444 -5367096 3265127 9059391 8215930
13370 8215930 3039398 -937879 -436539 2497961 3088420 -270898 -4044244 -4352214 -1719138
13361 -1719138 847622 2472975 4311520 6355381 7486909 7607508 6593311 2518365
13353 2518365 -5175114 -11892899 -12128961 -7270791 -4035676 -4781597 -5237586 -3274500 -3102159
13344 -3102159 -6859445 -8324049 -1499975 8499107 10840753 4057809 -1725148 1207181
13336 1207181 8452738 10790432 6112869 -319211 -4277145 -5864003 -5311918 -912780
13328 -912780 6945512 13314160 13449420 8552853 3985034 2639056 3056994 3744367 5532980
13319 5532980 8399532 9494634 7009249 3529184 2504048 3230317 2627911 500143
13311 500143 -748745 -745867 -1426004 -2869169 -2965166 -1619235 -1250431 -2276415 -2141865
13302 -2141865 -113670 1011095 -199400 -1121416 402190 2499102 2882472 2487905 2376493
13293 2376493 512811 -4274777 -7908274 -5527268 1024027 4916333 3324239 544758
13285 544758 1523647 5616195 8105112 5977956 1060871 -1954247 -449281 3215121
13277 3215121 4898995 4547620 5889832 9407896 9866679 3994733 -3169792 -4405734
13269 -4405734 -266725 2578059 1599850 986947 3728077 6874177 6584156 3648750 1764555
13260 1764555 3081288 6877522 10392770 10538241 7324588 5244589 7788731 11262534
13252 11262534 9074014 2318693 -247365 5160597 11295752 10516872 5626677 4114067
13244 4114067 5860782 4025100 -3446513 -10465276 -11594676 -8220702 -4172928 -143874
13236 -143874 4573562 8072404 7096338 1435738 -5125405 -8302068 -7067800 -4148036
13228 -4148036 -2874228 -3424463 -3049977 -617111 970975 -944712 -3661252 -1844206
13220 -1844206 4754422 10035599 9167959 4338305 1131535 1786392 4284559 6028186
13212 6028186 5655835 2471739 -2930037 -7579801 -8078433 -4172310 1004639 4353137
13204 4353137 5155852 4196144 2408562 936771 906796 2091566 2745773 1648583 -396109
13195 -396109 -1755430 -1806301 -807723 1007080 2890424 2996461 302083 -3014820 -3273343
13186 -3273343 -7907 3050930 2946246 1453657 2018473 4407931 5437757 4219658
13178 4219658 2979542 2280863 -496882 -5991324 -9824792 -8009280 -2837246 358470
13170 358470 441151 227517 384216 -1205704 -4005931 -4404190 -2257670 -2420236 -6860789
13161 -6860789 -10271077 -7720422 -2451916 -735672 -2215659 -1814768 548678 -526739
13153 -526739 -6260503 -10509531 -8658188 -4037461 -2199475 -3385230 -4540687 -5160037
13145 -5160037 -6674640 -8314714 -7884941 -5582750 -3647137 -3071084 -3433314 -4749484 -6505103
13136 -6505103 -6067699 -1435305 5076705 8988298 8865170 6398008 2454504 -2763971
13128 -2763971 -6022882 -2680605 6292706 13153842 12016647 5775378 1612304 1850550
13120 1850550 2548662 119607 -3983821 -5766703 -3811988 -612207 797889 564660
13112 564660 1463542 4592416 7323427 7135224 5914261 7327928 10432379 10010804 4526561
13103 4526561 -316094 1053226 6114298 7753485 4276073 1430586 4050082 9629583
13095 9629583 12174427 9859470 6186809 4517864 4115407 2238561 -1531575 -4595666
13087 -4595666 -4705916 -2729017 -1448334 -2316588 -4156687 -4685665 -2595419 1456756 5004496
13078 5004496 5289937 1813432 -2702963 -4941481 -4353731 -2720053 -910191 1790671
13070 1790671 4962084 6184177 4252852 1457337 932293 2861207 4949341 5850447
13062 5850447 6336751 7244909 7814093 6553399 3069354 -1336088 -4673086 -5704789 -4400058
13053 -4400058 -1365815 2202045 3884477 1339205 -4010803 -6337684 -1670346 5828822
13045 5828822 7728151 2042725 -4048074 -4038851 -559726 -536676 -4953720 -8081683 -5720892
13036 -5720892 292842 5975705 9653733 11359718 10875510 8434902 5877204 5352229
13028 5352229 7182093 9625751 10457351 8734386 5529093 2846399 1446675 229571
13020 229571 -1756110 -3640738 -4015551 -2939574 -1458125 -28293 1189743 1425895 387289
13011 387289 -568860 -278408 -126230 -2396191 -6640293 -9973355 -10931846 -10769173 -10719323
13002 -10719323 -10247820 -8586135 -6046355 -3236302 -719983 228841 -1410737 -4205910
12994 -4205910 -5198270 -3684102 -1833147 -898476 391674 2445479 3066251 1506951 1307045
12985 1307045 5511234 11080444 12363241 9299844 7542103 9908200 12285434 10034805
12977 10034805 4680691 1093148 588254 538346 -429875 -699444 797932 2618038 3333105
12968 3333105 3456076 3547924 2539897 -355681 -3625437 -5224317 -5289137 -5161946 -4570169
12959 -4570169 -2213785 901851 1410623 -1859233 -5191349 -3939880 1538413 6103846
12951 6103846 6243729 4122191 3855373 5526195 5728990 3703752 3278351 6927010 11004299
12942 11004299 10320905 5597814 2108993 1669997 968136 -1552522 -2700918 -921418
12934 -921418 -464925 -4880521 -10273007 -10305603 -5333410 -1011922 498675 2012350 4693526
12925 4693526 6169004 5969419 7104236 10494086 12750542 11511856 8600028 5891636
12917 5891636 2553048 -1166784 -1993407 1050110 3292983 579244 -4038635 -4132334 1275385
12908 1275385 6803902 7939548 5768194 4417077 6090451 9124871 10245330 8844651
12900 8844651 8253315 10912544 13486944 10848079 4805976 3298616 9028332 14698275
12892 14698275 13186467 7165340 3594684 3131877 1330569 -2508843 -4466423 -2993896
12884 -2993896 -843276 59510 923136 2955339 5508195 7232602 6425132 1717510 -4571984
12875 -4571984 -6343548 -1185638 4748354 4546409 553350 88822 3331228 3557905 -1025064
12866 -1025064 -4519229 -3935856 -3897171 -7228423 -8670724 -3387411 4133984 5844693 1042813
12857 1042813 -4193944 -5960210 -5550843 -4886309 -3750013 -1654688 780854 2629740
12849 2629740 3091969 1611512 -1126085 -3238406 -3740468 -3362972 -2651588 -1293404 -181580
12840 -181580 -1407940 -4532971 -5630253 -2506739 1410780 1351432 -2197684 -4286955 -2227101
12831 -2227101 1379016 2540063 643710 -1432353 -816829 2504493 6026518 7372982
12823 7372982 6157521 3379950 249599 -1688399 -892321 2004947 3725804 2180564
12815 2180564 -501864 -1167062 -236722 103901 608721 3338596 6203436 4492310 -1663780
12806 -1663780 -6524379 -6609443 -4419795 -2917723 -1604699 -296250 -1373424 -4911672
12798 -4911672 -6326550 -2804346 1967664 3450583 2661867 2500146 1533110 -2980215 -8551324
12789 -8551324 -9925499 -6849789 -3956206 -3474478 -3251169 -2198833 -2729413 -6247337 -9766278
12780 -9766278 -8900664 -2483413 6482088 13025747 13518024 8660546 3293426 1876556
12772 1876556 4409168 7687829 9214925 8205809 4377165 -1540854 -6760484 -8481786
12764 -8481786 -7051540 -5419489 -5644047 -7207098 -8265176 -7417997 -4878094 -2703187
12756 -2703187 -2931435 -5070105 -6918605 -7841402 -8568773 -7682284 -2511523 5050263 8415088
12747 8415088 4855879 -381035 -2189849 -2976775 -6750430 -10396362 -7937315 -749087
12739 -749087 4031904 3991276 2937606 2666204 1205782 -293325 2527205 8130801 8193610
12730 8193610 66601 -7133822 -4787610 2524907 3656443 -3270152 -9171644 -7121480
12722 -7121480 -351277 3879396 3197936 809078 679853 4210733 9671141 13200149
12714 13200149 11682618 6028894 764997 -628712 809825 1633529 661976 -65875
12706 -65875 1135550 3015369 3413816 2364680 1305174 121116 -2368650 -4986987 -4476792
12697 -4476792 -598049 2068929 81382 -3300471 -1984718 4528026 10203744 10021349
12689 10021349 5238176 459724 -1572460 -880690 1552857 4170426 4526446 948975
12681 948975 -5072399 -9516731 -9923767 -8453363 -9407953 -13207236 -14799577 -10175958 -2773887
12672 -2773887 375244 -1723931 -3266491 -1406819 -717065 -4535304 -7768251 -4323368
12664 -4323368 2451624 4122509 -292831 -4022212 -4139078 -5063634 -8906598 -10402983
12656 -10402983 -5513654 1106474 2352252 -1685477 -5223679 -5133399 -3061890 -821221
12648 -821221 1987472 5881445 9850329 11956721 10435889 5255623 -404394 -2152695
12640 -2152695 488685 2869377 1088113 -2766430 -3674581 -556494 2724391 2787420 700810
12631 700810 17475 2180601 4669644 3898759 10821 -2325408 620555 6424341 9348892
12622 9348892 7802112 5458814 4850748 4188111 1966523 272332 810484 1567688 841694
12613 841694 1079847 4524167 7922948 6514138 1494753 -1536250 -684306 673978 198110
12604 198110 -536082 -60218 866056 2477912 6727395 12484458 14173194 8745966 1289263
12595 1289263 -278683 5082926 10624057 10280782 4903859 -515962 -3027208 -3382092
12587 -3382092 -3149304 -2573773 -1463987 -390892 238555 1493358 4717130 8951735 11115533
12578 11115533 9529863 6069640 3720259 3003584 2294793 1017839 643312 2296650
12570 2296650 4819937 5796843 3724261 -1040601 -6608511 -10508689 -11112603 -8712766
12562 -8712766 -5101828 -2153719 -919724 -1340004 -1997113 -922326 1908614 3383770
12554 3383770 528808 -4981165 -7921538 -5983550 -2749698 -2459192 -4035232 -3317124
12546 -3317124 41531 1858336 37863 -2008923 -667790 2245990 2541166 597671
12538 597671 1118090 5799498 10060060 8831938 3157360 -1193365 -434814 3782088 6961631
12529 6961631 6244321 2546881 -653319 -665991 1845864 3873691 3443434 976000 -2402132
12520 -2402132 -5835125 -7667779 -6077787 -2205984 -124950 -1602415 -3266115 -1585766
12512 -1585766 1731161 2815942 1980749 2370087 3466528 1485379 -3286575 -5154925
12504 -5154925 -1198994 3924455 4518006 1416316 -825518 -1530977 -4074369 -9391101
12496 -9391101 -13515660 -12344551 -6367983 121629 3128534 1944316 -948326 -2761266
12488 -2761266 -3398507 -4836220 -7352877 -8194430 -5198796 -11823 4132645 6425819
12480 6425819 8167884 9695998 10250815 10198362 10481798 9928513 6183515 146226 -3425038
12471 -3425038 -1561492 2773504 4527247 3187335 2693680 4950211 6610546 3883590
12463 3883590 -1772024 -5529948 -5904206 -6347145 -9497220 -12940542 -12869603 -9737994 -7168281
12454 -7168281 -6307335 -4791160 -1475955 1246847 1162548 -532573 -1636615 -2413134 -4183070
12445 -4183070 -5787362 -4381875 150259 4007378 3883436 1230930 407143 2733594
12437 2733594 4359280 1455265 -3865812 -5701394 -2391769 1285789 1519522 964238
12429 964238 3262347 5811881 3817043 -608598 -692430 3621287 4456581 -1338618 -5831518
12420 -5831518 -1166036 8779954 13928444 10999350 4637554 -1244560 -6126697 -8391746
12412 -8391746 -5522919 394685 3137463 -16598 -5083864 -6850494 -4180684 540057
12404 540057 3782341 2462883 -3274725 -8739246 -9753618 -8663527 -10773686 -14994185
12396 -14994185 -13927408 -4798790 5435535 8781374 5268528 236362 -2899451 -3416750
12388 -3416750 -916597 3291920 5395049 3920407 2704874 4826759 6550102 2579105
12380 2579105 -4910061 -8569607 -6249518 -2903497 -2080444 -1858217 -689858 -1061754 -3976542
12371 -3976542 -4706538 1225457 10445622 14709194 10837026 4239258 2167361 5655315
12363 5655315 9084848 7053708 862454 -2815935 -223460 4360001 4144954 -1034607
12355 -1034607 -5129805 -5049276 -4271356 -5843886 -7132190 -4964098 -1618819 -1196678 -3247153
12346 -3247153 -4742525 -5705112 -7721471 -9090435 -7211113 -4243968 -4131367 -4917485 -1095616
12337 -1095616 6220742 9235271 5472734 2115605 4682893 8507543 6831382 1517692
12329 1517692 -767412 1200668 3538962 4842182 6582423 7756125 5901010 2784340
12321 2784340 2769653 5365776 5193289 222221 -4974173 -5367799 -846655 5209027 8900476
12312 8900476 7215204 692395 -5012443 -4482597 339274 2807917 1115040 -401110
12304 -401110 219549 -497162 -3948163 -5610156 -2393876 1845608 2519029 1206315 1677128
12295 1677128 3291791 3536626 3548668 5452554 6802371 3579770 -2611491 -5792122 -3609037
12286 -3609037 495672 2864976 3193799 2486272 1263582 373662 796166 2272849 3925157
12277 3925157 5513999 6341624 4732206 1229661 104145 3884792 8077220 5853897
12269 5853897 -2626711 -9920172 -10246998 -4850098 1500060 5303732 5262059 2226954 -953711
12260 -953711 -2383176 -3744825 -6803570 -8363151 -3747571 4658986 8304028 3764648
12252 3764648 -2335919 -2751233 926046 2369510 195916 -1640381 -1067437 -359779 -1664688
12243 -1664688 -4120345 -5952740 -6538988 -5837713 -4048876 -2343091 -2015460 -2424181 -1471265
12234 -1471265 1296982 3661966 3704288 2533158 2710158 4452415 4792788 959812 -6069879
12225 -6069879 -11959908 -12777496 -8151682 -1240258 3714922 4236000 1310760 -1471863
12217 -1471863 -1427482 442611 1186207 161870 -370841 799878 1837113 1051479 -376856
12208 -376856 -822094 -1088052 -2349816 -3268394 -2279586 -1127555 -2429328 -4699790 -3874750
12199 -3874750 333043 3682591 3661602 2610947 3166518 3977958 2120662 -2558105 -7520456
12190 -7520456 -10349559 -10005275 -6853851 -2868057 -488276 -67695 490939 2837780 6247636
12181 6247636 9185038 11163325 12198311 11982565 10597644 8755163 6644236 4052368
12173 4052368 2238333 3605817 8097294 11656909 10278170 4770161 -201703 -1438561
12165 -1438561 -148591 372539 -1244222 -3361935 -3857848 -2880408 -2392210 -3257444 -4125680
12156 -4125680 -3692969 -2566535 -1770125 -891824 580837 1342095 -157908 -2963721 -4586650
12147 -4586650 -4338869 -3846816 -4642916 -6853210 -9611284 -11227631 -9963883 -6289140 -3056718
12138 -3056718 -1789212 -739523 1363925 2380068 491720 -2139664 -3234532 -4568319
12130 -4568319 -7409399 -7511752 -1491899 4874708 3428209 -2888002 -3309967 3697539
12122 3697539 7607851 2764999 -2860579 -1162356 3888863 4913441 3511294 5038944
12114 5038944 7511110 5546426 1185333 1106255 5393278 7894900 6431926 4560309
12106 4560309 3975547 2904526 1919488 4013209 8270521 9962825 7724583 4781877
12098 4781877 2568135 -784976 -4723148 -5310261 -1907146 724027 -493212 -2355225
12090 -2355225 -673484 3382104 5106222 2322451 -2416830 -4668925 -2601265 577524
12082 577524 -195356 -4902334 -7357259 -3845611 630960 -426585 -4781099 -5181903 -1240010
12073 -1240010 613013 -1175929 -513902 5231536 9630422 6895420 689953 -1660479
12065 -1660479 1059696 4675902 6351645 6157697 4684630 2894506 2375761 3172504 3496068
12056 3496068 3096490 3704144 4701633 2697212 -2287121 -4845223 -1680996 3128790 4035122
12047 4035122 1362213 -1014236 -1569989 -636779 2330721 6459644 7720770 4201181
12039 4201181 51094 -626909 -465219 -3726062 -7699782 -6287085 -420842 2670991
12031 2670991 476309 -1835598 -569296 1225751 -13045 -2759349 -4169176 -4654733
12023 -4654733 -5233787 -4241102 -434516 3565749 4678610 4112722 5221447 8169981 10231640
12014 10231640 10517991 10943930 12445060 13316745 12198094 10328571 9387580 8679215 6325679
12005 6325679 2651532 454759 1475512 4026381 5073366 3601633 632889 -3086886
11997 -3086886 -7246452 -10082729 -9130820 -4987909 -1952010 -2847024 -4802274 -2766496
11989 -2766496 3354500 7701549 5215678 -2370139 -8322919 -7811418 -2072155 3908520
11981 3908520 6679552 6610904 5642024 4546661 3183914 1807381 366680 -2342455 -6574100
11972 -6574100 -9495952 -7972603 -3298223 -222167 -1098692 -4004394 -6738019 -8849068
11964 -8849068 -9003520 -5000548 1415837 4224496 966619 -2857338 -1317046 3208469
11956 3208469 3823172 -375207 -3175813 -464352 4482831 6245155 4164963 1950476
11948 1950476 2268071 3700781 3068991 -298 -2043285 -446975 2245023 1848671 -363042
11939 -363042 1026401 6344271 8871765 4970101 98350 57932 1985960 553689 -1768083
11930 -1768083 1094834 7446757 9732045 6760713 5079892 7651842 9680703 7523044
11922 7523044 4040453 2424466 1455479 -137863 -661615 216187 -221031 -2145367 -1496446
11913 -1496446 2913666 6127664 4538792 1446502 1058876 1776211 -20687 -3563464
11905 -3563464 -5603105 -5369813 -3712098 -716622 2129158 1216998 -3685465 -7002728
11897 -7002728 -4717427 -373472 883121 248977 1714168 4117605 3170744 -870199
11889 -870199 -3823800 -4328970 -4107444 -2926827 617362 4209914 3834401 394282 -1458758
11880 -1458758 -894012 -1325342 -3166579 -2638985 974988 3175946 1621394 59573 1900794
11871 1900794 4605851 3953501 219294 -3239320 -4530561 -3283784 966291 7067906
11863 7067906 11155313 10678711 8040459 7246463 8363270 8410669 6636855 5406857 6032881
11854 6032881 7013982 7035728 6881546 7158933 6515514 3967914 1369608 1368495 3746606
11845 3746606 5924820 6553308 6127876 4277744 -167868 -5344471 -6251981 -1179802 4756140
11836 4756140 6070619 4299502 4296577 5319529 2250011 -4535979 -7731968 -3787421 1332881
11827 1332881 853792 -3523593 -5639449 -4090053 -2164634 -1169898 923648 5052280
11819 5052280 9206196 10760563 8602068 4232390 2029149 5524223 11622196 12360276
11811 12360276 5090632 -3438312 -6718305 -7348147 -11161999 -16920759 -18494867 -14554197
11803 -14554197 -9417348 -5884811 -3294283 -1389955 -463209 1115121 4328943 6294157
11795 6294157 4804821 3449467 6029426 8748986 5381988 -2108200 -6320015 -6036481
11787 -6036481 -6211892 -7442629 -5177410 382147 3428599 2759106 3185441 5119781 2817655
11778 2817655 -4303702 -8654523 -6508454 -3441310 -3580134 -3208086 -203198 55720 -5138611
11769 -5138611 -8872554 -5575822 -902613 -2297796 -6748570 -6869602 -3306567 -1850437
11761 -1850437 -2768559 -2037692 174472 565927 -446996 -224362 470778 -79116 289940
11752 289940 3511066 5974577 3999745 695446 440434 864758 -2086857 -5666865 -5351776
11743 -5351776 -3788432 -5294803 -5949463 -155170 6628823 4347588 -4343988 -6645057
11735 -6645057 406830 6121844 4363007 1920599 4274332 5870434 1552665 -3102391
11727 -3102391 -1248900 3788510 5189610 4255818 6468837 10433168 9633994 3378159
11719 3378159 -1433198 465945 6593166 10244386 7527541 1186540 -1639580 2800262
11711 2800262 9147454 8456248 -34074 -7407498 -6909358 -1927128 673678 -134872 -1097846
11702 -1097846 -1215414 -1752579 -2465960 -2322447 -2171666 -3100205 -3825816 -2831014 -1358328
11693 -1358328 -1434443 -2569305 -2967632 -2375451 -1458960 -90343 1596628 2055909 83333
11684 83333 -3660033 -7799531 -10917458 -10764854 -6100407 -150465 1698144 -840825 -2122690
11675 -2122690 1096896 5004889 5084300 2572037 971230 223863 -1313477 -2355930 -739293
11666 -739293 2307124 4047714 4478524 5016967 4948977 2924143 369494 -139813 1265969
11657 1265969 2406658 2327660 1665314 1285632 2185798 4503899 5538586 2419354 -1868055
11648 -1868055 -353649 7254593 11813563 7194333 -554923 -2696090 -720688 -1669800
11640 -1669800 -5139274 -4850529 -799551 723098 -852451 1311017 9195598 15474118
11632 15474118 14815288 11343887 10324743 9679081 5328661 -852195 -4553228 -6176371
11624 -6176371 -8258104 -8834184 -3864067 4963928 10724267 9900720 6078024 4078382
11616 4078382 3936609 2339677 -2123204 -7048158 -9002354 -7074118 -3315543 60
11608 60 2671182 5543021 8215394 9329429 8709599 7516958 6439480 5358633 4454894
11599 4454894 3754342 2127988 -818896 -2447585 -33189 3945612 3582931 -2024385
11591 -2024385 -6215189 -3392057 3041739 5081613 545181 -4823530 -5067954 -233922
11583 -233922 5601674 9460745 10997614 10685729 8732399 5957285 4294898 5144524 7374121
11574 7374121 8288768 7125525 6236345 7729835 10407020 11754989 11492557 10654850 8577132
11565 8577132 4369203 649519 1261298 4684258 4553828 -1284563 -6805087 -6017045 -1140648
11556 -1140648 1605439 1182660 1506016 3843707 5084245 3554155 1573367 1263378 1999860
11547 1999860 3282144 6146422 9840811 10769614 7491445 3942748 4510874 7898579
11539 7898579 9357328 7847866 7090409 9196688 10846021 7797096 1237572 -2975822
11531 -2975822 -1472165 2045966 764351 -6880978 -14338481 -13780612 -5160420 3562123
11523 3562123 5474780 1659428 -2051426 -2615590 -1326260 399633 2857771 5672161
11515 5672161 7120717 6777962 5953300 4635055 1271473 -2964121 -3443213 1553956 7023795
11506 7023795 7684097 5691409 7070259 11883810 13618087 8727098 1473647 -2416979
11498 -2416979 -2397038 -1075939 473560 2389659 3985255 4995278 6473125 7928350
11490 7928350 6315035 769540 -4580212 -6190494 -6647421 -9977635 -13758699 -11922836
11482 -11922836 -4771454 187939 -1391627 -5197429 -5451678 -2561952 -193927 1158819
11474 1158819 3255559 5322901 4872643 2467548 1699252 4139001 7131418 7139405 3382314
11465 3382314 -2108482 -6510976 -8152518 -7653474 -7123789 -7459536 -7196801 -5157843 -3057096
11456 -3057096 -3537194 -6302716 -8337877 -7710270 -5156121 -2091615 753711 2589947
11448 2589947 2650478 1550537 775520 473174 -428497 -1732426 -1789921 -179665 1780168
11439 1780168 3591431 5776798 6811846 3527297 -3482510 -8434012 -7296581 -3093757
11431 -3093757 -882154 -622879 373618 762980 -2721909 -7498558 -6467192 1629877 9270210
11422 9270210 9926463 5607434 1891246 354359 -375014 -140333 1796291 4022701 4917532
11413 4917532 5070053 4901088 2947170 -294998 -577845 3753465 7336520 5071112 508822
11404 508822 550616 4414912 5502308 2903937 2531389 6198809 8164020 5134454 1950028
11395 1950028 3189099 5625481 4168527 331595 -785954 1329491 2599464 514163
11387 514163 -3769730 -7805696 -9103503 -5964567 -151205 3218813 1310370 -2809977
11379 -2809977 -4549814 -3157445 -145673 4198006 8842200 9616563 3831702 -4233725
11371 -4233725 -7206157 -3410161 2024192 4100525 2256964 -1646606 -5729831 -8206321
11363 -8206321 -8041395 -5930668 -3131967 -295496 1136864 -1219377 -6872234 -11054457
11355 -11054457 -10371844 -7221532 -5043390 -2617182 1885234 4644043 991374 -5550821
11347 -5550821 -6853409 -2200701 1372051 1151436 2321003 7288867 10416040 7793578
11339 7793578 4292269 4868911 5549460 394326 -7473172 -9800015 -5301612 -218520
11331 -218520 1663596 2321141 3293049 3014181 1080028 -611079 -2057121 -5423982 -10075142
11322 -10075142 -12246000 -10885999 -8859617 -6854593 -1596257 7176531 13303370 11909507
11314 11909507 6367206 3030067 2619714 2056403 1652671 3664378 5048271 -581552
11306 -581552 -12258194 -19705577 -15649799 -5230066 1061029 261904 -1955131 -902390
11298 -902390 1514158 885308 -3631240 -8268098 -8110893 -1949339 5104022 5575171 -1466940
11289 -1466940 -7489243 -4096416 5885725 11489938 7352070 -725324 -4797879 -4068201
11281 -4068201 -2600009 -2241826 -1830469 -951841 -716586 -1832924 -4387657 -8330381 -12121809
11272 -12121809 -12506891 -8042072 -1639652 2539589 3490553 2737684 1078403 -1353572
11264 -1353572 -3085158 -2411738 -12424 2105325 3777125 6154525 8238765 6840113
11256 6840113 869945 -6225974 -9426853 -6824530 -1049397 3455904 4560712 3993590
11248 3993590 4393982 5302497 3782485 -913458 -5742306 -7846894 -7641862 -6587853 -4603344
11239 -4603344 -1704005 415488 1020468 2210595 5283720 7459226 5577241 1211429
11231 1211429 -1505218 -1625097 -1219068 -913757 92656 407527 -2408210 -6813410 -7855858
11222 -7855858 -3914757 762359 1679553 -736461 -3085262 -3666685 -3523269 -4248071 -5899922
11213 -5899922 -6475270 -3612901 2171123 6817353 6963552 3892074 1283486 312793 -398695
11204 -398695 -1190333 -1117464 -766606 -1852859 -3933562 -4570946 -2916709 -447115 1661731
11195 1661731 3117803 3030816 1101445 -202050 1663831 4664721 4168676 -331467 -4601674
11186 -4601674 -6118456 -6683654 -7737681 -7803575 -6381416 -5903282 -7241504 -7187714 -3533388
11177 -3533388 563315 896534 -1289156 -873252 3901518 8942150 9393819 5283272 1254422
11168 1254422 1283255 4539700 7232635 7868380 8180973 8332508 5220447 -1431548 -5240701
11159 -5240701 -724232 7855806 11510136 8876746 6339756 6285687 3892888 -2332116
11151 -2332116 -5517372 -753021 6384188 7704446 3969991 2378823 5836538 10800373
11143 10800373 13819057 14676902 13862184 11446830 8396397 5981076 4278544 3064578
11135 3064578 2662707 2352808 537229 -1640569 -380612 4371778 6733633 3082505
11127 3082505 -1577155 -660453 4093639 6162715 5134781 6508763 11349120 14016534
11119 14016534 11550399 8142810 7439953 6635974 2450233 -1782582 -219749 6773907
11111 6773907 12712812 12843123 8419622 3861544 2692526 5772952 10581666 12326733
11103 12326733 8491922 2429643 -188027 1337644 2141704 -726171 -4093148 -4278161
11095 -4278161 -3070368 -3761949 -4020289 1081718 9527438 12791213 7682209 1313794
11087 1313794 670697 3122821 2580557 -7747 576886 3783758 3971333 -2368 -3522192
11078 -3522192 -4631267 -6250821 -8899333 -8574824 -4283918 -922335 -1387523 -1927732 717993
11069 717993 3115834 930348 -3456331 -4368291 -984521 2632100 3592734 2297290 185348
11060 185348 -1313632 -1101728 -159098 -1018097 -3544450 -4109072 -1241301 1304382 81233
11051 81233 -2821421 -3425891 -1454719 1334405 5018958 9552653 12126238 11138771 9925360
11042 9925360 11491352 12314449 7414038 -311326 -2685375 1867151 5465306 1292830
11034 1292830 -8048292 -14634583 -13802569 -6799704 1845855 7429197 7721415 4545232
11026 4545232 1893631 1802962 2871412 2629510 2800 -4322212 -8362930 -9624140 -6804508
11017 -6804508 -1092910 4694438 8055472 7934227 5084918 1617393 -1001594 -3372798
11009 -3372798 -5992265 -6586263 -2853701 2563873 4277775 1835764 191664 1303140
11001 1303140 1247752 -1667711 -2417318 2573638 8587962 9709501 7721506 7319041 6980834
10992 6980834 2654334 -2545748 -1394300 5385696 8684072 3839278 -3239370 -4955933
10984 -4955933 -1398938 1722639 563717 -3606937 -6327280 -4370319 240409 1891772
10976 1891772 -1032542 -3304502 -991786 1763771 -177230 -3167851 -209836 6260039
10968 6260039 6567576 -1319158 -8578250 -8773188 -5338836 -3103694 -932344 2914055
10960 2914055 5366469 3525438 -437175 -3538694 -6019656 -7570309 -5262895 607890
10952 607890 4275125 2735143 803790 2924270 5454450 3255922 -894226 -632355
10944 -632355 3662867 6061372 4357411 1381213 -1281771 -4217500 -5827722 -3465981
10936 -3465981 1364931 4609878 5937864 7822344 9300161 7298715 3917542 4834894
10928 4834894 9305681 9577772 3020676 -2812034 -1597711 2397154 2482347 925855 4007680
10919 4007680 9650933 9530289 2744835 -1845215 1188189 6297694 6281983 2589478 1223034
10910 1223034 3164807 4876074 5622059 8279650 13529725 18113386 19105751 16470977
10902 16470977 11633180 6778473 4975614 7280482 9975174 8418027 3497603 437270
10894 437270 1497013 4360971 7583687 11881458 14989255 11848439 3117880 -2471030
10886 -2471030 934875 7645780 8269282 2721706 -851000 1768261 6205461 6950435
10878 6950435 4012989 909722 -135997 444158 651151 -1304833 -4754057 -6564578
10870 -6564578 -5102208 -2907848 -3033626 -4296640 -3489585 -1069902 -527739 -2293544 -2481239
10861 -2481239 1337940 6557714 9201831 8572934 6712435 5224593 4340484 4029649 4506221
10852 4506221 5673509 6658627 6260974 4307342 2440659 2571922 4419940 5841181 5722004
10843 5722004 4874170 3910743 2443286 790687 -105465 -1054231 -3819938 -7001096 -6260730
10834 -6260730 -384462 6234259 9025173 7898051 4932739 1421153 -881455 -117083
10826 -117083 1620131 -483249 -5895250 -7649564 -2992734 1372752 -161067 -3075891
10818 -3075891 -1134719 2708890 2685707 2016738 7593381 16177633 17436071 9854265 2699567
10809 2699567 1643560 2821942 2639691 3238254 5306862 4866668 1275220 338063 4929419
10800 4929419 9438383 8188515 3503015 978272 1918986 4596944 8162553 11030915
10792 11030915 9539152 2509309 -5766282 -10237253 -10102352 -7124912 -2491820 2356504
10784 2356504 5069120 4793572 2727862 -486640 -4547555 -6592159 -3381195 2711680
10776 2711680 5014850 1323712 -3497974 -4866794 -3129619 337443 5560175 10385618
10768 10385618 10576361 6305962 3008549 3154546 3109735 1074795 1585817 7816442 15163838
10759 15163838 17361716 14340740 9727255 5178168 1469891 590066 2313510 2951846
10751 2951846 1395193 1549197 4845492 6222835 2699695 -213139 2657464 6543177
10743 6543177 4120329 -1900390 -2912466 1346976 2554891 -2320600 -6265519 -3581960
10735 -3581960 1668987 2360323 -1889057 -5708794 -5625954 -2994482 -517589 1413068 4419504
10726 4419504 8925465 12282670 11600873 8324916 7307114 10234838 13012769 11711585
10718 11711585 8025167 5954996 6010177 6315017 6883836 8430327 8803490 5446515 492528
10709 492528 -1402466 -103626 -60271 -2775474 -4147858 -1290437 2282069 1636609 -2142660
10700 -2142660 -3503599 -456295 2988622 3332404 3082793 6867660 13794342 17589722
10692 17589722 14838593 9515254 7343797 8491206 8795166 6317755 3280208 2377866
10684 2377866 4148184 7316949 9195598 6964884 1535825 -1391424 2189548 8502314
10676 8502314 10736394 8505869 7092386 7889882 6313388 668570 -3318449 -207437
10668 -207437 7556829 13416576 14805317 14116954 13976746 14687801 15160514 14275112 11995936
10659 11995936 9884867 9449794 9964446 9432503 7381370 5056940 3680703 4189701 6946394
10650 6946394 9604053 8122180 3028179 871904 4755675 7819250 3144847 -3838551
10642 -3838551 -2314178 6739761 11388259 7120721 2869160 5638978 10072549 8844801
10634 8844801 4260730 2441287 2853448 1123161 -2283358 -3042390 25180 4145997
10626 4145997 6826262 7253618 5641439 3952238 4926737 8293983 10475661 9464888
10618 9464888 7076178 5437694 4611469 4293300 4200945 2577957 -1589335 -4981692 -3083873
10609 -3083873 3390748 9740326 13762958 15875895 14963584 10781469 8176854 10926440
10601 10926440 13641039 9127579 1625062 1493922 7840871 9169183 2022898 -4238379
10593 -4238379 -3423022 51240 2887819 8412412 15640733 16316735 9096790 4266487
10585 4266487 7645004 11714773 9719950 6585572 7885238 9440130 6701483 4060694
10577 4060694 5828453 7404956 4161756 372492 1181119 4098484 5739337 8184582
10569 8184582 11862875 11624557 6674095 4446095 8039317 10623541 8934370 10077799
10561 10077799 17103111 20682401 14546013 6937603 6768049 10184214 10867074 11720254
10553 11720254 16003031 18699669 16952717 16995508 20859315 19560071 9988777 4032896
10545 4032896 9038801 14207445 9586161 3368884 5789275 10911239 10191673 9430892
10537 9430892 15447853 19982482 14253428 6225256 6308765 9386236 7883236 8059652 15707089
10528 15707089 21156752 17032166 14496032 22264373 27305099 18207262 9216140 16544662
10520 16544662 28897435 28070139 21250456 24534450 31392906 27482923 20552003 24791084
10512 24791084 31625879 27505998 23367425 33299644 42864673 34605672 24926524 36128203
10504 36128203 52731281 48871181 37223514 43155015 53744330 45814310 39186416 60674292
10496 60674292 82259238 67508427 51439448 86249408 134644202 129000507 119064236
10489 119064236 214094902 358101468 330580243 52759087 -252869008 -330552272 -207768301
10482 -207768301 -104215342 -111303613 -130113414 -89204966 -47083372 -56864136 -74483492
10475 -74483492 -53902129 -27668015 -35930835 -54587448 -47943604 -31427199 -32877801
10468 -32877801 -40461726 -32895280 -21485337 -23809800 -29392043 -24394027 -19949823 -27117352
10460 -27117352 -32211478 -23263348 -14154305 -18320433 -24003150 -18120372 -10222140 -11485195
10452 -11485195 -13518870 -8187124 -5485598 -12463037 -17064777 -11494706 -8720377 -17144298
10444 -17144298 -22180771 -12746267 -3200475 -7977193 -16271412 -13964975 -9810213 -16222729
10436 -16222729 -23175368 -16343610 -4995434 -6309034 -15269949 -15208100 -7308262 -5166538
10428 -5166538 -8616960 -6536679 566882 2645294 94641 1707122 6400932 5230861
10420 5230861 -1616621 -6527965 -9665553 -16334492 -22538418 -19438619 -10194665 -6877747
10412 -6877747 -11437828 -14010405 -10142458 -6484572 -8136048 -11611241 -12293417 -10173134
10404 -10173134 -6864763 -3577177 -2187237 -3194722 -4005656 -3320360 -3777588 -6176693
10396 -6176693 -6402434 -3090707 -1929668 -6137831 -9569806 -6840868 -3577046 -7671025
10388 -7671025 -15879058 -18538918 -13672949 -7779915 -5787991 -7687582 -11920596 -15591826
10380 -15591826 -14933658 -11033781 -10142323 -13172648 -12033318 -3101862 3862569 -585272
10372 -585272 -10439868 -13571816 -9949309 -8615271 -11148202 -10966639 -6864380 -4932268
10364 -4932268 -7269695 -9468991 -9567515 -9913154 -9990051 -6818844 -3045179 -5209477 -12415518
10355 -12415518 -15673818 -11172561 -6084177 -7368458 -11629497 -11114736 -5238671 -761353
10347 -761353 -2228112 -6506262 -7354696 -3153853 1656841 2663569 675072 -1073142
10339 -1073142 -2442082 -4845695 -5894350 -2002922 3601270 3061514 -3957624 -8260580
10331 -8260580 -4867973 -635407 -2692742 -7124899 -6719059 -3457441 -4150216 -8044786
10323 -8044786 -8531042 -5131284 -4542742 -9687502 -15345827 -15716463 -10568830 -3143200 3217995
10314 3217995 5823856 4268808 1869902 2240259 4539422 4999591 2437755 -842557
10306 -842557 -2984921 -4369621 -5654861 -6330592 -5326556 -2261299 1145943 1264091 -3309882
10297 -3309882 -8117550 -7339950 -2129936 727652 -587645 -177689 5062128 9091075
10289 9091075 5778371 -1394127 -4698450 -3120046 -1845702 -3640028 -6532213 -8423987
10281 -8423987 -9052584 -8281769 -6134268 -3724064 -1786400 307015 2560899 3647012
10273 3647012 3251136 2191049 -276625 -5129445 -9177434 -7419028 -786635 4429967
10265 4429967 5910584 7037697 8086881 4415161 -3698398 -8653042 -7267731 -5804922
10257 -5804922 -8332751 -9807659 -6960777 -5851720 -10495486 -13875578 -10079779 -6210760
10249 -6210760 -10834868 -18529248 -18496281 -12112302 -8734050 -9228876 -7421692 -4090493 -5274669
10240 -5274669 -8822994 -6859217 -1012686 -1213661 -8419428 -11928788 -6266777 1500396
10232 1500396 4461315 4619006 5177196 4321060 1168314 -691717 320538 1249635 1466108
10223 1466108 4200293 8460617 7705747 19136 -8202084 -12073641 -13800623 -14952200
10215 -14952200 -11880607 -4003101 1368498 -995157 -5746569 -5041879 107874 3218850
10207 3218850 2763788 2251566 2734122 2078475 590275 1409077 4932057 7142397 4476041
10198 4476041 -2178793 -8939895 -12716013 -13047213 -11158183 -8085276 -4420601 -1706786
10190 -1706786 -2120914 -5488974 -8514522 -8789257 -7518054 -6276749 -4033652 -449673
10182 -449673 1265024 -795582 -2708999 -530088 2225665 -458743 -6714758 -8982454
10174 -8982454 -5859659 -3822330 -6535735 -10215971 -11332467 -11608681 -12657980 -12045875
10166 -12045875 -7966001 -2804126 637832 2032665 963627 -3475341 -8806338 -10271953
10158 -10271953 -7715808 -5826592 -5692553 -2662236 4333465 8195667 3433096 -4851106
10150 -4851106 -7570777 -3662120 68908 -1221718 -5764505 -9156314 -8865079 -5100152
10142 -5100152 -58635 3547990 4388680 2685139 -1038040 -5528470 -7889147 -6241027
10134 -6241027 -3027590 -2140826 -3153516 -2689242 -1126140 -2435152 -6798664 -9421733
10126 -9421733 -8329788 -7397585 -9197413 -10552961 -8301907 -4284216 -1272404 1199912
10118 1199912 3501676 3120026 -944366 -5018770 -5561192 -3551806 -1399026 321774
10110 321774 548197 -2744882 -7732563 -9098298 -6718737 -7660449 -14874733 -20615817 -17478272
10101 -17478272 -9917909 -7129350 -9470969 -10470281 -8409923 -6689856 -5176720 -771666
10093 -771666 4300629 4044657 -1034521 -3777658 -1727189 -543740 -3941991 -7732296
10085 -7732296 -7125039 -3745004 -1782189 -2074014 -3219915 -4380103 -4319217 -1747479 1102823
10076 1102823 -325664 -5648452 -8247211 -4563951 -86439 -1742423 -8147285 -12473356
10068 -12473356 -12308827 -11189303 -11632693 -11998488 -10441372 -7589391 -4405053 -843613
10060 -843613 2270633 2970625 1186635 -219790 944025 3258901 3969505 2883642 2112451
10051 2112451 2577518 2747984 1028002 -2155285 -5153806 -6648655 -5681290 -1671268 3980703
10042 3980703 7369317 5534745 425969 -2824550 -1982494 307829 1373960 2319891
10034 2319891 4820834 6789323 4806598 -283610 -3813479 -3154102 39062 3477572
10026 3477572 6680897 8949696 8281193 4154101 -968617 -4623832 -6760478 -7658619
10018 -7658619 -5972426 -1306095 3252935 4265703 2653016 2335301 4464443 5771431
10010 5771431 3108846 -2441742 -6718349 -6521802 -2293385 2250650 3340542 955838
10002 955838 -1216012 -636157 704008 -280307 -2576874 -2583717 17290 1769931 887459
9993 887459 -877519 -2477213 -5252584 -8796130 -9664499 -6765515 -3700498 -2599678 -314222
9984 -314222 4733698 6608444 -484055 -11576655 -15794288 -10832477 -4704663 -2800958
9976 -2800958 -1736282 1553922 3115665 -511882 -4766969 -3635344 705641 1672859
9968 1672859 -1102579 -1926167 1273409 3998459 2464915 -1585458 -4594063 -5250749 -3365435
9959 -3365435 1252100 6516298 7845276 3134749 -3681787 -6535943 -3920821 267659
9951 267659 2113848 1768775 1527769 1638570 244081 -2516845 -2971854 1433660 7481831
9942 7481831 9328552 6129259 3219295 4923766 9464172 12549858 12856168 11536135
9934 11536135 8926388 4743257 -36996 -4044061 -6993357 -8531475 -7693026 -5578382
9926 -5578382 -5832433 -9379736 -11295521 -6859644 1346518 6792946 7780998 7892587 8752578
9917 8752578 8125179 5578966 4341211 5757941 6676678 4595418 1399830 -333820 -981128
9908 -981128 -1268221 237287 3776424 5805167 3693100 559942 1065147 3985682 3732174
9899 3732174 -1233644 -6288624 -7599902 -6647613 -6102980 -5424464 -3582680 -2830516 -5637789
9890 -5637789 -9731041 -10486008 -7435160 -4174415 -2242211 73952 2546559 2323280 27673
9881 27673 143608 1994557 -2387130 -14884430 -22490537 -12288392 8087117 17222684
9873 17222684 7825395 -4405697 -3906743 4383730 5851292 -1477564 -6415510 -2328386
9865 -2328386 5264367 8666108 7388142 5781451 6608009 9006794 10194667 8445951
9857 8445951 5536728 4910029 6195872 4542761 -2218528 -9160253 -10284419 -5735027
9849 -5735027 402326 5719298 8751274 6778341 -49389 -5566493 -4480519 -26642
9841 -26642 758776 -3140552 -7262138 -9206965 -9438554 -7336319 -3263973 -1962496 -6458566
9832 -6458566 -11002261 -8245019 -1357065 181643 -4479752 -7027071 -4364416 -2685501
9824 -2685501 -5273873 -6831421 -3753857 -765217 -2648035 -7156150 -10506262 -12583876
9816 -12583876 -12584911 -7165112 2185151 7282192 4357353 432323 2791298 8208703 8872429
9807 8872429 3643417 -2889195 -7817419 -10161954 -8037704 -1810295 3475793 4310926
9799 4310926 3635009 4546705 3923135 -1484857 -7208283 -6639640 -1057690 3110635 4002744
9790 4002744 3945935 2367584 -2458589 -6308974 -2664688 6354630 11022120 7336994 1885768
9781 1885768 1237923 3319599 2764380 -473632 -2031222 338550 4473596 6648299 5097022
9772 5097022 1752993 597456 2788942 4395880 1478453 -3883883 -6230657 -4395141
9764 -4395141 -2213805 -2003563 -2228536 -2050027 -2966243 -4449910 -3034417 1753600 5060406
9755 5060406 3457412 71097 -718335 -63627 -1417965 -3326539 -1421565 3255290 4220343
9746 4220343 -827155 -5862600 -4976935 -580412 975568 -1134271 -2269998 -453042
9738 -453042 1105801 93239 -1248665 -248806 2414420 4962651 6833537 6840163 3218484
9729 3218484 -1897920 -2725423 1678357 4027223 -778388 -6472099 -3949576 4336122
9721 4336122 7355872 1715176 -4464217 -4798334 -2528753 -2124190 -1428010 2726178 7438995
9712 7438995 8147944 6041447 5848091 8699489 11096558 9233617 2170287 -6990115 -11996263
9703 -11996263 -8997038 -2061510 1211656 148743 1084484 5838995 7911944 3578794
9695 3578794 -1264293 -910300 749277 -2229904 -6867777 -6110365 -482631 3509274 3906198
9686 3906198 4221513 5685855 6307472 6693580 9470430 13089237 12903690 8747541 5507647
9677 5507647 5681770 6694793 6043353 4174098 1883343 -511142 -1180405 1492185 4987361
9668 4987361 4993014 2127382 1899855 6998512 13407407 15421256 11702628 5465137 696266
9659 696266 -1333376 -2769399 -5588211 -7194329 -3025057 5071839 8303165 2700661
9651 2700661 -3713366 -1449914 6910145 10768359 6096559 -1586363 -6691472 -8026504
9643 -8026504 -4987450 2430750 9704773 11384314 8941130 8064980 8723909 6219209 1946703
9634 1946703 3074551 9536556 11632252 4809336 -2509698 -1493769 5021691 9657533
9626 9657533 12094568 15301642 16162285 9691962 -306750 -4263085 -65543 4743287
9618 4743287 4615290 2496193 2655479 3526520 1665802 -1444885 -1383401 2140980 4591173
9609 4591173 3210062 807076 1205834 3305171 2695282 -1487551 -4782510 -3591870 -248967
9600 -248967 318000 -3004583 -7017051 -8855197 -8605069 -7949880 -8208811 -9128602 -8479531
9591 -8479531 -4473057 274068 135288 -5843578 -10995574 -9302087 -3459231 -284864
9583 -284864 -1101449 -2233197 -2658475 -4474025 -6696242 -5457773 -832021 2579877 2642418
9574 2642418 1696587 894683 -1716214 -6220092 -9389203 -9745930 -9182306 -8387621 -5735266
9565 -5735266 -1836881 194278 465125 2824728 7896736 10947953 8763394 3640812
9557 3640812 -1295872 -5646803 -8893623 -9448354 -8420270 -8819361 -9336761 -5140324 3157890
9548 3157890 8320505 7072425 4533607 4465065 2951720 -2981077 -7967835 -6320640 -1356645
9539 -1356645 506264 -73390 1528921 4864515 6104949 5612921 6479551 7821104 6316736
9530 6316736 2597333 39581 -906141 -1603739 -876506 2406580 4914438 3167455 -85597
9521 -85597 29140 2578121 3513323 3459200 5278448 6365027 2070073 -4504039 -5376314
9512 -5376314 -370660 2276016 -950958 -4315722 -3689227 -2786920 -4643176 -5191102 -914457
9503 -914457 3610491 2085400 -3975832 -7770562 -6206016 -1576767 3165684 6313464
9495 6313464 6367934 3075306 -1318917 -4278014 -5326385 -4974837 -3715539 -3453625 -6574714
9486 -6574714 -11329147 -11674217 -4935431 3352729 5874878 2332626 -1965307 -3983041
9478 -3983041 -4787654 -4780417 -2257703 2600658 6330133 6310693 3781486 1606927 1127972
9469 1127972 2213299 4388152 6470050 6552553 4026639 975650 218898 2258560 5243867
9460 5243867 7662012 9637297 11315143 11626305 9985097 8127419 8265982 9640988 8998653
9451 8998653 4877535 -610477 -4900431 -7563760 -8636439 -6977635 -2514529 1898811
9443 1898811 3458686 2772154 1915437 1098742 290240 1974090 7795005 13585434 13016190
9434 13016190 6597602 1933026 3527109 7143388 6840269 3395567 2033103 4530969
9426 4530969 7540619 7588837 4652825 1206558 -223757 959039 2538489 1509816 -1949218
9417 -1949218 -4009911 -1924554 2578971 6137982 7812132 8078535 5986628 749898
9409 749898 -4854927 -6413169 -3594204 -1025241 -2493578 -6450504 -8439417 -6377526
9401 -6377526 -2090711 1410262 2773635 2627073 2129514 1670391 721877 -1391123 -4513986
9392 -4513986 -7097639 -6853859 -3031049 1753861 3593048 2222999 1923208 5438312 9124156
9383 9124156 7742882 2673660 385664 2716508 4397693 2050481 -252933 1718391
9375 1718391 4509590 1997852 -4859001 -9250456 -8050174 -4696559 -3182145 -4096825
9367 -4096825 -6364936 -8283113 -7042280 -1870303 2534346 708569 -5376333 -8277540
9359 -8277540 -5693289 -2923655 -3351775 -3381080 -25670 3153777 2611365 1605713 4291360
9350 4291360 7521795 5680145 706203 -459916 2774552 3769532 -196377 -3364216
9342 -3364216 -805520 3760038 3615738 -1374744 -5233065 -4039081 47479 2447621
9334 2447621 1235063 -1804734 -3823025 -3804890 -2585383 -463667 3256907 7217566 7082576
9325 7082576 999446 -5543094 -4841199 2936129 9317371 8373094 3546780 1349203 2431092
9316 2431092 2889773 1783569 2414124 6241168 9517903 7765653 1810787 -2667834 -1818842
9307 -1818842 1461200 1001214 -4214404 -7801268 -4207100 3374208 7184059 5373095
9299 5373095 3059505 3095350 2007183 -2733978 -7231547 -7045159 -4326625 -4384336 -7909290
9290 -7909290 -11058931 -11181305 -8319573 -3022952 2904137 5028060 397087 -7626559
9282 -7626559 -12823889 -13708516 -13398509 -12746562 -9025168 -2217234 2648371 1869144 -1930929
9273 -1930929 -3785911 -2662539 -1129698 -708465 -403435 716105 1747307 1353197 -34888
9264 -34888 -376842 1263474 2944890 2208183 -183352 -1300551 -1094145 -2845358 -6994848
9255 -6994848 -8662315 -4712567 456050 949951 -1827513 -2255351 -110913 -33676 -2169523
9246 -2169523 -1292216 3353111 5037965 -179088 -6549381 -6553198 -896969 4152781 5612715
9237 5612715 5032332 3757779 2055537 1493219 3690049 7091310 8206088 5770154 1638130
9228 1638130 -1447001 -1375344 2082007 5642723 4639563 -772886 -4339918 -1786040 2701775
9219 2701775 2129558 -3660180 -8871113 -10486845 -10576030 -10551913 -8913359 -5385143 -2174250
9210 -2174250 103199 3042504 5649144 3874002 -2769758 -8702761 -9338580 -6563185
9202 -6563185 -3965484 -982450 3610666 6232440 2830524 -3231014 -4371824 226057
9194 226057 3424860 1207934 -1594454 206539 3801899 3575137 443836 -300917 1503367
9185 1503367 160880 -6736971 -13993668 -15375161 -10480782 -3395278 1920815 3098839
9177 3098839 -144935 -4312749 -3804055 2596441 8821954 8043481 744843 -6339816 -8237320
9168 -8237320 -6143817 -4580985 -6411180 -10301564 -11718738 -7380934 150392 4158411
9160 4158411 1674480 -2658546 -3001575 52093 1777119 907652 225457 748383 498925
9151 498925 -825588 -926324 308520 -303524 -3660038 -5684851 -2866130 2428408 4882327
9142 4882327 2454648 -2654583 -7490639 -10337763 -10400847 -8050490 -5383844 -4890866 -7059437
9133 -7059437 -9835347 -10691406 -9217343 -7518248 -7566118 -8335807 -6912178 -2688440 1587406
9124 1587406 3803638 4835453 5263807 3192343 -1372264 -3278908 1554129 8675948
9116 8675948 9666416 3507822 -2464943 -3153703 -1140243 -285595 28281 1550831 3082117
9107 3082117 3022831 2201538 1344726 -651264 -3235121 -2806768 1916448 6475807 6134061
9098 6134061 1995365 -1681884 -3481748 -4297131 -3224420 1336634 7292740 9723142
9090 9723142 6621772 1134384 -2386156 -2825518 -2562846 -4328164 -7889499 -9820986 -7446386
9081 -7446386 -2786624 -679700 -2765459 -5700501 -5998033 -4020079 -1927359 -145794
9073 -145794 2301247 5515605 8167422 8257316 4370001 -2067334 -6191425 -4233380 1266099
9064 1266099 3883039 1214192 -2908933 -4222900 -2219546 1720787 5916866 7338375
9056 7338375 3734200 -1912583 -3786431 -1351186 139696 -1440870 -2013835 388182
9048 388182 1168897 -2662401 -6169148 -3902593 1429320 3638303 2311846 1457875 2247103
9039 2247103 2893216 3064451 3139387 1699486 -1330445 -2072264 1617483 5055218 3012976
9030 3012976 -1907597 -3331192 -951741 134057 -2140110 -5568724 -9089480 -12663755
9022 -12663755 -13114123 -7308415 831445 3459159 -621738 -4823438 -4755529 -3073668 -3248094
9013 -3248094 -4489293 -4827576 -4319643 -3242842 -1164828 700341 -24367 -2806119 -4117885
9004 -4117885 -2440208 -110355 495120 -551304 -2444724 -4565679 -5297574 -3167207 320243
8995 320243 1765542 7771 -3148741 -5678402 -6199460 -3371569 2238432 6819193 7331303
8986 7331303 5677264 5350903 5622643 3336283 -1020227 -3869942 -4241538 -4248064 -4715653
8977 -4715653 -4887475 -5491583 -7437188 -8616463 -6893722 -4893678 -6448037 -9706150 -9729663
8968 -9729663 -6680278 -4907561 -4840829 -2929855 636893 1646361 -219871 -592606 1458351
8959 1458351 1903420 -101344 76162 4342874 8137988 7554764 4208260 636777 -3386830
8950 -3386830 -7801434 -10993591 -13090333 -14972085 -13758737 -6538395 1138151 -133721
8942 -133721 -8588259 -11267961 -2942706 5654834 4560221 -964099 -1284695 1496766 -664205
8933 -664205 -6199688 -6237544 376276 5375659 3925040 120400 -733066 2126429 7286405
8924 7286405 12583790 13643077 7303488 -2384086 -7048463 -4217393 22098 -194527
8916 -194527 -3534480 -5066967 -3072182 155642 1917256 1240686 -1394002 -4615803 -6583354
8907 -6583354 -5975640 -3276980 -871222 -690234 -1336067 526002 4517889 5202007 -263265
8898 -263265 -6067563 -4869820 963389 2436516 -2150574 -4787375 -1051772 2911609
8890 2911609 901394 -3618314 -4152054 -1406120 -466525 -2272159 -3953320 -4136070 -2769275
8881 -2769275 690443 4257400 2937252 -3620440 -7671425 -3472098 3716221 5310653
8873 5310653 1840286 310532 2720723 5224240 6192611 6984048 6315175 1846220 -3504868
8864 -3504868 -4376448 -1535549 -432784 -1757095 -895939 3236887 6372519 6545821 6491192
8855 6491192 7482824 7623034 7247906 9047066 11451540 9133405 2224742 -2162723 -762972
8846 -762972 281212 -4989239 -12794128 -14804376 -9191116 -1704392 2087790 1803207 697161
8837 697161 1684942 4312924 4999291 1578345 -3040737 -4563028 -3731748 -4672130 -7123676
8828 -7123676 -6100981 -689587 2858398 132611 -4310006 -3327314 2582980 6151446
8820 6151446 2927570 -3875111 -7760709 -5630623 -186847 2891365 358044 -5519915
8812 -5519915 -9771865 -10050281 -7679762 -4396082 -806573 2283290 4116882 5566148
8804 5566148 7490915 7983755 4971729 1007911 534384 2181334 -276085 -7652961 -12277291
8795 -12277291 -8526969 -909364 2894907 2400571 2301762 3720181 3881965 2765095 3544977
8786 3544977 6125288 5771027 -44596 -7312915 -10189963 -7599972 -3122349 206128
8778 206128 2812272 6384745 10391180 12243062 10955677 8820597 7839419 6108607 930722
8769 930722 -5102847 -5571297 900093 7472357 7606867 3230986 637834 993852 -198053
8760 -198053 -5261620 -10952795 -13500679 -13013108 -11489527 -9660558 -7699646 -6718318 -7340980
8751 -7340980 -8122204 -7307673 -5348385 -3955891 -3305503 -2214732 -1131798 -2603849 -7310027
8742 -7310027 -11234911 -9408004 -2482790 2969681 1957316 -3244828 -6904143 -7522085
8734 -7522085 -8459384 -11380037 -12976160 -9826200 -3732382 299404 28264 -2432906 -4303123
8725 -4303123 -4965107 -4818972 -3450622 -439299 2817809 3765014 1662539 -1070236 -1392638
8716 -1392638 1006845 3965676 5875849 6619714 5632052 1813899 -3421467 -5798883 -3262564
8707 -3262564 741665 1890333 900815 1297358 3094378 3493493 3036667 5254991 9328883
8698 9328883 9154549 2468751 -4497083 -5583042 -3366245 -3955912 -6649358 -5536593 -43380
8689 -43380 3358885 1137352 -1893410 -93894 4824572 7068418 5091440 2432661 1821353
8680 1821353 2414220 2518120 1719959 -11462 -2675239 -5066335 -5373950 -3654287 -2031496
8671 -2031496 -1963982 -2981364 -4422605 -6284403 -7651445 -6709770 -3757410 -1989351 -3286686
8662 -3286686 -5022378 -3392382 1395532 5625390 6686606 4848002 1549466 -1395412
8654 -1395412 -1794815 761089 3220888 2345471 -913754 -3148258 -3595626 -3930493 -3982915
8645 -3982915 -2260395 -307299 -1196350 -3333074 -1767796 2936938 3663606 -2575103 -9188395
8636 -9188395 -9323208 -4919410 -1641369 -245326 1088199 752219 -2794405 -5203639 -1613241
8627 -1613241 4588812 6122308 3161714 2055457 3510916 1168013 -6668339 -12566079
8619 -12566079 -10747390 -5400400 -3740388 -5824059 -6011999 -1527877 4475172 7052298
8611 7052298 4477089 67634 -643436 3836333 8518099 8584316 6634888 8449762 12973604
8602 12973604 13245884 7539884 2241516 1781900 2941026 2289474 2235305 4999227 6674594
8593 6674594 3174748 -2228344 -3201227 639521 4054097 3365680 -747077 -5431078 -7230828
8584 -7230828 -4128567 925362 1880316 -1932056 -3652893 667129 4732311 1265187
8576 1265187 -5945855 -7232734 -1653837 2134640 -975036 -6601190 -8968849 -7790831
8568 -7790831 -5312648 -2725786 -1766037 -4482775 -8947432 -9875463 -5979103 -2463435 -3780743
8559 -3780743 -7966414 -10794222 -11565341 -11500148 -9838409 -5559885 -929695 400362 -2092341
8550 -2092341 -5811324 -8549433 -9669282 -8869341 -6331920 -3748068 -3174267 -4860872 -7374274
8541 -7374274 -9387915 -10258794 -9569221 -7460821 -5022120 -3264066 -2118089 -1283256 -1325937
8532 -1325937 -2773646 -4656870 -5257948 -4209007 -2864429 -2620243 -3584108 -4742267 -4739207
8523 -4739207 -2768118 382114 2240180 684925 -3539140 -7122355 -7557672 -5648520
8515 -5648520 -4086923 -4160628 -4832431 -4640424 -3089844 -181984 3564417 5900832 3830428
8506 3830428 -2266312 -7188152 -6450840 -2407647 -1435478 -4949283 -7084481 -2881069 4615871
8497 4615871 8171832 5157581 -316127 -2872178 -995247 2571981 3519136 -257962
8489 -257962 -5859157 -7346398 -2371830 4297341 6116454 2583274 -1011441 -1111373 -25394
8480 -25394 -1847372 -6652402 -10188145 -8553635 -2613769 2146876 924276 -4743571 -8157393
8471 -8157393 -5469101 -399822 1223046 -716327 -1909435 -1069746 -1230954 -3645976 -5359285
8462 -5359285 -4333425 -2776387 -3157283 -4395324 -4570266 -4474234 -5575196 -6801124 -6451117
8453 -6451117 -5586515 -6376754 -8166989 -8175092 -5489489 -1707776 1881491 4992344 6452469
8444 6452469 4689499 839840 -1272959 237320 2515419 1532186 -2605240 -5794551
8436 -5794551 -5139627 -2178161 -247210 -97433 232961 1748129 2965510 2761219 2488430
8427 2488430 3336334 3423349 628316 -2560368 -1012328 5489449 10468567 8533371 1882724
8418 1882724 -3435396 -4991869 -4451757 -2848315 272958 3582593 3992928 771955 -3274902
8409 -3274902 -5520753 -5983023 -5499600 -4172945 -2951141 -4406709 -9735655 -15839542 -17215600
8400 -17215600 -11215465 -1207843 5792030 5547045 1041249 -929226 1623667 3201161
8392 3201161 -1063764 -7724978 -9877915 -7397301 -6032791 -6918246 -4697885 1903951
8384 1903951 5578167 1344459 -4622712 -3799037 1942039 4295073 2094494 1964058 6083701
8375 6083701 8318050 4511931 -972142 -2410875 -387974 1591889 3171741 5362048
8367 5362048 6458194 4492161 1458278 873935 2667030 4183231 5005185 7027385 10256954
8358 10256954 12068244 11133373 9510790 9843248 11960453 13261795 12016203 9553318
8350 9553318 8631016 9741339 10492671 9550765 9035234 10613939 11492240 8367609 3711761
8341 3711761 2578953 3779053 1086746 -5690533 -8493624 -3086779 4011711 5638616
8333 5638616 4221564 5348325 7102037 4175617 -1472322 -3169894 -587735 543323
8325 543323 -1315086 -2167660 -1101179 -1533796 -3273662 -2155478 840463 -866342 -7898643
8316 -7898643 -11813222 -7988218 -3283602 -4833042 -8541418 -6423698 27490 2436817
8308 2436817 -1418886 -5419981 -5033633 -2237672 -172904 991376 1470514 -86579 -3975429
8299 -3975429 -7854570 -9250832 -7748257 -4214534 207717 3958807 5529235 4443434
8291 4443434 1137657 -3287726 -6339867 -5035781 368317 4983189 4130286 -1254058
8283 -1254058 -6234071 -7854383 -7046914 -5536065 -3859384 -2417990 -1901589 -2254085 -2949794
8274 -2949794 -4133568 -5657651 -5470662 -1491215 4650401 8147449 6298380 1684050
8266 1684050 -911402 260017 2533092 2049175 -2235539 -7473691 -9551728 -6802328
8258 -6802328 -1146827 3984699 6120042 4613291 749802 -2631197 -3288240 -2144975
8250 -2144975 -2242683 -4440190 -6005160 -4586006 -1619861 -185853 -1209472 -3557746 -6118615
8241 -6118615 -7637928 -6234357 -1892555 1684695 778975 -3191056 -5123112 -2911193
8233 -2911193 61909 -319549 -4024684 -7677163 -8373573 -5715015 -1587428 940937 -293741
8224 -293741 -4189106 -6612349 -4180463 2143533 7899046 9622717 7877071 5624156
8216 5624156 4601541 4579382 5689701 9084232 14155042 17309249 15844270 11625802 8243359
8207 8243359 5781184 1901058 -2672794 -4237684 -2173050 -279861 -416115 783707
8199 783707 6106181 12358100 14079981 10065581 3389082 -2489309 -5075628 -3357572
8191 -3357572 -7239 8815 -3757839 -5383672 -1416905 2701380 746385 -3692747 -2465028
8182 -2465028 3589491 5413007 87708 -4930558 -4211594 -1925491 -2478972 -1775012 5084919
8173 5084919 13156851 13116809 4626055 -3569667 -5882381 -4998655 -4602204 -4125299 -2800182
8164 -2800182 -2805305 -4860787 -5292408 -1665405 1973127 169370 -5576689 -8460264 -5860571
8155 -5860571 -2331363 -2227778 -3895583 -3772725 -2887423 -5378371 -11752408 -17223710 -17198266
8146 -17198266 -12097723 -6049454 -2376243 -1160408 -325691 1628024 3979656 5078893
8138 5078893 5072855 5881590 7812965 8265718 5664361 2790320 3297032 6106653 6726301
8129 6726301 3730567 306429 -890270 -711645 -492477 265751 1543532 1362976 -1129706
8120 -1129706 -3572474 -3422864 -1156274 1121773 2202873 1568567 -899698 -3355142 -2635672
8111 -2635672 1502560 5001000 4351265 826012 -1867229 -1901460 404882 3959211 6422199
8102 6422199 5164052 1245588 -255579 3261096 7733247 7845132 3929324 -131444
8094 -131444 -3174344 -6304073 -8062947 -5418660 586458 4807442 4385330 1692771 147293
8085 147293 -1916 -724325 -3005131 -5323411 -4534612 1022662 8297206 11104914 6836513
8076 6836513 -101440 -3714724 -3337080 -2438320 -2620851 -2452595 -1062859 786191 2716459
8067 2716459 4726486 5693865 4665650 2938838 2220779 1714002 -193815 -2446379 -2523263
8058 -2523263 -289778 2000140 2577731 964738 -2111531 -3318770 1589725 11095251
8050 11095251 16410526 11708925 2822925 -432743 1867840 1168887 -5252381 -9991402
8042 -9991402 -7325860 -1689860 -480663 -3730631 -5317789 -1518858 5132267 9292911
8034 9292911 8449808 5682057 6224630 10074436 10631694 4005124 -3575471 -3321576 3594956
8025 3594956 8352908 7872884 7014645 7003232 1946510 -9214516 -16584313 -11882277 -652021
8016 -652021 5426378 4014567 2388601 4711912 6619176 2919965 -4864879 -10593383
8008 -10593383 -10351962 -5733652 -1356952 13233 -530323 -1001350 -1584874 -2481412 -754345
7999 -754345 6074335 13843892 14732978 7598028 64272 -1743429 -387603 -1093118 -3517733
7990 -3517733 -3931491 -2100171 -1126774 -2113495 -3098767 -2787469 -2363106 -3399230 -5401901
7981 -5401901 -5653481 -1840963 4306730 7397778 4748466 782794 1460345 5837672 8024891
7972 8024891 6404312 4801291 4681534 3172469 2253 -749786 1806421 2822466 -288002
7963 -288002 -3606019 -3732727 -2921810 -3703250 -4453236 -3973702 -4306029 -5211074 -2559489
7954 -2559489 3389418 5356580 357592 -3376923 2282115 13132136 18996372 17025280
7946 17025280 11444544 5347862 600333 942401 6535405 9457137 3383716 -5734285
7938 -5734285 -7439987 -1865322 2231778 1649769 973090 2373189 3234316 3295787 4659952
7929 4659952 5057945 490678 -5638309 -5731434 -605240 1135468 -2681856 -4610730 -840265
7920 -840265 2668883 957220 -2396251 -2900096 -1873119 -879028 2608912 8695373 11255259
7911 11255259 6253181 -1878356 -6971100 -8511503 -7882251 -3637270 3928578 9198426
7903 9198426 8243357 4784934 3774247 3889985 2066736 316117 1209546 1042963 -4614201
7894 -4614201 -11546717 -11311608 -3798425 2369249 2106174 -529018 -422937 1004280 -635450
7885 -635450 -5180653 -7226484 -2200078 8094010 16204901 16103726 9653873 4189017
7877 4189017 3451167 4228468 2999436 1282890 1432962 1588083 -753062 -3615716 -3812833
7868 -3812833 -2305185 -1379020 254460 3706824 4643249 -622942 -6073615 -2281752 8316069
7859 8316069 12329111 4079773 -6123768 -7191324 -2185824 -903733 -4241489 -5234898
7851 -5234898 -2175648 -850932 -3749960 -5607154 -2015998 3985964 7032954 6186025
7843 6186025 3281117 -1219182 -6557444 -8868427 -4931768 2192271 5490322 2265743
7835 2265743 -3071636 -5038733 -3053414 -226414 1385857 2278477 3414501 4715262
7827 4715262 5711329 6453142 7266596 8089540 8546960 8675392 9082145 9840044 9500716 6357377
7817 6357377 1125980 -2844853 -3139694 -1253784 -793721 -3324146 -7246044 -10126039 -10601385
7808 -10601385 -8481787 -4732617 -1288257 522765 1160676 1435809 982445 -126424 183332
7799 183332 3070837 5582995 4162267 672785 363630 3600288 4769680 964956 -3303857
7790 -3303857 -2810467 1404587 5127949 7168215 8511777 8454181 5858838 2077217 -1167160
7781 -1167160 -4663833 -8878703 -10776835 -7864343 -3353903 -2439666 -4632321 -4635300 -401122
7772 -401122 4147399 4550972 287158 -6158248 -11358052 -12246145 -8491279 -3478054 -535539
7763 -535539 806371 2378986 3319646 2057680 304199 637795 1689665 467799 -1865922
7754 -1865922 -1652514 844983 2054939 1459702 1776758 3152043 2970986 1501321 1846214
7745 1846214 3898250 4168852 2059359 334055 -871400 -3773416 -6277881 -3541348
7737 -3541348 2228631 2211603 -5470819 -11188112 -7689462 -572168 1482723 -198417 1078174
7728 1078174 4972712 5316091 1047208 -2342311 -1593047 795254 1799791 1248281 -115897
7719 -115897 -1450918 -700078 3444658 8442929 10064754 7696940 4980949 5338924 8558380
7710 8558380 11083966 8781507 1250512 -5940281 -6387985 -1188137 1926377 -902623
7702 -902623 -5294459 -6931725 -7536457 -8456223 -5537045 2920296 9298665 6091644 -2462848
7693 -2462848 -6942333 -6773204 -7726668 -8744534 -3296141 6677063 10570033 5142210 -538699
7684 -538699 -51478 979468 -3913113 -10646520 -11746917 -8040583 -5548677 -5617897 -5404563
7675 -5404563 -4595571 -4852183 -5077833 -3232921 -800343 -172228 109950 2160007 3250961
7666 3250961 -352747 -5847166 -6950642 -3939215 -3620656 -8424217 -12339698 -10256359
7658 -10256359 -5439071 -3821186 -5307061 -5395183 -2599824 598974 2840628 5229802
7650 5229802 7599437 7597551 4675339 1734365 1101774 1512184 1197861 1546244 4535001
7641 4535001 8014511 7436144 2236425 -3235438 -5923812 -7375656 -9126880 -8748935 -3911960
7632 -3911960 2433330 5120565 3524922 1331903 715317 921004 1844404 4247892 6351357
7623 6351357 5196550 2333762 3080663 8281456 11816327 9184142 3956674 1988474
7615 1988474 3370306 4677194 5521605 7177474 7271391 2454161 -4492950 -6839766 -3768044
7606 -3768044 -1767818 -4534312 -7685903 -6767203 -4861480 -7180340 -12056686 -13412392
7598 -13412392 -10278009 -7715287 -8487998 -9686998 -8921168 -8415472 -10001330 -10394234 -5785462
7589 -5785462 1459188 5420248 4864092 4121817 5581358 6200429 3442812 428619 1520093
7580 1520093 5402616 6880994 4527053 2204691 2829291 4904697 6608141 9120575
7572 9120575 12973267 14463365 10127579 3189561 679394 3984166 6914151 4736676
7564 4736676 887221 1545865 6571959 10045863 8575538 4829242 2602224 2148434 1796770
7555 1796770 1299486 1398793 1683841 1047301 -229009 -447570 1181710 2815433 1183218
7546 1183218 -4625026 -10473934 -10345572 -3948794 1147468 -1389949 -7223601 -6602460 1197955
7537 1197955 5965582 1609969 -4534867 -3237386 2262091 1996712 -4450245 -7549123
7529 -7549123 -3166139 1725510 1062172 -1317460 802767 6141111 8941860 7368617
7521 7368617 3843734 230934 -2802226 -3936473 -2521820 -66785 2075326 4202541
7513 4202541 5549355 3536440 -1714439 -5801816 -5912540 -4439807 -3727145 -1901617 1949436
7504 1949436 3533322 26822 -3411607 -701642 4932140 5352360 -107738 -4557103
7496 -4557103 -4729543 -4289362 -5928414 -7718145 -8201352 -8335292 -7549077 -4481045 -2194195
7487 -2194195 -5367672 -11265335 -11406479 -4208400 2196769 2668808 2039049 4914442 6858530
7478 6858530 2326607 -5197227 -8365801 -6509073 -3983346 -1876332 1623505 5415203
7470 5415203 6655921 5826098 5192615 4524317 3363272 4379363 8635774 10803616 5951132
7461 5951132 -1533653 -3192176 1299515 4864344 4428794 3206595 2261138 -1045672 -5195278
7452 -5195278 -4204028 2207432 6339938 3892681 176371 880970 3515972 2901074 -762924
7443 -762924 -4449707 -7730616 -10474502 -9978219 -5862399 -3365349 -5897977 -8389569 -4487735
7434 -4487735 3049582 6187125 3428366 588617 1116172 2726365 3271862 3287752 2481519
7425 2481519 -177093 -2600862 -1809221 -19685 -1805337 -4842532 -1501635 8342652
7417 8342652 14606820 11281585 5445134 5826042 9256452 6785272 -1380922 -6499515
7409 -6499515 -5001962 -2341672 -2616244 -2743110 451839 4212060 4818263 3697921 4438149
7400 4438149 6960705 8416094 7620288 5451970 2762526 776793 1692326 5647202 8395222
7391 8395222 5457709 -1702384 -6590291 -4992388 910122 5951341 7260694 5440078
7383 5440078 2341234 -936136 -4273559 -7396705 -8734144 -6223524 -10798 6493116
7375 6493116 9550037 8611697 5768832 2657320 -141515 -1380695 218964 3084684
7367 3084684 3372072 14227 -2952695 -1235332 3943917 7316230 6224767 3415138
7359 3415138 2892494 5036603 6945906 6497311 4662529 3805420 4603285 5406974 4662835
7350 4662835 3029842 2011837 991676 -2318177 -7748695 -11192210 -9265227 -3938529
7342 -3938529 140140 1873999 3712167 5668558 4117375 -1443498 -4971090 -1451670
7334 -1451670 5053398 6261555 1253531 -2703778 -1232925 1549673 862335 -1286414
7326 -1286414 -986795 -80330 -2771635 -7331538 -8049396 -4650311 -2792018 -4311948 -3896284
7317 -3896284 1766407 7669361 7708890 3454050 458371 -613337 -3086168 -6556203 -6724848
7308 -6724848 -3064504 -695759 -2949671 -6727654 -7572293 -5730564 -4480615 -4973120 -5465920
7299 -5465920 -4248992 -1177216 2788491 5952644 6479678 3893668 -202449 -3263199
7291 -3263199 -3397429 -532609 2806637 2835629 -1326235 -5690874 -6192329 -4337742 -4321613
7282 -4321613 -5429886 -2879326 3018709 4998466 -678472 -7588824 -7739628 -2321237
7274 -2321237 1547870 1239676 -201612 -599322 -55536 2200516 5800000 5635001 -2337753
7265 -2337753 -12262873 -13420631 -4996519 2303059 1476980 -2317358 -2277580 -561683 -2191169
7256 -2191169 -5076410 -3871502 485041 2669506 1598148 39173 -2136415 -6872305
7248 -6872305 -11283619 -9688060 -2568198 3306784 4554153 4499150 5566137 5093607 1438385
7239 1438385 -1782371 -1386010 176758 -546645 -2007589 -741579 2373121 3601497 2502131
7230 2502131 2217700 4090921 5657414 4354545 615695 -3262113 -5572777 -6079985 -5529269
7221 -5529269 -4559012 -2852734 -6390 2534353 1892212 -2736502 -8073590 -9655171 -6353798
7212 -6353798 -1243040 1580046 641777 -1719378 -1600465 2141940 5935838 5273284 346361
7203 346361 -3991170 -4060692 -987182 1884474 2647063 1009393 -2447511 -5468097 -4803523
7194 -4803523 124121 5527946 6990758 4073538 151323 -1348324 224166 2699537
7186 2699537 3590645 3479454 5839077 11415649 14670201 10115462 1174681 -3050197 -147422
7177 -147422 3108952 2171438 879670 2423183 2179558 -3685855 -9014313 -5842779 2321255
7168 2321255 4835993 -424923 -5109804 -3915334 -1019821 -1163837 -2182061 103693
7160 103693 5187623 9577557 11322171 10217928 6607903 2030577 -1240474 -2376948
7152 -2376948 -1878590 270789 3771280 6504986 7205015 8114267 11048407 12867390 9910278
7143 9910278 4748822 2237754 848659 -4267214 -10688230 -10304892 -2107908 5869404
7135 5869404 9128468 11677523 15513335 15154831 7780330 -102515 -2296847 -1505000 -2042959
7126 -2042959 -1659863 2183265 5127745 3288940 1452859 4873997 8443635 4133802
7118 4133802 -4870486 -8241590 -4424471 -1784334 -4465530 -7460029 -6953133 -6177078 -8110194
7109 -8110194 -9880144 -8011504 -3862921 -680579 948676 2327000 3832929 4029382
7101 4029382 305024 -8233361 -16668749 -16642422 -6843068 2807047 3146198 -2011428 -3030534
7092 -3030534 -5875 -1160799 -7347492 -9591014 -3768980 2776431 2974463 -540941
7084 -540941 -2099167 -1256576 405138 3739671 8097324 9013217 5073715 1662154 2768535
7075 2768535 4450713 1973257 -1835725 -1955439 -537709 -3337552 -9239299 -10844256
7067 -10844256 -5116095 2614934 5663993 2361906 -4775092 -11930151 -15242226 -12630518
7059 -12630518 -5821729 917134 4381337 4098544 1657591 -211555 679394 3447125
7051 3447125 4481312 1792533 -2347509 -4308297 -2824618 1298520 6659598 10727847
7043 10727847 10605074 6753088 3579021 3726449 4103494 550979 -5577606 -8904226 -6926037
7034 -6926037 -2368022 735283 830458 -935376 -2555941 -3460128 -5306474 -9022912 -11307164
7025 -11307164 -7540855 882873 6391440 4626804 -184997 -2198957 -1769773 -2064441
7017 -2064441 -2124756 854465 5037108 5888475 3304333 1312193 1618925 2660230 4086883
7008 4086883 6577906 7614286 3320340 -4854150 -10463543 -9947359 -5750165 -1413196
7000 -1413196 1475880 1332313 -2537364 -6125087 -3906422 2488644 5112781 1581197
6992 1581197 -813362 3166522 7807108 5504796 -805401 -2107906 3055733 7567635
6984 7567635 7116678 4736287 3557501 2335880 154468 -593785 1258838 3078750 3196605
6975 3196605 3666077 5228843 4316135 -678264 -4487363 -2035985 2688595 1605968 -5097489
6966 -5097489 -9107387 -7011593 -5302164 -9204164 -13674133 -11338638 -4346954 -950703
6958 -950703 -2754617 -3254033 796570 4105162 1693508 -2825555 -2297747 3937827 9533620
6949 9533620 9332097 4510327 -188922 -1727874 -832422 -116836 -655764 -675643 1519500
6940 1519500 4017089 3161528 -815469 -3205368 -1240552 2076279 2797636 1624917 1504570
6931 1504570 2248333 1679365 582521 1993849 5889911 8733640 8654949 7408518 6643998
6922 6643998 5852478 4910646 5051584 5888412 4898119 1743045 -113672 1550828 4040830
6913 4040830 3945782 2289833 1930750 2087634 -24582 -3200301 -2906627 1596958 5498721
6904 5498721 5405186 3865832 4371527 5563147 4195356 1278186 730765 3016814 4625271
6895 4625271 3879887 2952577 3226263 2790995 424067 -1482906 -504876 2088213 3818867
6886 3818867 4703049 5541838 4978700 2072270 96660 3286040 10128169 14140471 11998966
6877 11998966 7311215 5134788 5803007 5903086 3246059 -949367 -3811273 -3628208 -1265296
6868 -1265296 1118896 2852163 4946750 6911331 6155993 2978391 2945600 9674042 17370029
6859 17370029 16654680 7394286 -807886 -1937546 -607651 -3034702 -7447243 -8340239
6851 -8340239 -5605328 -3605738 -3611313 -2639388 755858 3732902 2698831 -2618543 -8782690
6842 -8782690 -11483848 -9563656 -6447979 -5976380 -7217094 -6325878 -3016632 -716628 -166570
6833 -166570 1398830 3490953 1528695 -4479404 -7521669 -4179175 -526548 -1659898
6825 -1659898 -2545963 2654775 8427500 5365739 -4144888 -8912676 -6040988 -3722231
6817 -3722231 -6320755 -7714956 -2688082 4414217 7046919 5332404 2947018 951982
6809 951982 -781861 -723570 1525256 3299961 3101299 3194788 5070679 6054996 3623253
6800 3623253 -244265 -2189976 -2115224 -1758181 -1140160 750258 3480775 5412422 5123077
6791 5123077 2081085 -2020538 -3047373 925974 5198628 3543332 -2169984 -3506942
6783 -3506942 2077212 7044915 4916563 -977460 -4075656 -3814062 -2917741 -784034 3958565
6774 3958565 8133088 7969374 5794922 6346340 8369785 6573061 1061396 -1907423 708491
6765 708491 4424555 4145146 1012221 -82048 2865720 7108390 8903744 7746089 6605905
6756 6605905 7883099 10017471 9948416 8103499 7285700 6637217 2117309 -5205798 -7653806
6747 -7653806 -1929389 4300678 2966273 -2213548 -1896156 4022316 6884286 3396927
6739 3396927 -206204 700592 2539331 1032883 -1985483 -3174340 -3214201 -3505082 -2144956
6730 -2144956 2319166 6781785 7503458 5371017 3474834 2040466 -334568 -2553861
6722 -2553861 -2327276 -443703 145843 -882884 -865570 1054401 1800415 -1489621 -6803795
6713 -6803795 -8616572 -4127521 2924201 5968072 3037611 -1449758 -3171643 -3317608
6705 -3317608 -4852612 -6169877 -3357927 2360498 5216430 3449383 1576305 2554655
6697 2554655 3481220 1849697 432810 1955474 4017064 4119360 4934024 8663046 10580557
6688 10580557 5761418 -801718 302845 8181244 11724670 5822516 -1550828 -2105067
6680 -2105067 1009495 53691 -4806454 -7093220 -4730554 -2098358 -2511658 -4493407 -5487764
6671 -5487764 -4688330 -2064638 1493234 3001688 91623 -4887617 -6969787 -5013956
6663 -5013956 -2513910 -1636952 -412971 2888259 6201609 6519372 3795266 382650 -1302151
6654 -1302151 396815 5211309 9527164 9167209 4980471 2312421 3204016 3150852 -1542458
6645 -1542458 -7396565 -9092425 -7673187 -7902361 -9784143 -9000907 -4849213 -1199838 752768
6636 752768 3987452 8180946 7451587 -597817 -8941783 -9382186 -3344081 792237 -925341
6627 -925341 -4533434 -5275830 -3183072 -789866 670124 1021522 -264483 -3187233 -6058423
6618 -6058423 -6638731 -4132121 314936 4550497 6765631 6743088 6122333 6826233 8792344
6609 8792344 9628937 7147222 2404463 -485130 1286749 5194445 5712489 1668883 -1214101
6600 -1214101 2199359 8474830 9379235 3040201 -3598694 -4371887 -975082 1667934 2299360
6591 2299360 2131460 878448 -1524563 -2181076 1045973 5114341 5680131 3652665 3154875
6582 3154875 4493606 4445928 2621341 1804387 1971985 -183033 -4821952 -7657370 -6725672
6573 -6725672 -5208569 -5391847 -4962406 -2118219 491254 402390 -371556 571646 1669312
6564 1669312 1221404 1540700 4300392 5432855 849589 -5394680 -5734017 -727701 1435934
6555 1435934 -2430164 -5951387 -3749864 288772 -290168 -4681346 -7078630 -5569905
6547 -5569905 -3237708 -1877354 140088 3637574 6521991 6993996 5989350 5270434 5019420
6538 5019420 4230850 2232659 -545063 -2351788 -1153789 2549413 4687260 1873036
6530 1873036 -3449106 -5019783 -599379 5117163 6805621 4908682 3411187 3556060
6522 3556060 3159694 1282802 -3552 694648 1179258 -1895432 -8540091 -14534646 -15024640
6513 -15024640 -8907434 119803 6886305 9120470 8197558 6118533 3571364 1442981
6505 1442981 1769505 5062860 8268968 7934160 4528594 1205216 -815321 -2728327 -4702917
6496 -4702917 -5479633 -5498600 -6715493 -8448916 -7163111 -2134154 2052457 1179953 -2971706
6487 -2971706 -5324667 -3897958 -924253 910554 823488 -462306 -1352930 -371278 2025591
6478 2025591 3655576 3627735 3343885 3361676 1782947 -2407535 -7008003 -9758134 -10997478
6469 -10997478 -10785801 -7052664 -301898 3660822 977563 -3337936 -2026233 3197963
6461 3197963 4573904 1309643 799194 5594908 8319937 3672235 -2343831 -1305987
6453 -1305987 5184801 8871428 7065803 4551412 4982032 6799777 7608675 7324122 6138196
6444 6138196 3314894 -765875 -3840282 -3816318 -328942 5147175 9288451 8525120 2999098
6435 2999098 -2333413 -3085701 -762780 -97065 -2390046 -4665706 -4573162 -2756118 -570143
6426 -570143 1529011 3204691 4190416 4815977 4760981 2538821 -1417521 -3131365 -141002
6417 -141002 3586757 2428278 -2336866 -4139932 -1090353 1619407 330636 -2022641
6409 -2022641 -1810014 -259908 117618 54909 780183 666644 -1405162 -2631106 -350285
6400 -350285 3134489 3794509 1650102 -440230 -1465603 -1981282 -1567710 -515448 -1357475
6391 -1357475 -4303422 -4343328 1309912 6010523 1742548 -7231251 -8165738 1838858 11126364
6382 11126364 10643030 6266962 7446736 11624955 9648474 2094353 -790982 4908074
6374 4908074 10703955 8369750 1074168 -2565505 -410175 2277619 1096030 -2936324
6366 -2936324 -6212898 -6495270 -3978255 -537806 1855196 2892105 3583964 3665773 1098922
6357 1098922 -4184336 -7765529 -4945372 2826734 8701014 8474373 5425911 5416193 9031729
6348 9031729 11356876 9225224 5760434 6158446 10678364 14246117 12828495 7874880
6340 7874880 3497235 1205246 -516488 -2405136 -2978657 -1530854 -275059 -1636921
6332 -1636921 -4421115 -4805395 -1442835 2026190 791688 -5155374 -10058132 -8151943
6324 -8151943 -108955 7170825 7507599 1309748 -6088340 -10587129 -11942592 -11122824 -8377923
6315 -8377923 -5080029 -4389878 -7233386 -9357264 -5825614 2002006 7295282 5952890
6307 5952890 985120 -2156165 -1726553 262902 1496808 922932 -966026 -1531238 2039128
6298 2039128 8018680 10131814 5387327 -690458 -887636 3784139 6383215 4951472
6290 4951472 4357589 6631776 6924343 2360012 -1709724 396398 5486579 6511721 3479743
6281 3479743 2462617 5264875 7037949 4500622 532593 -757102 1192126 4762018
6273 4762018 8021395 8186259 3665139 -1921292 -2141958 3945764 9959673 10571992 7478196
6264 7478196 4694650 2555699 2302 -1171116 1020012 4439985 5628392 5100897
6256 5100897 5723293 7233118 6592662 3153926 -325160 -1782745 -2000414 -2647509 -4391092
6247 -4391092 -6596442 -7322968 -4934517 -1403097 -1603953 -6474501 -9479715 -4210301 6026635
6238 6026635 11032203 5915408 -3831152 -9814251 -9461702 -6415873 -5314149 -7322456
6230 -7322456 -9208001 -6851937 -763401 3750579 3922794 3906636 7934125 12376706 10663824
6221 10663824 4037520 33828 618754 -268890 -5925434 -11335863 -11448882 -8231061 -5586452
6212 -5586452 -3261763 -381220 333395 -2578214 -4218655 1089288 11413319 19232685
6204 19232685 20141789 15656178 9369114 4323804 2607808 3744661 4410002 2437343
6196 2437343 -273042 -896789 547444 2737225 5416302 7635226 6886288 3002411 -467475
6187 -467475 -1807653 -3845828 -7398881 -7261624 -512929 6022170 4253850 -2662326 -4930309
6178 -4930309 -1215128 396179 -3434180 -5958418 -1906331 3947039 4263153 -693317
6170 -693317 -4816628 -3995467 1328020 7976340 11521619 9061118 2936215 -1025221 -478142
6161 -478142 1316916 1213645 -51764 -991765 -1596558 -736537 3553126 8761861 8301082
6152 8301082 783517 -6215167 -6212420 -3032457 -4394285 -9898692 -11969081 -7180606 -492410
6143 -492410 1874498 -942879 -5346276 -7140762 -4233103 1592036 5576096 4948051 2224432
6134 2224432 1284970 1801972 860581 -1364132 -1730482 561275 2868145 3487732 3480379
6125 3480379 3736565 3642187 3163644 3069548 2714164 955710 -366825 2212909 7899167
6116 7899167 11017105 8040614 1742130 -3478298 -6578258 -7736643 -5486855 -153784
6108 -153784 3160574 412302 -4332984 -3509644 2643464 5561765 604800 -6120260 -6699342
6099 -6699342 -2376309 -361491 -2563751 -3745112 -582370 3399799 3873523 2031100
6091 2031100 1564792 2332347 1017959 -2975743 -5921975 -4523192 25643 3516708 3072515
6082 3072515 -345778 -2939498 -1561280 3116923 7190343 7838663 6263225 5390828 5799488
6073 5799488 5735642 4562249 3951248 5299299 7699744 9243999 9282885 8696188 8415536
6064 8415536 8146502 6719397 4011545 2040860 2680361 4361560 3520792 144753 -1279034
6055 -1279034 1579905 4657832 3432806 74749 -238122 2046569 2067570 -345959 307670
6046 307670 5881002 10897563 10937041 8853450 8848512 9435204 7175767 3683543 3486461
6037 3486461 6878424 9629852 8884787 5757698 2941735 2512703 4795587 7014314 5113323
6028 5113323 -441048 -3365550 473764 6570212 7650072 3665532 681739 1351634
6020 1351634 2391252 1361602 249944 1170670 3067836 4041309 3411577 831208 -3131900
6011 -3131900 -5415058 -3537148 -301348 -681863 -3768205 -3582404 822671 2661933 -2081815
6002 -2081815 -7781167 -7733074 -4371939 -4483143 -7677201 -7038097 -397924 5866597 5559983
5993 5559983 134074 -4479261 -4878804 -2052312 1221602 2883586 2781825 2322388 2130136
5984 2130136 504235 -3883509 -8262638 -7820144 -2196526 3069487 3229600 -33344 -1865710
5975 -1865710 -1052943 -419288 -1343902 -1564586 648903 3198661 3319624 2219226 3572492
5966 3572492 7802857 10945449 10027477 6825084 4650726 4022861 4070697 5717288 9382295
5957 9382295 11028032 5915724 -3238921 -7494309 -3371220 1831035 183940 -5836028
5949 -5836028 -7712538 -3249145 1596869 2010386 -637081 -3189940 -4569747 -4188143 -1474676
5940 -1474676 1478416 1177335 -1887141 -3405886 -2086325 -1317055 -2230384 -1065859 3218941
5931 3218941 4851422 -73357 -6221337 -6879668 -4630649 -6170221 -9761228 -7508300
5923 -7508300 610759 5060282 1085254 -4296473 -3354590 2103377 6271316 8200864
5915 8200864 9247605 7482265 1653534 -3327384 -2144275 2194815 2443706 -1570846
5907 -1570846 -2866284 1611947 6692897 7186546 4630129 3446580 4702074 6419816
5899 6419816 7255222 7444914 7640087 8156164 8481195 7559124 5683689 4832818 4999316
5890 4999316 2198256 -6085649 -14960696 -16593842 -10297600 -3027055 449760 2183008
5882 2183008 4581580 5515655 3112569 342155 507677 1718303 186565 -3421189 -4993820
5873 -4993820 -2809142 1022170 3920563 5060151 5115392 5497328 6678944 6545084 2780119
5864 2780119 -2451762 -3926100 -934452 1056295 -1086406 -2922512 191156 5098824
5856 5098824 5696583 2217962 -473178 -1206434 -2419876 -3356662 -472860 5344910 8416859
5847 8416859 6084811 1621387 -1352427 -2367124 -1667237 336447 558154 -4144769 -10787857
5838 -10787857 -12533716 -8564195 -5372590 -6026017 -5093612 1701751 9189557 9917159 5061091
5829 5061091 1973534 3713199 6819700 7663656 5754669 1958334 -1883126 -2507760 1320280
5820 1320280 5787071 6343505 3874312 2460148 2348367 179222 -4199328 -6409703 -3945337
5811 -3945337 382817 2543828 1352131 -2282460 -6713738 -9556682 -9731483 -9745119 -12044032
5802 -12044032 -13172464 -6968542 5229256 13651401 12356519 6800316 5015129 6577860
5794 6577860 6091411 3191914 1699540 1379591 -1293749 -4761932 -3172545 3010787 5311755
5785 5311755 -323670 -6632887 -5929683 -1887892 -3173591 -9093033 -10155139 -2396879
5777 -2396879 6875537 9657102 7021399 4758064 4228200 2556353 -617678 -1728707
5769 -1728707 1386690 6267362 8746895 7109103 2906879 -741038 -1281027 1403551
5761 1403551 4601993 5149772 2655912 -245658 -958842 619331 2881132 4624795 5649246
5752 5649246 6075611 6219597 6845056 8325670 9402192 8034359 4153827 383450 -1189613
$$ [...]
##END NTUPLES=NMR SPECTRUM
##END=
