##TITLE=31Pdec_LR-726-C1
 CDCl3, 24 sc
 27.11.2020
##JCAMPDX= 6.0         $$ Bruker NMR JCAMP-DX V2.0
##DATA TYPE= NMR SPECTRUM
##DATA CLASS= NTUPLES
##ORIGIN= UXNMR, Bruker Analytische Messtechnik GmbH
##OWNER= root
$$ XWIN-NMR		Version 3.5
$$ Fri Nov 27 10:05:27 2020 Russian Standard Time (UT+4h)  she@DPX200
##.OBSERVE FREQUENCY= 81.013821
##.OBSERVE NUCLEUS= ^31P
##.ACQUISITION MODE= SIMULTANEOUS
##.ACQUISITION SCHEME= undefined
##.AVERAGES= 24
##.DIGITISER RES= 17
##SPECTROMETER/DATA SYSTEM= spect
##.PULSE SEQUENCE= zgpg30
##.SOLVENT NAME= DMSO
##.SHIFT REFERENCE= (INTERNAL, DMSO, 0, 182.463)
##AUDIT TRAIL= $$ (NUMBER, WHEN, WHO, WHERE, WHAT)
$$ ##TITLE= Audit trail, XWIN-NMR		Version 3.5
$$ ##JCAMPDX= 5.01
$$ ##ORIGIN= Bruker BioSpin GmbH
$$ ##OWNER= she
$$ F:/spectra/data/she/nmr/P31/1/pdata/1/auditp.txt
$$ ##AUDIT TRAIL=  $$ (NUMBER, WHEN, WHO, WHERE, WHAT)
(   1,<2020-11-27 10:04:20.45 +0400>,<she>,<DPX200>,
      <created by zg, POWCHK disabled, PULCHK disabled
       configuration hash MD5:
       00 E9 B6 7A A2 85 ED C7 34 08 36 98 17 FE 4E 26
       data hash MD5: 32K
       7D 45 9F 56 04 BF AD 97 C0 7E 74 13 93 29 44 87>)
(   2,<2020-11-27 10:04:22.92 +0400>,<she>,<DPX200>,
      <Start of raw data processing
       efp BC_mod = 2 LB = 1 FT_mod = 6 PKNL = 1 PHC0 = -2440.15 PHC1 = 220.4008 SI = 64K 
       data hash MD5: 64K
       08 D1 0C 25 0F 60 0F 8C 26 45 41 03 26 BC 06 C6>)
(   3,<2020-11-27 10:04:45.68 +0400>,<she>,<DPX200>,
      <pk PHC0 = 13.3397 PHC1 = -30.6 
       data hash MD5: 64K
       6F 60 4D E8 65 98 C6 7B F7 2E A1 FE 6B EB F5 1B>)
(   4,<2020-11-27 10:04:48.60 +0400>,<she>,<DPX200>,
      <abs ABSG = 5 
       data hash MD5: 64K
       B7 FD 3A 55 8C 57 03 CC D7 9E 3E EE AD 04 CF CD>)
$$ ##END=
$$ 
$$ hash MD5
$$ 9B F6 21 F1 FC 76 88 30 49 9B 1C 74 80 E6 62 35
##$RELAX= 
##$RELAX= 
##$RELAX= 
##$RELAX= 
##$RELAX= 
##$RELAX= 
##$RELAX= 
##$RELAX= 
$$ Bruker specific parameters
$$ --------------------------
##$DU= <F:/spectra>
##$EXPNO= 1
##$NAME= <P31>
##$PROCNO= 1
##$TYPE= <nmr>
##$USER= <she>
##$AMP= (0..31)
100 100 100 100 100 100 100 100 100 100 100 100 100 100 100 100 100 100 
100 100 100 100 100 100 100 100 100 100 100 100 100 100 
##$AQSEQ= 0
##$AQ_mod= 1
##$AUNM= <au_zg>
##$AUTOPOS= <>
##$BF1= 81.014009
##$BF2= 200.13
##$BF3= 200.13
##$BF4= 200.13
##$BF5= 200.13
##$BF6= 200.13
##$BF7= 200.13
##$BF8= 200.13
##$BYTORDA= 1
##$CFDGTYP= 0
##$CFRGTYP= 5
##$CHEMSTR= <none>
##$CNST= (0..31)
1 1 145 1 1 1 1 1 1 1 1 1 1 1 1 1 1 1 1 1 1 1 1 1 1 1 1 1 1 1 1 1 
##$CPDPRG= <waltz16>
##$CPDPRG1= <>
##$CPDPRG2= <waltz16>
##$CPDPRG3= <>
##$CPDPRG4= <mlev>
##$CPDPRG5= <mlev>
##$CPDPRG6= <mlev>
##$CPDPRG7= <mlev>
##$CPDPRG8= <mlev>
##$CPDPRGB= <>
##$CPDPRGT= <>
##$D= (0..31)
0 1 0 0 0 0 0 0 0 0 0 0.03 2e-05 3e-06 0 0 0 0 0 0 0 0 0 0 0 0 0 0 0 0 
0 0 
##$DATE= 1606457059
##$DBL= (0..7)
120 120 120 11 120 120 24 19 
##$DBP= (0..7)
150 150 150 150 150 150 150 150 
##$DBP07= 0
##$DBPNAM0= <>
##$DBPNAM1= <>
##$DBPNAM2= <>
$$ [...]
##$SUBNAM2= <"">
##$SUBNAM3= <"">
##$SUBNAM4= <"">
##$SUBNAM5= <"">
##$SUBNAM6= <"">
##$SUBNAM7= <"">
##$SUBNAM8= <"">
##$SUBNAM9= <"">
##$SW= 369.568048894756
##$SWIBOX= (0..15)
0 1 3 0 0 0 0 0 0 0 0 0 0 0 0 0 
##$SW_h= 29940.119760479
##$TD= 32768
##$TD0= 1
##$TE= 0
##$TE2= 300
##$TE3= 300
##$TEG= 300
##$TL= (0..7)
0 120 53 12 22 120 120 120 
##$TP= (0..7)
150 150 150 150 150 150 150 150 
##$TP07= 0
##$TPNAME0= <>
##$TPNAME1= <>
##$TPNAME2= <>
##$TPNAME3= <>
##$TPNAME4= <>
##$TPNAME5= <>
##$TPNAME6= <>
##$TPNAME7= <>
##$TPOAL= (0..7)
0.5 0.5 0.5 0.5 0.5 0.5 0.5 0.5 
##$TPOFFS= (0..7)
0 0 0 0 0 0 0 0 
##$TUNHIN= 0
##$TUNHOUT= 0
##$TUNXOUT= 0
##$USERA1= <user>
##$USERA2= <user>
##$USERA3= <user>
##$USERA4= <user>
##$USERA5= <user>
##$V9= 5
##$VALIST= <valist>
##$VCLIST= <CCCCCCCCCCCCCCC>
##$VD= 0
##$VDLIST= <DDDDDDDDDDDDDDD>
##$VPLIST= <PPPPPPPPPPPPPPP>
##$VTLIST= <TTTTTTTTTTTTTTT>
##$WBST= 1024
##$WBSW= 4
##$XGAIN= (0..3)
0 0 0 0 
##$XL= 0
##$YL= 0
##$YMAX_a= 10973
##$YMIN_a= -9846
##$ZGOPTNS= <>
##$ZL1= 120
##$ZL2= 120
##$ZL3= 120
##$ZL4= 120
##$ABSF1= 182.463
##$ABSF2= -187.1042
##$ABSG= 5
##$ABSL= 3
##$ALPHA= 0
##$AQORDER= 0
##$ASSFAC= 0
##$ASSFACI= 0
##$ASSFACX= 0
##$ASSWID= 0
##$AUNMP= <proc_1d>
##$AZFE= 0.1
##$AZFW= 0.5
##$BCFW= 0
##$BC_mod= 2
##$BYTORDP= 0
##$COROFFS= 0
##$CY= -3
##$DATMOD= 1
##$DC= 0
##$DFILT= <>
##$DTYPP= 0
##$F1P= 0
##$F2P= 0
##$FCOR= 1
##$FTSIZE= 65536
##$FT_mod= 6
##$GAMMA= 0
##$GB= 0
##$INTBC= 1
##$INTSCL= 5.30512e-09
##$ISEN= 30
##$LB= 1
##$LEV0= 0
##$LPBIN= 0
##$MAXI= 10000
##$MC2= 0
##$MEAN= 0
##$ME_mod= 0
##$MI= 50
##$NCOEF= 0
##$NC_proc= -5
##$NLEV= 6
##$NOISF1= 182.463
##$NOISF2= 159.3651
##$NSP= 0
##$NTH_PI= 0
##$NZP= 0
##$OFFSET= 182.463
##$PC= 4
##$PHC0= -2426.81
##$PHC1= 189.8008
##$PH_mod= 1
##$PKNL= yes
##$PPARMOD= 0
##$PSCAL= 0
##$PSIGN= 0
##$REVERSE= no
##$SF= 81.014009
##$SI= 65536
##$SIGF1= 159.3651
##$SIGF2= -187.1042
##$SINO= 113.3802
##$SIOLD= 16384
##$SREGLST= <1H.CDCl3>
##$SSB= 0
##$STSI= 65536
##$STSR= 0
##$SW_p= 29940.119760479
##$SYMM= 0
##$S_DEV= 0
##$TDeff= 32768
##$TDoff= 0
##$TI= <>
##$TILT= no
##$TM1= 0
##$TM2= 0
##$TOPLEV= 0
##$USERP1= <user>
##$USERP2= <user>
##$USERP3= <user>
##$USERP4= <user>
##$USERP5= <user>
##$WDW= 1
##$XDIM= 65536
##$YMAX_p= 427693320
##$YMIN_p= -4748746
$$ End of Bruker specific parameters
$$ ---------------------------------
##NTUPLES= NMR SPECTRUM
##VAR_NAME=  FREQUENCY,     SPECTRUM/REAL,   SPECTRUM/IMAG
##SYMBOL=    X,             R,               I
##VAR_TYPE=  INDEPENDENT,   DEPENDENT,       DEPENDENT
##VAR_FORM=  AFFN,          ASDF,            ASDF
##VAR_DIM=   65536,         65536,           65536
##UNITS=     HZ,            ARBITRARY UNITS, ARBITRARY UNITS
##FACTOR=    0.456856943014862, 1,           1
##FIRST=     14782.0589164895, 0,            0
##LAST=      -15158.0608439895, 0,           0
##MIN=       -15158.0608439895, -4748746,    0
##MAX=       14782.0589164895, 427693320,    0
$$ Real data points
##PAGE= N=1
##DATA TABLE= (X++(R..R)), XYDATA
$$ [...]
43744h71791L10834M30096L93782J86777L9708K1807j8108k9648K06069M91325
43734A160851K73387m37839q38436m36644J71009J66931l02048m39779j0733M24469
43724b68832M01808J22567N1697L04515N46988L77884j87164o20502m59551N0561
43714C19971K57934O1801J3471K90888K79949l49888q25086l02990P06042Q91346
43704A343438o857q40994p07304r0137P3793k10401k23149J94410L85903k8827
43694a10125m91633l43242J29659J24040l61938m21525L48780J096789R12039
43685H82844J56529j74616J1296l7296n11936p40191l78228O0037J21493L412
43675f06656p0604k23045l22329J19359R69817J234975M06995o62912q89909l23274
$$ plain form
43744 -871791 -560957 -130861 262921 449698 489406 511213 493105 463457 669526 1160851
43734 1160851 1434238 996399 157963 -278681 -107672 59259 -242789 -682568 -693301 -268832
43724 -268832 132976 255543 307240 611755 1158743 1536627 1349463 728961 269410 319971
43714 319971 577905 639706 653177 944065 1224014 874126 49040 -253950 452092 1343438
43704 1343438 1336581 495587 -211717 -301854 -228061 -438462 -661611 -467201 -81298 -110125
43694 -110125 -601758 -945000 -815341 -691301 -1053239 -1474764 -1125984 -29195 882844
43685 882844 1039373 864757 876053 838757 326821 -413370 -791598 -731561 -610068 -606656
43675 -606656 -677260 -900305 -1222634 -1103275 -133458 1101517 1508512 845600 -44309 -367583
43665c67583K55055M85290M82061K75325p0164k06569j8031M4764k90109n68052
43655B1987m01500j85817l15781l52428J69779P29273N96465Q3084n5978J7601
43645C06685l33752p87810m19413O02620J018587L44127m67240n45960k34461
43636e16617k39939n15672n36146j37509L72556O34329N23129K17183M516j12585
43626c06755l59659n45226o5975R48092J227785L66j561944j660981k69954R78207
43616a616044J062959M87868J3949k32859k75020n8775J08703j15953l25328P4538
43606h75962O18279L33251n28568p40019j58928L3788n51100q04092q5034O86575
43596b071810O69152L49080K80982J9815o36919p04772L98801J447518J002752
$$ plain form
43665 -367583 -112528 372762 854823 1130148 1059984 853415 835384 880148 590039 21987
43655 21987 -379513 -565330 -881111 -1233539 -1063760 -334487 261978 345062 289084 306685
43645 306685 -27067 -814877 -1234290 -631670 386917 731044 263804 -282156 -516617
43636 -516617 -756556 -1272228 -1808374 -1945883 -1573327 -938998 -415869 -198686 -194170 -306755
43626 -306755 -666414 -1211640 -1277615 -329523 898262 898628 -663316 -2324297 -2594251 -1616044
43616 -1616044 -553085 -65217 -51268 -284127 -559147 -617922 -509219 -625172 -950500 -875962
43606 -875962 -257683 75568 -453000 -1193019 -1351947 -1318159 -1869259 -2673351 -2758385 -2071810
43596 -2071810 -1402658 -1053578 -772596 -752781 -1389700 -2094472 -1695671 -248153 754599
43587G54599m16515j142163p04536m0635J86968J97927K48751K66564K42796K17365
43577a88879M8703k23829j76221K82562N38276K33399o4756J18030K28483l15763
43567D80005r04458o01181L14764P97152O03699L09288J02724k83562o53034m64012
43557b98615J76992N61285L77595p3939m91159p00686m89575k1829M420o09126
43547a564637r34684k54080O39609O42624J75901L57372Q83615N18963n17566
43538e2883o13035N72700J407634Q36763j16073k46237M997k54098o46065l50974
43528E42729K46577J40878n47515o93379J06556R75158R95728K54725n06788p84062
43518G30607o81250o21110p62346p37139j71307N89336P25616L7215o99501p08545
$$ plain form
43587 754599 338084 -804079 -1508615 -1549250 -1362282 -1164355 -915604 -649040 -406244 -188879
43577 -188879 -140176 -364005 -540226 -257664 280612 514011 449255 567285 795768 480005
43567 480005 -424453 -1025634 -710870 86282 689981 999269 1101993 818431 165397 -298615
43557 -298615 -121623 439662 817257 743318 252159 -448527 -938102 -959931 -955511 -1564637
43547 -1564637 -2499321 -2753401 -2113792 -1471168 -1295267 -937895 -54280 464683 -52883
43538 -52883 -665918 -93218 1314416 2151179 2035106 1788869 1793866 1539768 893703 542729
43528 542729 789306 930184 382669 -310710 -204154 771004 1766732 2021457 1514669 730607
43518 730607 49357 -571753 -1334099 -2071238 -2242545 -1653209 -927593 -890378 -1589879 -2298424
43508b298424j19460L72040L47246j13328o70967q87903m74421L27326Q66316
43499b651575P97286M01193P6067r7480j18063J47817O51414J009682R52024O12343
43489A780708J87332l06579p27640p20601k50688J73978J47487j18968k20628
43480e5599j07552R6642L82951N93246L43960l08073n95080n2338O02412L66110
43470A266679n44818r70606n11947Q979k6676j29569K65108P02299M52890k11525
43460C00814m53742k74132l83880o95745j89876J253889K072851J032972q13755
43451A849396j420880n28409K33689q6797n79583k03649O57942J088181J002746
43442B012636P70496L20315m50289j020412q94650m07116j18116K9695K10441
$$ plain form
43508 -2298424 -2417884 -2045844 -1698598 -1811926 -2482893 -3370796 -3845217 -3517891 -2651575
43499 -2651575 -1854289 -1453096 -1377029 -1474509 -1592572 -1444755 -793341 216341 1168365 1780708
43489 1780708 1968040 1661461 933821 213220 -37468 136510 283997 165029 -55599
43480 -55599 -163151 -66509 316442 909688 1253648 945575 350495 298157 900569 1266679
43470 1266679 721861 -248745 -760692 -751713 -778389 -907958 -642850 59449 512339 300814
43460 300814 -152928 -427060 -810940 -1506685 -1696561 -442672 1630179 2663151 1849396
43451 1849396 428516 -99893 133796 46999 -532584 -736233 -78291 1009890 2012636
43442 2012636 2783132 3103447 2653158 1632746 738096 330980 212864 242559 453000
43433D53000P5468m78338o38002J23052Q63881M81765m31505n30268K4216N147
43423e1584n02533k12623Q02525Q68613l81757j014887J61729J458899P99550
43414A927932j060401j650068l06050J216851J339620L18784o84923r57827m77560
43405c33642K96057O77792L77267j08491j37211K34967M93884M37541J76071k90156
43395A824079q66285j040281m49150M30147P83179M72820j3614l69267n69555
43386B02073m26040J81862P32951N09595l27378q03404m02730L29386O37142M64102
43376A097559K42352J83052J27417n6624k01711l8253L60387M77931m2149p51604
43366A398357q19663k19760R3532m50301j097529q12778K04063Q44628O93607
$$ plain form
43433 453000 528468 50130 -587872 -464820 399061 880826 449321 -80947 -56731 -51584
43423 -51584 -554117 -766740 35785 904398 522641 -492246 -330517 1128382 1927932
43414 1927932 867531 -782537 -1088587 128264 1467884 1786668 1101745 143918 -333642
43405 -333642 -37585 640207 1017474 908983 771772 1006739 1500623 1938164 2114235 1824079
43395 1824079 957794 -82487 -531637 -101490 681689 1154509 1140895 771628 202073
43386 202073 -223967 -42105 690846 1200441 873063 69659 -333071 -3685 633457 1097559
43376 1097559 1339911 1522963 1650380 1593756 1392045 1353792 1714179 2192110 2149961 1398357
43366 1398357 578694 358934 452466 2165 -1095364 -1908142 -1704079 -859451 -165844
43357a65844M21250N45685O47020J50549o95181j092518o94979L2379M00307K28435
43347b22897o7766n9960J67595K25816L2272j33249j79097l28092n37509l42835
43337a445722L51772Q25978M25914m53362q55188n02441L8353K86914L28501L73277
43327f26004L98032L45560K68861J48384j32117n21372p26737m86214J71167Q86406
43317b74034J146579P06942m4656m11765k31743m6748k17263l31513P5971O44280
43307A016050O44964Q4395l16248j91440L7138r4187m22283m72928j50525J40101
43297B75037L982m30060o01514k13753K99266L05155j08152k24449K35231P07248
43287B47991O47089K20233j62761m19279n28597k80366K47226N04699K57314J2313
$$ plain form
43357 -165844 255406 801091 1448111 1598660 903479 -189039 -884018 -851639 -451332 -222897
43347 -222897 -290663 -350623 -183028 42788 75060 -58189 -237286 -565378 -1102887 -1445722
43337 -1445722 -1093950 -267972 157942 -295420 -1150608 -1653049 -1614696 -1327782 -999281 -626004
43327 -626004 -227972 117588 386449 534833 402716 -118656 -845393 -1331607 -1160440 -274034
43317 -274034 872545 1579487 1534831 1123066 891323 844575 627312 295799 371770 1016050
43307 1016050 1661014 1745409 1429161 1237721 1274859 1180672 758389 285461 134936 275037
43297 275037 279019 -151041 -752555 -966308 -667042 -361887 -470039 -694488 -459257 247991
43287 247991 895080 1115313 952552 533273 4676 -275690 -28464 476235 733549 745862
43277G45862J67070L47705J79114L5082K72497L67754k67798j124378j215559
43268d92651m82281L32518Q12617R44234N22674m39506j096595p16996P0153J63133
43258c82700k33133r5230M42450K48537o71579r61972j64942N28044L44377Q4734
43248h61414L94199M84229k79711r11244l35375O70967O06276l95826q78406l40225
43238a846530K84697L29436K12225L76448N57589M73402L72848M58161L84678
43229A602954k04850j014196j343011q61429M7707O42880M85111j68076o48216
43220a461126n74754j18408M24305R45449J255648R83054J74213l82395m8942
43211A197044O28578M87813n86175j285118n53598Q94619J377210L63521r11906
$$ plain form
43277 745862 912932 1260637 1439751 1474833 1747330 2115084 1847286 722908 -492651
43268 -492651 -974932 -642414 170203 1114437 1637111 1197605 101010 -615986 -545833 -382700
43258 -382700 -615833 -711063 -268613 -20076 -691655 -1653627 -1818569 -1290525 -946148 -861414
43248 -861414 -467215 17014 -262697 -1173941 -1509316 -838349 -232073 -627899 -1506305 -1846530
43238 -1846530 -1561833 -1232397 -1020172 -643724 -86135 387267 760115 1218276 1602954
43229 1602954 1398104 383908 -959103 -1820532 -1772825 -1129945 -644834 -812910 -1461126
43220 -1461126 -2035880 -2154288 -1729983 -784534 471114 1454168 1628381 1245986 1197044
43211 1197044 1825622 2313435 1727260 442142 -111456 783163 2160373 2523894 1611988
43202A611988j090958k87045M07217M86150L59246L31902J42466l36749p08247
43193I15970o66258l70616M6191O13950Q98377K13602j013996j201412J77374
43184c86818J399922P52626r44307j595939q85611k49088k12583J90483J259706
43175f71609J870316J358555M79103n9190m58072p19747k81566O45017J022632
43166C185439R25428J682673L185612L093695K05373l173902m058437k552364
43158B493517r08433j31894L16699M56843j52392p87708l00690P13727O31354
43149B331023m19155o82078K05513N91361l08087j097137o56865M7124j82895
43140a71196p30325l90631N34890Q32556L08888j90798k26662q7339M8221L02605
$$ plain form
43202 1611988 521030 233985 641202 1127352 1486598 1818500 1960966 1624217 915970
43193 915970 249712 -120904 -74713 539237 1437614 1651216 637220 -564192 -386818
43184 -386818 1013104 1765730 821423 -774516 -1660127 -1909215 -2121798 -1931315 -671609
43175 -671609 1198707 2557262 3036365 2977175 2519103 1799356 1517790 2162807 3185439
43166 3185439 4110867 5793540 8979152 12072847 12278220 9104318 5045881 2493517
43158 2493517 1585084 1453190 1769889 2226732 2074340 1286632 985942 1699669 2331023
43149 2331023 1911868 1229790 1435303 2026664 1718577 621440 -35425 11699 -171196
43140 -171196 -901521 -1292152 -757262 75294 384182 193384 -33278 -120617 -72396 230209
43130B30209N73044N43734J65946l34597p47409q44802m26831K26720M08884m0195
43120b45297k99251K97420J136961J089460J06216p57914q25478m77477k40077
43111b15437J5301N48037R96976P73870R800m76519k35091K48663K84914q5569
43101A864945l03120k15594k12790m22401m24072n0472J27593l59239r94664q99090
43091a888904j05404M80126L43672n3549m9412L98776Q34174Q54739M22202r6973
43081A139447j85565K45751O25626M22966q6929k57373j12591k69526q18625j063666
43071c60485o20666o6190o9597m36635n24661k17042N0261J7577j19149q3182
43061b429769J71946M96267O68841N47372K41807L6022K7573K0504r7673j27681
$$ plain form
43130 230209 803253 1346987 1512933 1178336 430927 -413875 -840706 -613986 -205102 -245297
43120 -245297 -544548 -247128 889833 1979293 2085509 1327595 502117 24640 -215437
43111 -215437 -200136 347901 1344877 2118747 2128547 1652028 1416937 1665600 1950514 1864945
43101 1864945 1561825 1346231 1133441 711040 286968 236496 364089 4850 -989814 -1888904
43091 -1888904 -1994308 -1514182 -1170510 -1224059 -1273471 -874695 -40521 814218 1236420 1139447
43081 1139447 953882 1199633 1825259 2248225 2161296 1903923 1791332 1521806 703181 -360485
43071 -360485 -981151 -1047341 -1116938 -1553573 -2078234 -2295276 -2245015 -2227438 -2346587 -2429769
43061 -2429769 -2257823 -1761556 -1092715 -545343 -303536 -267514 -239941 -219437 -317110 -444791
43051d44791N3482J26467k53497p85532p53633l5896N75299L89093j90747k12457
43041a532212M25392P95142L16444l78924m17966O3772L32540K73056L13104L94316
43031E84664N7057m76220m18563J86972L38274k59463n76169L6576O59209K61104
43021C93441o29575q43325l88247j06802q4295K57373P82245O94753m6314n23523
43011d94269k05149M12974O26656K70575l52991o97192l12793M55900N44948l47884
43001i9225r80335k59697R50250J038819J14576l31160R4818L19638r7100l24290
42991D26294k2028j2868o61300j140079r32435o35794o29060l33673M86567J023904
42981b430472P92968M53709N26711N40726K18748J95785O87870P81870N5825m11966
$$ plain form
43051 -444791 -391309 -264842 -518339 -1303871 -2057504 -2093400 -1518101 -1129008 -1319755 -1532212
43041 -1532212 -1106820 -311678 4766 -374158 -792124 -728352 -395812 -122756 190348 584664
43031 584664 641721 165501 -253062 -66090 272184 12721 -563448 -526872 132337 393441
43021 393441 -236134 -1079459 -1467706 -1574508 -1658803 -1401430 -619185 75568 29254 -494269
43011 -494269 -699418 -286444 340212 610787 257796 -439396 -752189 -296289 248659 -99225
43001 -99225 -1079560 -1339257 -389007 649812 764388 433228 528046 847684 750584 426294
42991 426294 404266 391398 -269902 -1409981 -2342416 -2978210 -3607270 -3940943 -3454376 -2430472
42981 -2430472 -1637504 -1183795 -657084 -116358 102390 298175 986045 1767915 1823740 1411774
42971A411774J78420Q03294J97670j063885j494618q78680j48540K28656M16184
42962c49725L41819q1668l51841p6554K50477J31638P153K99357L87811k39005
42952C19462o92804K757J060436R77926j30371q72595q13325p06671p82217m83234
42942b120636J49066L88227J65537J18290K94377J34889k86056l25091j9861L8140
42932a463118l0346L52450Q18031M29783n43178q07615j12573M31015K71396Q0280
42922e73875K52813L20347J60388K28349L05898l12874j093005o06166R04791
42913d13334J368263J01654r32774k82797O53862R3588j134423j092101Q6376
42904a551686O91379K77278j07414o4032k30096o61989o03967L3505M49039L53522
$$ plain form
42971 1411774 1590194 2393488 2591158 1527273 32655 -846025 -994565 -765909 -349725
42962 -349725 -7906 -89574 -441415 -517969 -267492 -135854 -128701 170656 558467 319462
42952 319462 -373342 -370585 689851 1667777 1537406 664811 -148514 -855185 -1637402 -2120636
42942 -2120636 -1971570 -1583343 -1417806 -1299516 -1005139 -870250 -1156306 -1481397 -1501258 -1463118
42932 -1463118 -1493464 -1141014 -322983 106800 -436378 -1243993 -1356566 -925551 -654155 -573875
42922 -573875 -321062 -715 159673 388022 693920 381046 -711959 -1318125 -413334
42913 -413334 954929 1056583 123809 -158988 494874 588462 -545961 -1638062 -1551686
42904 -1551686 -860307 -583029 -690443 -754475 -984571 -1646560 -2250527 -2217022 -1767983 -1414461
42894a414461L16518N61712N87657J84778k02079l21135m14045n25646l75536
42885a602237m7504J7576j58388p2720L36239N38719L32203J35022J72583J28537
42875b19970j35108k24262Q0552L72676K52318p4887j88111l8742J76750L80840
42865C82056N26467M19453m5012o17378r04353p67029l88932n0008P7446P229
42855a360061q7556L704L90758R79507J394875J120352M3468j112238j323422
42846D9387m26164O47335J008915P29154L01282k20294r23189j339801r18363
42837a091738n6493K07832l36253o89314m9670J023491J348118O30349l11417
42828F74905o78679n06851k59159q4064J46020K95310J8042n56674p32174j80285
$$ plain form
42894 -1414461 -1097943 -536231 51426 236204 34125 -287010 -701055 -1226701 -1602237
42885 -1602237 -1649741 -1632165 -1790553 -1863273 -1527034 -988315 -656112 -521090 -348507 -219970
42875 -219970 -355078 -579340 -498788 -126112 126206 51319 -136792 -175534 1216 382056
42865 382056 908523 1327976 1282964 665586 -238767 -1005796 -1394728 -1444736 -1367290 -1360061
42855 -1360061 -1447617 -1443913 -1053155 -73648 1321227 2441579 2485047 1372809 49387
42846 49387 -376777 270558 1279473 2008627 2309909 2089615 1166426 -173375 -1091738
42837 -1091738 -1148231 -940399 -1276652 -1965966 -2015636 -992145 355973 986322 674905
42828 674905 -3774 -510625 -769784 -853848 -707828 -412518 -394476 -951150 -1683324 -1863609
42818a863609M85177N70016L06227K99836L66608p8768o55997k99193R07176J473018
42808A510491O16724n65528p91713l34523j26056j56634O4132K89791N7608k43856
42798C20436j16427j14689q47808j433347o28194R00387J305688M33196l8585
42789b19343M96756O54383l23831j097446m88401N41452N66951o1125j80101J13475
42779B770j4389l78455j99065K77746K06822j76409P6950P49878N97485n03835
42769F39498j115885l87746P01184Q71246K15333l64347m94440l41090K5249M98387
42759B47389O57600L25017J9852K03116M20892o8176j018213j339327n67637M91123
42749f28364Q27702M16604k2958r1518m6113j66480k81912j46563K2880k21843
$$ plain form
42818 -1863609 -1378432 -808416 -502189 -202353 164255 85487 -570510 -869703 37473 1510491
42808 1510491 2127215 1561687 769974 435451 309395 152761 216893 506684 564292 320436
42798 320436 204009 89320 -758488 -2191835 -2820029 -1919642 -613954 -180758 -219343
42789 -219343 277413 931796 607965 -489481 -977882 -436430 130521 69396 -110705 2770
42779 2770 -11619 -390074 -589139 -311393 -104571 -280980 -204030 545848 1143333 639498
42769 639498 -476387 -864133 -162949 708297 923630 559283 64843 -276247 -250998 247389
42759 247389 904989 1230006 1249858 1452974 1873866 1805690 787477 -551850 -1119487 -628364
42749 -628364 199338 615942 592984 501466 455353 288873 6961 -139602 -116722 -338565
42739c38565q28828j133970o65175K10442P31554O80499N22381O27521P47193
42730E53052M60597j17754m10233j41717K42743J00933n69103j052010p58280
42721a691772M4384N54119L98550l038o3781K72788N94598N59721J96008j94771
42711F66806k88524j3271L32599L73792J15738j00805j31652j86086l51534l78876
42701C8187j63902L924L318K02374P17729Q37521n6526j276833j444992l28368
42691a467568P89762P82562k4848n63849l83927J44703N23683N37095K23493j94153
42681C66953m76426o04661o49170m31730K34057R38769R39974K38146k62466o217
42671B87229M61525M50000J52366Q7179J31145q1957k75086L6815N30518M62122
$$ plain form
42739 -338565 -1167393 -2301363 -2966538 -2756096 -2024542 -1344043 -821662 -194141 553052
42730 553052 1013649 895895 485662 343945 586688 687621 118518 -933492 -1691772
42721 -1691772 -1647388 -1093269 -694719 -697757 -761538 -488750 105848 665569 861577 666806
42711 666806 378282 365011 697610 1071402 1187140 1086335 954683 768597 417063 38187
42701 38187 -125715 -121791 -118473 83901 801630 1639151 1582625 305792 -1139200 -1467568
42691 -1467568 -677806 104756 79908 -483941 -867868 -723165 -199482 337613 561106 366953
42681 366953 -109473 -714134 -1363304 -1795034 -1560977 -622208 317766 555912 293446 287229
42671 287229 748754 1198754 1351120 1438299 1569444 1487487 1212401 1249216 1779734 2241856
42661B241856o7784k11996K38707N11913P0847o67344j082506j071355p53100
42652g90762j84488L17277K67433k03367l21150J78603N39360J17080o02200p17419
42642a399633j35244N40674R09697R33677N80486k0094l54317j16611K11254R173
42632A159062m93803n80441k00355K4608j12875j44393J32824K43889j35343n81863
42622f88690n49603j21623K42902L57635L46793L02159K35191J98631J97479J08234
42612F29108j30698l78217m74141m23094k94945j01610J37402L63202N62262P04289
42602E93558O02620J22865m39600n67623k36003n179j77998l29556q2947J14557
42592d05306l15980q92811n18692P67282J491858P71668k37413P9710J312520
$$ plain form
42661 2241856 2174072 1962076 2200783 2712696 2783543 2116199 1033693 -37662 -790762
42652 -790762 -975250 -657973 -390540 -593907 -915057 -736454 -197094 -80014 -682214 -1399633
42642 -1399633 -1534877 -994203 -84506 849171 1429657 1409563 1055246 938635 1149889 1159062
42632 1159062 665259 84818 -115537 -90929 -203804 -348197 -215373 28516 -106827 -688690
42622 -688690 -1238293 -1359916 -1117014 -759379 -412586 -110427 124764 323395 520874 629108
42612 629108 498410 120193 -353948 -777042 -1071987 -1173597 -1036195 -672993 -110731 593558
42602 593558 1196178 1319043 879443 311820 75817 70638 -107360 -436916 -519863 -405306
42592 -405306 -721286 -1614097 -2132789 -1365507 126351 898019 660606 740316 2052836
42583B052836J476107o2979j569152j404469k04769M04382J87747L2819O8902
42574I81424k81484p15400l14470N46741L97605q14517j271060j31595R93994
42565f08762O21786k57621k0965Q35304P54390j12556l57857J08059J52111k38183
42555H75706K6423P89625O25261m95281p75653M41915J392314O21110q40593j294137
42545A366690p87604l23561N355N64030Q75006L15098n46692o64627j01118K34135
42535I36712l621m14384o38816m86668J90209R88065R66417m7309r10853p30969
42525a51217j11807M9393K168K62013L32981l03362q41261l41881N14142N08566
42515h0265j096J39081O05619J57340q76996q69409L32482J066589N89398N7045
$$ plain form
42583 2052836 3528943 3465964 1896812 492343 287574 691956 879703 912522 981424
42574 981424 699940 -15460 -329930 216811 614416 -200101 -1471161 -1602756 -608762
42565 -608762 13024 -244597 -265562 569742 1324132 1211576 853719 961778 1113889 875706
42555 875706 902129 1691754 2317015 1821734 1046081 1487996 2880310 3501420 2660827 1366690
42545 1366690 579086 255525 260880 824910 1699916 2015014 1468322 803695 702577 936712
42535 936712 933091 518707 -120109 -606777 -416568 571497 1537914 1490605 579752 -151217
42525 -151217 -263024 -213631 -211463 50550 383531 80169 -761092 -1102973 -588831 -80265
42515 -80265 -81361 57720 663339 820679 -56317 -925726 -593244 473345 1062743 1119788
42505A119788K40836K87716m06730r19412m62447J98647J20753k91107k48002
42496c59958K2334n3847k25823K2664M45897M75545J08861l19297o29034n61743
42486a074401J46131R78732Q94665q1717n97725M1028Q05081O94843K87301L98583
42476B492521M26582m71272j481807j155906J66133O79872k10028j098346p18431
42467a370682L85152Q20082J70394o62278o15306L00942R48406M37855n52681
42458a38116n58889M66639Q70835k00419j290430p45107P47318J256970N16709
42449I25510k6049K53237L82895k71165r13845p01576j1890K83329p962m35477
42439e22993n42391k04967K02709K0292p77440j149480k88715R75121J166349
$$ plain form
42505 1119788 1360624 1648340 1241610 322198 -140249 58398 179151 -111956 -359958
42496 -359958 -337624 -391471 -617294 -594630 -148733 326812 435673 116376 -512658 -1074401
42486 -1074401 -928270 50462 945127 863410 265685 306713 1111794 1806637 2093938 2492521
42476 2492521 2919103 2447831 966024 -189882 -23749 656123 446095 -652251 -1370682
42467 -1370682 -985530 -165448 4946 -657332 -1272638 -971696 -23290 414565 -138116
42458 -138116 -697005 -230366 640469 440050 -850380 -1595487 -848169 408801 925510
42449 925510 899461 1152698 1535593 1264428 350583 -350993 -362883 -79554 -87516 -522993
42439 -522993 -1065384 -1270351 -1067642 -1047350 -1824790 -2974270 -3262985 -2287864 -1121515
42430a121515L34957r1078L86010O84987J44393l61893n1541L54638r7455q87686
42420g06183p78143K67245J026686O96397k32065p73055n51554j1736K26222J44717
42410f91469L28060R61340J192682K10384j259208j585056m70345N97681N15622
42401b00309k4405J9475L44217J12401m25966l86996J79795M18000J23081n9464
42391I9829J67040L77610L21014K86159M13842M10802J48754r8353j94246l27966
42381A604485m96830l85039K5226K62884O0145k32874k27706q2485j52820l70011
42371D975l63774m6501K71953L02064M6610l24893o32092o63992k32861N51490
42361a087021J152804J034202L10360k70296k07885J07069k5388n75420q39674
$$ plain form
42430 -1121515 -786558 -877636 -491626 193361 337754 -24139 -75680 278958 181503 -706183
42420 -706183 -1484326 -1217081 -190395 506002 273937 -499118 -1050672 -1062408 -836186 -691469
42410 -691469 -363409 597931 1790613 2000997 741789 -843267 -1313612 -715931 -200309
42401 -200309 -224714 -205239 138978 251379 -174587 -561583 -381788 36212 159293 99829
42391 99829 266869 644479 965493 1251652 1665494 2076296 2225050 2126697 1932451 1604485
42381 1604485 1107655 722616 747842 1010726 1070871 837997 610291 527806 374986 4975
42371 4975 -358799 -405300 -133347 168717 215327 -109566 -741658 -1405650 -1638511 -1087021
42361 -1087021 65783 1099985 1410345 1140049 932164 1039233 1013845 438425 -401249
42352d01249n07621o1826M9657J5569R3687M2589l27416n08459Q1504J064397
42342d59168J418316P92196j34180o48737p51146p37394o12609k59132J74747
42333a217107M16196M17186K91103L1839m28188q93310q89182j55726Q81904J358357
42323a86928Q67804p632l57807o4055J68246n8514k54105Q7198N90175N52480
42313A336862L3247k80967j17520J40911J92449J42430O0589j67995m34976m12460
42303D92570j06486J11133J44667K87185N38000M36450j41507o25597n65964k52581
42293C17870r8697L4553L59785N31758J79164l18434l36865k1061J5432j62865
42283E00640R8435P36008P33336l68496j508057j346286m1571R40133O60141k86983
$$ plain form
42352 -401249 -908870 -970696 -921039 -905470 -811783 -769194 -1096610 -1605069 -1523565 -459168
42342 -459168 959148 1751344 1617164 968427 217281 -520113 -1132722 -1391854 -1217107
42333 -1217107 -800911 -383725 -92622 -60783 -488971 -1382281 -2271463 -2427189 -1545285 -186928
42323 -186928 680876 673244 315437 251382 419628 361114 107009 194207 784382 1336862
42313 1336862 1370109 1089142 971622 1112533 1304982 1447412 1508001 1340006 905030 492570
42303 492570 386084 497217 641884 929069 1467069 1903519 1762012 1136415 570451 317870
42293 317870 219173 253726 613511 1145269 1324433 1005999 669134 648073 663505 500640
42283 500640 599075 1335083 2068419 1699923 191866 -1154420 -1195991 -255858 404283 117300
42273A17300p12645k85668K90962L54351J16923K37992P71943R72452L07038p01238
42263A469410j062045n71094K7272J09700j40660k62337j95366j15648q536J89644
42253e59660L02104J48376j24979k68259k73661k09950k921K65029J91235l05379
42243h38065n23690J36588J050324R91075j12693r71458p29004l3941J84569J30506
42233g15789M88646R93424P57191j67095o66291k14553L17195P341o84571n96244
42223d80746L74014J033722N19590n35285q63904j94269N27600M40189k54218
42214E66693p64801p14965l34991M7070K76902K64550K0984k00424j21583K04724
42204g55841N06132O43089N47763M1540p85526j224437o86319K82200N58295P3866
$$ plain form
42273 117300 -595345 -881013 -590051 -235700 -118777 119215 891158 1863610 2170648 1469410
42263 1469410 407365 -163729 -136457 -26757 -167417 -429754 -625120 -740768 -749304 -559660
42253 -559660 -257556 -109180 -234159 -502418 -776079 -986029 -988950 -723921 -532686 -838065
42243 -838065 -1361755 -1225167 -174843 816232 703539 -267919 -996923 -1030864 -846295 -715789
42233 -715789 -227143 766281 1523472 1356377 690086 475533 792728 800069 115498 -480746
42223 -480746 -106732 926990 1446580 911295 47391 -146878 380722 820911 566693
42214 566693 -198108 -913073 -1248064 -1200994 -924092 -659542 -638558 -838982 -960565 -755841
42204 -755841 -249709 393380 941143 982683 197157 -1027280 -1713599 -1431399 -873104 -799238
42194g99238r8123M55074P43656O7690o62891l32556N26187N69871k18599o33085
42184c82014k48208J02014q4461k53466J7597K96345K34784K04049M37080M54723
42174G78443j4901l49923Q318N70403N41512M2607k00361m2063r320l51188o74655
42163B98872n64097j20027J84214j9741n94070q94657m19301M72761Q79814N13182
42153b63050K8357L731J98999J86601R6061K10892L59809K85843J52884J09306
42143A369433j53294p48842j020828m29867M10877N12713J0365j41284J94575
42134C848J35024o64918j321444r79688M8059Q35077R20571M71137j07744l89815
42124a049893j97619J19701J10934K162M22201J215777J351211M11394o11131
$$ plain form
42194 -799238 -897361 -442287 301369 369059 -293832 -626388 -100201 469670 251071 -382014
42184 -382014 -630222 -528208 -612669 -866135 -848538 -552193 -317409 -113360 323720 778443
42174 778443 763542 413619 421937 992340 1533852 1576459 1376098 1334035 1324715 973527 298872
42163 298872 -265225 -385252 -201038 -220779 -814849 -1709506 -2128807 -1656046 -776232 -263050
42153 -263050 -234693 -230962 -31963 154638 250699 461591 821400 1107243 1260127 1369433
42143 1369433 1216139 467297 -553531 -983398 -572521 -59808 -49443 -190727 3848
42134 3848 138872 -526046 -1847490 -2827178 -2779119 -1944042 -1023471 -552334 -660078 -1049893
42124 -1049893 -1247512 -1127811 -1016877 -1014715 -592514 623263 1974474 2385868 1774737
42115A774737o25179J00961N32921M10542L17541M85124M49790n5405o25457q03017
42105A962558o34850l95161j60057J20581L89608M83353K34241l95972j087585
42096E16716j214950n05523M34302P21505L28675P8208L99452P15706L99292k42872
42086A630511m84305k68626j31483k68122l79097l74064n06477p08295m96931
42077a986889J82567O49728M21364o8650j45020J62955L77174L80358L57838K34029
42067E65454j45356m52093k15978L40279N14039J74554j06962l4420N4954m3891
42057F50580n2423J18381R9776j84271k42765Q2577K02053j95086m59683m5186
42047b6047M39527J40271n95816o90824L8631P19628P61670M21428M6452l48645
$$ plain form
42115 1774737 1149558 1250519 1783440 2193982 2511523 2996647 3446437 3391032 2765575 1962558
42105 1962558 1327708 932547 772490 893071 1282679 1766032 2000273 1604301 516716
42096 516716 -698234 -1203757 -769455 -47950 280725 358933 758385 1474091 1873383 1630511
42086 1630511 1146206 877580 746097 477975 98878 -275186 -781663 -1489958 -1986889
42077 -1986889 -1804322 -1154594 -733230 -801880 -946900 -783945 -406771 -26413 331425 565454
42067 565454 420098 -31995 -247973 92306 606345 780899 673937 639517 694471 650580
42057 650580 598157 716538 816314 632043 389278 471855 673908 478822 19139 -26047
42047 -26047 413480 553751 -42065 -732889 -694258 25370 787040 1208468 1254920 906275
42037I06275o44556n58671k01488j5795k7409J75764N87762O21984M2755n85040
42027C01581o72433k94345J54833M79870O08104M74652K20899P8358p6451n35947
42017G39121j036672q99653j17012M42754K87898J9580K72388O54789M72680n8478
42007G77395j96515P6725R9059k97174n31941k84781K8891L7683N15K11968L42946
41996B64771o3748p08884p77216r5374N16049L41808k15839k65047J63451J09196
41986g30833p45116j304422m85963J121601J853417J018857m32826j243006j071076
41977b019367l37896L87505O33129K95653j10295l935L83401L22603j85152l36631
41967i70985J44160N49177M06350J87340K93937L08274q9109m00090k98989l95195
$$ plain form
42037 906275 261719 -296952 -498440 -514235 -541644 -365880 221882 843866 886621 301581
42027 301581 -370852 -665197 -510364 -30494 577610 1052262 1273161 1351519 1275068 739121
42017 739121 -297551 -1197204 -1314216 -871462 -583564 -563984 -291596 363193 835873 777395
42007 777395 580880 657605 756664 459490 -72451 -357232 -328341 -290658 -290143 -78175 264771
41996 264771 201023 -507861 -1285077 -1380451 -864402 -522594 -738433 -1003480 -840029 -730833
41986 -730833 -1475949 -2780371 -3266334 -2144733 -291316 727541 294715 -948291 -2019367
41977 -2019367 -2357263 -1969758 -1336629 -1040976 -1151271 -1155206 -771805 -449202 -634354 -970985
41967 -970985 -826825 -277648 128702 316042 609979 918253 829144 429054 130065 -265130
41957b65130j027770j221358j13952J293856J300825K0834p84667k79614N21469
41948e55507N48250K9809l16778l19695j24297J84076L77845K55775J56822M82989
41938G19289P33513J25211p83312n16175Q98553J490877J54277j538850j515224
41929b31841n6202R20366O15733j09827m69473n25140l71996J07427N72412L98665
41919H50124l14952p87410o71465l17236L8968M40339N89476R5869n46534l17546
41909i40367P13141J214780M98728m53277n11277J4458J64767q0629n8744K29565
41899G91145J45219l72283o13393k06748L74110N80691M32494J94881n6607l06456
41889I63053m09907k48281J42955O33106R38555O35594l00592j027441n57360
$$ plain form
41957 -265130 -1292900 -2514258 -2628210 -1334354 -33529 -12695 -797362 -1076976 -555507
41948 -555507 -7257 22552 -294226 -613921 -738218 -554142 -176297 79478 236300 719289
41938 719289 1452802 1578013 794701 278526 1177079 2667956 2822233 1283383 -231841
41929 -231841 -288043 632323 1248056 1138229 668756 143616 -228380 -120953 451459 850124
41919 850124 535172 -252238 -923703 -1240939 -1201971 -761632 -172156 -76287 -622821 -940367
41909 -940367 -227226 987554 1486282 1033005 521728 536186 700953 620324 561580 791145
41899 791145 936364 564081 -49312 -256060 118050 698741 1131235 1326116 1269509 963053
41889 963053 553146 304865 447820 1080926 2019481 2655075 2354483 1327042 769682
41880G69682Q57119J700085R85112m28450r06115j23045O31584K25142r32803
41871B778311j587343j244592n60840k74180l02407j17008L55986O51557N19620
41862B19104L05428L74970N06915K33404l79574p33338m97684j4909K28245J87948
41852D30509J00909J8185j67074l55102k55651J75957N62160N17647J50074k6683
41842A150931K53698N70396K71516n75462j007229k71101J058075J545094N55600
41833C551518r71835j620512j020215J133N13622L53819q313j27526j4196j0819
41823F46676k79847m98272k52909L04252N52004K51643j06910n3892J80450J35873
41813H79068q3838n3241J29167r2278p40994r94093k01369J119742J720022J012626
$$ plain form
41880 769682 1626801 3326886 4311998 3883548 2977433 2854388 3485972 3711114 2778311
41871 2778311 1190968 -53624 -614464 -888644 -1191051 -1308059 -952073 -300516 219104
41862 219104 524532 899502 1406417 1639821 1260247 526909 29225 14316 242561 430509
41852 430509 531418 549603 382529 27427 -228224 -52267 509893 1027540 1177614 1150931
41842 1150931 1404629 1975025 2246541 1671079 663850 392749 1450824 2995918 3551518
41833 3551518 2579683 959171 -61044 -59911 453711 807530 799217 671691 657495 646676
41823 646676 366829 -131443 -384352 -80100 471904 723547 616637 562745 743195 879068
41813 879068 795230 741989 871156 778878 37884 -956209 -1157578 -37836 1682186 2694812
41803B694812k51607q45819m85977r2784m80934j140802r02229K79854J044552
41794a80934M94220m52216l36559P56109J397969Q99610J08607m2373J98340Q1478
41784B924251m14360o99225n43456k97891k41960k07882N6762M50553O21531M23520
41774B071843Q8581j49749m39128r97046j461479j082996J83137J293406J295210
41765H01779M92414j08490j52732q1756k04707l73988m62872m79122l00107P8377
41755g91204K22604j18401l52494J45264Q58108Q09636J80025r484K93964J39306
41745A377324n66668p78337k50059n7486n49050n46489M30621R19026r5419j148261
41735a264798m88895R69229J030034k67624q11585J81413J161795Q70237K639
$$ plain form
41803 2694812 2443205 1597386 1111409 1018625 537691 -603111 -1505340 -1225486 -180934
41794 -180934 313286 -138930 -475489 280620 1678589 2578199 2686806 2644433 2842773 2924251
41784 2924251 2509891 1810666 1267210 969319 727359 519477 576239 1026792 1648323 2071843
41774 2071843 2160424 2010675 1571547 574501 -886978 -1969974 -1786837 -493431 801779
41765 801779 1294193 1185703 1032971 951215 746508 372520 -90352 -569474 -869581 -791204
41755 -791204 -568600 -687001 -1039495 -894231 -36123 773513 953538 944054 1238018 1377324
41745 1377324 810656 32319 -217740 -275226 -824276 -1370765 -940144 -21118 -116537 -1264798
41735 -1264798 -1753693 -784464 245570 -22054 -833639 -652226 509569 1379806 1382445
41726A382445l12487j27593o8882k86813o17789q96207p43666P2776Q71053O41752
41716h5411l89546q64037k15909O26435P98738N77562M21037J18746m28074o32860
41706g3319k04926J87489n046k92152n5421M09422N47679M81505M66168J73262
41696A634661n48334r16134l10114M61591K15841o75744p30682L80491J331861
41687H43437J102812K59287j71724j30895j87724m70496o68153p10457p44965
41678h78878n93282R9610J065587J334733L76486r54466j191483o2573J041237
41669B36971Q04514k82558o60316O6688O24855J8662r94332j033558k2758Q59905
41659c81927Q18936J98389k97352l97369k04135P2219J71605n223j64889J5472
$$ plain form
41726 1382445 1069958 942365 873483 586670 -31119 -927326 -1670992 -1598216 -727163 -85411
41716 -85411 -474957 -1338994 -1554903 -928468 -129730 447832 868869 987615 559541 -73319
41706 -73319 -278245 -90756 -95802 -387954 -443375 -33953 513726 995231 1461399 1634661
41696 1634661 1086327 170193 -139921 321670 537511 -138233 -868915 -488424 843437
41687 843437 1946249 2205536 2033812 1902917 1715193 1244697 576544 -133913 -878878
41678 -878878 -1472160 -1372550 -306963 1027770 1404256 449790 -741693 -804266 236971
41669 236971 1041485 758927 98611 165299 790154 808816 -185516 -1219074 -1241832 -381927
41659 -381927 437009 635398 338046 -59323 -263458 -191239 -19634 -24857 -189746 -174274
41649a74274K79748K8380p25545j145151o08522M19938R37242O05134J7204j61372
41639e27218N9006K10902P0580r9041L5962M16864O54907N04292J42328r5873
41629A372709j95858n01630j153742j621711j142144K25072J320801J106519J9081
41620e70903m69289K75425J249822J212641K75704m91357n93745m56137m14998
41611A7163k31896K16997M63744O4776o63834q97234k18141Q51226J260352N05147
41601A368300o76980j022536k97466L97575K28023j87479O8402N66029K11720
41592F55588q15995j205025n47931J73774L45006N01345Q96454P63070j82436
41583E83850q24647l16055M39619K00537o11333o84063O7851O11266O18549O98656
$$ plain form
41649 -174274 105474 133854 -591691 -1736842 -2345364 -1925426 -988184 -383050 -365846 -527218
41639 -527218 -468212 -257310 -186730 -285771 -249809 167055 821962 1326254 1468582 1372709
41629 1372709 1176851 675221 -478521 -2100232 -3242376 -3017304 -1696503 -589984 -570903
41620 -570903 -1040192 -764767 485055 1697696 1973400 1482043 888298 432161 17163
41611 17163 -214733 2264 466008 530784 -133050 -1030284 -1248425 -397199 863153 1368300
41601 1368300 691320 -331216 -628682 -231107 -3084 -190563 -122161 443868 655588
41592 655588 -160407 -1365432 -1913363 -1739589 -1394583 -893238 3216 766286 583850
41583 583850 -240797 -556852 -117233 83304 -528029 -1212092 -1144241 -532975 85574 784230
41573G84230R23924N84671l83233j002563p07717j75334k11007o24787p41874
41564a553690l96243J05237N26909P30577N29093k3335m34367k79662K08905L86435
41554b00141Q50m85203m46931J44229O50864N11250p5542m14290k06571J45389
41544c76096J83947l0522j68206j03734R0876L12235L46764m8305p13462j044018
41534a550521o63755J15890P12749Q44142N45805N1651j91664R1399M52932J98681
41524F07309m27662m17724L49536P46068K64037l2283N89903R89175J1126j211839
41514A467646p99456O94705R14136n74399j543667o24794O45172L99717p44740
41505a65680r51913J5816Q53808Q58420N08511K51855K6281p9159K33429P60502
$$ plain form
41573 784230 1708154 2292825 1909592 907029 199312 23978 -187029 -811816 -1553690
41564 -1553690 -1949933 -1844696 -1317787 -587210 -58117 -81452 -515819 -795481 -586576 -200141
41554 -200141 -199291 -684494 -1131425 -987196 -336332 174918 99376 -314914 -521485 -376096
41544 -376096 -192149 -222671 -390877 -494611 -403735 -91500 255264 206959 -506503 -1550521
41534 -1550521 -2214276 -2098386 -1385637 -541495 4310 55961 -135703 -44304 408628 607309
41524 607309 179647 -238077 111459 857527 1121564 1089281 1679184 2668359 2679485 1467646
41514 1467646 668190 1362895 2277031 1702632 158965 -465829 179343 579060 -165680
41505 -165680 -1117593 -1101777 -247969 610451 1118962 1370817 1397098 1317939 1551368 2311870
41495B311870Q46634L16950k21113j75613L11259N60537Q4408q60427j374468
41486A800037p96314M13462J026309M67000n40860r97639p89199m34753j96696
41477d8653l5762p8212m33361p11310l74555M41136R87005Q21967K53768j60193
41467F61830j73950J01062L54180K46337k62973p39690p24473l55251k04386m60701
41457a558015o50396l22492L13993O90386O17781M39680M87444O19613M13071
41448A051065k40589q36222o84869K68190J168256J051926k2270r28015p70550
41439E6922K6780L35842j30797n04503j20383N01326N25418Q8013n6044J63303
41429H85877J21950k67254l32525J22938L53902q6253n23696k40571L77364N40851
$$ plain form
41495 2311870 3158504 3475454 3254341 3078728 3389987 3950524 4034932 3174505 1800037
41486 1800037 1003723 1417185 2443494 2910494 2369634 1371995 582796 148043 -48653
41477 -48653 -84415 -162627 -595988 -1307298 -1681853 -1240717 -253712 568255 822023 661830
41467 661830 487880 588942 943122 1189459 926486 186796 -537677 -892928 -1097314 -1558015
41457 -1558015 -2208411 -2530903 -2216910 -1526524 -908743 -469063 18381 637994 1051065
41448 1051065 810476 -25746 -710615 -442425 725831 1777757 1755487 827472 56922
41439 56922 83702 419544 288747 -215756 -336139 165187 690605 778618 722574 885877
41429 885877 1007827 740573 408048 530986 884888 798635 274939 34368 411732 952583
41419I52583K72061O2948j37864o21394r98422o45939J20631L59638o9772l80825
41409a086355j67425J54815L11281N52724Q36891O18567j42375o50409m45406
41400a7692j17677k92203o12480m22320R0834K06694j69550l73510N6931Q07800
41390h43173J210231R20917J77759m23932m38054K7278M46053M23279K235n03569
41380I99024p58209n38450P6016O25317O44086J42520m65470q19798p81813l43719
41370a220496K75643O06638L97029j5516j45328K5662K34079M14247N07079J75145
41360A254182o28013j142239o51055L82961Q54467M89036p4347m49726p58282
41351g23016q63903m55346J20956K05090N470K69737P61341M40701o14761r70435
$$ plain form
41419 952583 1224644 1287592 1149728 528334 -470088 -1116027 -995396 -635758 -705530 -1086355
41409 -1086355 -1253780 -1098965 -787684 -234960 601931 1220498 1078123 427714 -17692
41400 -17692 -135369 -427572 -1040052 -1462372 -1371538 -1164844 -1334394 -1707904 -1650973 -843173
41390 -843173 367058 1287975 1465734 1041802 603748 631026 1077079 1500358 1502593 999024
41380 999024 240815 -297635 -221619 403698 1047784 1190304 724834 -94964 -876777 -1220496
41370 -1220496 -944853 -338215 58814 43298 -102030 -76368 157711 571958 1079037 1254182
41360 1254182 626169 -516070 -1167125 -784164 70303 559339 484992 35266 -723016
41351 -723016 -1586919 -2042265 -1921309 -1716219 -1710749 -1441012 -679671 -238970 -853731 -1824166
41341a824166n0739Q25482M15399o68638j061237n06650K96579Q43171R38234
41332g92565M38145l20274n42123r4112K01037j4678L9178P59170J129351L13623
41322A116752p67629p60192O8033M78462K65265J30798J02439l41778q55258n27585
41312a090693M08258O73855m2136n29664P9017J046817J189567M23235m28448
41303A729808p66091o29905l52648j88599j22898Q1707M98687P71523M99626j97248
41293A323962p76026q41880m22413J45345M23016K34949k2946J91759P23008Q51262
41283A830036M27557J12794J82904K1958o48053j025041n37850L3307j98081o72312
41273d72781l29578N22493O92320P5147l06592q3188Q1685l8586K07234R62683
$$ plain form
41341 -1824166 -1874905 -1049423 -634024 -1302662 -2363899 -2870549 -2573970 -1730799 -792565
41332 -792565 -354420 -674694 -1216817 -1310929 -1109892 -1124570 -1085392 -326222 803129 1116752
41322 1116752 349123 -411069 -343036 135426 400691 531489 633928 292150 -563108 -1090693
41312 -1090693 -682435 -8580 -50716 -580380 -501363 545454 1735021 2158256 1729808
41303 1729808 963717 333812 -18836 -207435 -330333 -248626 250061 1021584 1521210 1323962
41293 1323962 547936 -293944 -716357 -571012 -147996 86953 64007 255766 978774 1830036
41283 1830036 2257593 2370387 2553291 2575249 1927196 902155 364305 397612 199531 -472781
41273 -472781 -802359 -279866 412454 487601 181009 97821 179506 140920 348154 1310837
41263A310837J274149M83355o97921j134566o62466J5381L65944M27719M03344
41254A785776K93560k384l76181m90993k49678j09133m64458q17975l23686P33620
41244b1532R92283k9760j075343r50313j72817J21103k9078R6113L77897K01909
41234d89538j91463p2405L78796L46217j51284l06604Q2083M16226L96141K58500
41224F66669O8321k10218j85073L63756O93426Q2959p61276o17559K67368O04337
41214I72710K34987K05139O94122O53657k05760p81761m51061j9923j56820k95938
41204H49352J13070M95441J63945n28552q53692p40719m75905q6591L75648N64963
41194a23040L52352N9276j34984m07017o82956n28654Q7448N95838O17513L22510
$$ plain form
41263 1310837 2584986 3068341 2370420 1235854 573388 588769 954713 1382432 1785776
41254 1785776 2079336 2076952 1700771 1209778 960100 850967 386509 -431466 -755152 -21532
41244 -21532 970751 940991 -134352 -1084665 -1257482 -1136379 -1165457 -1069344 -691447 -489538
41234 -489538 -681001 -753406 -374610 -28393 -179677 -486281 -404198 12028 408169 666669
41224 666669 734990 524772 339699 703455 1396881 1479840 718564 101005 368373 972710
41214 972710 1207697 1412836 2106958 2760615 2554855 1773094 1322033 1302110 1145290 849352
41204 849352 962422 1457863 1621808 1093256 239564 -501155 -977060 -1063651 -688003 -123040
41194 -123040 229312 288588 153604 -253413 -936369 -1465023 -1377575 -781737 -164224 158286
41184A58286r6827n78783p50151j67740Q33077J308861Q92549J30206l82786m75934
41174H70758r8630O18949J068523P70807J60691n9945n0920l35503n97245k15638
41164B131847L70297K59086k41373r3510N31877M81549l23415q22647p66161q56899
41154F70651r38740j08998J189227J398408N28621K75075R04509N71940j278842
41145C211851k419291j240710O49853J043068L40103J54386M11976N6505o19138
41136A588603n62617m0493j01413n59359l63811M27780P34355K76007j46494p5744
41126A176814J21100J26927M6081m7051k08513l72687m41209l79891n0626N33569
41116E04514P59136P3582q68760q41494R0456O81980N93772P28258J214822R74802
$$ plain form
41184 158286 61459 -517324 -1267475 -1435215 -602138 706723 1599272 1729478 1346692 870758
41174 870758 772128 1391077 2459600 3230407 3391098 3331153 3280233 2944730 2347485 2131847
41164 2131847 2502144 2761230 2519857 2426347 2958224 3439773 3116358 2293711 1527550 670651
41154 670651 -268089 -377087 812140 2210548 2739169 3014244 3918753 4490693 3211851
41145 3211851 792560 -448150 201703 1244771 1584874 1739260 2151236 2207741 1588603
41136 1588603 1025986 985493 884080 324721 -39090 388690 1123045 1399052 1252558 1176814
41126 1176814 1297914 1424841 1470922 1423871 1215358 842671 401462 21571 -29055 504514
41116 504514 1263650 1337232 468472 -373022 -282566 399414 993186 1721444 2936266 3911068
41106C911068j33068p38457l31547j65685q30804j075196k39535L47519j53583
41097E90712m54111L48120Q72609M0236o76297J43950J163558P38645m171N57576
41087C320827J221712L82441M465K913005O957865O555353N88779n371598o147519
41078A0425330k916589l09993k68922j109878j073791m15425k47828q12274j264823
41069B005807q24628J09373L93230j85666n20524m195L93246j49840p17923k17922
41059B80958N82505L18693n86954p42231k61400l40856q61008n94162L96061O95904
41049a112490n4481o30324k78277M07265Q28660J039745R46885L31165k77982
41040A200166j41771L37366J86354m02128l94550K06090L93415j7552j87379J00145
$$ plain form
41106 3911068 3778000 3039543 2707996 2542311 1711507 636311 396776 744295 590712
41097 590712 136601 484721 1357330 1397566 721269 865219 2028777 2767422 2763251 3320827
41087 3320827 4542539 4924980 4929445 7842450 14800315 21355668 21944447 16572849 10425330
41078 10425330 7508741 7198748 6929826 5819948 4746157 4330732 4082904 3270630 2005807
41069 2005807 1181179 1290552 1683782 1498116 977592 973397 1366643 1216803 498880 280958
41059 280958 863463 1182156 595202 -147029 -408429 -749285 -1610293 -2204455 -1808394 -1112490
41049 -1112490 -1166971 -1797295 -2075572 -1668307 -839647 200098 1146983 1478148 1200166
41040 1200166 1058395 1395761 1582115 1179987 785437 991527 1384942 1367390 1180011 1280156
41030A280156J01292m45788q70084o95341j38932M79795Q93606P18942K7790l90610
41020I60826j91166j17468n65236o24560K40894Q57172K00100p26821o02766k4824
41010e93849j03623k39008M83682J051859J86712r78961n75168P19388Q68704
41001H19736j767k05503K29309n5694p66340m81163L72268K00045n70187j90592
40991f49888R21827P44272n38555o92148O05923J311357O48380m1817k36410q06640
40981A266301j481486r11749N18655J003496M97369N05338Q42983k8600j546283
40972F66024j506221j8931O12949J5583K0109P85450N75244m38164k03883J101547
40962A609707J112325k69447o54717K87729M22465m11399j16281J186356J221118
$$ plain form
41030 1280156 1381448 935660 65576 -629765 -768697 -288902 604704 1323646 1351436 960826
41020 960826 769660 652192 86956 -537604 -296710 560462 760562 33741 -569025 -593849
41010 -593849 -697472 -936480 -452798 599061 785773 -193188 -768356 -48968 819736
41001 819736 817969 612466 841775 786081 19741 -461422 -89154 110891 -459296 -649888
40991 -649888 271939 1016211 477656 -214492 391431 1702788 2351168 2309351 2072941 1266301
40981 1266301 -215185 -1126934 -608279 395217 892586 1397924 2240907 2212307 666024
40972 666024 -840197 -859128 -246179 -230596 -210487 574963 1150207 712043 508160 1609707
40962 1609707 2722032 2452585 1797868 2085597 2508062 2096663 1980382 3166738 4387856
40953D387856M21830J471275L489547K463779j520606l517769j702017J0679p63599
40944D740975j263821K55805R92195o63521j720012l26674O30549q16697j862084
40935c3285l74792J015196M2090j009063J4640J158632O89060M64380J483231
40926C450089J208127j150278k063940N102J378266p0888r65888P78404J632838
40917D201832n99303k086208j49344J465671k41500j764456m3952J597536K57345
40908B637621p68916J017205J842487n87322j643152J308941K910110j30084k023246
40899D563644J180548L452986L74927j685149K063441M646220Q43950j346001
40891A4094566M181508Q310340L665284M75151P446385J2594486N326640O32007
$$ plain form
40953 4387856 4809686 6280961 9770508 12234287 10713681 7195912 5493895 5504574 4740975
40944 4740975 3477154 3732959 4725154 4061633 2341621 2014947 2645496 1828799 -33285
40935 -33285 -408077 607119 649209 -359854 -345214 813418 1502478 1966858 3450089
40926 3450089 4658216 3507938 1443998 1449100 2827366 2756478 1790590 2568994 4201832
40917 4201832 3602529 1516321 1366977 2832648 2591148 826692 782740 2380276 2637621
40908 2637621 1868705 2885910 4728397 4141075 2497923 3806864 6716974 6586890 4563644
40899 4563644 5744192 9197178 9572105 7886956 9950397 14596617 15440567 14094566
40891 14094566 18276074 26586414 30251698 30726849 38173234 50767720 56094360 56726367
40883E6726367J3310158K6052429K0306483K2429609O7424620J21012384J00431270
40876D27693320q472506j12227802j22633375o2809292j7740322j7401016k3809177
40869F2599830j1575640L7469m877603j1086013n359197P62656l326595p767061
40861A9407846l170898K068628p42410m859417k564288P99528j023993l066325
40853F848671o8357K764174J38549l063016j349353J349836M1337j942812l40351
40844D378678J484340m90270k815567j164065J584576J101708o11102M000J140251
40835D612549p8959j564985n64933P92016j87678j486624n80622N82439l16015
40826A207188j319532l07341O34265n66894j715817o37065O22297M8126l20691
$$ plain form
40883 56726367 70036525 96088954 116395437 138825046 206249666 327262050 427693320
40876 427693320 419220814 306993012 184359637 121550345 103810023 86409007 62599830
40869 62599830 51024190 51061659 46184056 35098043 29738846 30501502 27174907 19407846
40861 19407846 16236948 18305576 17563166 12703749 10139461 10938989 9914996 6848671
40853 6848671 6780314 9544488 9683037 6620021 5270668 6620504 6661841 4719029 4378678
40844 4378678 5863018 5372748 2557181 1393116 2977692 4079400 3468298 3472298 4612549
40835 4612549 4533590 2968605 2403672 3195688 3008010 1521386 940764 1523203 1207188
40826 1207188 -112344 -419685 214580 -352314 -2068131 -2705196 -2082899 -2034773 -2355464
40817b355464J209975K110637M44083r57592M31711K011657Q60801r73113o51228
40808B131467K24443o50734j442302k4058J310669P5714j311867Q1579J957628
40799B352539R72353q46989J99277K440203J709812j160737j970635m57742J05634
40790C343715o97878l43166J171799J336598J25547j44610M50985k33914j693038
40781C316038j232925Q91110J507148o5108j077867k93374L24934m02336r98945
40772A968675m11803K91894K50730R6426K02599L9763k91393o6292L92962J35946
40762B609507m93226m53635j09469m96634j047931m82126N80374M53185o16688
40753e6643q67938n9882M63347L63590M13401M06762m29069j291792p20368O52079
$$ plain form
40817 -2355464 -1145489 965148 1409231 451639 883350 2895007 3755808 2782695 2131467
40808 2131467 2355910 1705176 262874 238816 1549485 1625199 313332 394911 2352539
40799 2352539 3324892 2477903 2677180 5117383 6827195 5666458 3695823 3238081 3343715
40790 3343715 2645837 2302671 3474470 4811068 4936615 4792005 5242990 5009076 3316038
40781 3316038 2083113 2974223 4481371 4416263 3338396 3045022 3369956 2967620 1968675
40772 1968675 1556872 1848766 2099496 2195922 2398521 2438284 2146891 2080599 2473561 2609507
40762 2609507 2116281 1662646 1553177 1056543 8612 -473514 106860 560045 -56643
40753 -56643 -924581 -984463 -521116 -157526 255875 662637 233568 -1058224 -1778592 -1126513
40743a126513R23296K03151K97732J301080J398493J64927p66492o51940o01584
40734A142150j140359j260115m78956L07265N32438O11750O04387Q2485n23048
40725a22003k84158M91770O91928L82342M67357P16822K38928m82239l40087L4595
40715A795255p30563j752286q64548J438105K222447P04688n85046n0735P01778
40706B879095J15191p36172n16788p3247n62510j158856o26825L85575N32331
40697B37794K8729l8094K92383J85192l20651m23189M0542M41449L87677J10680
40687I42512k221K11596N54661N35292o3718p06211p39498l64116k40807l46099
40677b18609j47587K66034K99073j5165j03770N763j99730n32083k78093M19811
$$ plain form
40743 -1126513 -203217 -66 297666 1598746 2997239 3162166 2395674 1743734 1142150
40734 1142150 1791 -1258324 -1737280 -1430015 -897577 -285827 318560 401045 -122003
40725 -122003 -406161 85609 777537 1159879 1627236 2344058 2582986 2100747 1760660 1795255
40715 1795255 1064692 -687594 -1552142 -114037 2108410 2813098 2228052 2177317 2879095
40706 2879095 2994286 2258114 1741326 1668079 1105569 -53287 -680112 -294537 237794
40697 237794 266523 228429 520812 706004 385353 -37836 2706 444155 831832 942512
40687 942512 940291 1151887 1706548 2241840 2178122 1471911 732413 368297 127490 -218609
40677 -218609 -366196 -100162 198911 183746 79976 85739 -113991 -646074 -924167 -504356
40667e04356O23915J39056k35867j18187m314j70007k56211j19596m6701l0695
40657g22963J72837L20870M6377k28088J20841O54039M63235k18315l81136R802
40647B37499J15308j18127N539L53382J13394m76436k89808O57618J060296M51667
40637B110332j79354j99928j45840l74569m53196k61511k59613l61497L3371O84192
40627E92387O61708M432l11969j42463k52746n77326k42372N22963M80969l16857
40617D18726l88573N70129J039248K73810n10898l38833J11146J46976K20683
40608A542414N36497L40144m65339p68863k12569R3246l20163l76393L87187P73808
40598A529969J52673l12879Q0196J73986p32061j239699k70179Q11738M51763
$$ plain form
40667 -504356 119559 258615 22748 -95439 -99753 -269760 -525971 -645567 -692268 -722963
40657 -722963 -550126 -229256 -182879 -410967 -290126 363913 827148 608833 227697 237499
40647 237499 352807 234680 240219 593601 706995 230559 -59249 598369 1658665 2110332
40637 2110332 1930978 1731050 1585210 1210641 757445 495934 236321 -125176 -91805 592387
40627 592387 1254095 1258527 946558 804095 551349 -25977 -268349 254614 735583 418726
40617 418726 30153 600282 1639530 1913340 1402442 1063609 1174755 1321731 1542414
40608 1542414 2078911 2419055 1953716 1184853 972284 1065530 745367 368974 756161 1529969
40598 1529969 1682642 1369763 1449959 1623945 891884 -347815 -617994 193744 645507
40589F45507m44831k27624O36461O32082j02887l71381k22075m80019p84733k45042
40579i64542N74055M14779l76350l44362N54591Q82162J23127o10890m39736K01763
40569A4597N60873M70910R1159l24055l45325J91011P50147P09158J35162n36069
40559A717568j086527j274043p29192K73115P27471K59732k75766k11805m2659
40550f42106k32907k55235K29174M70170J4287k66226K42677N89597o3388p67587
40540f81544l88293L88743M05878J46022N35269Q22529j00786j253541q99341
40531a025064L93089O06576k78963m07750N43070Q74263L9216m23916K18338O16552
40521A155411q0611o49351k2576Q35268O37290k14877o48653o18324n22115j10470
$$ plain form
40589 645507 200676 -26948 609513 1241595 1138708 767327 545252 65233 -719500 -964542
40579 -964542 -390487 24292 -352058 -696420 -141829 740333 863460 252570 -187166 14597
40569 14597 575470 1046380 1137539 813484 468159 659170 1409317 2118475 2253637 1717568
40559 1717568 631041 -643002 -1372194 -1099079 -371608 -111876 -387642 -599447 -642106
40550 -642106 -875013 -1130248 -901074 -430904 -416617 -682843 -440166 149431 86043 -681544
40540 -681544 -1069837 -681094 -275216 -129194 406075 1228604 1127818 -125723 -1025064
40531 -1025064 -631975 -25399 -304362 -712112 -169042 705221 744437 320521 538859 1155411
40521 1155411 1074800 425449 402873 1238141 1875431 1660554 1011901 393577 -128538 -239008
40511b39008P29721J094345K80551q50386r53507r8507N21233L55091p9509k79932
40501D80092k95145k25208K7799L89811N22832K71856p3442j02753K04920L81931
40491A582693N669o48476p90027j57196N09857M46545p8639k71067l3575O8314
40481F34098j40817k65415j75842j99085l62783k09626L94699Q84376P17334N6382
40471A333321m87670m98528m5863M27351N13981K96534K01024K46645j05413r90279
40461H91103j575414j088514J3826O20712L93067r7574l59459l46839o3917M19443
40451a193566O85333L93831j27826l17431j84030q5002p484K35317L94387J33485
40441g2986k50984k05853J85674L76271J94940j17768m13369n64068k96468K74068
$$ plain form
40511 -239008 490713 1585058 1865609 1015223 61716 -36791 484442 839533 760024 480092
40501 480092 184947 -40261 -12462 377349 900181 1172037 1098595 995842 1200762 1582693
40491 1582693 1588362 939886 149859 -7337 502520 949065 870426 599359 565784 634098
40481 634098 493281 227866 52024 -147061 -509844 -719470 -324771 559605 1276939 1333321
40471 1333321 845651 347123 301260 728611 1242592 1539126 1740150 1986795 1881382 891103
40461 891103 -684311 -1772825 -1758999 -1138287 -745220 -842794 -1202253 -1549092 -1613009 -1193566
40451 -1193566 -508233 -114402 -242228 -559659 -743689 -828691 -836175 -600858 -206471 -72986
40441 -72986 -323970 -529823 -344149 32122 227062 109294 -304075 -868143 -1164611 -890543
40431h90543M74239J20960L9690O82791J062167K24211r83110j049974j27906
40422d47475L62054N4864r8137K59706M06392P7057o2100K63895M80309K82637
40412A579202L4593j07374l39959m48187n3479M31663L28190J0268K99635P42753
40402B477305J72377j057831j284298k04456N91875K27620k42605Q2840N03904
40393A266731K93280K9648K53826K71010n21670j361929j327555p35160l01299
40384b133118L6001M60225N06371j2172l11183R4082M14190n3267n77742j98750
40374a775363O06072P34798K47935O1513L59663N23047L08250L5798j65561m11966
40364E24186n63091l85442k420L37331N89395O10032R5722p08318r28910k70478
$$ plain form
40431 -890543 -416304 -295344 -255654 427137 1489304 1713515 730405 -319569 -447475
40422 -447475 -85421 -30557 -128694 131012 537404 614461 552361 816256 1296565 1579202
40412 1579202 1613795 1506421 1166462 718275 664796 1096459 1424649 1434917 1734552 2477305
40402 2477305 2649682 1591851 307553 103097 694972 922592 679987 762827 1266731
40393 1266731 1560011 1589659 1843485 2114495 1592825 230896 -1096659 -1831819 -2133118
40384 -2133118 -2097117 -1636892 -1130521 -1142693 -1453876 -1359794 -945604 -998871 -1576613 -1775363
40374 -1775363 -1169291 -434493 -186558 -125045 234618 757665 1065915 1101713 936152 524186
40364 524186 -38905 -424347 -426767 -89436 499959 1109991 1205713 497395 -431515 -701993
40354g01993L98390K87693k00225k73760N7320L30875M67190M78529L6705q31547
40344D9177j260034o37171L67315P19692M34543K18275K25169R8478j38495j48803
40334g1854j0971j10192m51273o61842n19801r5823L57290M37725j2680m10256
40324a549677l5069P16299O60622k99438q21529j80230N97113M50901j09358j55626
40314g25992O6723q7986l04869l2044K80971L155l54419J8102O98151O82254K3237
40303B67283m65629o06077o93475n15028J44281N72110R6809n40594k36828N64615
40293a412533O04197J2579K2498O84559P19010k45974j034061q52746l10123o1177
40283a873771J57469N97147Q06580M60430n5436l18889l13529K1543P59188J315794
$$ plain form
40354 -701993 -303603 -15910 -216135 -489895 -432575 -101700 365490 844019 880724 49177
40344 49177 -1210857 -1848028 -1480713 -761021 -326478 -108203 116966 215444 76949 -71854
40334 -71854 -82825 -193017 -644290 -1306132 -1825933 -1921756 -1564466 -1126741 -1139421 -1549677
40324 -1549677 -1584746 -868447 -207825 -507263 -1328792 -1509022 -911909 -461008 -570366 -725992
40314 -725992 -659269 -747255 -1052124 -1084168 -803197 -800042 -1154461 -1136359 -438208 244046 267283
40303 267283 -198346 -804423 -1497898 -2012926 -1868645 -1296535 -1199726 -1740320 -1977148 -1412533
40293 -1412533 -808336 -795757 -773259 -88700 630310 384336 -649725 -1502471 -1812594 -1873771
40283 -1873771 -1716302 -1119155 -312575 147855 92419 -226470 -539999 -518456 240732 1556526
40273A556526Q47621l87447j068644n86209J64500J87663k99182m85542j85148
40264b55862J40834J23504j85326m54228l47035J15072M87375M48749K00232M458
40254B77773k52541n72412m84371J47255N65266K15469k50870q5410J75341k55397
40244e19897o98810n539J193712J172604n9890o65068K5611M93481l01730j180837
40234e46363p59642L80597Q24367M32140K5204j47166l67545m87897j58585L27450
40224d77440L45955j16273n14635n35012k96598K6178L52892O05048P04877N56718
40214F51710P7819m85763n25387J26296O63647L16696m26319n46752j33038q6424
40204c67515l87173j16102P16870R33787J55083n03078k71750J44843j7906l79187
$$ plain form
40273 1556526 2404147 2016700 948056 361847 526347 714010 414828 -70714 -255862
40264 -255862 -115028 8476 -176850 -631078 -978113 -863041 -375666 73083 273315 277773
40254 277773 25232 -547180 -1031551 -884296 -319030 -103561 -354431 -439841 -264500 -519897
40244 -519897 -1218707 -1224246 -30534 1142070 1082180 417112 442723 936204 634474 -546363
40234 -546363 -1306005 -925408 -101041 331099 356303 209137 -158408 -646305 -804890 -477440
40224 -477440 -131485 -247758 -762393 -1297405 -1594003 -1567825 -1214933 -609885 94992 651710
40214 651710 729529 243766 -281621 -155325 508322 825018 398699 -148053 -281091 -367515
40204 -367515 -754688 -870790 -153920 779867 934950 431872 160122 304965 287059 -92128
40194i2128m05414l52323l80646L6270R05859J140971K44106n85561k12525O16026
40184I14635N26811k95893o21306k29885n94k70927m21296j4986O42392J027592
40174A256543Q06845k1318q35343p49288J33153N20413k51998j033314n25940
40165g00247O26961P59076k94087j028806n10683N36683J013817P36738J86831
40156A326283k23401l55593l10788l02345k97483o530M78530N25246q1150o05111
40146A47658m27736l2871j43015m88026l84964L213P2716P426M20473J036763
40136B11637R40973O4069o79012p30167l70360R6744O25217Q85308M62363l05189
40126A201583o15060m03583l46537o10244n93655p2338L82920M04425L55973N36734
$$ plain form
40194 -92128 -497542 -849865 -1230511 -1194241 -288382 852589 1096695 511134 298609 914635
40184 914635 1441446 1145553 524247 294362 293768 22841 -398455 -413441 228951 1256543
40174 1256543 2063388 2042070 1206727 457439 590592 1111005 859007 -174307 -700247
40165 -700247 -73286 685790 391703 -637103 -1147786 -611103 402714 1139452 1326283
40156 1326283 1102882 747289 436501 134156 -163327 -169857 308673 833919 752769 147658
40146 147658 -280078 -312949 -455964 -943990 -1328954 -1325741 -1253025 -1245599 -825126 211637
40136 211637 1152610 1216679 537667 -192500 -562860 -466116 159101 1044409 1506772 1201583
40126 1201583 586523 182940 -163597 -773841 -1367496 -1439834 -1056914 -652489 -296516 240218
40116B40218O47745M08343L7466j96656l33728m00965k84026p8303l2500n9090
40106e1496J35870M22386L81938O1274j13594j49029m03082o92400m10340L33802
40096d84671O62620K72129j30537p5266m8601m70587q44293n53542K03864Q64905
40086f03979J223877J176561M90921n04208p42192K14357J214417Q84082m60883
40077B892953j287943r91229m51133m17329m69944l1422N11821M49650m7879k26997
40067f9452k0490j09171o07357o12915L90546J418064J164146r6735q54459n20445
40057H1732o3181k60425n74033l86281j59440l79336l73265N30988J444622J020132
40047H81513l49036j009090n13595J1299l5880J3059M34432M19407k95425o50561
$$ plain form
40116 240218 887963 1296306 1333772 1137116 803388 402423 118397 40094 7594 -51496
40106 -51496 84374 506760 888698 949972 836378 687349 284267 -408133 -818473 -484671
40096 -484671 177949 450078 319541 244275 195674 -274913 -1119206 -1672748 -1468884 -603979
40086 -603979 619898 1796459 2287380 1783172 1040980 1255337 2469754 3353836 2892953
40077 2892953 1605010 613781 162648 -254681 -724625 -756047 -244226 205424 157545 -69452
40067 -69452 -89942 -199113 -806470 -1419385 -1028839 389225 1553371 1456636 602177 81732
40057 81732 18551 -241874 -815907 -1202188 -1361628 -1740964 -2114229 -1583241 -138619 881513
40047 881513 532477 -476613 -990208 -978909 -1014789 -1001730 -567298 -147891 -443316 -1093877
40037a093877k1399N87846J73534n85099m71468L36280P22225L63636j85489o20769
40027g94580r35760p57674J86727J173050J149186K15120n12555m23777Q2259
40018f18004N02105P12473N86953L9059m94205m33880K1167J40364j65874k85139
40008E019o3896n6771m09658m95246n4782K57245K7196j24153L40019P50646K27045
39997D02664p30154p84421K57882J127141R03851J65262q1854K08767M21303L78750
39987B269191L67108L34974j23867r38174j375498r47298n8581N14719M76792
39978E19366J09851j65432o4967M26792Q95598P47243l4754o66930n32764q3708
39968A150295j79530p24838p50489O8284P94174N22639l45929p11687k60606K99946
$$ plain form
40037 -1093877 -1115276 -527430 -353896 -938995 -1410463 -1074183 -351958 11678 -173811 -794580
40027 -794580 -1730340 -2488014 -2301287 -1128237 20949 236069 -276486 -700263 -618004
40018 -618004 -115899 596574 1183527 1222586 728381 294501 315668 456032 290158 5019
40008 5019 -58877 -115648 -525306 -1020552 -1075334 -818089 -790893 -915046 -575027 175619 402664
39997 402664 -327490 -1111911 -854029 273112 1176963 1342225 1260371 1469138 1890441 2269191
39987 2269191 2636299 2971273 2847406 1909232 533734 -413564 -472145 42574 519366
39978 519366 629217 463785 398818 825610 1721208 2468451 2433697 1766767 1234003 1150295
39968 1150295 970765 245927 -504562 -436278 357896 880535 534606 -177081 -437687 -137741
39958a37741L49356Q3088J0096J57816Q9435m04998r14628q56915k33090L36127
39948a521454M41441M30362P77392J179275Q78893j26589q64512o15292J87542
39939G67058O42683N05378J69091j24346m82994q81138r90040o04725K9494M33699
39929e35840L64929O6630M0961M62144Q70351O95806N7428l35840j48459J53344
39919A691454J9245m71528q81172r92837q03513l33018J86935L12588P500j05752
39909a370098L75146Q45440M39107o34749j218692o81072L71991R75995Q38572
39900e8360K91103k86515o43628n63225J5882P89735J191888Q12089j91604j057882
39890B99483r84559N5141J139874J267229L82960n99975p71778j08733N50885
$$ plain form
39958 -137741 211615 294703 304799 462615 552050 147052 -767576 -1624491 -1857581 -1521454
39948 -1521454 -1080013 -649651 127741 1307016 2185909 2059320 1194808 579516 767058
39939 767058 1409741 1915119 2084210 1959864 1476870 595732 -394308 -999033 -969539 -535840
39929 -535840 -170911 -104281 -63320 398824 1269175 1964981 2022409 1686569 1538110 1691454
39919 1691454 1710699 1239171 357999 -634838 -1438351 -1771369 -1584434 -1271846 -1264346 -1370098
39909 -1370098 -994952 -149512 289595 -345154 -1563846 -2244918 -1872927 -896932 -58360
39900 -58360 232743 -53772 -697400 -1260625 -1244743 -455008 736880 1548969 1357365 299483
39890 299483 -685076 -629935 509939 1777168 2160128 1560153 788375 679642 1230527
39881A230527L66837n52719j122615n11354O67033R76810J02400o20756r6239
39872D39924R10525R06359j53763r45749p74368k91308j60865j71731j0143R8081
39862a53038J0273P9681L96084L71748k91274q83446o37501J30661N35868L38775
39852a02169n6745m17002p20379p03894j96882K78148P2098n01511m85327K69159
39842b564504Q07096M42654l21515n87908j80721M04544O98169N49732J04342
39833f48111k19013o7328L19854L36127n3633j63198K96926N90300L5937q03109
39823c75248q11327O6219P45662N17277j39896m19797k07147P1219J35129L2537
39813c85372j04480k08656k96395m29349n43135l89453J15602O17799P52516O92554
$$ plain form
39881 1230527 1597364 1044645 -77970 -589324 77709 1054519 1156919 536163 439924
39872 439924 1350449 2256808 2103045 1157296 382928 91620 -69245 -240976 -251119 -153038
39862 -153038 -142765 -63084 333000 704748 413474 -469972 -1107473 -976812 -440944 -102169
39852 -102169 -158914 -575916 -1296295 -2000189 -2197071 -1918923 -1846825 -2348336 -2833663 -2564504
39842 -2564504 -1757408 -1314754 -1636269 -2224177 -2404898 -2000354 -1302185 -752453 -648111
39833 -648111 -867124 -934452 -614598 -278471 -332104 -495302 -198376 391924 427861 -375248
39823 -375248 -1186575 -1120356 -374694 142583 2687 -417110 -624257 -553038 -417909 -385372
39813 -385372 -489852 -698508 -994903 -1424252 -1967387 -2356840 -2241238 -1623439 -870923 -178369
39803a78369P87771Q21500L16591m56978o39224j22406J88829j46150l37972K39579
39793D73171Q05452L35518o92963r28032j60007N35691N61231M30218M91107K70275
39783B121661m41140r07811n41863J05058J59230l30413o46355m80005j25229
39774a086867R6789O8987j89883l72675l548Q07550J125849L37818p74899q59118
39764h49997K35836J263710J198781L22448m97945r22324j097089j000400m47517
39755a794497L73115Q93674Q23282M91164L40046K93068p0467p60906j174810
39746e86331q35841o7999L84679K63372k3427l9367K36244N87230P87579O10719
39736A316858J8996n60148n49910L7496N49062N23024J87137l8261j15261k26147
$$ plain form
39803 -178369 609402 1430902 1747493 1290515 651291 528885 717714 571564 233592 473171
39793 473171 1278623 1614141 921178 -6854 -166861 368830 930061 1360279 1851386 2121661
39783 2121661 1680521 772710 230847 335905 495135 164722 -481633 -961638 -1086867
39774 -1086867 -990078 -921091 -1110974 -1483649 -1487197 -679647 446202 784020 9121 -849997
39764 -849997 -614161 649549 1848330 2170778 1672833 750509 -346580 -1346980 -1794497
39755 -1794497 -1421382 -527708 295574 786738 1126784 1419852 1349385 588479 -586331
39746 -586331 -1422172 -1490171 -1105492 -842120 -865547 -904914 -668670 -81440 706139 1316858
39736 1316858 1335854 775706 225796 263292 812354 1335378 1522515 1484254 1368993 1142846
39726A142846m10048o20010q19680q14453l45259M32559R37060Q45908M30977
39717G79900O0509j65741j49799K13808N51462K38575n41138p81132j90136J75870
39707A92178m25641j058467m93441P73698J211487N22485j63589j84381m1659
39698C32670j42841j67028L7187P6471j08041o796M45614N77119Q2108m74991
39688F51472o27532n89960n22106j66500L57204L95315p7112j53248N10524R42333
39678G20390M08816k98652j57777M01849L22282k78652m62591j59323j10195l57071
39668B9076j74015M87692P91581M36322R0891J19131N656n12531q06392m51775
39658A5636n0984k36824o12648m94084r7700p3205k61484O2658Q22442J028502
$$ plain form
39726 1142846 732798 112788 -706892 -1521345 -1866604 -1434045 -496985 348923 779900
39717 779900 840409 674668 524869 738677 1290139 1528714 987576 206444 16308 192178
39707 192178 -233463 -1291930 -1785371 -1011673 199814 722299 558710 374329 332670
39698 332670 189829 22801 59988 136459 28418 21622 467236 1044355 1126463 651472
39688 651472 23940 -566020 -1088126 -1254626 -897422 -502107 -579219 -732467 -221943 720390
39678 720390 1129206 830554 672777 1074626 1396908 1118256 655665 496342 386147 29076
39668 29076 -144939 342753 1134334 1570656 1661547 1780678 1786334 1273803 467411 15636
39658 15636 -35348 -272172 -884820 -1378904 -1476604 -1549809 -1811293 -1748635 -926193 102309
39648A02309K63695n72396n00103J58567L15283k58972o27572j03590P37152Q99573
39638D13946L40781j53177k21102k57386m38192k90434L55090P53572K96503l89642
39628D09959k80034M51347O82875J11603l14296L9668N28450L58007j75727l30490
39618A481362j83290l62644q38831q95277k92167L28762L90261J21052N6774K45872
39608E1874L31724J89420J00079K99400N98908N78298R9073m93177p52829o33065
39598C69705m26493k60404L2217M43538N72270J80077l15544l28300N9404K04470
39588E30940j59733n39116l73079K07346N23526J29484o42164q92865n5313J288513
39578A7539J768009P65695o58698r45144K0442Q63968O42210p2384l40764k11961
$$ plain form
39648 102309 366004 -206392 -706495 -547928 -232645 -491617 -1119189 -1222779 -485627 413946
39638 413946 754727 601550 380448 123062 -315130 -605564 -250474 503098 799601 409959
39628 409959 129925 581272 1264147 1375750 1061454 1101122 1629572 1987579 1811852 1481362
39618 1481362 1298072 935428 96597 -798680 -1090847 -762085 -371824 -250772 -193998 51874
39608 51874 383598 573018 673097 972497 1571405 2149703 2248776 1755599 1002770 369705
39598 369705 -56788 -317192 -284975 158563 730833 910910 595366 267066 326470 530940
39588 530940 371207 -167909 -540988 -333642 189884 319368 -322796 -1215661 -1270974 17539
39578 17539 1785548 2551243 1892545 947401 967843 1831811 2474021 2401637 2060873 1848912
39568A848912k71682n05947m76293k57207l19835o20641o13955j72491K29378
39559a159761L16634L13856L27173J17755k72289l25102J41490N00045J20515
39550H0316p05037j099182o48265K46856Q99867R17672M11961q3189l5218M97060
39540D82841Q25170M22601l70840p13631k75954L97976O07398L43311J87625L90477
39530B296974L76708m74598j686736j939633p42142P33213J059601L54216j03407
39521a25804K43625O93789O14522K85401J43015P5357j12664k63493l14532n11663
39511G27553p91166o48264k4012M27868L99310M06342O66063M66642n31124j298164
39501a98952q18216K81981O77413L21723J78250M16150L02861k66546n26615j91433
$$ plain form
39568 1848912 1577230 1071283 594990 337783 17948 -602693 -1216648 -1389139 -1159761
39559 -1159761 -843127 -529271 -202098 -84343 -356632 -681734 -540244 -40199 80316
39550 80316 -624721 -1723903 -2372168 -2125312 -1225445 -307773 104188 20999 -14219 482841
39540 482841 1308011 1730612 1359772 646141 370187 768163 1375561 1718872 1906497 2296974
39530 2296974 2673682 2199084 512348 -1427285 -2169427 -1436214 -376613 -22397 -125804
39521 -125804 117821 811610 1426132 1711533 1854548 1929905 1817241 1553748 1239216 727553
39511 727553 -63613 -711877 -735889 -308021 91289 497631 1163694 1630336 1099212 -198952
39501 -198952 -1017168 -735187 -57774 263949 442199 858349 1161210 894664 368049 176616
39491A76616J86331L17417M80625O16909K96508k50330k79945O7397j93947j098100
39481C19481j334857k85060Q30997P04885k44151p79399o50488m12460j84880
39472b035932K35458N02760J20807n13030m89333K59994Q72689Q25105N03545
39463B82063M10112M74957L72028M7987k85497m25899l32643j51752p6782r1599
39453B22975J1029K48001L18295L8472l31402m16964j87683J04977K59905K40348
39443E07953J30068O6679N5953q9524l59142k90525L76989R78723O22496m17138
39433A582532r20282m89395p2922l53294o87116k99748M43461P91445P80931P26704
39423A502316L34467n72442j106522l93003Q04849Q84280l07906j279312j039919
$$ plain form
39491 176616 362947 680364 1160989 1777898 2074406 1824076 1544131 1611528 1417581 319481
39481 319481 -1015376 -1300436 -469439 235446 -8705 -788104 -1438592 -1851052 -2035932
39472 -2035932 -1800474 -1297714 -1176907 -1689937 -2179270 -1919276 -1046587 -221482 282063
39463 282063 692175 1167132 1539160 1587147 1301650 875751 543108 391356 314574 222975
39453 222975 234004 482005 800300 838772 507370 90406 -97277 7700 267605 507953
39443 507953 638021 704700 760653 671129 311987 21462 398451 1377174 1999670 1582532
39433 1582532 662250 172855 99933 -253361 -940477 -1240225 -796764 -5319 775612 1502316
39423 1502316 1836783 1264341 157819 -235184 569665 1453945 1146039 -133273 -1173192
39414a173192k04445K91111L94366L92929J90055k10791k59054L58761R77610
39405G57350P25213k23201q25209n47475J9094O6522l60245n73388l20957j22336
39395a404632l50837m88156J50818J212977J582412Q90667k4082l85616m09846
39386G73705n52065o07536k23748K87015L94910K07089J81233L11694K46693n8100
39376I60890l63714n30619m26555Q6177N95990K46641r17585j475669m77838R25890
39366a376392R50693k37471q44242j27885P66251P53530J55960k51458k97501
39357e08515o3291M54213Q66288N58919k19482m10765K26204N57758j86749j063415
39347B11165p08015O72310J573122J140163L336p35145o73303k01937J16270N9381
$$ plain form
39414 -1173192 -1377637 -1086526 -692160 -299231 -109176 -319967 -579021 -220260 757350
39405 757350 1482563 1259362 434153 -113322 -94228 -27706 -387951 -961339 -1282296 -1404632
39395 -1404632 -1755469 -2243625 -2092807 -879830 702582 1593249 1569167 1183551 773705
39386 773705 221640 -385896 -609644 -322629 72281 279370 460603 772297 1018990 960890
39376 960890 597176 66557 -359998 -273821 322169 568810 -348775 -1824444 -2302282 -1376392
39366 -1376392 -425699 -663170 -1507412 -1635297 -869046 -115516 40444 -211014 -508515
39357 -508515 -571806 -117593 748695 1307614 1088132 677367 903571 1461329 1274580 211165
39347 211165 -496850 175460 1748582 2888745 2892081 2156936 1483633 1281696 1397966 1457347
39337A457347k22316n16180p23561p09546l10719K74602M92401K08881K4301K84473
39327B59683L56953k86855q55158k93662Q23762R31164o1703n52301J80968Q14213
39317A317064J34093j065474j302272n36401J91863M74169O72055Q07093M69884
39308A162074k77098p88565o76722k11357J19131R5733j13454j35897J50736L34911
39298c40508q188n59908n68423Q3399P55331R88352Q33067L02686n53583j040045
39288a07820m41763O03371O75232k15212m91274M11744J031699L31383n60410
39279A236950l77368J06284l54645j036924m30124R92831J346046K94212o03844
39270A173418m68044j24200l42644p15037o91406l91839j4490M37477O31305K13228
$$ plain form
39337 1457347 1235031 718851 -4710 -714256 -1024975 -750373 -257972 -49091 -24790 259683
39327 259683 616636 329781 -525377 -819039 4723 935887 874184 321883 502851 1317064
39317 1317064 1451157 385683 -916589 -1452990 -1261127 -786958 -114903 692190 1162074
39308 1162074 884976 96411 -580311 -791668 -672537 -576804 -690258 -826155 -675419 -340508
39298 -340508 -348696 -908604 -1477027 -1393628 -638297 350055 1183122 1485808 932225 -107820
39288 -107820 -549583 53788 729020 513808 22534 434278 1465977 1797360 1236950
39279 1236950 859582 965866 611221 -425703 -855827 137004 1483050 1777262 1173418
39270 1173418 705374 581174 238530 -476507 -1167913 -1559752 -1574242 -1136765 -505460 -292232
39260b92232k80089l0995N03571Q1271j089338j244011K10067J450704P48109
39251E7057j042740j752263q09514M24699P92003N56920N09212Q06667R97532
39242E39573P08572N6514m86105n70421l05398k5293J60186L13089K99384p2481
39232F17620n69347o94336l91263r3892O293J98237N96163P95999M83297l4919
39222I13852k31164j8264K49594K59961N6196m4707J64623M23578K30007m09615
39212A594061q06199n01583N1316K14240J17362J99147K38490k17112p56778n51201
39202d18257J92228L98696j36670l92057J72631P32822M74037k01044n21310m94871
39192a93795m63198l09940Q1046K70631j354j49252L15659P53353L07631n87902
$$ plain form
39260 -292232 -572321 -603316 -99745 -18474 -1107812 -2351823 -2141756 -691052 57057
39251 57057 -985683 -2737946 -3547460 -3122761 -2330758 -1773838 -1264626 -457959 539573
39242 539573 1248145 1304659 818554 248133 -57265 -82558 77628 390717 690101 617620
39232 617620 48273 -646063 -1037326 -1131218 -1124925 -926688 -330525 465474 948771 913852
39222 913852 682688 664424 914018 1173979 1230175 1185468 1350091 1773669 2003676 1594061
39212 1594061 787862 286279 337595 551835 669197 868344 1106834 889722 132944 -418257
39202 -418257 -226029 172667 35997 -356060 -183429 549393 1023430 822386 301076 -193795
39192 -193795 -656993 -966933 -885887 -615256 -616610 -765862 -450203 303150 610781 22879
39182B2879p26015O1340P18393N92150J69464j2003j76893n94442q79067o17561
39172a441755j11774J34121K24923M98056O75899K14137o00616p89523j19264
39163a315796M40855J62576l09794k4426O90758P49538J06981j79566K64924N39874
39153A125924L4184o02491o73511n13172n27492k09925Q02755J594162J181127
39144B211561J68264k06507j02627n59839j334180j094191J73592Q17543O0418
39135A34034p84344m08873N95494R04740L93900j47430m01398n86586o65019l76393
39125a341875K08793P30438Q69366M03949n44443j161543o10787O61291J167675
39116C82864L41908o55736o20127J31964N39699K88226k36983p56103j094095
$$ plain form
39182 22879 -703136 -641796 76597 668747 838211 826208 649315 54873 -824194 -1441755
39172 -1441755 -1553529 -1419408 -1194485 -696429 -20530 193607 -407009 -1196532 -1315796
39163 -1315796 -874941 -712365 -1022159 -1046585 -355827 393711 500692 321126 586050 1125924
39153 1125924 1160108 557617 -115894 -629066 -1156558 -1366483 -563728 1030434 2211561
39144 2211561 2379825 2173318 2070691 1510852 176672 -917519 -743927 73616 134034
39135 134034 -650310 -1059183 -463689 441051 834951 687521 286123 -300463 -965482 -1341875
39125 -1341875 -1133082 -402644 466722 870671 326228 -835315 -1446102 -784811 382864
39116 382864 724772 69036 -551091 -419127 120572 408798 171815 -584288 -1678383
39107a678383r79619m89269j02585J46221P60811J567885J509042L69696m74854
39098F28945m8929O52403L44599l95168k39452M96722M10509n20379r02594k54539
39088A72117L85737L20839O6056O1761l0202l05670j94361L88809N71731j80908
39078A255909j172220j430287q60862r262O74568R41113O96400K12479n3977k5725
39068B28136L2377O7283J74283J07252l80644p96388m15442M58129P19144O7501
39058B61631o09931o44758l34486k9337M12505Q42675O16531k41958p05798k53400
39048f86326K86215J70961J2006N82890J247685Q63336k85101p89887j75117N71800
39038A798462N68635P1174k78718l47780l22426l03743m24303q27033j221985
$$ plain form
39107 -1678383 -2658002 -3147271 -3249856 -3103635 -2342824 -774939 734103 1103799 628945
39098 628945 580016 1232419 1577018 1181850 942398 1439120 1849629 1329250 426656 172117
39088 172117 557854 878693 944749 1006510 976308 670638 476277 865086 1436817 1255909
39078 1255909 83689 -1346598 -2207460 -2216722 -1542154 -601041 95359 307838 253861 228136
39068 228136 260513 327796 502079 609331 228687 -567701 -983143 -525014 194130 261631
39058 261631 -348300 -993058 -1327544 -1356881 -944376 -101701 514830 272872 -432926 -686326
39048 -686326 -400111 -229150 -217144 365746 1613431 2476767 2191666 1401779 1226662 1798462
39038 1798462 2367097 2438271 2159553 1811773 1489347 1185604 761301 -65732 -1287717
39029a287717r66211M1198R51832R04200J16132m24169k44774J37981J30629m7152
39019f88051K10178Q30941J012409L30986n98466q95592m89784j2381J25349N5708
39009a18703l90J2430J60799M60987O09015K49056m10968p11253l83073J46602
38999A4502M00247L44099R7485l51752q75286j065891o92095j1032N88015R40817
38989f10891R31645L89012m98034j006896n81845M27707J093569R24373K86112
38980A354752j60924j92145r6711j52994k18018J4644M37692N55432K08849j21034
38970A629543l1531J84514Q7620j42992j06947Q368k10060n02629l27133R263
38960E98016l13066j127796j302085n13549J95753J16229p8521L12642P56330
$$ plain form
39029 -1287717 -2253928 -2212730 -1260898 -356698 -240566 -664735 -909509 -771528 -640899 -688051
39019 -688051 -477873 353068 1365477 1696463 1097997 202405 -287379 -299760 -174411 -118703
39009 -118703 -119093 -106663 54136 515123 1124138 1373194 962226 250973 -132100 14502
38999 14502 414749 758848 856333 504581 -370705 -1436596 -2128691 -2139723 -1551708 -610891
38989 -610891 320754 709766 211732 -795164 -1377009 -949302 144267 1068640 1354752
38980 1354752 1193828 1001683 904972 751978 533960 548604 986296 1541728 1750577 1629543
38970 1629543 1598012 1782526 1870146 1727154 1620207 1628575 1418515 915886 588753 598016
38960 598016 284950 -842846 -2144931 -2658480 -2462727 -2346498 -2425019 -2112377 -1356047
38951a356047N48025J57430L44106O93699L35319m12451m97306M1746J22968m95886
38941e18397p61974p2651P32079O90201R3494j51692J05571K56952k4763l55117
38931f297j97124M73314J068560R14440J0436q04372p36914j8676M14075J80509
38921A297951j59365j01025L5241k84771q71410j010169m44550K75697M52106
38912h10295j7246o00405o88778j38562O63560J180035J111600M86351l99012
38903G87248j022765r02134j19733N63368M65106k13297o64689m79243K3307M20408
38893a142424O37422O55184K98956l41574o66312k01505O72075J042935N16183
38884A470940l67282p91533m90448J60061O35976O74445L27900j42820m01490
$$ plain form
38951 -1356047 -808022 -650592 -306486 387213 722532 310081 -187225 -145479 -22511 -518397
38941 -518397 -1280371 -1353022 -620943 69258 162752 11060 116631 373583 348820 -6297
38931 -6297 -203421 269893 1338453 2252893 2263329 1458957 722043 703367 1117442 1297951
38921 1297951 1138586 1037561 1072802 788031 -83379 -1093548 -1538098 -1262401 -810295
38912 -810295 -827541 -1427946 -2116724 -2255286 -1591726 -411691 699909 1186260 787248
38903 787248 -235517 -1137651 -1257384 -694016 -228910 -442207 -1106896 -1586139 -1562832 -1142424
38893 -1142424 -505002 150182 449138 107564 -558748 -760253 -88178 954757 1470940
38884 1470940 1103658 312125 -178323 -18262 617714 1292159 1620059 1477239 1075749
38875A075749k67143N1850P9302l98103j003766j179693q41452l40741J47875
38866b676122P33215J226730J084024L25842o9464N85591J425990R81919o65569
38857B952156j756696j228558j72164j40145q45258p53320M10849J189731O66497
38848C23092j31087R7716Q61072O94653m60647j109987n02883K64478K4728o77353
38838f16218n56083L46347P58138J58646m93305k54354M94723P36983K33718l06820
38828E01775k10211M29117Q99032N73844m02458j109774p98126J65342P02133
38819G50674L95475j00850j59522J0450J6128L6705L06612M19839n3162o44963
38809I77386n65117L4257K95661O3697L0077L64295L23496l23318n70824K77248
$$ plain form
38875 1075749 808606 860456 939758 541655 -462111 -1641804 -2483256 -2823997 -2676122
38866 -2676122 -1942907 -716177 367847 693689 624225 1209816 2635806 3617725 2952156
38857 2952156 1195460 -33098 -205262 -345407 -1190665 -1943985 -1533136 -343405 323092
38848 323092 192005 289721 1150793 1845446 1384799 274812 -228071 36407 61135 -616218
38838 -616218 -1172301 -825954 -67816 90830 -402475 -656829 -162106 574877 808595 501775
38828 501775 291564 720681 1619713 2193557 1791099 681325 -116801 48541 750674
38819 750674 1146149 1045299 885777 896227 912355 949060 1255672 1675511 1622349 977386
38809 977386 412269 446526 742187 805884 835961 1200256 1523752 1200434 629610 906858
38799I06858J194014P47520o14587r80847K43104J331171O53837r76969j456558
38790A047543l00821Q52158O20846m35268r42937n80629o5827J30669J72863J83151
38780F81748M420l02736l57878q848M69164Q07623R51661Q02927K69121l27696
38770B989506m46378j41829j43048p93459j407905j140268j46548O04354M98420
38761a27155j51710n90203l45509M36571J116762J090438L92274l14732m85363
38752A021373k54082r3079j29886p2624K85837P28036Q05591L21953l74348o82720
38742A556051m49068j59638j89999j95524K33093O40137K82411m77149m25607
38733H14707O17124J270403N16565q04811j214640n55367J51971K57312k1236
$$ plain form
38799 906858 2100872 2848392 2233805 1252958 1496062 2827233 3481070 2504101 1047543
38790 1047543 746722 1598880 2219726 1784458 841521 260892 195065 325734 498597 681748
38780 681748 686168 383432 25554 16706 485870 1293493 2245154 3048081 3317202 2989506
38770 2989506 2543128 2401299 2258251 1464792 56887 -1083381 -1229929 -625575 -127155
38761 -127155 -278865 -869068 -1214577 -778006 338756 1429194 1821468 1506736 1021373
38752 1021373 767291 674212 544326 471702 757539 1485575 2291166 2613119 2238771 1556051
38742 1556051 1106983 947345 757346 561822 794915 1435052 1717463 1240314 814707
38733 814707 1431831 2702234 3218799 2413988 1199348 643981 795952 1053264 1032028
38724A032028k87365l26390k3362M05111L90135j86123n90002k81053J78441N1853
38714C63273l04375j04046M20980M15535n9881j51678K34468K96051j63458l51680
38704E95189J15189N73344M59921Q8807j49829m24848q07171q33646l02970J81511
38694e04503L0560m93337p15611l87903K35689P25686O75235N5842n00073l24110
38684a202525L29442O10905L55858J87704K92656J39272l40301m12842J59691
38675A19860N61395K36786k58648l63540m25389p45159p49589n7992N84866M99602
38665e97808K87822O53144Q72688p0003j442239j529712k18291Q39038P05906
38656d99455K38218L27729N32047J40392n31337p39661m39471o7625K23808M56473
$$ plain form
38724 1032028 744663 418273 394911 800022 1190157 1004034 414032 132979 311420 363273
38714 363273 58898 -45148 375832 791367 731486 579808 814276 1110327 946869 595189
38704 595189 710378 1283722 1743643 1832450 1682621 1257773 450602 -383044 -686014 -504503
38694 -504503 -473943 -967280 -1682891 -2070794 -1835105 -1109419 -434184 -378342 -878415 -1202525
38684 -1202525 -873083 -262178 93680 281384 574040 713312 373011 -39831 119860
38675 119860 681255 918041 659393 295853 -129536 -874695 -1624284 -1682276 -1097410 -597808
38665 -597808 -309986 343158 1215846 1145843 -296396 -1826108 -2044399 -1205361 -499455
38656 -499455 -261237 66492 598539 738931 207594 -532067 -971538 -1039163 -815355 -358882
38646c58882M17309L20l80825l01610J484Q054k18001j00645N13723R89652O64839
38635A235418k88668r92416p87966J00890Q36514Q01698J14766n97190q00188
38626c77142m52160L3279J79824p9816l27111j65455K94200O64093Q28495Q83061
38616A481268O90119R2068m64205k82119M22262N51252k69838r75949o21483J35266
38606G58641O0248p22597r75224k63864N35358O73654M01035J87724K3191j63038
38596E15128j86786j11255l49056q29292p52649K45579J257538J145983R5257
38587A030447o19377l18159L18959L20234l03141p26912m79948K5631J76269j5094
38577e91091o6890J68714K96075L0249l42044l75897m7056L23843M73247L00206
$$ plain form
38646 -358882 58427 58747 -322078 -623688 -622204 -614150 -832151 -932796 -419073 570579 1235418
38635 1235418 946750 -45666 -833632 -732742 103772 905470 1020236 423046 -377142
38626 -377142 -829302 -796023 -616199 -696015 -1023126 -1188581 -894381 -230288 598207 1481268
38616 1481268 2171387 2263455 1799250 1517131 1939393 2490645 2220807 1244858 623375 758641
38606 758641 818889 96292 -878932 -1142796 -607438 66216 467251 654975 678166 515128
38596 515128 328342 217087 -131969 -961261 -1713910 -1468331 -210793 935190 1030447
38587 1030447 411070 92911 411870 732104 428963 -297949 -777897 -752266 -575997 -591091
38577 -591091 -657981 -489267 -193192 -162943 -504987 -880884 -927940 -604097 -130850 169356
38567A69356j38230m91577l23260K35663M36477p8493o56500n68397j09676k5691
38557a550328k13446M6260P21195R48376M18146j71768k92820k36863k25187J16483
38547d39952P92275R06106l0253j010981q00741K21872O22211M1968m50916j85850
38537c34261J82257J1333j42723M96060J450547J484813L40310r02185j246664
38528A339487q45587m28745k77889j71474L1640K18804K98058K93499K05921J1126
38518F74840k44970m99815p15020p43469l78722K64631O99997O86750N74736O37752
38508I56710M72848k86330j002503p02895L79932R57797N10456j04567j91496
38499I89952k20245o48810q38694j43238P56805P79455J43445q4988K04362J19210
$$ plain form
38567 169356 31126 -460451 -783711 -548048 -111571 -190064 -846564 -1414961 -1524637 -1550328
38557 -1550328 -1763774 -1717514 -996319 -47943 370203 198435 -94385 -331248 -556435 -439952
38547 -439952 352323 1258429 1228176 217195 -583546 -361674 260537 302505 -148411 -334261
38537 -334261 -152004 -140671 -283394 212666 1663213 3148026 3488336 2586151 1339487
38528 1339487 493900 65155 -212734 -384208 -352568 -133764 164294 457793 663714 674840
38518 674840 429870 -69945 -784965 -1528434 -1907156 -1642525 -942528 -255778 318958 956710
38508 956710 1429558 1143228 140725 -562170 -182238 775559 1286015 1181448 989952
38499 989952 769707 120897 -717797 -861035 -104230 675225 818670 733682 938044 1057254
38489A057254n49418q83927l34704M27223N82202K46684N969k467n1620k81473
38479B15723n72925p16348n21024J1168N74378Q64684R11816Q20230M35410k60904
38469A762208p23627m87016j5043j21786o80831q01662k64408J91310J32887J680
38459a006288J40787K15330J8144k9245K93853M51429K3083n01256m07090K51278
38449e49975Q66513J058333Q02542K21512l46703m90828k77448k14580m14071
38440F55295l75217J05225N07417M83442M34454O41499N59196k80341j249126
38431A481844j343674n48648K69861N43795M00316J40114l8369J3869J90676Q9827
38421A199611l74576o47700l09595K05993K38228j11015k36724J1184K58088K73577
$$ plain form
38489 1057254 507836 -376091 -710795 -283572 298630 545314 551283 548816 497196 215723
38479 215723 -357202 -1073550 -1594574 -1583406 -1009028 -144344 767472 1587702 2023112 1762208
38469 1762208 1038581 551565 536522 414736 -266095 -1067757 -1332165 -1140855 -1007968 -1006288
38459 -1006288 -865501 -650171 -632027 -661272 -367419 84010 107093 -394163 -801253 -549975
38449 -549975 316538 1374871 2177413 2398925 2052222 1561394 1283946 1069366 655295
38440 655295 280078 385303 892720 1376162 1810616 2452115 3011311 2730970 1481844
38431 1481844 138170 -410478 -140617 403178 803494 943608 905239 919108 1109784 1199611
38421 1199611 825035 177335 -132260 73733 311961 200946 -35778 -24594 233494 507071
38411E07071J36866p3653k61563k11463N5012J24301j91619m78749l88131j68146
38401i50074n4517K07476O03765M11679n67026j114776j66996J320179J504809
38392A194519L14586n83384l69458K0969j81616l75316P2164O45239O67520L91010
38382A796233K55196k5528p33509j250360q40161J62081P91056P15974L34966
38373A205948m7260l95526n36411k81012J39171L12303K34772K03498K51863J53590
38363A240936j07867l10487l81988m33733m36494k04601K79590P71317R96573
38354A413246Q27924L15090k94346o70370o99480n64154m13919j51566K79202
38345D1627O01439M60686j26703p75467j086094q60652j43792P23860J216189
$$ plain form
38411 507071 643937 570284 308721 97258 152270 276571 84952 -393797 -781928 -950074
38401 -950074 -1004591 -797115 -193350 218329 -348697 -1463473 -1630469 -310290 1194519
38392 1194519 1509105 925721 556263 577232 395616 20300 92464 737703 1405223 1796233
38382 1796233 2051429 2025901 1292392 42032 -798129 -636048 155008 870982 1205948
38373 1205948 1158688 763162 226751 -54261 84910 397213 631985 835483 1087346 1240936
38363 1240936 1133069 822582 440594 6861 -429633 -634234 -354644 416673 1413246
38354 1413246 2241170 2556260 2261914 1591544 892064 327910 -86009 -237575 41627
38345 41627 643066 1103752 977049 201582 -884512 -1745164 -1888956 -1165096 51093
38336E1093J040486M24289j70045n39759p68943q53051o03407l8262L68180J35491
38326i53928n05554o70552J11416J075339R68794k93274j278358p17478Q92239
38317a371356J907537J489273L12948n30426o40956k41554L25359P16226O25847
38308B592898N0118o46901j035349q59188j20262P26682Q46965j20503j314560
38299A19900j423175l19512P40137P56355J19083k44495j46111m121J1424L3567
38289c56948L2431q8006j42317N0538K26458M5151k63204j67815L29895O74556
38279C40739N71012L08115J82522P8954j65509l53785j96923J92185L62218N6941
38269A376469m99160q73008q50881n39919j64362J03665J85951J72610L27624
$$ plain form
38336 51093 1091579 1515868 1345823 806064 37121 -815930 -1419337 -1457599 -1089419 -953928
38326 -953928 -1459482 -2130034 -2018618 -943279 25515 -267759 -1546117 -2263595 -1371356
38317 -1371356 536181 2025454 2338402 1807976 1167020 925466 1250825 1967051 2592898
38308 2592898 2643016 1996115 960766 101578 -18684 707998 1554963 1434460 119900
38299 119900 -1303275 -1622787 -882650 -126295 -7212 -251707 -397818 -401939 -390515 -356948
38289 -356948 -324517 -412523 -554840 -504302 -277844 -232693 -495897 -663712 -333817 340739
38279 340739 911751 1219866 1402388 1481342 1315833 962048 765125 957310 1319528 1376469
38269 1376469 877309 4301 -846580 -1386499 -1550861 -1447196 -1261245 -1088635 -761011
38260g61011P61494J112227R48180N49815O95305J367477J393410N9229j524167
38251D601959j681635m70883M44571J63253m60736m44592p1897p5775m25931o65300
38241I13034p19625o84542m22667J4709J58019j25583k68503O7368L93429K92005
38231c82356J12466J20757j19234o73652n72551O16673J501030O44981j067817
38222A80297j558791n99611J24420j32713k45165N30926J247070R62832K24582
38213G33847p3235p8788k93436m98991l10760o210K9508o245J03691O4889k39963
38202e75693l03737Q5579K94361o0901l43542n5192J69333k43864n34896J75300
38192a393252J142339R68676j44524o70628p9556O40168P63653O18965M21997
$$ plain form
38260 -761011 483 1112710 2060890 2610705 3306010 4673487 6066897 6126126 4601959
38251 4601959 2920324 2449441 2894012 3057265 2596529 2151937 2080040 2004265 1578334 913034
38241 913034 193409 -491133 -913800 -899091 -741072 -866655 -1135158 -1067790 -674361 -382356
38231 -382356 -269890 -149133 -268367 -942019 -1514570 -897897 603133 1248114 180297
38222 180297 -1378494 -1978105 -1853685 -1986398 -2231563 -1700637 -453567 509265 733847
38213 733847 660612 581824 288388 -210603 -521363 -527573 -498065 -504310 -400619 -335730 -575693
38202 -575693 -879430 -793851 -499490 -560391 -903933 -959125 -789792 -1033656 -1568552 -1393252
38192 -1393252 -250913 717763 573239 -97389 -176945 463223 1226876 1845841 2267838
38183B267838j77336r73471j027364k15461K95626j48456n76466R88Q82248P26692
38173A054838l53691r75630m78958L35550M60019j49950p75444p51234N325R29519
38163f99656J304984J065575Q80016J146964J282629N24467q39232j676058j363141
38154A626548l93403L41783L98507p5486n88678o56089k46484J29612N6579k08035
38144C84854j59891J40855J98537q1577k65002j20281P4599P6281M2728J88816
38134D79919M54552O43308N74988R3056o83326j135929o97240K98595Q41491M55089
38124A324503l22841p78464p52863l71604K70968Q22107P19435p767n44701l79407
38114b0634k3031r3802k82468K1504N68280O22865K03261k2854M0110j98461q11268
$$ plain form
38183 2267838 2090502 1117031 89667 -125794 169832 21376 -555090 -554102 328146 1054838
38173 1054838 701147 -274483 -753441 -417891 42128 -107822 -883266 -1634500 -1629175 -699656
38163 -699656 605328 1670903 2550919 3697883 4980512 5504979 4665747 2989689 1626548
38154 1626548 1233145 1574928 1973435 1897949 1309271 653182 406698 536310 592889 384854
38144 384854 224963 365818 564355 482778 217776 97495 172094 248375 291103 479919
38134 479919 934471 1577779 2152767 2245823 1562497 426568 -270672 27923 869414 1324503
38124 1324503 1001662 223198 -529665 -901269 -630301 191806 911241 903474 358773 -20634
38114 -20634 -43665 -137467 -419935 -398431 169849 792714 995975 973121 1013231 814770 3502
38103C502j013187l70524M55093O38667K47426j14809j92743q9960J68997N09010
38093B41472N44727M7531n12256m78581K8752K75698N1617k6199M21163Q18489
38083A412413N11841j12975j44373L98698N08272k27113q61179m99476K45801
38074A231909J51325o53412p95577J89364J014551N19441n74254p12119K40553
38065F11781Q53118J51083j123235j520661n79190Q21294J503259J096593J65670
38056A979712n52828q28910p91400m51518J46670N02284J37136m60990k55772
38047e75616P31194J230363O24465o8462P3116K95440m28625j376133j098674
38038e92932R4498N10556k18273o62311n9164N50155K39506l59595l86640j64754
$$ plain form
38103 3502 -1009685 -1380209 -925116 -286449 -39023 -153832 -346575 -436535 -267538 241472
38093 241472 786199 833730 321474 -157107 -128355 147343 198960 172761 593924 1412413
38083 1412413 1924254 1811279 1666906 2065604 2573876 2346763 1485584 986108 1231909
38074 1231909 1383234 729822 -65755 123609 1138160 1657601 1083347 371228 611781
38065 611781 1464899 1615982 492747 -1027914 -1607104 -785810 717449 1814042 1979712
38056 1979712 1426884 597974 -193426 -644944 -498274 4010 141146 -319844 -575616
38047 -575616 155578 1385941 2010406 1941944 2015060 2310500 1881875 505742 -592932
38038 -592932 -498434 12122 -206151 -868462 -927626 -377471 -137965 -497560 -884200 -1048954
38028a048954k76379l28476K53300R96002J020545L97561l7407J27904N51340
38019A655436O88242K50744m96861p16342Q0679R94205O35717p09327j157388
38010A225105j3851J034623M98102o57374p68524j79101l30878j060765r10614
$$ plain form
38028 -1048954 -1325333 -1653809 -1400509 -404507 616038 1013599 976192 1104096 1655436
38019 1655436 2343678 2594422 2097561 1381219 1461898 2456103 3091820 2382493 1225105
38010 1225105 1211254 2245877 2743979 2086605 1318081 1138980 808102 -252663 -1163277
$$ [...]
##END NTUPLES=NMR SPECTRUM
##END=
