##TITLE=31Pdec_LR-725-RM1A
 CDCl3+CHCl3, 124 sc
 26.10.2020
##JCAMPDX= 6.0         $$ Bruker NMR JCAMP-DX V2.0
##DATA TYPE= NMR SPECTRUM
##DATA CLASS= NTUPLES
##ORIGIN= UXNMR, Bruker Analytische Messtechnik GmbH
##OWNER= root
$$ XWIN-NMR		Version 3.5
$$ Mon Oct 26 12:35:02 2020 Russian Standard Time (UT+4h)  she@DPX200
##.OBSERVE FREQUENCY= 81.013821
##.OBSERVE NUCLEUS= ^31P
##.ACQUISITION MODE= SIMULTANEOUS
##.ACQUISITION SCHEME= undefined
##.AVERAGES= 124
##.DIGITISER RES= 17
##SPECTROMETER/DATA SYSTEM= spect
##.PULSE SEQUENCE= zgpg30
##.SOLVENT NAME= CDCl3
##.SHIFT REFERENCE= (INTERNAL, CDCl3, 0, 182.463)
##AUDIT TRAIL= $$ (NUMBER, WHEN, WHO, WHERE, WHAT)
$$ ##TITLE= Audit trail, XWIN-NMR		Version 3.5
$$ ##JCAMPDX= 5.01
$$ ##ORIGIN= Bruker BioSpin GmbH
$$ ##OWNER= she
$$ F:/spectra/data/she/nmr/P31/1/pdata/1/auditp.txt
$$ ##AUDIT TRAIL=  $$ (NUMBER, WHEN, WHO, WHERE, WHAT)
(   1,<2020-10-26 12:34:21.48 +0400>,<she>,<DPX200>,
      <continue with go, POWCHK disabled, PULCHK disabled
       configuration hash MD5:
       00 E9 B6 7A A2 85 ED C7 34 08 36 98 17 FE 4E 26
       data hash MD5: 32K
       FB 05 C5 91 7B CD 97 29 71 16 AA DF A5 CA FB E9>)
(   2,<2020-10-26 12:34:27.84 +0400>,<she>,<DPX200>,
      <Start of raw data processing
       efp BC_mod = 2 LB = 1 FT_mod = 6 PKNL = 1 PHC0 = -2382.604 PHC1 = 28.80069 SI = 64K 
       data hash MD5: 64K
       AC 39 45 D1 EF 96 0C 8C 57 0B 18 61 15 FA 2C 5A>)
$$ ##END=
$$ 
$$ hash MD5
$$ D9 3B 2A 1C BC 5D 97 09 E7 B1 3F 81 BB 63 15 0C
##$RELAX= 
##$RELAX= 
##$RELAX= 
##$RELAX= 
##$RELAX= 
##$RELAX= 
##$RELAX= 
##$RELAX= 
$$ Bruker specific parameters
$$ --------------------------
##$DU= <F:/spectra>
##$EXPNO= 1
##$NAME= <P31>
##$PROCNO= 1
##$TYPE= <nmr>
##$USER= <she>
##$AMP= (0..31)
100 100 100 100 100 100 100 100 100 100 100 100 100 100 100 100 100 100 
100 100 100 100 100 100 100 100 100 100 100 100 100 100 
##$AQSEQ= 0
##$AQ_mod= 1
##$AUNM= <au_zg>
##$AUTOPOS= <>
##$BF1= 81.014009
##$BF2= 200.13
##$BF3= 200.13
##$BF4= 200.13
##$BF5= 200.13
##$BF6= 200.13
##$BF7= 200.13
##$BF8= 200.13
##$BYTORDA= 1
##$CFDGTYP= 0
##$CFRGTYP= 5
##$CHEMSTR= <none>
##$CNST= (0..31)
1 1 145 1 1 1 1 1 1 1 1 1 1 1 1 1 1 1 1 1 1 1 1 1 1 1 1 1 1 1 1 1 
##$CPDPRG= <waltz16>
##$CPDPRG1= <>
##$CPDPRG2= <waltz16>
##$CPDPRG3= <>
##$CPDPRG4= <mlev>
##$CPDPRG5= <mlev>
##$CPDPRG6= <mlev>
##$CPDPRG7= <mlev>
##$CPDPRG8= <mlev>
##$CPDPRGB= <>
##$CPDPRGT= <>
##$D= (0..31)
0 1 0 0 0 0 0 0 0 0 0 0.03 2e-05 3e-06 0 0 0 0 0 0 0 0 0 0 0 0 0 0 0 0 
0 0 
##$DATE= 1603701058
##$DBL= (0..7)
120 120 120 11 120 120 24 19 
##$DBP= (0..7)
150 150 150 150 150 150 150 150 
##$DBP07= 0
##$DBPNAM0= <>
##$DBPNAM1= <>
##$DBPNAM2= <>
##$DBPNAM3= <>
##$DBPNAM4= <>
##$DBPNAM5= <>
##$DBPNAM6= <>
##$DBPNAM7= <>
##$DBPOAL= (0..7)
0.5 0.5 0.5 0.5 0.5 0.5 0.5 0.5 
##$DBPOFFS= (0..7)
0 0 0 0 0 0 0 0 
##$DE= 6
##$DECBNUC= <off>
##$DECIM= 4
##$DECNUC= <off>
##$DECSTAT= 4
##$DIGMOD= 1
##$DIGTYP= 9
##$DL= (0..7)
0 0 52 120 120 21 21 25 
##$DP= (0..7)
$$ [...]
##$SUBNAM2= <"">
##$SUBNAM3= <"">
##$SUBNAM4= <"">
##$SUBNAM5= <"">
##$SUBNAM6= <"">
##$SUBNAM7= <"">
##$SUBNAM8= <"">
##$SUBNAM9= <"">
##$SW= 369.568048894756
##$SWIBOX= (0..15)
0 1 3 0 0 0 0 0 0 0 0 0 0 0 0 0 
##$SW_h= 29940.119760479
##$TD= 32768
##$TD0= 1
##$TE= 0
##$TE2= 300
##$TE3= 300
##$TEG= 300
##$TL= (0..7)
0 120 53 12 22 120 120 120 
##$TP= (0..7)
150 150 150 150 150 150 150 150 
##$TP07= 0
##$TPNAME0= <>
##$TPNAME1= <>
##$TPNAME2= <>
##$TPNAME3= <>
##$TPNAME4= <>
##$TPNAME5= <>
##$TPNAME6= <>
##$TPNAME7= <>
##$TPOAL= (0..7)
0.5 0.5 0.5 0.5 0.5 0.5 0.5 0.5 
##$TPOFFS= (0..7)
0 0 0 0 0 0 0 0 
##$TUNHIN= 0
##$TUNHOUT= 0
##$TUNXOUT= 0
##$USERA1= <user>
##$USERA2= <user>
##$USERA3= <user>
##$USERA4= <user>
##$USERA5= <user>
##$V9= 5
##$VALIST= <valist>
##$VCLIST= <CCCCCCCCCCCCCCC>
##$VD= 0
##$VDLIST= <DDDDDDDDDDDDDDD>
##$VPLIST= <PPPPPPPPPPPPPPP>
##$VTLIST= <TTTTTTTTTTTTTTT>
##$WBST= 1024
##$WBSW= 4
##$XGAIN= (0..3)
0 0 0 0 
##$XL= 0
##$YL= 0
##$YMAX_a= 40004
##$YMIN_a= -9284
##$ZGOPTNS= <>
##$ZL1= 120
##$ZL2= 120
##$ZL3= 120
##$ZL4= 120
##$ABSF1= 0
##$ABSF2= 0
##$ABSG= 0
##$ABSL= 0
##$ALPHA= 0
##$AQORDER= 0
##$ASSFAC= 0
##$ASSFACI= 0
##$ASSFACX= 0
##$ASSWID= 0
##$AUNMP= <proc_1d>
##$AZFE= 0.1
##$AZFW= 0.5
##$BCFW= 0
##$BC_mod= 2
##$BYTORDP= 0
##$COROFFS= 0
##$CY= -3
##$DATMOD= 1
##$DC= 0
##$DFILT= <>
##$DTYPP= 0
##$F1P= 0
##$F2P= 0
##$FCOR= 1
##$FTSIZE= 65536
##$FT_mod= 6
##$GAMMA= 0
##$GB= 0
##$INTBC= 1
##$INTSCL= 5.30512e-09
##$ISEN= 30
##$LB= 1
##$LEV0= 0
##$LPBIN= 0
##$MAXI= 10000
##$MC2= 0
##$MEAN= 0
##$ME_mod= 0
##$MI= 50
##$NCOEF= 0
##$NC_proc= -10
##$NLEV= 6
##$NOISF1= 182.463
##$NOISF2= 159.3651
##$NSP= 0
##$NTH_PI= 0
##$NZP= 0
##$OFFSET= 182.463
##$PC= 4
##$PHC0= -2382.604
##$PHC1= 28.80069
##$PH_mod= 1
##$PKNL= yes
##$PPARMOD= 0
##$PSCAL= 0
##$PSIGN= 0
##$REVERSE= no
##$SF= 81.014009
##$SI= 65536
##$SIGF1= 159.3651
##$SIGF2= -187.1042
##$SINO= 113.3802
##$SIOLD= 16384
##$SREGLST= <1H.CDCl3>
##$SSB= 0
##$STSI= 65536
##$STSR= 0
##$SW_p= 29940.119760479
##$SYMM= 0
##$S_DEV= 0
##$TDeff= 32768
##$TDoff= 0
##$TI= <>
##$TILT= no
##$TM1= 0
##$TM2= 0
##$TOPLEV= 0
##$USERP1= <user>
##$USERP2= <user>
##$USERP3= <user>
##$USERP4= <user>
##$USERP5= <user>
##$WDW= 1
##$XDIM= 65536
##$YMAX_p= 377464047
##$YMIN_p= -317745227
$$ End of Bruker specific parameters
$$ ---------------------------------
##NTUPLES= NMR SPECTRUM
##VAR_NAME=  FREQUENCY,     SPECTRUM/REAL,   SPECTRUM/IMAG
##SYMBOL=    X,             R,               I
##VAR_TYPE=  INDEPENDENT,   DEPENDENT,       DEPENDENT
##VAR_FORM=  AFFN,          ASDF,            ASDF
##VAR_DIM=   65536,         65536,           65536
##UNITS=     HZ,            ARBITRARY UNITS, ARBITRARY UNITS
##FACTOR=    0.456856943014862, 1,           1
##FIRST=     14782.0589164895, 0,            0
##LAST=      -15158.0608439895, 0,           0
##MIN=       -15158.0608439895, -317745227,  0
##MAX=       14782.0589164895, 377464047,    0
$$ Real data points
##PAGE= N=1
##DATA TABLE= (X++(R..R)), XYDATA
$$ [...]
43747e6669201m6561629K0705171Q6202123P5616281k740860n8795519l5778309
43740a8021943K3978777M5707597J0882134m3027789p2749489n4113630Q186528
43733i9157815O8495280P0410124J7825379j7896560M986214L2847325k848289
43726G4661658p3049145q7162922k6435489L5289581M8156893M2552134M4506045
43719E8518755J9890488m2522749o7689716J848103Q9520836P4544778k3664878
43712A10445617o2908677J0319284Q0673824M0420932n5769507q8830050n0348487
43705a5997064k2829341l3407869l3796649q789796n875j2316821P351831O7504102
43697e2287482R2082851L1652838n0209774o0848939n029620L3599064J2236354
$$ y = [-56669201, -103230830, -82525659, 3676464, 79292745, 76551885, 17756366, -18021943, 5956834, 51664431, 62546565, 19518776, -53230713, -107344343, -99157815, -30662535, 39747589, 57572968, 39676408, 44662622, 77509947, 74661658, 1612513, -85550409, -111985898, -76696317, -28539424, 14012710, 58518755, 78409243, 35886494, -31803222, -29955119, 59565717, 134110495, 110445617, 47536940, 57856224, 138530048, 178950980, 123181473, 34351423, -15997064, -38826405, -72234274, -106030923, -114820719, -114826594, -127143415, -119791584, -52287482, 39795369, 71448207, 21238433, -39610506, -44640126, -11041062, 1195292]
43690A195292k8077249l1785202N368894M2822049L8270896j4632958p1860368
43683e8698646p3598991j5132146L4653153J5226894m4090243o4496568k4876267
43676b31012814K3017435M3621544N9817422Q6314680Q1852627J5355911o1582689
43669A7384116p0537758j7877798J3688805j1704000l3293242O165192O7406599
43662b8768086P2241406J8535033k3630661j7526700Q69980o005340k6442656
43655a0727024l9815912n3415491o6373351m5698090J6023046N9182345L1147040
43648a09677437k5538323k5064713L4186906O6691894L0154078j5523326q344983
43641e3115904K2564865J3720418k8698819m2624597p690591K8077877J9107164
$$ y = [1195292, -26881957, -58667159, -53298265, -10476216, 27794680, 13161722, -58698646, -132297637, -147429783, -112776630, -97549736, -141639979, -206136547, -231012814, -207995379, -164373835, -104556413, -18241733, 63610894, 78966805, 17384116, -53153642, -71031440, -57342635, -69046635, -102339877, -96174685, -28768086, 43473320, 62008353, 38377692, 20850992, 21720972, 15715632, -10727024, -50542936, -103958427, -170331778, -216029868, -200006822, -140824477, -109677437, -135215760, -160280473, -126093567, -59401673, -29247595, -44770921, -53115904, -30551039, -16830621, -45529440, -88154037, -95844628, -67766751, -48659587]
43634d8659587k3412722n5810204n0073310j0241947L5493422N2579251L0102732
43627g0022365j688881k860219K2994635L0071384m481643m1498066k9811526
43620i7296681K0673725M9875435L0571054K312640M711613J3451591j6072016
43613H227361o2327174n3765982K1432031Q0740071N4819251j7546455m9600117
43606a8021014k6977559p598163j8197545j8702037K1554281O9318237P3653698
43599G5029898L0440019k0186813l6607433o700739L8973028M3975654j2360514
43592A12563100p2858842o3527370N191675N1104462L8463495J7917313K8760686
43585A17614519L4134036l070100m4673007l7898303k270596R606889q55733L53440
$$ y = [-48659587, -72072309, -127882513, -177955823, -188197770, -152704348, -100125097, -70022365, -71711246, -74571465, -51576830, -21505446, -25987089, -67485155, -97296681, -76622956, -26747521, 3823533, 6136173, 10847786, 24299377, 8227361, -54099813, -107865795, -86433764, -5693693, 49125558, 31579103, -18021014, -44998573, -52596736, -70794281, -89496318, -67942037, 1376200, 75029898, 105469917, 85283104, 48675671, 41974932, 80947960, 124923614, 112563100, 39704258, -23823112, -18631437, 32473025, 70936520, 88853833, 117614519, 151748555, 148678455, 104005448, 66107145, 63836549, 73443438, 72587705, 72941145]
43577G2941145L321602k3525429n4235797l2030430K6802133L8903685j9740692
43570A2436217o9137046l9900982K9261804N2767831J3767988k9027035k7677565
43563e7508788L236638J6976959p364197l9726797k8588448L8055983J07759635
43556C2840985J17244305O2708754p526642n7244559q0691576o7637398p607305
43549g913436O1289630O7837090J772595n7696612m5973373k045579m698556n3762326
43541d1190567p4926925k9350837L9460745P1563868N6226970K1024710o888513
43534C5919451j3671466r56836J0567560Q6293k1858463k1149744J2934727M9871551
43526E1743073N6075035L0223999q269463m2312801n6379660l9416482q709246
$$ y = [72941145, 76262747, 52737318, -1498479, -33528909, -6726776, 32176909, 12436217, -56700829, -96601811, -67340007, -14572176, -804188, -29831223, -57508788, -54272150, -37295191, -44659388, -84386185, -112974633, -74918650, 32840985, 150085290, 212794044, 205267402, 148022843, 67331267, -306131, -7913436, 53376194, 121213284, 122985879, 65289267, 19315894, 17270315, 12571759, -41190567, -116117492, -145468329, -106007584, -34443716, 21783254, 42807964, 35919451, 22247985, 21291149, 31858709, 31945002, 10086539, -11063205, 1871522, 51743073, 107818108, 138042107, 129772644, 87459843, 31080183, -8336299, -17045545]
43519a7045545n545332l9307335n8800064j7029010N1670349O7502457J5608591
43512b945889l2792107k3060678J2692018J8472843j423151q874902n623868j9317973
43504f2873707l5787064j3353138L6579647N1715050J6484785q329600J6848962
43497A284935M5327261K3149548j9654711k0100879J1020656P901843l7257787
43490A1670866n6363809j2574003M2017770M6480390J5721818J753655P705933
43483E6412620m903601l7547951m1156333N126375M6918428K1502132n0064992
43476c713322q0539917k8504753M5964208N8334333L406621n0584535n3917059
43469a09554424k0287845J5900270M1642086N2296807L6497227j412921l0853776
$$ y = [-17045545, -22590877, -61898212, -120698276, -137727286, -86056937, -18554480, -2945889, -35737996, -58798674, -46106656, -27633813, -29056964, -37931866, -43555734, -62873707, -98660771, -112013909, -75434262, -23719212, -7234427, -15564027, 1284935, 46612196, 69761744, 50107033, 30006154, 41026810, 48928653, 11670866, -44692943, -57266946, -15249176, 31231214, 46953032, 48706687, 56412620, 51509019, 13961068, -27195265, -22068890, 24849538, 46351670, -3713322, -84253239, -112757992, -66793784, -8459451, -5052830, -55637365, -109554424, -129842269, -113941999, -72299913, -20003106, 16494121, 15081200, -15772576]
43462a5772576l0507795j4409870n216499m479341o954268j7471292l1345593
43455a26157234k5263069N906607K9152169J8848091l605307o810266J481712
43448a06447297r21973m451380Q655891J8260706l131051k9107126o989803N6366318
43440f7765715R2884403O4158034M281188l7826693n1367293m4667746j9130291
43433e9434113J3888032K5260658M253786j9505815j2391963J8942895L6557903
43426G571383J7968819j5883783k1600118J3579962M6077192K7157000k1709649
43419E3160806k9003018J7419906M1644961q23710m2508908j2300245L7070149
43412F4659941R550693o7301373p7018753l847120M2067176P114038k6229534
$$ y = [-15772576, -46280371, -60690241, -65906740, -70386081, -77340349, -94811641, -126157234, -151420303, -145513696, -116361527, -97513436, -101118743, -107929009, -106447297, -107369270, -111820650, -103164759, -84904053, -88035104, -117142230, -124132033, -67765715, 25118688, 89276722, 93557910, 55731217, 4363924, -40303822, -59434113, -45546081, -20285423, -16031637, -35537452, -47929415, -28986520, 7571383, 25540202, 9656419, -11943699, 1636263, 47713455, 74870455, 53160806, 24157788, 41577694, 83222655, 82398945, 39890037, 27589792, 64659941, 74210634, 6909261, -70109492, -73956612, -31889436, -24775398, -51004932]
43405e1004932J1268616O3003887N2495076N977537j1155590m287265j3076242
43398E3221087k5889498j3195527J560387j6352440l9160018j9372049K5961030
43391c3227028M4220387L2000951K3696514K0647150l115157m3845195p3601105
43384c3223483q2209072o6352431j0235118P0250643J05012498N5562286j4858651
43377B3946672k6019645L260478J257408l2297481l8593166r602422J0531725
43370f7516431J7408023M1554108O1093660K2258176n0374171o7596230j3204771
43363e6377636L1869812K2184998L218943O891243l045041l7771680l7601738
43356g0631099K0597531O1819809K9976407j4751717K789702M4363251K6220496
$$ y = [-51004932, -39736316, 23267571, 75762647, 81740184, 70584594, 66297329, 53221087, 27331589, 14136062, 15696449, -655991, -39816009, -59188058, -33227028, 10993359, 42994310, 66690824, 87337974, 84222817, 40377622, -33223483, -115432555, -181784986, -192020104, -121769461, -16756963, 38805323, 23946672, -2072973, 1187505, 2444913, -29852568, -68445734, -78048156, -67516431, -50108408, -8554300, 52539360, 74797536, 24423365, -43172865, -56377636, -24507824, -2322826, 896117, 7787360, 4742319, -33029361, -70631099, -50033568, 11786241, 41762648, 27010931, 29800633, 74163884, 100384380]
43349A00384380l5069183m7470581R102595N7030773M1817656m076397l1609287
43342I0109956m1185226n2558463n6301386k6849015L5253504R0827987Q8134929
43335A27432286J0287783r0840998j26776973o3813421L2217296O9974240L6697131
43328d822656m635053r454847J414987n927155k0764099q319254L1287681N3834056
43320C2613660K4881345l3723035o6263663m8283113r483081J3962223K2598252
43313f3697412K8372500J7249189k0068796m2248919k454667O5653865P5240010
43306E8045770J1483463m1705235k7640649L793744r977853m0396620k7610053
43299g4007433R683709J0036233j6608965k860874N5695084Q3266969M0136059
$$ y = [100384380, 65315197, 17844616, 26947211, 83977984, 125795640, 121719243, 90109956, 48924730, -3633733, -59935119, -86784134, -51530630, 39297357, 127432286, 137720069, 46879071, -79897902, -143711323, -111494027, -41519787, -4822656, -9457709, -18912556, -17497569, -23424724, -44188823, -52508077, -21220396, 32613660, 57495005, 23771970, -42491693, -90774806, -100257887, -86295664, -63697412, -35324912, -18075723, -38144519, -80393438, -82848105, -17194240, 58045770, 69529233, 27823998, 183349, 3977093, -6000760, -46397380, -74007433, -64323724, -54287491, -70896456, -73757330, -18062246, 65204723, 105340782]
43292A05340782k2184315m6822783m2904140l6880394j6708616K5601960M5634460
43285A1076954L212408n9795263o1698274N933512O5007716N8363155J8138605
43278D0238813L483212J4036978P190529k2884662l4826034r048025J9877964
43271A8068775J8281441L388363Q741413K7537178K7619632N252110j6278447
43264I2610465l0799988m8828697n8767407l6988564N70633Q270210j6148208
43257i0081556k0810157J7788429N4431230M6749881J5646895l449739j8562394
43250A712589m1631064m0003275Q124453M7730568J3115576o0460164p2261213
43243a43672530o29231O6800290O0297413J2151688j3007328p573592j712539
$$ y = [105340782, 83156467, 36333684, -6570456, -43450850, -60159466, -34557506, 11076954, 14289362, -45505901, -107204175, -101270663, -36262947, 22100208, 40238813, 43722025, 57759003, 64949532, 42064870, 7238836, -1809189, 18068775, 36350216, 39738579, 48479992, 76017170, 103636802, 108888912, 92610465, 61810477, 12981780, -45785627, -82774191, -82203558, -73933348, -90081556, -110891713, -93103284, -38672054, 8077827, 23724722, 20274983, 1712589, -39918475, -79921750, -71797297, -24066729, -10951153, -71411317, -143672530, -144301761, -77501471, -17204058, -5052370, -18059698, -25633290, -27345829]
43236b7345829m371442p793994j7400573l5601791l8432728n551266M0416654
43229i6080969N5106671K5136798k0844585m4504337k7337186J7525857M9880286
43222d1117465L7149311j613480r363197L2684237O8942690L9261365l6368331
43215H9575130q1354757o0831466j5276001O049275M038783M986886J0405717
43208d2406433L487542q745081N335238N4147463R8585636R3172057M1711250
43201B45287672o769993j7410416o997333j3791550m4782058p0607719o8130204
43194A6798399m8093166l3941648k7905716j2837087J5685729L4437188J9094289
43187c6762012j9935616m2357912k4333637J1636084K6149869J4114993O347796
$$ y = [-27345829, -31717271, -39511265, -56911838, -92513629, -130946357, -136497623, -96080969, -40974298, -15837500, -36682085, -81186422, -108523608, -90997751, -41117465, -3968154, -5581634, -14944831, 17739406, 86682096, 125943461, 89575130, 8220373, -52611093, -67887094, -61837819, -57799036, -52812150, -42406433, -38918891, -47663972, -42328734, 11818729, 110404365, 203576422, 245287672, 238517679, 221107263, 214109930, 200318380, 155536322, 84928603, 16798399, -31294767, -65236415, -93142131, -105979218, -90293489, -55856301, -36762012, -56697628, -99055540, -123389177, -111753093, -85603224, -71488231, -65140435]
43180f5140435K0606540L5313356K3168992q139357k6064144j4181728J1276179
43173b3160597K0654682j023754l7370790m8134491p594798N8115789Q9107039
43166E0593080N6665648o424728m8314654m9698265k3944050P026379K1380138
43159G283548R312140o868128M427334K5663991J102212o5098429q1727152J70973
43151a05733511Q6125029N4914879n6485456r2236220k00754R7292016Q5510252
43144F9186235N156868l9624298l1694928j8722039o304582L0297880O1472467
43137F9767603K7727298n4055244r2676249m7655820J4504024J6555130k8550024
43130i4383282m9382295j5973953L1491753M2891692J5542488j3530280j5660991
$$ y = [-65140435, -44533895, -9220539, 13948453, 5809096, -20255048, -34436776, -23160597, -2505915, -3529669, -40900459, -89034950, -96629748, -38513959, 50593080, 107258728, 100834000, 52519346, 2821081, -21122969, -14096590, 7283548, 16595688, 9727560, 14154894, 39818885, 40921097, -24177332, -105904484, -105733511, -19608482, 35306397, -21179059, -113415279, -113616033, -16324017, 69186235, 74343103, 34718805, 3023877, -15698162, -22002744, 8295136, 69767603, 97494901, 43439657, -49236592, -96892412, -82388388, -65833258, -94383282, -143765577, -159739530, -128247777, -85356085, -69813597, -83343877, -99004868]
43123i9004868J221802J1006846N005267k091142J477422Q354525O370855n418138
43115g3077431k0375785k9493827j9465211J4170260M5440963L5706847j2052280
43108e9146464m3723995k2671579J6448025J5590236k2034721l7399555m192440
43101a57130493L1530405J8448264k5327538l7600588k11270L6545070K9491960
43094a04254190Q306028K7962193P1958751O1426368k3520189r2540544o2423083
43087a13084666K2704078N7051899K5841239N995290K7600651L4942283J88314
43080F1239088k5419717j2479719j0195843m5700835n5686075O431981P2935892
43073h875228O0836391M264575j0678728J0481195K396315k5336337q540502L5434399
$$ y = [-99004868, -97783066, -86776220, -81770953, -83862095, -82384673, -74030148, -67659293, -73077431, -93453216, -122947043, -142412254, -128241994, -82801031, -47094184, -59146464, -102870459, -125542038, -109094013, -93503777, -115538498, -152938053, -157130493, -125600088, -107151824, -132479362, -170079950, -170291220, -133746150, -104254190, -95948162, -67985969, 3972782, 65399150, 41878961, -50661583, -113084666, -90380588, -33328689, -7487450, -1492160, 26108491, 61050774, 61239088, 35819371, 23339652, 13143809, -32557026, -88243101, -81811120, -8875228, 51961163, 56225738, 45547010, 56028205, 58424520, 33088183, 24547681, 59982080]
43065E9982080K1327958m8348138o7541928L776526O8921748M1151216l5518986
43058D3750476o8004322l7675243J3104773N0362926N1736730J026493o9537363
43051a5235530q6009776k8089270L4678125M2730061K3192096K1804989K2754854
43044A5825549m689439l5550410l0622122n629458J569852n232664m678962o387306
43036g5394960k1265226k3031072P057815L7211025L7279351K7481372K4657059
43029A3995364j153593n4575193o6412740J729514O8858173M8167128r581757
43022A026896j176206M9155649L0379869n9115978j00205285m2909837K8486388
43015i4358504M2561236K6767074J4598787j1939800m4267680k5640411M0907685
$$ y = [59982080, 81310038, 32961900, -34580028, -30803502, 38118246, 79269462, 43750476, -24253846, -61929089, -48824316, 1538610, 53275340, 54301833, -15235530, -101245306, -129334576, -94656451, -51926390, -28734294, -6929305, 15825549, 11136110, -24414300, -55036422, -60665880, -59096028, -64328692, -69007654, -75394960, -96660186, -119691258, -112633443, -75422418, -38143067, -10661695, 13995364, 12841771, -41733422, -108146162, -106416648, -37558475, 10608653, 1026896, -149310, 49006339, 79386208, 20270230, -79935055, -122844892, -94358504, -51797268, -25030194, -10431407, -22371207, -66638887, -92279298, -51371613]
43008e1371613O7950243K0633947k4075018j1792831K175323k9673302m7786516
43001g3939767O413253P3662914O8108666J2909709j5000426j2631778k2365466
42994C7157105l1232111m135319K6133384O936709l1340692k3670977R353924
42987a0797977k708365m6279612l8883038K6879705O3930556K6676425l0027174
42980a1209480m6260492k8026791m036521J5131713J8752181J990071k957988
42973e6617307L2733855O5432348K7318384n6260552q4577994k7221386L6255475
42966f2937177M0632559R927789j7534631m7030914p0909822m1934342M1739110
42959a48047428R6914852O0823702j8301127m9935025j5310458L3230450M6356241
$$ y = [-51371613, 16578630, 37212577, 13137559, 1344728, 3520051, -26153251, -73939767, -67526514, 6136400, 74245066, 87154775, 72154349, 59522571, 37157105, 5924994, 1789675, 27923059, 34859768, 3519076, -20151901, -10797977, -13506342, -59785954, -98668992, -71789287, -7858731, 18817694, -11209480, -57469972, -85496763, -89533284, -74401571, -55649390, -53659319, -56617307, -23883452, 41548896, 68867280, 12606728, -71971266, -99192652, -62937177, -22304618, -12376829, -29911460, -76942374, -147852196, -189786538, -148047428, -51132576, 9691126, -8610001, -58545026, -73855484, -40625034, 5731207]
42952E731207J3285778l8601715n3491636p28047O4556271N3673593k5115216
42945A9310235o3430078q754048O1356186O5166580K8419700R080395l276156
42938A07872814l4511131m8859679j5082402J3836223j7718176o0799502l5754480
42931i1016333L2468436N6983693L0366260J5355333K1455416L594288l0153781
42924C9053312k2985341J9489952L1316889N168906J050922K3693234M780285
42917A01568159o3248509q8254909k4158497M3466716K4472434m2160219n6688569
42910a05003394m810951L9128052K4180169k2740462m0883634J694145P5222036
42903c3214039J03504054M1837773n2564586p3714724j612779P3022099P6424242
$$ y = [5731207, 19016985, -19584730, -73076366, -73804413, -9248142, 44425451, 19310235, -44119843, -52873891, 8482295, 73648875, 102068575, 111148970, 107872814, 73361683, 24502004, 9419602, 23255825, 5537649, -55261853, -91016333, -58547897, -1564204, 28802056, 44157389, 65612805, 69207093, 39053312, 16067971, 35557923, 66874812, 72043718, 73094640, 96787874, 101568159, 38319650, -49935259, -74093756, -30627040, -6154606, -48314825, -105003394, -109814345, -70686293, -46506124, -69246586, -110130220, -108436075, -33214039, 70290015, 112127788, 59563202, -14151522, -15764301, 57257798, 133682040]
42896A33682040L5771524L429811k7235443p3371428r4934284n1454490J4803900
42889e9308370K9483649l956103j7051184J4543713M4703591L8763469J7681562
42882F4860327Q056947K8178k3751858n1852952n7946622l3331928M851365K7422214
42874f1664329J6186230j5153686k9833676j0848419J6232686J9212878L763071
42867f2105245J46288J6921439L2863240L0104583J3576555j684921p489243p553615
42859A4779081j2380717k2461818j6453849K4141536P4564458Q0895379K9073664
42852A72157734l1278672n3107453m8575048m9772172m8585108k2265101O552075
42845g4873745n689947m5015222m4933064J7521688Q0194523P4553123R996998
$$ y = [133682040, 169453564, 172883375, 145647932, 72276504, -22657780, -74112270, -59308370, -29824721, -33780824, -50832008, -36288295, 8415296, 47178765, 64860327, 72917274, 72945452, 49193594, -2659358, -60605980, -93937908, -89086543, -61664329, -45478099, -60631785, -90465461, -101313880, -85081194, -65868316, -62105245, -61958957, -45037518, -12174278, 17930305, 31506860, 29821939, 22332696, 14779081, 2398364, -20063454, -36517303, -12375767, 62188691, 143084070, 172157734, 140879062, 87771609, 39196561, -10575611, -59160719, -81425820, -74873745, -80563692, -125578914, -170511978, -152990290, -72795767, 1757356, 11754354]
42838A1754354m8140206n7969371k7749382J7853628O0865087Q1434209O0993053
42831I9041372Q971893l4692877m2799249l3647894l9758684n5581151m8398191
42824a46864781j9018285q570004k8572254k9634379K3103674Q1696537P6718998
42817e1140494K1695119r180188K953538K849085l1945889m3299402J2026923
42810i6041308Q1952404Q6022858K3150338l7205858m6395352j6240504J5916485
42803A1159063K6213619J6928054J0196386J7792466J4681428k5331225o5738516
42796E901275l4658304O2114188J17409096N6868622n4621383r5806291l8730324
42789A8476879M1392121P2883723M5155704j4193933o0905464n2361737J993491
$$ y = [11754354, -36385852, -94355223, -122104605, -104250977, -43385890, 38048319, 99041372, 108013265, 73320388, 30521139, -3126755, -42885439, -98466590, -146864781, -165883066, -174453070, -203025324, -232659703, -209556029, -127859492, -51140494, -29445375, -38625563, -35672025, -32822940, -64768829, -108068231, -96041308, -14088904, 71933954, 95084292, 57878434, 11483082, -4757422, 11159063, 37372682, 54300736, 64497122, 82289588, 96971016, 71639791, 5901275, -28757029, 33357159, 150766255, 207634877, 153013494, 57207203, 18476879, 59869000, 132752723, 177908427, 163714494, 102809030, 50447293, 52440784]
42782E2440784K9708569j3128638o7614249n1483649J4841033L8332049n176018
42775b080119m3240329k4121922J7969627L3674608K5428317J5823019M654661
42768B8107862j1131172j4769080N944329L7371130N5686945M2443600r758106
42761A33895508p5490338r4667659l8273784L6739167N2263563J5863921k761586
42754B7568792Q867685m541395m9751157n4357399J0901630O7175832M3459945
42747D9323933j3213638j4927976L1053130M2501709p930074n8559980n1910448
42740b3663344l447868L2992915K9875487L533449j2835084o435127Q37488j7206014
42732C651902m7953691n1466861j9677636R370698J0638301Q364214K8198732
$$ y = [52440784, 82149353, 69020715, 1406466, -50077183, -35236150, 3095899, -2080119, -45320448, -69442370, -51472743, -17798135, 7630182, 23453201, 28107862, 16976690, 2207610, 8151939, 45523069, 101210014, 143653614, 133895508, 58405170, -36262489, -74536273, -37797106, 14466457, 30330378, 27568792, 36436477, 31895082, -17856075, -72213474, -61311844, 5863988, 49323933, 36110295, 21182319, 52235449, 94737158, 86807084, 28247104, -23663344, -27111212, 5881703, 35757190, 39290639, 26455555, 20020428, 20857916, 3651902, -44301789, -95768650, -115446286, -106075588, -95437287, -87073073, -58874341]
42725e8874341M8104886L3214510m664132k1523412k719909K3163326K4691995
42718D1392923m524893m9782621q2163130p0102917j0923028N2344415O9492312
42711e4266939L9205004P403408Q146235K4907582J8974161j6029663m3039576
42704a4699788k7401831J7109196M1919099K2151782j6098962l3266409k1518059
42697c1804972M18200J7876716K7016793K7332913K5026619K6460082J5771497
42690A08097848l0130052q5714141q1424633j917849O7944726N1574322q370556
42683B0059665j9656413J6137141K0889479k0031964l8452345p643002J5800014
42676a2897425k813955k0908930j914730K5905041K9137278J6964839o00009l1679804
$$ y = [-58874341, -10769455, 22445055, 17780923, -3742489, -6462398, 16700928, 41392923, 36868030, -12914591, -95077721, -165180638, -176103666, -123759251, -54266939, -15061935, -7658527, 487708, 25395290, 44369451, 28339788, -14699788, -42101619, -24992423, 16926676, 39078458, 22979496, -10286913, -31804972, -31386772, -13510056, 13506737, 40839650, 65866269, 92326351, 108097848, 77967796, -7746345, -89170978, -91088827, -23144101, 28430221, 20059665, 403252, 16540393, 37429872, 17397908, -21054437, -28697439, -12897425, -15711380, -36620310, -38535040, -12629999, 16507279, 33472118, 32872109, 1192305]
42668A192305n4919806l0366384J7527671J5297198l2538115l3371496L4336256
42661h2842371O5568248J57687o3767320k3390143O0515512O4710115l548477
42654A7403251l9773618j5268504P878778J237631p311393j2976482k8847164
42647g7657501k2316976L7534690Q9364529M8562711m4932082o5286837J0195936
42640b4535530O8498454L6446388k4076524l3905479j0398323j0803670l6434396
42633c5209080m7614643k5964159J6294526N2652731N0412788L270637l8217735
42626b4374935j8212530M0232048N9860305J9628348k5390885l9519304m6692054
42619c4469007n8496099m0238876J7443219O0596118M6934949N390755j7632971
$$ y = [1192305, -53727501, -84093885, -66566214, -51269016, -83807131, -117178627, -82842371, -17274123, -17116436, -80883756, -104273899, -43758387, 20951728, 17403251, -22370367, -37638871, -29760093, -28522462, -35833855, -48810337, -77657501, -99974477, -62439787, 26924742, 75487453, 30555371, -34731466, -24535530, 43962924, 80409312, 56332788, 22427309, 12028986, 1225316, -35209080, -82823723, -108787882, -92493356, -39840625, 10572163, 13842800, -24374935, -42587465, -2355417, 57504888, 77133236, 51742351, 12223047, -34469007, -92965106, -133203982, -115760763, -55164645, -8229696, -2838941, -20471912]
42612b0471912k3688378l5470743m6020545l4642726n106300K2575122L5859311
42605a06966171K7335465l610309l2176150k1775687K7691564P0918053O7642703
42598B9059468K0849008l4939991n8795809k7189974L4029785N6888777J1759634
42591C1660898m0382427k9292147J5727181J0912612m4560752o5902790k1102279
42584a42939704K1442201P818098k4663626k3115556J760473J5148774J6967485
42577a27581855K0382990K0725963J8300672K6474376L4410483J2140673k9061453
42570b4208151l8305647n419881K1297905J5899513P281287J1452832L767626
42563h234516j6900954j2405860J6802426J5806561k9554129o0158401m0232017
$$ y = [-20471912, -44160290, -79631033, -125651578, -160294304, -165400604, -142825482, -106966171, -79630706, -83241015, -115417165, -137192852, -109501288, -38583235, 29059468, 49908476, 14968485, -43827324, -71017298, -36987513, 19901264, 31660898, -8721529, -38013676, -22286495, -11373883, -55934635, -121837425, -142939704, -121497503, -113679405, -138343031, -161458587, -159698114, -144549340, -127581855, -107198865, -86472902, -68172230, -41697854, -7287371, 4853302, -24208151, -62513798, -67933679, -46635774, -30736261, -23454974, -12002142, -8234516, -25135470, -37541330, -20738904, -4932343, -34486472, -94644873, -134876890]
42556a34876890m367767K4042564O6105844J00636806N5794842n3368380r6475641
42549d2508622j8751561N5478691J3659103o2736674l8328668M9063661N8592137
42542A4468067j9304468o4517783l2771551J652434L510553K4413492P5146798
42535B597542Q6016282K8419161l5974590n8621812n6564154l8419209J6684397
42528e5862383P6207886N8551892l3420574q2915327k1858232O4685184O5031109
42521G0419555k298764l7040423r428009K0010733Q887076j3278968k712079L5798741
42513G0357862N7893633L2772369k0052116m8915893l1541223n676379j5644267
42506C9193986m4586120m0270136K82150K3342360Q40273l0897434l0541637m776344
$$ y = [-134876890, -139244657, -115202093, -49096249, 51540557, 107335399, 53967019, -42508622, -61260183, -5781492, 7877611, -54859063, -93187731, -44124070, 14468067, -4836401, -69354184, -102125735, -100473301, -96962748, -72549256, 2597542, 88613824, 117032985, 81058395, 22436583, -34127571, -72546780, -55862383, 20345503, 78897395, 45476821, -37438506, -59296738, 5388446, 70419555, 68120791, 31080368, 21652359, 41663092, 50550168, 37271200, 34559121, 70357862, 128251495, 161023864, 140971748, 92055855, 60514632, 54838253, 39193986, -5392134, -45662270, -45380120, -22037760, -21197487, -52094921, -82636558, -87412902]
42498h7412902J8517793L0568084L2150600J7686048o443691j4974906J041519
42491h867455J3895442k798155l0880066k5112965K8588390Q5475185Q0377448
42484A40677824k51289r0247098j08509991n2816517L389730J4634048J3667801
42477g9455492L1912708L0667091k8986239r4017426p6936061J3657613P6788689
42470a26369117N1350963k0173224o1288351l7959983L2777166R6669519R0474230
42463B5481203J0892091n5684819l1855267L8363496M7631285j7422855o2974713
42456d5569579l3075615K2496561M2901719L4419508K6088410J9868414J3864621
42449H0994039J3714132K778375l6249169o3788291k5668741M0186643L5125458
$$ y = [-87412902, -68895109, -38327025, -6176425, 11509623, 5065932, -9908974, -8867455, 5027987, 2229832, -28650234, -53763199, -25174809, 60300376, 140677824, 140426535, 50179437, -58330554, -111147071, -107757341, -93123293, -79455492, -47542784, -16875693, -45861932, -139879358, -216815419, -203157806, -126369117, -75018154, -95191378, -156479729, -194439712, -161662546, -64993027, 25481203, 36373294, -19311525, -51166792, -12803296, 34827989, 17405134, -45569579, -78645194, -56148633, -13246914, 21172594, 47261004, 67129418, 80994039, 94708171, 97486546, 61237377, -2550914, -28219655, 11966988, 47092446]
42442D7092446m2783235p9946110k3502507L6322730J9853402j6674660O186073
42435e3451861M9868665L3575328k1592204l5381344n696513N038930j1272283
42428c8911282n662939K8563764M5225055K6911151R36825j7283086k8935847
42421A0843641j6481368K5562404M3518540j2160806q8275483p9134639K2399283
42414i3728428J07200671R7135794L2519172j1392189k2703592k8461165k9341454
42407E1228809j0343636J3079142O186324l3624263o5052440m7962060Q248439
42400g8239685M7573032K6493448l0989837n5869532j6789808M5276108P5446400
42393A2900126O5461668L7672709O114656j7986989j8241256m492336j6080094
$$ y = [47092446, 4309211, -75636899, -99139406, -62816676, -42963274, -59637934, -53451861, -3583196, 29992132, 8399928, -26981416, -32677929, -27638999, -38911282, -44574221, -16010457, 29214598, 56125749, 57062574, 39779488, 10843641, -5637727, 19924677, 63443217, 51282411, -36993072, -116127711, -93728428, 13472243, 110608037, 143127209, 131735020, 109031428, 80570263, 51228809, 40885173, 53964315, 60150639, 26526376, -38526064, -86488124, -78239685, -30666653, -4173205, -35163042, -91032574, -107822382, -62546274, 12900126, 78361794, 116034503, 122149159, 104162170, 85920914, 81428578, 65348484]
42386F5348484n7247848p1032783k3775844K8913202K0976789k0122546k2223539
42379g9164085J0935736J4925199j6360835k2026783J1464962K1359519k1169935
42372h0036222n5687689k7695649K8300723M8089872K8767811J2213090J4406545
42365c1641519J6865730O250315j2943427l0292554l1581639o586275K8882540
42358f1046829L9957938J6908147r584070j0504686P497285K1962103K2414899
42351B7604787N583867k8831700o0987177n6540530r715548M0897607N7348746
42344b4639948M2575917K0456891L77879j7189623k2069151q415126N861674q04909
42336c846396k0947644k7406807j2187793M020581L397937m575405M78703J7673446
$$ y = [65348484, 8100636, -62932147, -86707991, -57794789, -36818000, -56940546, -79164085, -68228349, -53303150, -69663985, -91690768, -80225806, -58866287, -80036222, -135723911, -163419560, -135118837, -87028965, -58261154, -46048064, -31641519, -14775789, -8525474, -21468901, -51761455, -83343094, -89929369, -61046829, -21088891, -4180744, -13764814, -24269500, -16772215, 5189888, 27604787, 33188654, 4356954, -56630223, -113170753, -122886301, -81988694, -24639948, 17935969, 38392860, 38770739, 21581116, -488035, -8903161, -3041487, -3846396, -24794040, -52200847, -64388640, -60368059, -56970122, -61545527, -61066824, -43393378]
42328d3393378K3346639N063334j6329283j3822178M184363L680722k1855944
42321e9125725l6955559j4619719K6794139N5068535O4235554N9458671L1057218
42314A25913114k2870125p0339318p7948958n2670183k0104888J5308253N1169195
42307e1542910N6769091J3829456l2774552k4086254K3953918M1166753P641536
42300C4957038k5896236k3940788p011890K599166J0364110R626658k0881500
42293b0183442n7269681l7765774L5848218P2242992J5220325o4881697o5251965
42286a22041024R917918P1274927P3259449M9045892L1547346J1987396j5361480
42279A09630424k6548669q084588J4887356J2786041r940729k7793324k9042818
$$ y = [-43393378, -20046739, -14983405, -31312688, -45134866, -40950503, -37269781, -59125725, -96081284, -110701003, -83906864, -28838329, 35397225, 94855896, 125913114, 103042989, 32703671, -45245287, -97915470, -118020358, -102712105, -51542910, 5226181, 19055637, -13718915, -37805169, -13851251, 27315502, 34957038, 9060802, -14879986, -21891876, -19292710, -8928600, 698058, -20183442, -77453123, -115218897, -79370679, -7127687, 8092638, -56789059, -122041024, -112123106, -40848179, 32411270, 81457162, 113004508, 124991904, 109630424, 83081755, 74997167, 89884523, 102670564, 92729835, 64936511, 35893693]
42272C5893693k2301148j7010505j0098535O424432K8055726L4353527J1509392
42265F6826582k3889132l8265735k1552874J393914O336920l00897J663427J3651438
42257E863643J8110770L772613k1101005l7812721l3006502q489002K0972251
42250e1689953M0751987M4778558K9876837n287111m4715207n3773386j4950573
42243e5008848M3107877P3510178O1347798K6636410j0536719m0893212n2529193
42236D5634291l8993901j7311437r938831j3680216j1526079k906332O707567
42229d2014938K6661282N3676208M7787866j2406573p1710417n9580117M492875
42222e3093814L8378708K1068898P030049J7482587J1247672k0061596k5859728
$$ y = [35893693, 13592545, -3417960, -13516495, -7092063, 20963663, 55317190, 66826582, 42937450, 4671715, -16881159, -15487245, -9150325, -9451222, -7787795, 5863643, 23974413, 27747026, 6646021, -31166700, -64173202, -72662204, -51689953, -10937966, 33840592, 63717429, 58430318, 13715111, -40058275, -55008848, -11900971, 61609207, 122957005, 149593415, 139056696, 98163484, 45634291, 6640390, -10671047, -20609878, -34290094, -45816173, -48722505, -42014938, -15353656, 38322552, 86110418, 73703845, 1993428, -57586689, -53093814, -14715106, 6353792, 13383841, 30866428, 42114100, 22052504, -3807224]
42215c807224L238468P533967k6053258k2445239M5812745Q2842345J4764206
42208A01886010p8415714p8927176p387562K9743025J2305795L574897J2670166
42201d550559j0615119n4931339m5719506K4258804P0663862M4624267q444282
42194A5286128l6733775m1828685l1048734L387657L3543931R418206m7537522
42187i5512794m9191143K5236452Q3912982N6170671r766966l7878347l4825547
42180f1854692l9730665l3476787J4338336N7316093K8482027l8654809m1410970
42173a14991467L8090774R7402254N6083619l6597466p5603360l2873075L0468253
42166c8020468N6518434M5279458K1434368q315900m4267677o5466734m4471925
$$ y = [-3807224, -568756, 6965211, -19088047, -41533286, 4279459, 87121804, 101886010, 23470296, -55456880, -62844442, -33101417, -20795622, -17220725, -4550559, -15165678, -70097017, -115816523, -91557719, -20893857, 23730410, 15286128, -21447647, -63276332, -94325066, -90937409, -57393478, -47975272, -95512794, -144703937, -119467485, -35554503, 20616168, 10849202, -27029145, -61854692, -101585357, -135062144, -120723808, -63407715, -34925688, -73580497, -114991467, -76900693, 20501561, 76585180, 39987714, -35615646, -68488721, -38020468, 18497966, 63777424, 85211792, 76895892, 32628215, -32838519, -77310444]
42159g7310444J0316573N1951639M4996185L141861l2349013l6137165j0148189
42152d5538553K9314551N7647009N1119152J1384149k9900113m6867135m4133235
42145a6974175l1949861n274922K7513637K9812411q227757l1667875P064072
42138b9704470O1455538M3663604m4259385j02970836o7693816J7257398P1189369
42131e1062598O4935816J7203185l9896193o6848493l8310358J5940697L4133112
42124f3904832L859164k4682951j7951999K802905J4922885K3082637J9350612
42117d2521579j3076381l5923446J7077471J13240270J20477918k756335j14347562
42110D2170356p6181274M8150717R4325141L1498985l1491483l4242980k2976943
$$ y = [-77310444, -66993871, -15042232, 29953953, 33095814, 746801, -35390364, -45538553, -16224002, 41423007, 92542159, 103926308, 74026195, 27159060, -16974175, -48924036, -54198958, -26685321, 3127090, -5100667, -36768542, -29704470, 31751068, 75414672, 31155287, -71815549, -139509365, -122251967, -51062598, 13873218, 31076403, -8819790, -75668283, -113978641, -98037944, -63904832, -60045668, -84728619, -102680618, -99877713, -84954828, -61872191, -42521579, -55597960, -91521406, -74443935, 38796335, 159274253, 156517918, 42170356, -34010918, 14139799, 108464940, 139963925, 108472442, 74229462, 51252519]
42103E1252519k9746940k3468931K099937L501265k3384233k6215589O453047
42096c9508925K2124360M216248K919909L5724567M9577991J9995227l889602
42089I1159775K647267r062695n7223079p2837731j9076623K4061742j4240889
42082e4572233o4836179k3783361P1216048R2347363J7550792m8627996m2651550
42075e3357116j3030057j0056948j1864319N891243J5682076j930928j2524945
42068h1190994J2215097M1063617L2660541j171805j8959706p445885J2510698
42061a0318437J5666534p632788l8334688l3244343K3188649P4157647M6880095
42054G0362669m1844656r4458595o1605991o28155J9578818Q537360J0487807
$$ y = [51252519, 21505579, -1963352, 136585, 3637850, -19746383, -45961972, -39508925, -17384565, -13168317, -10248408, 25476159, 75054150, 95049377, 91159775, 93807042, 84744347, 27521268, -45316463, -64393086, -40331344, -54572233, -119408412, -143191773, -71975725, 20371638, 37922430, -10705566, -53357116, -66387173, -76444121, -88308440, -82417197, -66735121, -68666049, -81190994, -68975897, -27912280, 4748261, 3576456, -15383250, -22829135, -10318437, 5348097, -2284691, -40619379, -73863722, -50675073, 23482574, 70362669, 28518013, -65940582, -127546573, -128174728, -108595910, -100058550, -89570743]
42047h9570743K8277589L9560947M3463538M3096120K1737406j7871644l1915673
42040C6777540j369178K3137211m407495m9247300n4272328l1852389k6841821
42033a08075760k7242746M893045M2964329K9774240j3860868j3694132K7105929
42026e8135963K6992202k8170452m6553625K0957498R1176642P0132256j2858075
42019F3540483o3465733n6018930l4604534k2273832m695670J6734244K1931624
42012g8852348J5754918K3595199M5373076N2048274K6681158j6547114m8429509
42005A9623654m5362548j0951322J2859964j3678441o4428414o7299845q218448
41998a77455400L9058156K2765460p157528J3509427N1411091L2324185k5180349
$$ y = [-89570743, -61293154, -21732207, 21731331, 64827451, 86564857, 68693213, 36777540, 35408362, 58545573, 54138078, 4890778, -49381550, -81233939, -108075760, -135318506, -130425461, -87461132, -57686892, -71547760, -85241892, -58135963, -31143761, -59314213, -105867838, -84910340, 6266302, 76398558, 63540483, 74750, -55944180, -90548714, -112822546, -117518216, -100783972, -78852348, -63097430, -39502231, 5870845, 57919119, 84600277, 68053163, 19623654, -25738894, -36690216, -23830252, -37508693, -101937107, -169236952, -177455400, -138397244, -115631784, -122789312, -109279885, -57868794, -25544609, -50724958]
41991e0724958k7732616M5620343J03512786O9251488k3843384r3170038j05338905
41984h2425284p8308216k9355897L4330552R0631306J03758340N6780744k2982105
41977G2429440p3897851m9931713K5627678P2413264M0439182l0442194o3289542
41970f651736l6948097O700430K9857229L0791024J8157973k599820j6555658
41963B2751345r109445R747480J8940451J8764280K2216274K4804488J3594899
41956A21709772o010289k1752591l3973049l5069146l279356M2520849K8357326
41949I2503516o8398524j42130807q1364530N8150036J12414246L7669587l9834989
41942c0991465k5724452J4786801r564085o2938129n3057391J6959114O3711308
$$ y = [-50724958, -78457574, -32837231, 70675555, 139927043, 116083659, 22913621, -82425284, -160733500, -190089397, -155758845, -65127539, 38630801, 95411545, 72429440, -1468411, -51400124, -25772446, 46640818, 87080000, 56637806, -6651736, -43599833, -36899403, -7042174, 23748850, 41906823, 39307003, 22751345, 13641900, 23389380, 42329831, 61094111, 83310385, 108114873, 121709772, 115699483, 93946892, 59973843, 24904697, 21625341, 64146190, 92503516, 24104992, -118025815, -199390345, -141240309, -28826063, 8843524, -30991465, -56715917, -41929116, -51493201, -114431330, -167488721, -150529607, -86818299]
41935h6818299N1496438J9706455J629867j0723990k4328061k4378345k317914
41928g5733849K8817405M9263227M6141334K1383698m218285j1917739j3047438
41921D0688353k9794245n0964457m7313790k7830220k6390993l1717425P95546
41914a72527231N7481467O6604864J3794835k7464477j5383761M55318j4232706
41907i1271691j0327266L8751052O1755493J0816880l2958829J3408184P9744738
41900F9918561M6085489n5323508q6628559k4572447J4546098k9024255p7879325
41893a42877946n8649499j926890L7428079N7185486O3060830L5132231j8175573
41886b8823282m4819856k3231297J0383007K8775648M0162591L5772881q921303
$$ y = [-86818299, -35321861, -15615406, -13985539, -24709529, -49037590, -73415935, -75733849, -46916444, 2346783, 48488117, 69871815, 65653530, 53735791, 40688353, 10894108, -40070349, -87384139, -115214359, -141605352, -173322777, -172527231, -115045764, -48440900, -34646065, -62110542, -77494303, -77038985, -91271691, -101598957, -62847905, -1092412, 9724468, -23234361, -9826177, 69918561, 116004050, 60680542, -25948017, -50520464, -35974366, -64998621, -142877946, -201527445, -203454335, -166026256, -108840770, -45779940, -10647709, -28823282, -73643138, -96874435, -86491428, -57715780, -17553189, 18219692, 9298389]
41879I298389o2972277n6216684Q168570M4796568J8322941q338804O266089J5035221
41871b5639987j2685348j9713832L3389873Q0878013N4326824k580577j1236390
41864I6738576J3885391P946364k5906128l5895109j8578345o009129O549306
41857C8730926L0719299K3086704m6700160j01544673m6334984O7149677R0639296
41850E5746085q64478o8258248j9074984O2390348N5964795k3504671p5075306
41843a2676459o0262307j9430510J5079398M3222532N7178897M2326433R550232
41836G4988216j8729156m2058263o3914593o0366945j0490010N5923521Q3661387
41829A9014157N7081599N188058m3710355p3026148o0254753m29115N7041901
$$ y = [9298389, -53673888, -109890572, -101722002, -56925434, -38602493, -46941297, -40675208, -25639987, -38325335, -58039167, -24649294, 56228719, 110555543, 107974966, 96738576, 110623967, 118570331, 92664203, 56769094, 38190749, 32181620, 38730926, 69450225, 92536929, 45836769, -55707904, -102042888, -34893211, 55746085, 54881607, -13376641, -32451625, 29938723, 85903518, 62398847, -12676459, -72938766, -92369276, -77289878, -34067346, 23111551, 65437984, 74988216, 56259060, 14200797, -49713796, -110080741, -120570751, -64647230, 19014157, 76095756, 81283814, 37573459, -35452689, -95707442, -96136557, -39094656]
41822c9094656N0107470q433158l6976003L380388N3187443M0795133j8459356
41815D4507261n1323146k6885100J7831675L8705765K8363642L190697j6533884
41808C7856910j2427920J4569760L1058662N846288m0085184n1024252j0859478
41801b5065214L3498884L6416292R284157r187045j1873400k2963889n0386466
41794d0276681o5140441l2827965M0895508R9639402Q4110510N340625m8926025
41787D2814933j5882588N0076151M2242457m3859195r4796804m1790543L9805468
41780b1390121M6218324r151034m1527234l3239535l3746236n0296191l6958278
41773a80090305J1594695M6051987M9942255N6745045O6514173L2950220l8889449
$$ y = [-39094656, 11012814, 2579656, -34396347, -31015959, 22171484, 62966617, 44507261, -6815885, -33700985, -15869310, 22836455, 51200097, 54390794, 37856910, 25428990, 39998750, 71057412, 76903700, 36818516, -14205736, -25065214, 8433670, 44849962, 54134119, 44947074, 33073674, 10109785, -40276681, -105417122, -138245087, -97349579, 2289823, 86400333, 91740958, 42814933, 26932345, 77008496, 119250953, 75391758, -19405046, -61195589, -21390121, 24828203, 15677169, -25850065, -59089600, -92835836, -143132027, -180090305, -168495610, -122443623, -72501368, -15756323, 50757850, 83708070, 44818621]
41766D4818621o7781149j4505562M8682782M1921443j0170892l2220350j4696362
41759c951469p467595k7023460l7987278j7061530J8106872M1618461M2296778
41752H530779J8507606j8730182m3510812m1069209k7345000k3059466k3626912
41745a50303196j4975205k26262J1862812K5123364L8710151L2290026l825619
41738f1343929l9784467l4916788J2934709O4262862P5607479L5203497k1207810
41731C0755553l2778389J6197050N5149171J0137898p2353112o4397830N4363203
41724b926456J39622562P7805045m6585394p5451392n597102K9274228k3381925
41717I2759566o8517376l1166688K9998041K9113794j5933166k7937221Q114156
$$ y = [44818621, -22962528, -37468090, 11214692, 53136135, 42965243, 10744893, -3951469, -11419064, -38442524, -76429802, -93491332, -75384460, -33765999, 8530779, 27038385, 8308203, -35202609, -76271818, -103616818, -126676284, -150303196, -165278401, -165504663, -153641851, -128518487, -89808336, -57518310, -61343929, -101128396, -136045184, -123110475, -58847613, 16759866, 51963363, 30755553, -2022836, 14174214, 69323385, 79461283, 7108171, -57289659, -2926456, 136696106, 214501151, 167915757, 92464365, 86867263, 116141491, 92759566, 24242190, -6924498, 23073543, 52187337, 36254171, 8316950, 16431106]
41710A6431106L5919629J7246356k2733329l7011226j3213325J6008873J1587454
41703B4235538k2473034l8419729p694191L3590282L2035933o587690l0004570
41696a5317461j8696841l743704o701968j2472239q501851k276389Q865268L5305218
41688b3539967N2373805J7037074n2080157p0875979k504593P7069193P3741456
41681G1220832j658073n6077279l6638371J9452558M6983218K1627181l2138901
41674C2771165o9060830n6692039m559242L8225311L0705675j5322573m9853417
41667i3785950l8843268O933241N0469703O3674248M6572491J9804293j69898
41660E4654860j5048336l0812600m2158565m3963569m2799611l5219572M756855
$$ y = [16431106, 52350735, 69597091, 46863762, 9852536, -3360789, 12648084, 24235538, 1762504, -36657225, -44351416, -10761134, 21274799, 14687109, -15317461, -34014302, -37758006, -44459974, -56932213, -65434064, -67710453, -58845185, -23539967, 28833838, 45870912, -6209245, -77085224, -79589817, -2520624, 71220832, 69562759, 13485480, -23152891, -3700333, 43282885, 64910066, 32771165, -36289665, -92981704, -97540946, -59315635, -28609960, -43932533, -93785950, -132629218, -125695977, -75226274, -11552026, 35020465, 54824758, 54654860, 39606524, 8793924, -33364641, -77328210, -120127821, -155347393, -150590538]
41653a50590538P8469566J21659559O9531076l8345531q6273147l4111753K8768801
41646a0891967J7565884k9501056k7186357K0385305M1741281K2193562J2712290
41639D7018942K2115910m055101p4248820j05629319l8107316O6038968R7715029
41632A0848293M1698841j9403042k5945450m926003o618992k9207655l3559113
41625f7113121m933219L0075350M0226366K2207295m237431k0881879k4843774
41618b9500413k1043045p926273J8950097M5318564L6894032j7946406p1957519
41611d7210963o0320965J2600220O4324222L6918844k4505614l5130459J3682053
41604c9642662N4997867N0135610K8460736J7316101j878406m0932397o5870503
$$ y = [-150590538, -72120972, 49538587, 119069663, 80724132, -5549015, -39660768, -10891967, 6673917, -22827139, -50013496, -29628191, 12113090, 34306652, 47018942, 69134852, 65079751, -9169069, -114798388, -152905704, -86866736, 10848293, 52547134, 33144092, 7198642, 2272639, -4346353, -33554008, -67113121, -72046340, -41970990, -1744624, 20462671, 16225240, -4656639, -29500413, -50543458, -58469731, -39519634, 5798930, 42692962, 24746556, -47210963, -107531928, -94931708, -30607486, 6311358, -18194256, -53324715, -39642662, 15355205, 65490815, 93951551, 111267652, 109389246, 68456849, 2586346]
41597B586346m9911720k0124696r867035n876887J2533116K2531720l2603k3602187
41589g1763946q947697J3615532j4737837p9114300j02305848n4491131J6724555
41582c01020672O5724867Q9126510Q2744677L3442158k8360964l8941634Q949426
41575h8335632M9153870M1536396K3529449K9400653K6652926j6447451n8241974
41568G248237m1931495J2417649L6738231J1905059k0488979k8223409j9573170
41561d1907877j0757628m160766J028139M735370J0440699J7087088J7906469
41554e628506J9417102L9203138O8713581O6709067J3811053n1586542p6832178
41547G3806715n2394119o199215L1676337L8368019N556121l6858474l8031934
$$ y = [2586346, -47325374, -67450070, -77317105, -83193992, -70660876, -48129156, -48161759, -71763946, -80711643, -67096111, -81833948, -160948248, -263254096, -317745227, -301020672, -235295805, -146169295, -63424618, -29982460, -58343424, -97285058, -88335632, -39181762, 2354634, 25884083, 55284736, 81937662, 65490211, 7248237, -34683258, -22265609, 14472622, 26377681, 5888702, -22334707, -41907877, -52665505, -56826271, -55798132, -51062762, -40622063, -23534975, -5628506, 13788596, 52991734, 121705315, 188414382, 202225435, 150638893, 73806715, 21412596, 15213381, 46889718, 85257737, 90813858, 53955384, 15923450]
41540A5923450M836254L0398787k365884n1605703n3178637q088258L4133096
41533b9946895M7557678L9528114J6818344j0576132j6460269N747358J8963064
41526G1631262l380856k9823022k3886467q269084j9542466l5143804j3806395
41519f2220832K1867337K0497662l513595M613312L3786486J8852536m0278425
41512f395519o6371065k9017851J0140469O247290j805190K3070276M3385226
41505b0746364J8521390j5828468p349701K1258919J1884396k7580131l3793743
41498e3633702Q557148L8499292O429012n4655915o8043597l676076Q7061543
41491c9462295J23202741P4971141j0401625o4585875o7832024m8123943k5283918
$$ y = [15923450, 20759704, 51158491, 48792607, -2813096, -55991733, -64079991, -29946895, 17610783, 57138897, 73957241, 63381109, 46920840, 52668198, 71631262, 68250406, 38427384, 14540917, 6271833, -13270633, -48414437, -62220832, -40353495, -19855833, -23369428, -18756116, 15030370, 33882906, -6395519, -72766584, -101784435, -91643966, -85396676, -87201866, -64131590, -20746364, -2224974, -18053442, -25403143, -4144224, 7740172, -19839959, -53633702, -45076554, -6577262, -148250, -54804165, -122847762, -126523838, -39462295, 83740446, 158711587, 148309962, 83724087, 15892063, -32231880, -57515798]
41484e7515798R283833N3372183P0901071L2111542l8381259p5544210l9627251
41477d5399889L4959943O3943430M339029p8481882p1625849L8173724J25301558
41470G1210064P9215557m5063667j00602399m4764294K6562316L5741601J6176035
41463C8475213K2856595M0198369K9530367J698041j3189920k0128507l3989301
41456F5450857m1274460l1256555k5179502l2359160j9923079K7629075O2064423
41449E151599L8406677j0031279k2753771n884030j0104727l8051313m2912537
41442h6179381j1052961J8239134J7449890M29255j6633065l3143612l6657173
41435a47547913o715261M0814041N6998612K6234719o440824L213302L7235058
$$ y = [-57515798, -48231965, 5140218, 76041289, 108152831, 69771572, -5772638, -45399889, -10439946, 53503484, 57842513, -20639369, -92265218, -54091494, 71210064, 150425621, 105361954, 4759555, -40004739, -13442423, 22299178, 38475213, 61331808, 101530177, 131060544, 132758585, 119568665, 99440158, 65450857, 24176397, -7080158, -32259660, -64618820, -84541899, -56912824, 5151599, 43558276, 33526997, 10773226, 4889196, -5215531, -43266844, -86179381, -97232342, -78993208, -61543318, -61114063, -77747128, -110890740, -147547913, -154263174, -113449133, -56450521, -30215802, -36656626, -33443324, 3791734]
41428C791734M1876988J839047l7080281k3339386L4850536P3839061N0126513
41421A45904212m036827k3970283r46541J2619132j1255943l6701465l1879943
41414D9732342k3536261m2718169o0706894l3896687J8034250L7517354J3812336
41407d1761729j3718525k2514943k0815798o853574K5761470M7772989K1712842
41400a0417268k9462613m3523405j4060244J232638j9910940k6951585J3198907
41393a29894510N5544617N0624264K3786525K6773486M9511491L8923253j5130388
41386A00138738o6099753p5323194m7752466o598733L0930276N0871731M5264592
41379C1431191K4342353Q699543P185161J3229041J8210415J7510791J0037827
$$ y = [3791734, 45668722, 47507769, 10427488, -12911898, 21938638, 95777699, 145904212, 141867385, 117897102, 116950561, 129569693, 118313750, 81612285, 49732342, 26196081, -16522088, -77228982, -111125669, -93091419, -55574065, -41761729, -55480254, -77995197, -98810995, -105664569, -79903099, -32130110, -10417268, -39879881, -83403286, -97463530, -96230892, -116141832, -143093417, -129894510, -74349893, -23725629, 60896, 26834382, 76345873, 115269126, 100138738, 34038985, -41284209, -89036675, -95635408, -64705132, -13833401, 31431191, 55773544, 64473087, 71658248, 84887289, 103097704, 120608495, 130646322]
41372A30646322Q64568m665039j4445976l9565188o3324179m7185063J3303575
41365b4370980O4884484N7538693Q381899k8103556l5333414l8868759m5733965
41358d1605598k8797460K0550831O6821112P5365739N1224541J6288722k1558519
41351A38289368n5198492o3038377l6384477k921803N979810l102805m425657
41344b0802433J839451k450427j0743027K139174L1157432L9891316J7300716
41337E8332202n232703j0242762k4758477o3957720q3177206l5128589M5201450
41330a18963805O8716897Q715037n7799398m4414793L9928172J05090770Q5551898
41323H6824778J1294352l0989498k035883L8552891O564807q5161977j25090627
$$ y = [130646322, 131510890, 126845851, 112399875, 72834687, 9510508, -37674555, -24370980, 40513504, 98052197, 106434096, 78330540, 42997126, 4128367, -41605598, -70403058, -49852227, 16968885, 92334624, 143559165, 159847887, 138289368, 83090876, 20052499, -16331978, -19253781, -13273971, -16376776, -20802433, -18962982, -21413409, -32156436, -30017262, 1140170, 41031486, 58332202, 53099499, 42856737, 18098260, -45859460, -129036666, -164165255, -118963805, -50246908, -41531871, -99331269, -143746062, -103817890, 1272880, 86824778, 98119130, 67129632, 65093749, 103646640, 110211447, 25049470, -100041157]
41316a00041157m9566882N7143963O7672332j5341421o9787396l0057347L6757227
41309a03220681N1282417L0104157K3589924J9243555j9512728o4496029n3326079
41302a16335464Q812557M8794381K6627930j9228582l4107802j0883595J7928303
41295g8392272K0806598o817907l7819971l6918771k016736L2468779M4881970
41288f3808310M8188838M4257763M788256o1491188p6678490J675940Q5607770
41281a7459421N7696468n3108237j00053879k8073193N3669677M3153931j3417478
41274e7592132j7273208K8041445M4741495J3531765j4559605j8576264l2000579
41267e3687083o1873514n9868530j711105N9138827N6441947M0067l8437993j7565981
$$ y = [-100041157, -149608039, -92464076, -24791744, -40133165, -109920561, -139977908, -103220681, -51938264, -21834107, 1755817, 20999372, 1486644, -63009385, -116335464, -107522907, -58728526, -32100596, -51329178, -85436980, -96320575, -78392272, -57585674, -64403581, -102223552, -139142323, -141159059, -108690280, -63808310, -15619472, 28638291, 33426547, -28064641, -104743131, -103067191, -17459421, 40237047, -12871190, -112925069, -140998262, -87328585, -44174654, -57592132, -74865340, -46823895, -2082400, 11449365, -3110240, -21686504, -53687083, -115560597, -175429127, -177140232, -118001405, -61559458, -61519391, -99957384, -117523365]
41259a17523365K8984104M2537691R408024l2934719m4775962j9879685K1421508
41252a12762404N1825991M8156986Q332223l3192582l2015198J0162552M2398787
41245a7093645L3966862J3180531J0649196M729304l0399229n8318433k6931077
41238g0216491L7872126N7096197J4508207k3433671j2142533J5872178J9138006
41231C8694019N519328m495157j4856513k5164963j8049136k745626j5910657
41224c7008705m9972920m2330205K5052725P8119423N4425164k498224j3537322
41217A2249936J9322560L3784924P013038l3033922o4730063p3829003k8209211
41210a27431741P1646392J38710358Q2151132n7219042j34993852p9972415K6946948
$$ y = [-117523365, -88539261, -46001570, -36593546, -69528265, -114304227, -134183912, -112762404, -60936413, -12779427, -4447204, -37639786, -69654984, -59492432, -17093645, 16873217, 30053748, 40702944, 45432248, 15033019, -43285414, -70216491, -32344365, 24751832, 39260039, 15826368, 3683835, 19556013, 38694019, 44213347, 39718190, 24861677, -303286, -18352422, -21098048, -37008705, -86981625, -129311830, -104259105, -26139682, 28285482, 25787258, 12249936, 31572496, 65357420, 72370458, 39336536, -25393527, -99222530, -127431741, -55785349, 82925009, 165076141, 107857099, -27136753, -107109168, -80162220]
41203h0162220O9891840K9987874k8664326n1501370l3326961K478489L0552755
41196f0743919M1091346M3976396M5714934K9031227k0017966p3690405q6750688
41189h1389075n5940620j9425810m82681Q650573J0478822k881155j5287039L606535
41181a52670450M4014471N9121101L5159082R899354O232210J178908j5328998
41174a2394322q952111L2010569N1094161J537631o7858099p0062208m587654
41167g9212033M1636340J8693317k3210397j4923969L6291180O6371991M0720050
41160H6366479j4949149n7475133o6567378m2407409N954745N4633004O7708838
41153C3263997L0700395k3475366m4148981k0856511Q072196R183732p276409
$$ y = [-80162220, -10270380, 19717494, -8946832, -60448202, -93775163, -91296674, -60743919, -19652573, 24323823, 70038757, 99069984, 79052018, 5361613, -81389075, -137329695, -156755505, -157238186, -148587613, -138108791, -140989946, -156276985, -152670450, -108655979, -49534878, -14375796, -4476442, 1755768, 2934676, -12394322, -21346433, 10664136, 61758297, 63295928, -4562171, -74624379, -79212033, -37575693, -18882376, -42092773, -57016742, -20725562, 45646429, 86366479, 71417330, 13942197, -52625181, -95032590, -89077845, -34444841, 33263997, 63964392, 40489026, -3659955, -24516466, -16444270, -7260538, -14536947]
41146a4536947j4047512q164555l443604P75913J5957956L7361460M5198177K9880168
41138H8981056j547117l7444046o2946006o0098674k8021016N931909J5635120
41131g9508774O564860j955037o923691r438941M198983L3127937L6740863j2568970
41123b9762770o7764677n6650363J2217926N6213118L6820824M821091Q936736
41116c5168115K5944598J6115332j0400247k7221340m2462391o4337448n6791396
41109a94321007J0189039R1171043J08140301N3901937k341972j2213755M61835
41102E4987421m636785k3089839k4568607n196294O546080j0894231m3540495
41095e0392750n4953878k5219907K3783654M6513043K1103889k5794241m6104091
$$ y = [-14536947, -28584459, -36749014, -40192618, -39416705, -23458749, 13902711, 59100888, 88981056, 87433939, 49989893, -12956113, -73054787, -101075803, -95143894, -79508774, -72943914, -74898951, -81822642, -91261583, -87062600, -53934663, -17193800, -29762770, -97527447, -154177810, -141959884, -85746766, -48925942, -44104851, -35168115, -9223517, 6891815, -3508432, -30729772, -73192163, -137529611, -194321007, -184131968, -92960925, 15179376, 69081313, 66739341, 54525586, 54987421, 50350636, 27260797, 2692190, -2504104, 4041976, -6852255, -50392750, -105346628, -130566535, -106782881, -60269838, -39165949, -64960190, -111064281]
41088a11064281j8814720L1227863N9543777M6396580J6341889P297012J9027540
41081D9955660J2788561k4108604m3025736k97428O2959210O2435128j0798156
41074A09908635p2685567o0772586r441530J5488696N345620n476837n47977J3504533
41066d677013L2535786M6561205L0557477k1256321p2984093q7007997o2892496
41059a39163452j6204246M3530030Q7338144O9219332k179196m2820042j158273
41052a437703N7378287M2359969k4305169m7069217p387903K0470707M9910j9927253
41044B0131628o741105J718415j8666545k1880107K5920255P2741454N2840720
41037A26064715j2359619m8673965l4915391j3500931j2040322j2439432K800598
$$ y = [-111064281, -129879001, -98651138, -39107361, 7289219, 23631108, 30928120, 49955660, 62744221, 38635617, -4390119, -4687547, 58271663, 120706791, 109908635, 37223068, -23549518, -32991048, -17502352, -12156732, -17633569, -18181546, -4677013, 27858773, 74419978, 104977455, 83721134, 10737041, -76270956, -139163452, -155367698, -111837668, -24499524, 44719808, 42540612, -279430, -1437703, 55940584, 98300553, 73995384, 26926167, 19538264, 40008971, 40058881, 20131628, 13390523, 15108938, -3557607, -25437714, 482541, 73223995, 126064715, 113705096, 65031131, 30115740, 16614809, 4574487, -7864945, -5064347]
41030e064347K0983013K4755301J4523332l013612k3831494l6583318k4891930
41023c3123055R208225L7487494L3284081K856570j9842133j2052001R117387
41016B6936568N786534l0624943o1039535m3389744J2570165N3846722M6410905
41009A0496672R825776j4458087j1734807l35851m07587j0835234j8047271j7636264
41001e3132653j5825874r219368J7945735N9663910P0581059J8690345n2728041
40994C5975113o4723538j0173214L3989391K0468553o459099O46222J0818117
40987B0541545j6462981m1727041q531198M7505765M7233126j810444k3019402
40980B3729370k534658J877266k0984588k0795598K632406r231393m8346285l2015153
$$ y = [-5064347, 15918666, 40673967, 55197299, 52183687, 28352193, -8231125, -33123055, -23914830, 13572664, 46856745, 49713315, 29871182, 17819181, 26936568, 32723102, 2098159, -58941376, -102331120, -89760955, -35914233, 10496672, 20322448, 5864361, -5870446, -6206297, -6613884, -17449118, -35496389, -53132653, -68958527, -78177895, -60232160, -568250, 70012809, 88703154, 35975113, -28748425, -38921639, -4932248, 15536305, 9077206, 9723428, 20541545, 4078564, -37648477, -46179675, 1326090, 48559216, 46748772, 23729370, 21194712, 23071978, 2087390, -18708208, -16075802, -25307195, -73653480, -105668633]
40972a05668633L9066719M8000985m4498445j05580770l0006420Q4103553Q7842182
40965b6740829J2778879l126571M6873290M7040966k0816252m1863674K8279348
40958D2425157Q2489313L6183627m7309794p2865398n0250392l8886247l8876584
40951h7090318j8516324Q732337J3042798J2936874M0033841O8493646M6388552
40944H4021406j9211424o7065574o3409150k9359344P319983L9596805N7419895
40937I312597M1190321m300017l9185537l3017614m280639N069213j1550021j5423171
40929e2184868J8653632N4359699L4733471l3041407p4010018m2886010J4971560
40922g9403941L3012675J7139102J9130386M2234939L9144429m37559k7851816
$$ y = [-105668633, -66601914, -18600929, -63099374, -168680144, -198686564, -114583011, -26740829, -13961950, -17088521, 29784769, 76825735, 56009483, 14145809, 42425157, 124914470, 161098097, 113788303, 40922905, -9327487, -48213734, -87090318, -105606642, -96874305, -83831507, -70894633, -30860792, 37632854, 84021406, 64809982, -2255592, -65664742, -95024086, -87704103, -48107298, 9312597, 50502918, 46202901, 7017364, -26000250, -30280889, -25211676, -36761697, -52184868, -33531236, 20828463, 55561934, 22520527, -51489491, -94375501, -79403941, -46391266, -29252164, -10121778, 32113161, 71257590, 70820031, 42968215]
40915D2968215j5589894N07180j4388592l7103677k7569658R580959L7529473
40908d065994L4794284L564421m4176216q3282435q1165302l2766748K6359822
40901a80738168O0040914O6593641O0243537M1822066Q086151k8460395m7834342
40894b0246596l9310410m454145L7340557M6656775J54124o3875719p2251024
40887a15986438l729026Q2548353J16997046Q4914298J5727762m8983556o6445024
40880F5043415k4022080K2750212M76047p1674068q9703792j7395711M7855974
40873f6670003K1056897l6999248k0702130M8366506O2242616N942717k5150107
40866a1912752J3930021N4727055L8067499J38378n272117J0429581J3303751
$$ y = [42968215, 27378321, 27885501, 13496909, -23606768, -51176426, -41595467, -4065994, 30728290, 34292711, -9883505, -93165940, -174331242, -207097990, -180738168, -120697254, -54103613, 6139924, 47961990, 56048141, 27587746, -20246596, -59557006, -64011151, -26670594, 19986181, 20140305, -43735414, -115986438, -119715464, -37167111, 79829935, 164744233, 180471995, 131488439, 65043415, 41021335, 63771547, 64247594, -7426474, -97130266, -114525977, -66670003, -45613106, -82612354, -103314484, -54947978, 7294638, 13237355, -11912752, 2017269, 56744324, 94811823, 94950201, 89678084, 100107665, 113411416]
40859A13411416P749589P228815k754134k8096864l9848075k6272109k4714618
40852F704020n7021565p8149018m1197915K3051005M7318204K1793821p581900
40845h5083348j4520273j1397516n577811R711426K4576568J9590315L131182
40838e9569457K03628O724852k188727k0300786j4074719J7182425L4058699K1813079
40830a6151006J3332979K7548851L3956652R562340j4057245l557070J3391976
40823F4027477p956120m7066767m2066476J0471725M3178535J6823754k5806141
40816A1605987k9645843j817499J7751344J9429015J5932168L227517k2659695
40809A3822994l1931082L131797M9645713M6398684m825348l4679634n179833
$$ y = [113411416, 121161005, 128389820, 125635686, 97538822, 57690747, 31418638, 6704020, -50317545, -128466563, -169664478, -146613473, -99295269, -77501448, -85083348, -99603621, -111001137, -116578948, -106867522, -82290954, -62700639, -59569457, -59365829, -52640977, -54829704, -75130490, -89205209, -72022784, -37964085, -16151006, -2818027, 24730824, 58687476, 68249816, 54192571, 50635501, 64027477, 56071357, 9004590, -33061886, -22590161, 20588374, 37412128, 11605987, -18039856, -19857355, -2106011, 17323004, 33255172, 36482689, 13822994, -18108088, -14976291, 34669422, 81068106, 76242758, 41563124, 36383291]
40802C6383291L7857939L4862992q096542m1591216m2384121k6137413j1348832
40795b0453902l002477j279930j794951N748327K2538197L2812092K2693666k768091
40787E4492931k6802025l1788086n451587L9098909N4013080O564156n9742133
40780C0385245o4307853j779839M3551599K0658230j6826473o295340K2636048
40773B8021617R808586k5578058k0151530K0866720L3383224K831721k0456393
40766B8725887j1848304m22841j464207N577739K0559138J2005720k2054743m3301936
40758a2223547l5801300k1999481r603533J4521814L2748999J1818470k1263767
40751d1802345j483069N6391445N4556134l4580071j05266900p0120218Q007856
$$ y = [36383291, 74241230, 109104222, 101007680, 59416464, 17032343, -9105070, -20453902, -23456379, -24736309, -26531260, -20782933, 1755264, 34567356, 57261022, 54492931, 27690906, -4097180, -9548767, 29550142, 83563222, 90127378, 30385245, -33922608, -35702447, 7849152, 28507382, 11680909, 5385569, 28021617, 37830203, 12252145, -7899385, 12967335, 46350559, 49182280, 28725887, 16877583, 16454742, 14990535, 20568274, 41127412, 53133132, 31078389, -12223547, -48024847, -70024328, -79627861, -65106047, -32357048, -20538578, -41802345, -43285414, 13106031, 67662165, 33082094, -72184806, -142305024, -134297168]
40744a34297168J6853814l6204880m9565345J4123315Q6522074J00576479O3329267
40737F1337556J8164128q553830j4298394j1944928j9342599l5239409l4214951
40730d4092427m006152L0369242L8648095J8972616j5117226m8965145n3937320
40723g8128317n865548O1346887P3531283J8688349k6509358j1822924J1350566
40716D2590938j4205590m8650398k6080549K7129272L6436008L483089q185086
40709A2517684J2574814J8335969j976264j2149086o414712j2107811j8981315
40702h200721O917488L9709748J6155588m9608320o7559410j0035367M0619233
40695c2001761J7403761l6202367l9634197J6469389P5622800Q4557351L1182120
$$ y = [-134297168, -117443354, -153648234, -203213579, -189090264, -102568190, -1991711, 61337556, 79501684, 70947854, 56649460, 44704532, 25361933, -9877476, -44092427, -48098579, -17729337, 20918758, 39891374, 24774148, -24190997, -78128317, -83993865, -22646978, 50884305, 69572654, 43063296, 31240372, 42590938, 28385348, -20265050, -46345599, -19216327, 17219681, 20702770, 12517684, 25092498, 43428467, 41452203, 29303117, 22888405, 10780594, -8200721, -1283233, 38426515, 54582103, 4973783, -62585627, -72620994, -32001761, -14598000, -50800367, -90434564, -73965175, 1657625, 86214976, 117397096]
40688A17397096m5483128p3399460k4034169L0870491M056752p0092255p1104116
40681a31788789K5058922J02407288P8124254J4325348j721057Q259320j9449812
40674G5215474o6326863o7528337k1599518K1727765M5504271N9313179M4947155
40667I1253126j1164168n8869445l9058994J9012139L1875276j6618963o1201154
40660d4772183n8398855l2275133j2505997O420330L0048728M3461419M1918966
40653b6102725L6985103K2434776j8844362o2834962n1842270K0326653P5719722
40646d158065M3776130m1909292q1068381l1640438M4214215O8215640M3807343
40639D1237152L3314630N5091464N4504009p014779q2150614r9510778o2379682
$$ y = [117397096, 71913968, -1485492, -25519661, 5350830, 9407582, -60684673, -131788789, -106729867, -4322579, 73801675, 88127023, 86405966, 94665286, 75215474, 8888611, -58639726, -80239244, -58511479, -13007208, 46305971, 91253126, 80088958, 21219513, -17839481, 1172658, 33047934, 16428971, -44772183, -103171038, -135446171, -147952168, -141531838, -111483110, -68021691, -26102725, 10882378, 33317154, 14472792, -48362170, -100204440, -79877787, -4158065, 39618065, -2291227, -83359608, -115000046, -70785831, -2570191, 41237152, 74551782, 129643246, 184147255, 177132476, 94981862, -4528916, -66908598]
40632f6908598k9739033j9423570J476466L4899076L7246437J189620k1207690
40625f2467292l626103J4960278P748567O977353L2146372M1360920O673768k7409175
40617A6364688j9926851m972069k1064533l1971063L385933L9880370J6449069
40610a854456l0164510k2266533K4523254L1737832r36382m36003L9756071M1807193
40602H2166466j9164186o9146849n6815980k4293010j9049151k2617998j0391415
40595a39312123l534359j2989431j492338M7037811Q0340722N2098917p260105
40588A4889094m2113243m7047618m4550583l3390669q819249O017353j304707
40581a56319622J916700M0150217P5289534N7800516M458488k8528956k8123346
$$ y = [-66908598, -96647631, -116071201, -114594735, -79695659, -42449222, -41259602, -62467292, -66093395, -51133117, -43384550, -36407197, -4260825, 37100095, 43773863, 16364688, -3562163, -8534232, -29598765, -61569828, -58183895, -18303525, -1854456, -32018966, -54285499, -29762245, 1975587, 1039205, 603202, 40359273, 82166466, 63002280, -6144569, -62960549, -87253559, -106302710, -128920708, -139312123, -142846482, -155835913, -157328251, -110290440, -29949718, 22149199, 14889094, -27224149, -74271767, -118822350, -152213019, -161032268, -155014915, -156319622, -154402922, -114252705, -38963171, 18837345, 23295833, -5233123, -33356469]
40574c3356469k5200829k8342245j5499957J0859933J6399090o449279j9804604
40567a01394360o79887J7426456p235325n7641990p3326645k7758318L9473888
40560b11136181P4473166O6785404L8706117K634518l6433650n1419124j6270157
40553a32659907L8228206M6883513O847344p351522L9373151P3692739K1168256
40546H6181780p0919472r6655114m1295114J8496839M1046430N2270892O0339600
40539D9465841L7202359l587398m892150L4509776M4560670l466646n1461675
40532A02330777n3686384l8939030l5427448j7628925K2478967L1976092j4024435
40525b920386n1211793k1113480L4470634M3636046J4043578j67273N828440q39266
$$ y = [-33356469, -58557298, -86899543, -102399500, -91539567, -75140477, -81589756, -101394360, -102074247, -84647791, -91883116, -149525106, -222851751, -250610069, -211136181, -136663015, -69877611, -31171494, -28536976, -64970626, -116389750, -132659907, -94431701, -47548188, -40700844, -48052366, -8679215, 65013524, 86181780, 15262308, -81392806, -122687920, -104191081, -63144651, -10873759, 49465841, 86668200, 83080802, 78188652, 112698428, 157259098, 153792452, 102330777, 48644393, 9705363, -25722085, -43351010, -20872043, 11104049, -2920386, -54132179, -75245659, -40775025, 2861021, 16904599, 16737326, 22565766, 21726500]
40517B1726500k0155152l0022500l5768575m5417593l0615519K2627608O1111725
40510e6513506L4273770j6032164j2943250L4654966N1059930J6754139j2629048
40503C8624837p380012j900861k0391335l4799263j7633931J6348288L9352302
40496A2220025M0732919J8466126k1801966n3373833m9439368k1872312q737584
40489h3805993k1666545l1961137r161175M3706476Q7085655P2719417k16142
40482E6700556n6823187k4970004N0242009M7249800m8017586r7230499j3809065
40475h6657976R0630335O9468281l6675844p7528342l0185776Q4031j6604242
40468h7469533k709551N1819494N4440626j3142561m1989622K0169843P5795958
$$ y = [21726500, 1571348, -28451152, -64219727, -109637320, -140252839, -117625231, -56513506, -22239736, -38271900, -51215150, -16560184, 34499746, 51253885, 38624837, 31244825, 29343964, 8952629, -25846634, -43480565, -27132277, 12220025, 52952944, 71419070, 49617104, -3756729, -53196097, -75068409, -83805993, -105472538, -137433675, -146594850, -102888374, -15802719, 56916698, 56700556, -122631, -25092635, 25149374, 72399174, 24381588, -72848911, -86657976, 3972359, 73440640, 36764796, -40763546, -70949322, -70865291, -87469533, -90179084, -38359590, 16081036, 2938475, -39051147, -18881304, 56914654]
40461E6914654M3792629j2216672j1496022O632337k1936541n5582998k9283805
40454b3176418J3295336n914870n2608062l4515953L5152650N4610767l3467m2031178
40446e5221195j4976236L3347861L8592379J871855l9090396n7636527l6658458
40439a29770717K5943026Q9130107R0708280J9318519o5163831r5235527n6984130
40432a22054273J2377548O1695103O1549948K6640822n58656l865982j1922190
40425B3862320m0661878m9716394L2109P0041607Q1830445K3032483l9168919
40418F9251773n2242230l3511897k0435680j4160432L720156L0839838M6261238
40411B9722766L7790638J2081371j3903521k6293139k5612189k1748796j3384421
$$ y = [56914654, 100707283, 88490611, 76994589, 83626926, 61690385, 6107387, -23176418, -9881082, -15795952, -68404014, -102919967, -67767317, -13156550, -13190017, -55221195, -70197431, -36849570, 1742809, 3614664, -35475732, -93112259, -129770717, -103827691, -14697584, 76010696, 95329215, 30165384, -65070143, -122054273, -109676725, -47981622, 13568326, 40209148, 39650492, 35784510, 23862320, -16799558, -66515952, -66483843, 3557764, 85388209, 108420692, 69251773, 17009543, -16502354, -36938034, -51098466, -47378310, -16538472, 29722766, 67513404, 79594775, 65691254, 39398115, 13785926, -7962870, -21347291]
40404b1347291J1486984M3167777M3527596l027434n4591518o1376680l1826652
40397g3987218j0698966p699026L811913K3734564J5770903k7721182n8933942
40390a35722954l6190115K0224192N7708732N4402420L0712651J2457215K727139
40383F319280j2131666l7345520n3359525l3343713J6121468M8260932K9942591
40376c5536153j1862466k5496135n768409O837021m368457p322133J9777973M3916442
40368a9822317K3106025k5220944l8804265O944561O0612177N4768299r609506
40361E1974030o1816088m7774602O006225L4766445K2374571Q355174J4212403
40354B8098158J3079198j1526687k6835869n157437K3816642J9483103l070538
$$ y = [-21347291, -9860307, 33307470, 76835066, 73807632, 19216114, -42160566, -73987218, -84686184, -92385210, -88573297, -64838733, -49067830, -76789012, -135722954, -171913069, -151688877, -93980145, -39577725, -8865074, 3592141, 6319280, -5812386, -43157906, -96517431, -129861144, -113739676, -65478744, -35536153, -47398619, -72894754, -78663163, -71826142, -76194599, -83516732, -63738759, -19822317, 3283708, -21937236, -60741501, -53796940, 6815237, 61583536, 51974030, -9842058, -57616660, -51610435, -16843990, 5530581, 13885755, 28098158, 41177356, 29650669, 2814800, -2342637, 21474005, 40957108, 37886570]
40347C7886570l750849J0159627m29990l3725657n0146487m1657908l6573988
40340a18238682l4573038k011016N5534515P9829789M3263019j0642050l7777291
40333b4614754m9101802o0140327m0985775K8453163R3097260P7839880o266984
40326A8280661o7743928m7105797K0719429O3058233N3752155K7112148K6348354
40319I4421255M9999955N0057821q997061r1086647j15660648n6901308J6937281
40312f1229352L0517991m697970k4541929j1640342k493660p808375M995340L8439613
40304c8458684M0987067j0771164o0216061m6736201O642196L4121867K6045933
40297d8385047K6022943M4185856M0991721L600239k5639614j9850874j0857347
$$ y = [37886570, 34135721, 44295348, 43865358, 10139701, -40006786, -81664694, -118238682, -152811720, -154822736, -99288221, -19458432, 23804587, 13162537, -24614754, -73716556, -133856883, -174842658, -146389495, -53292235, 24547645, 18280661, -49463267, -96569064, -75849635, -12791402, 40960753, 68072901, 94421255, 144421210, 194479031, 185481970, 94395323, -21265325, -78166633, -61229352, -30711361, -35409331, -59951260, -71591602, -74085262, -81893637, -76898297, -38458684, 2528383, -8242781, -68458842, -115195043, -108552847, -74430980, -48385047, -22362104, 21823752, 62815473, 66415712, 40776098, 20925224, 10067877]
40290A0067877k7356652l8702411p376932M0083655N0893340K9892093K3302976
40283H0803946L1232246O350360n3085900p8881342l0604664L9168812N7112214
40276E2095672K2542389j5101414l3852299m0772613k2971738L8709637J10690539
40269A11340173J20793677M7791384m4967865q5145361o9116942m3283342l4076338
40262C335386k5849185Q36866L5311504M8623712K9030659l773893k1623221j9036714
40254D6855114j2813719j3219450j1211168K20127Q831316Q55142j5337367j8728510
40246a4548515l299044J5805173K0399429O632069j0903154r830980J6369868
40239B0624846M4970774M6689271J9650918j5378688m4874886o0193446l8003788
$$ y = [10067877, -17288775, -55991186, -63368118, -23284463, 27608877, 57500970, 80803946, 112036192, 118386552, 65300652, -13580690, -44185354, -5016542, 52095672, 74638061, 59536647, 25684348, -15088265, -38060003, 649634, 111340173, 232133850, 279925234, 234957369, 149812008, 80695066, 37411724, 3335386, -22513799, -21676933, 13634571, 62258283, 91288942, 87515049, 65891828, 46855114, 34041395, 20821945, 9610777, 9830904, 18662220, 19517362, 4179995, -14548515, -17847559, -2042386, 18357043, 24989112, 14085958, 4254978, 20624846, 65595620, 112284891, 131935809, 116557121, 71682235, 11488789, -26514999]
40232b6514999K9128832Q5375745N8675322k9638509p3317833l1487463P922681
40225B0143776k9294490p8460151m2513006M0522859N3013300j2285682m4876777
40218i3750171J059767M1851249J1598812l6846691k9863662J6392398M2386393
40211d7171905L4265476J1887214j4850824k9674610n710015L7324280L1026733
40204A7096349l7702830q3018929l8843426L9495038O0822769K8903084P908477
40197e339468N878094j4577624m1806082l0243415M729528M278782k4425260j4531575
40189a16037020L4419118L8371860l1061464q4000704m4831682L2170628N0473438
40182a20495826J4121265J84060K5674572L2489834j797218k3545252M977268
$$ y = [-26514999, 2613833, 87989578, 146664900, 117026391, 43708558, 12221095, 20143776, -9150714, -87610865, -130123871, -89601012, -36587712, -48873394, -93750171, -92690404, -50839155, -39240343, -76087034, -105950696, -89558298, -47171905, -12906429, -1019215, -15870039, -45544649, -51254664, -13930384, 17096349, -20606481, -103625410, -142468836, -102973798, -42151029, -13247945, -5339468, 538626, -14038998, -55845080, -86088495, -81358967, -77080185, -101505445, -116037020, -81617902, -43246042, -74307506, -158308210, -203139892, -170969264, -120495826, -106374561, -106190501, -80515929, -48026095, -49823313, -73368565, -68391297]
40175f8391297M0371014K4636064k6591480m8075294j5500861K9779194L8633273
40168b5139387K410477n3149216q9266592o9509398R069414R0360100J01540017
40161c3684585M0274063j4414354l747948L4628834L0765491j1107761k7447946
40154A5265794J003700K6691057J8035744J92809l152181r253450l0455819m0652371
40146b2324717k1012611M447706J2881358K0257816L8168207L5532629j0289096
40139E7661292n9902707o1251062k5453252p57888O210407K5645619N5632645
40132b214946N9115388K9196771K782962K002512R010210Q267443J0003927J7721789
40124A35886056J1386992j7733068m5063309m4892024k3565333m608026L335835
$$ y = [-68391297, -28020283, -3384219, -29975699, -78050993, -93551854, -63772660, -25139387, -22728910, -75878126, -165144718, -234654116, -225584702, -135224602, -33684585, 6589478, -7824876, -11572824, 23056010, 53821501, 42713740, 15265794, 16269494, 42960551, 60996295, 61189104, 58036923, 48783473, 18327654, -22324717, -43337328, -38889622, -26008264, -5750448, 32417759, 67950388, 57661292, -2241415, -63492477, -88945729, -89703617, -83493210, -57847591, -2214946, 56900442, 86097213, 88880175, 90882687, 99892897, 108160340, 118164267, 135886056, 147273048, 129539980, 84476671, 39584647, 16019314, 11411288, 14747123]
40117A4747123R367408K0109781K7229509J5383335j6767642m6290713m8742510
40110b4963709l0095984j4785320k678662K5688397N3521064L0238820m1187446
40103d262840p5579417j6680416P0357744Q4367185K7861287j7019212k1775291
40096D7269040k5764180l0854131Q615637P5506085P8427290p178558q2502337
40089F3518846o7880076j6622232j4437326m1107931k4934528J9771636J7457580
40082f4234031k9777606l6331149K5635923P4077030L8360819l9790775o9718832
40075a01778621k6810204L7469277O6019543M0409103j7301850n3766821k1390330
40068g7149903N8382861R3357874K5743084p9181803j03653198l1582338L2005366
$$ y = [14747123, 24114531, 44224312, 71453821, 86837156, 70069514, 23778801, -24963709, -55059693, -69845013, -72523675, -46835278, 6685786, 36924606, -4262840, -79842257, -96522673, -26164929, 58202256, 86063543, 69044331, 47269040, 21504860, -9349271, -733634, 74772451, 153199741, 146021183, 63518846, -4361230, -20983462, -35420788, -76528719, -101463247, -81691611, -64234031, -94011637, -130342786, -104706863, -30629833, 7730986, -32059789, -101778621, -128588825, -91119548, -25100005, 15309098, -1992752, -55759573, -77149903, -18767042, 74590832, 100333916, 21152113, -82501085, -114083423, -82078057]
40061h2078057J2614929l1185938o556998O6414606Q4839174J9134301m7602499
40054A5579518m6608932q933051R250408J4659901L6296898N2730671K7275875
40047A00251288j9116388l7276351k9056722l1609550m0489041j9160581K2705134
40040e3752211L4167526J0296689K255342K6346891L3933980k405329l8032704
40033A2810184k7015723J0719760L0469076K3806132K308009l3308438o7309526
40026d7520526n6444615Q694214O5619000N4326359K558111j5169149J5673855
40019B7737249L7833191J1136125l6292922n4226958l3350366o866952m093176
40012e8123809j4910041n821291K6695520L8861992J889800l9873257k5060171
$$ y = [-82078057, -69463128, -100649066, -107206064, -40791458, 44047716, 63182017, 15579518, -31029414, -39962465, -30712057, -16052156, 20244742, 72975413, 100251288, 81134900, 43858549, 14801827, -16807723, -57296764, -76457345, -53752211, -19584685, -9287996, -7032654, 19314237, 53248217, 50842888, 12810184, -14205539, -3485779, 26983297, 50789429, 53097438, 19789000, -47520526, -103965141, -95270927, -29651927, 24674432, 27232543, 12063394, 27737249, 65570440, 76706565, 40413643, -13813315, -47163681, -54030633, -58123809, -73033850, -78855141, -52159621, -13297629, -11407829, -51281086, -76341257]
40005g6341257K1553011J6238594m3966312n8598638J9683405R6821357P4368084
39998D9758244n754134m3998747m1451752o1030083q0313166k1781811Q3131785
39991a21439664J05436249J8988748m5945469l081780N9452236L1288905m1595761
39984C103464m1372610K6863215M9407847j2716000p2441872n7531615m095063
39977a08782634K1738145J8657254K1672221L1895446K4961132Q37605j7468721
39970f489552k0114094j3171031K423135K5456668L8558022K8341887J4900546
39963F9905581K7930248N4362718M7502442k348727m6229402m7575931l5835845
39956F7711084n0811074o6517299k8496050M6446221P5502655K6482989l3260240
$$ y = [-76341257, -54788246, -38549652, -82515964, -141114602, -121431197, -24609840, 49758244, 44004110, 5363, -41446389, -102476472, -182789638, -204571449, -121439664, -16003415, 2985333, -42960136, -46041916, 13410320, 44699225, 3103464, -38269146, -11405931, 38001916, 25285916, -47155956, -104687571, -108782634, -87044489, -68387235, -46715014, -14819568, 10141564, 10979169, -6489552, -26603646, -39774677, -37351542, -11894874, 26663148, 55005035, 69905581, 97835829, 152198547, 199700989, 197352262, 151122860, 103546929, 67711084, 16900010, -49617289, -78113339, -31667118, 43835537, 70318526, 37058286]
39949C7058286l3261857Q070714K7772898J0221853j4250522k9436778l8099137
39942c1924543k8512802R453218M6763182M4307741J1891084q815187j0541756
39935C2620937j8391239l0361372j9927087K191600n498227l5405157k5478874
39928a00249419L9510920Q5609860N1309570k0097878m1336307K098705M8995428
39921F5840879N2446795K0935174j8817717n1942108o6831600n3001656j7381936
39914f8752169J4893053K0240360o532880m4383649n3141774j2445004L9825137
39907a10296926M1626152o835971l2880542O833608O1836641O6951880L8183400
39900F5418242K8321950K6701513j4393717p2336819o7807059M494832M9941203
$$ y = [37058286, 3796429, 11867143, 39640041, 49861894, 35611372, 6174594, -31924543, -60437345, -50984127, -4220945, 40086796, 51977880, 43162693, 32620937, 14229698, -16131674, -36058761, -33867161, -39365388, -74770545, -100249419, -60738499, 24871361, 76180931, 56083053, 14746746, 16845451, 65840879, 118287674, 139222848, 120405131, 68463023, 1631423, -51370233, -68752169, -53859116, -33618756, -40151636, -84535285, -137677059, -150122063, -110296926, -68670774, -75506745, -108387287, -101553679, -39717038, 27234842, 65418242, 93740192, 120441705, 106047988, 33711169, -34095890, -29601058, 20340145]
39893B0340145J1891901m4998982l9631560N479778J4819493j9045691l9607026
39886i0751942k3510996k66978J2883243K7127313L4754280J1166832k7468590
39879e6066838l0378380O693863K4458835r642790m7800351l4585117J2751220
39872a34569558M0223757L5307228K0243502j052002l2096584m1499954L021277
39865a10422334O3601873O1901992r132789o5168828m5254737J0648529L4117717
39858e9708577K5926328K8842373L9837377J6177536l9356759o2277167j2955867
39851f3514756O2807601Q6566954L9137580k4962949m8084670l3381337k8202740
39844i634317n1534519o2112158j8645917M6778277O0050373J2924165j5547022
$$ y = [20340145, 32232046, -12766936, -52398496, -46918718, -32099225, -51144916, -90751942, -114262938, -114529916, -101646673, -74519360, -39765080, -28598248, -56066838, -86445218, -79751355, -55292520, -64935310, -112735661, -147320778, -134569558, -94345801, -59038573, -38795071, -39847073, -71943657, -113443611, -110422334, -46820461, 15081531, 5948742, -59220086, -104474823, -93826294, -59708577, -33782249, -4939876, 34897501, 51075037, 11718278, -50558889, -63514756, -707155, 85859799, 124997379, 100034430, 51949760, 18568423, -9634317, -61168836, -123280994, -141926911, -95148634, -35098261, -22174096, -37721118]
39837c7721118K6006863P8664699N8200016j9876207p1161213p1446255o9301030
39830a06634245p5799447l9562009M2351693Q3161573L2963102k8674054k419102
39823i4612489Q1300240J08064519M4403228l2369094o0765408o2787974o9975817
39816h6742795o2078929j7771481L1075906M1521840K0446489L816074O25504
39809f9107392o972959k5337181m1657186m3047949k2467413J9293566N9990897
39802a29305617O5297487L2244307m87392q600877j7416485m6472178n3808879
39795a58549634O290525Q8662921R2972292K424611q2002247p4017689q405278
39788a32624499K8326829K2848336K8807914O4038339Q3040594N2713925m27068
$$ y = [-37721118, -11714255, 66950444, 125150460, 105274253, 34113040, -37333215, -106634245, -182433692, -221995701, -179644008, -96482435, -63519333, -92193387, -94612489, -13312249, 94752270, 139155498, 106786404, 46020996, -16766978, -86742795, -148821724, -166593205, -135517299, -93995459, -73548970, -69732896, -69107392, -76080351, -101417532, -143074718, -186122667, -208590080, -189296514, -129305617, -64008130, -31763823, -32251215, -40852092, -58268577, -104740755, -158549634, -152259109, -63596188, 29376104, 31800715, -50201532, -124219221, -132624499, -104297670, -81449334, -52641420, 11396919, 94437513, 147151438, 146724370]
39781A46724370l3270037l6652532k7379353k0405932k3458403l4615730l4525223
39774f3582840n771693L1189048L1313127j0623918l9273396p131190N9176900
39767d703962Q9901053N5565204q069143m9815120n1415234k9001374r685084
39760g223660r435610j9048833j2128100K0632063M9951670L8481052p433218
39753E3795364l5337624m587887O3018715R9657652N8601259l6586169j11808691
39746H6752619j14719154o4095336j9405223q920362j0128654j170131L156435
39739a28529806j2724405k3815358L042195M9484116O0728302K1877816k0100396
39732e0037536k3153259l678385M37314q168477J083563K3726433J5709953l3656073
$$ y = [146724370, 113454333, 76801801, 49422448, 29016516, 5558113, -29057617, -63582840, -69354533, -38165485, -6852358, -17476276, -56749672, -63880862, -4703962, 85197091, 140762295, 132693152, 82878032, 31462798, 2461424, -7223660, -16659270, -35708103, -47836203, -27204140, 22747530, 61228582, 53795364, 18457740, 13869853, 76888568, 176546220, 235147479, 198561310, 86752619, -27966535, -92061871, -111467094, -120387456, -130516110, -131686241, -128529806, -141254211, -165069569, -162027374, -112543258, -51814956, -29937140, -50037536, -73190795, -76869180, -76431866, -84600343, -83516780, -59790347, -44080394, -77736467]
39724g7736467o3505424j5940331O8380815Q2449748o932937j02229211r6780827
39717b12294634j4067432L4580677J1385810o861620L7950888Q9815627O5719911
39710F229227j6425074o3007422l2838073K2706394M1464321J7624736j8882186
39703d3128077m4084309m4690379j3659582L7394180P5473970P0397851K1464081
39696E9167735l7191725n6430437j2953492N8601029R1099351N6822995m000023
39689A55115433m0394596m9181996n2431744m7079112j7918208J6858007J9160089
39682a5872127j0877031k7171432L992204N9384487P9271798K7838394o0433198
39675E6133095j00673155n0402148K5419067L1606703j7918197j7012510N7323118
$$ y = [-77736467, -141241891, -157182222, -88801407, -6351659, -13284596, -115513807, -212294634, -226362066, -191781389, -180395579, -187257199, -149306311, -59490684, 6229227, -10195847, -73203269, -106041342, -83334948, -41870627, -24245891, -43128077, -87212386, -131902765, -145562347, -108168167, -32694197, 37703654, 59167735, 21976010, -34454427, -47407919, 11193110, 102292461, 159115456, 155115433, 114720837, 65538841, 13107097, -33972015, -51890223, -35032216, -15872127, -26749158, -53920590, -49928386, 9456101, 88727899, 116566293, 56133095, -44540060, -94942208, -69523141, -37916438, -55834635, -72847145, -15524027]
39668a5524027R0795247J3889921o9927643m2837900L2602879J7548149o9007775
39661d2461149q5817011j0020536L5142161N55698j8172391K9942075O1140886
39654b9690267K3875752n80245M5594766P9724603K4312916n1619533n2932863
39647C8685129j4382639j3973967k5217472J1438682M9907799J3479982n1813707
39640H123807m2727515K5625390N1569446K2545886J5198901L6926053J3460700
39633A30722668n9799725r0527726l7705117K7868889L7068330k396252n9816934
39626e4585867j11269556j04744807l758538J15209681J20285454R235453p1976503
39619a01604683l3093081M7928913O6582711L7080937K4188512K2443306q402914
$$ y = [-15524027, 75271220, 89161141, 19233498, -23604402, 8998477, 26546626, -42461149, -128278160, -138298696, -103156535, -102600837, -120773228, -90831153, -29690267, -5814515, -6394760, 39200006, 118924609, 143237525, 91617992, 38685129, 24302490, 10328523, -14888949, -3450267, 46457532, 59937514, 8123807, -34603708, -8978318, 42591128, 65137014, 80335915, 117261968, 130722668, 70922943, -19604783, -57309900, -29441011, 7627319, 5231067, -54585867, -165855423, -270600230, -274358768, -159149087, -38863633, -29628180, -101604683, -134697764, -86768851, -20186140, 16894797, 41083309, 63526615, 55123701]
39612E5123701m9371932m7516035K90396N0253924O9285540M8650721l239733
39605A23476582m8665656m4260220m035372J1998076o638954m830525L0646341
39598E7690272L1913584l2266657q4500558n3853227J2059530K9906513Q835529
39591c0215014O839343J7793035K304101j4523671J5305286N3906281K3756366
39584G5165727n1549321o8777423j0610168K6771693n249024l3454030K614013
39577f5088533M5186448K0580166l2989178k9583432K2776330L9199832m871778
39570d790145m4675127l7574606j9256042k1048421m332593O7799814J41561575
39563G7684455J27274164K9009057n1247718m9470408j3559210j0529267k2847592
$$ y = [55123701, 5751769, -41764266, -41473870, 8780054, 78065594, 126716315, 123476582, 74810926, 30550706, 26515334, 38513410, 31874456, 27043931, 57690272, 89603856, 57337199, -27163359, -81016586, -68957056, -39050543, -30215014, -23375671, -5582636, -3278535, -17802206, -2496920, 51409361, 75165727, 23616406, -45161017, -55771185, -28999492, -34248516, -67702546, -65088533, -19902085, 678081, -32311097, -61894529, -39118199, 81633, -4790145, -49465272, -87039878, -106295920, -127344341, -131676934, -63877120, 77684455, 204958619, 233967676, 182719958, 133249550, 119690340, 109161073, 86313481]
39556H6313481K180403M3014780K6816105m7193851r0165454m9037360J9531317
39549h540579L4784546m014966m0588472m4565263k4649539R293964M9065020
39542b9215289P0664365N4791005J5367921j9862958m2230103n2307599m0589286
39535d3381944q217693J4317987K661517k3407734k7848839q413216R385024J1042374
39527g3862524j232145k1658035l3434923j3684681K5191480L2181501o032208
39520i2531535k3955045L1594950J02487937Q6021473j3500418q1884131n1868796
39513d3635565J5703929L4642377P489985q305208L872105J4152343Q497910L011118
39505C5428994L516970o370387l1740846n0176855m0106530r718101J3601883
$$ y = [86313481, 88493884, 131508664, 158324769, 111130918, 20965464, -28071896, -8540579, 26243967, 22229001, -18359471, -62924734, -87574273, -78280309, -29215289, 41449076, 96240081, 111608002, 91745044, 49514941, -2792658, -43381944, -51599637, -37281650, -34620133, -58027867, -85876706, -94289922, -84904898, -73862524, -75094669, -96752704, -130187627, -143872308, -118680828, -86499327, -92531535, -116486580, -84891630, 17596307, 103617780, 90117362, 8233231, -43635565, -27931636, 6710741, 14200726, 5895518, 9767623, 23919966, 32417876, 35428994, 38945964, 32575577, 834731, -49342124, -89448654, -99166755, -85564872]
39498h5564872J6752907J2881465J6300313J6098522p359995m0987290m2582432
39491a14461382j159071L5398085K3621399p904097K060965N2323231P6885465
39484F6764595M3289139j067134n243362R855917o099590m6032888n3649092j2305588
39476d488003K3749122M073160m5064138n2257513N643157P1219164P5425527
39469G8300476J9160859l2681984l1388461M294411K3028205O567162j7480237
39462D9800431j9083708m54667J6154143K0082050K0602931K7388600L3169995
39455A47659775K2646409m705821l1618635m5047157m7167624l8069174r442781
39448e745008K5968250K5062864k7349553p0436938l3996792M8941577O4335853
$$ y = [-85564872, -68811965, -55930500, -39630187, -23531665, -30891660, -71878950, -114461382, -115620453, -80222368, -56600969, -64505066, -62444101, -10120870, 66764595, 110053734, 108986600, 103743238, 113599155, 107499565, 61466677, 7817585, -4488003, 19261119, 23334279, -21729859, -73987372, -68344215, 2874949, 78300476, 97461335, 64779351, 33390890, 37685301, 60713506, 67280668, 49800431, 30716723, 30262056, 46416199, 66498249, 87101180, 114489780, 147659775, 170306184, 165600363, 133981728, 88934571, 41766947, 3697773, -5745008, 20223242, 45286106, 17936553, -52500385, -86497177, -37555600, 26780253]
39441B6780253k5058345j11630037q1725823L0614435R5547735O1152325R9288
39434d220169r984268K0256595L5813792J7945314j0461557k6610327k5194534
39427b455154j0998909N039180J1017401O607258L560727Q651605J3503775M708702
39419C9634585j9878234m3587681l9360166L033131N4012258O6065870K9763111
39412H9682874j0686666j3457426Q833273J4466334p170201k7414226k1371392
$$ y = [26780253, 1721908, -109908129, -191633952, -161019517, -65471782, -4319457, -4220169, -14204437, 6052158, 41865950, 59811264, 49349707, 22739380, -2455154, -13454063, -8414883, 2602518, 9209776, 12770503, 21422108, 34925883, 39634585, 19756351, -23831330, -63191496, -60158365, -6146107, 59919763, 89682874, 78996208, 65538782, 74372055, 88838389, 81668188, 54253962, 32882570]
$$ [...]
##END NTUPLES=NMR SPECTRUM
##END=
