##TITLE=31Pdec_LR725-RM1
 CDCl3, 124 sc
 22.10.2020
##JCAMPDX= 6.0         $$ Bruker NMR JCAMP-DX V2.0
##DATA TYPE= NMR SPECTRUM
##DATA CLASS= NTUPLES
##ORIGIN= UXNMR, Bruker Analytische Messtechnik GmbH
##OWNER= root
$$ XWIN-NMR		Version 3.5
$$ Thu Oct 22 11:07:50 2020 Russian Standard Time (UT+4h)  she@DPX200
##.OBSERVE FREQUENCY= 81.013821
##.OBSERVE NUCLEUS= ^31P
##.ACQUISITION MODE= SIMULTANEOUS
##.ACQUISITION SCHEME= undefined
##.AVERAGES= 124
##.DIGITISER RES= 17
##SPECTROMETER/DATA SYSTEM= spect
##.PULSE SEQUENCE= zgpg30
##.SOLVENT NAME= CDCl3
##.SHIFT REFERENCE= (INTERNAL, CDCl3, 0, 182.463)
##AUDIT TRAIL= $$ (NUMBER, WHEN, WHO, WHERE, WHAT)
$$ ##TITLE= Audit trail, XWIN-NMR		Version 3.5
$$ ##JCAMPDX= 5.01
$$ ##ORIGIN= Bruker BioSpin GmbH
$$ ##OWNER= she
$$ F:/spectra/data/she/nmr/P31/1/pdata/1/auditp.txt
$$ ##AUDIT TRAIL=  $$ (NUMBER, WHEN, WHO, WHERE, WHAT)
(   1,<2020-10-22 11:05:31.93 +0400>,<she>,<DPX200>,
      <continue with go, POWCHK disabled, PULCHK disabled
       configuration hash MD5:
       00 E9 B6 7A A2 85 ED C7 34 08 36 98 17 FE 4E 26
       data hash MD5: 32K
       F4 CF 64 49 57 42 B9 98 B4 25 8B B3 BE 1E DD E1>)
(   2,<2020-10-22 11:07:09.42 +0400>,<she>,<DPX200>,
      <Start of raw data processing
       efp BC_mod = 2 LB = 1 FT_mod = 6 PKNL = 1 PHC0 = -2372.461 PHC1 = 72.20061 SI = 64K 
       data hash MD5: 64K
       79 84 D8 9E 98 50 4B 4F 8A CB FE D4 F4 9C D7 4B>)
$$ ##END=
$$ 
$$ hash MD5
$$ F1 65 AA 69 B8 FE 97 A5 80 D6 89 9C D1 9D 47 63
##$RELAX= 
##$RELAX= 
##$RELAX= 
##$RELAX= 
##$RELAX= 
##$RELAX= 
##$RELAX= 
##$RELAX= 
$$ Bruker specific parameters
$$ --------------------------
##$DU= <F:/spectra>
##$EXPNO= 1
##$NAME= <P31>
##$PROCNO= 1
##$TYPE= <nmr>
##$USER= <she>
##$AMP= (0..31)
100 100 100 100 100 100 100 100 100 100 100 100 100 100 100 100 100 100 
100 100 100 100 100 100 100 100 100 100 100 100 100 100 
##$AQSEQ= 0
##$AQ_mod= 1
##$AUNM= <au_zg>
##$AUTOPOS= <>
##$BF1= 81.014009
##$BF2= 200.13
##$BF3= 200.13
##$BF4= 200.13
##$BF5= 200.13
##$BF6= 200.13
##$BF7= 200.13
##$BF8= 200.13
##$BYTORDA= 1
##$CFDGTYP= 0
##$CFRGTYP= 5
##$CHEMSTR= <none>
##$CNST= (0..31)
1 1 145 1 1 1 1 1 1 1 1 1 1 1 1 1 1 1 1 1 1 1 1 1 1 1 1 1 1 1 1 1 
##$CPDPRG= <waltz16>
##$CPDPRG1= <>
##$CPDPRG2= <waltz16>
##$CPDPRG3= <>
##$CPDPRG4= <mlev>
##$CPDPRG5= <mlev>
##$CPDPRG6= <mlev>
##$CPDPRG7= <mlev>
##$CPDPRG8= <mlev>
##$CPDPRGB= <>
##$CPDPRGT= <>
##$D= (0..31)
0 1 0 0 0 0 0 0 0 0 0 0.03 2e-05 3e-06 0 0 0 0 0 0 0 0 0 0 0 0 0 0 0 0 
0 0 
##$DATE= 1603350152
##$DBL= (0..7)
120 120 120 11 120 120 24 19 
##$DBP= (0..7)
150 150 150 150 150 150 150 150 
##$DBP07= 0
##$DBPNAM0= <>
##$DBPNAM1= <>
##$DBPNAM2= <>
##$DBPNAM3= <>
##$DBPNAM4= <>
##$DBPNAM5= <>
##$DBPNAM6= <>
##$DBPNAM7= <>
##$DBPOAL= (0..7)
0.5 0.5 0.5 0.5 0.5 0.5 0.5 0.5 
##$DBPOFFS= (0..7)
0 0 0 0 0 0 0 0 
##$DE= 6
##$DECBNUC= <off>
##$DECIM= 4
##$DECNUC= <off>
##$DECSTAT= 4
##$DIGMOD= 1
##$DIGTYP= 9
##$DL= (0..7)
0 0 52 120 120 21 21 25 
##$DP= (0..7)
$$ [...]
##$SUBNAM2= <"">
##$SUBNAM3= <"">
##$SUBNAM4= <"">
##$SUBNAM5= <"">
##$SUBNAM6= <"">
##$SUBNAM7= <"">
##$SUBNAM8= <"">
##$SUBNAM9= <"">
##$SW= 369.568048894756
##$SWIBOX= (0..15)
0 1 3 0 0 0 0 0 0 0 0 0 0 0 0 0 
##$SW_h= 29940.119760479
##$TD= 32768
##$TD0= 1
##$TE= 0
##$TE2= 300
##$TE3= 300
##$TEG= 300
##$TL= (0..7)
0 120 53 12 22 120 120 120 
##$TP= (0..7)
150 150 150 150 150 150 150 150 
##$TP07= 0
##$TPNAME0= <>
##$TPNAME1= <>
##$TPNAME2= <>
##$TPNAME3= <>
##$TPNAME4= <>
##$TPNAME5= <>
##$TPNAME6= <>
##$TPNAME7= <>
##$TPOAL= (0..7)
0.5 0.5 0.5 0.5 0.5 0.5 0.5 0.5 
##$TPOFFS= (0..7)
0 0 0 0 0 0 0 0 
##$TUNHIN= 0
##$TUNHOUT= 0
##$TUNXOUT= 0
##$USERA1= <user>
##$USERA2= <user>
##$USERA3= <user>
##$USERA4= <user>
##$USERA5= <user>
##$V9= 5
##$VALIST= <valist>
##$VCLIST= <CCCCCCCCCCCCCCC>
##$VD= 0
##$VDLIST= <DDDDDDDDDDDDDDD>
##$VPLIST= <PPPPPPPPPPPPPPP>
##$VTLIST= <TTTTTTTTTTTTTTT>
##$WBST= 1024
##$WBSW= 4
##$XGAIN= (0..3)
0 0 0 0 
##$XL= 0
##$YL= 0
##$YMAX_a= 44837
##$YMIN_a= -9142
##$ZGOPTNS= <>
##$ZL1= 120
##$ZL2= 120
##$ZL3= 120
##$ZL4= 120
##$ABSF1= 0
##$ABSF2= 0
##$ABSG= 0
##$ABSL= 0
##$ALPHA= 0
##$AQORDER= 0
##$ASSFAC= 0
##$ASSFACI= 0
##$ASSFACX= 0
##$ASSWID= 0
##$AUNMP= <proc_1d>
##$AZFE= 0.1
##$AZFW= 0.5
##$BCFW= 0
##$BC_mod= 2
##$BYTORDP= 0
##$COROFFS= 0
##$CY= -3
##$DATMOD= 1
##$DC= 0
##$DFILT= <>
##$DTYPP= 0
##$F1P= 0
##$F2P= 0
##$FCOR= 1
##$FTSIZE= 65536
##$FT_mod= 6
##$GAMMA= 0
##$GB= 0
##$INTBC= 1
##$INTSCL= 5.30512e-09
##$ISEN= 30
##$LB= 1
##$LEV0= 0
##$LPBIN= 0
##$MAXI= 10000
##$MC2= 0
##$MEAN= 0
##$ME_mod= 0
##$MI= 50
##$NCOEF= 0
##$NC_proc= -9
##$NLEV= 6
##$NOISF1= 182.463
##$NOISF2= 159.3651
##$NSP= 0
##$NTH_PI= 0
##$NZP= 0
##$OFFSET= 182.463
##$PC= 4
##$PHC0= -2372.461
##$PHC1= 72.20061
##$PH_mod= 1
##$PKNL= yes
##$PPARMOD= 0
##$PSCAL= 0
##$PSIGN= 0
##$REVERSE= no
##$SF= 81.014009
##$SI= 65536
##$SIGF1= 159.3651
##$SIGF2= -187.1042
##$SINO= 113.3802
##$SIOLD= 16384
##$SREGLST= <1H.CDCl3>
##$SSB= 0
##$STSI= 65536
##$STSR= 0
##$SW_p= 29940.119760479
##$SYMM= 0
##$S_DEV= 0
##$TDeff= 32768
##$TDoff= 0
##$TI= <>
##$TILT= no
##$TM1= 0
##$TM2= 0
##$TOPLEV= 0
##$USERP1= <user>
##$USERP2= <user>
##$USERP3= <user>
##$USERP4= <user>
##$USERP5= <user>
##$WDW= 1
##$XDIM= 65536
##$YMAX_p= 272928429
##$YMIN_p= -157390380
$$ End of Bruker specific parameters
$$ ---------------------------------
##NTUPLES= NMR SPECTRUM
##VAR_NAME=  FREQUENCY,     SPECTRUM/REAL,   SPECTRUM/IMAG
##SYMBOL=    X,             R,               I
##VAR_TYPE=  INDEPENDENT,   DEPENDENT,       DEPENDENT
##VAR_FORM=  AFFN,          ASDF,            ASDF
##VAR_DIM=   65536,         65536,           65536
##UNITS=     HZ,            ARBITRARY UNITS, ARBITRARY UNITS
##FACTOR=    0.456856943014862, 1,           1
##FIRST=     14782.0589164895, 0,            0
##LAST=      -15158.0608439895, 0,           0
##MIN=       -15158.0608439895, -157390380,  0
##MAX=       14782.0589164895, 272928429,    0
$$ Real data points
##PAGE= N=1
##DATA TABLE= (X++(R..R)), XYDATA
$$ [...]
##PAGE= N=2
##DATA TABLE= (X++(I..I)), XYDATA
4803f8228132L2590063L2186204K1043999Q617908j1816196l0162855j7592291
4796c3361300K3686827M7528370K5122456j3354889k4913374j2410427o213298
4789F084365j1501567j0205178r19824N04120m288391M724809K8044971L6747805
4781D9191110J1425778k8818369m8833778l6750156j0148841Q884290J3962604
4774d1087362J2032647R789105O767847N77957n585013n365530J535808Q364687
4766a2969854J0715410J0557684Q507951j03618j5649007k6952642k1907327l246612
4758e1048015J2954081J4521634M932342k126755K261498J2508184J4165516J629862
4750I798347j1968373r182999P861316J7720605P350724j0623254j6075527q036456
$$ plain form
4803 -68228132 -35638069 -3451865 17592134 26210042 14393846 -15769009 -33361300
4796 -33361300 -9674473 37853897 62976353 49621464 24708090 12297663 6084365
4789 6084365 -5417202 -15622380 -16542204 -16038084 -20326475 -15601666 12443305 49191110
4781 49191110 60616888 31798519 -17035259 -53785415 -63934256 -55049966 -41087362
4774 -41087362 -29054715 -19265610 -12497763 -11919806 -17504819 -22870349 -21334541 -12969854
4766 -12969854 -2254444 8303240 16811191 16707573 1058566 -25894076 -47801403 -51048015
4758 -51048015 -38093934 -23572300 -18639958 -20766713 -18505215 -5997031 8168485 9798347
4750 9798347 -2170026 -11353025 -3491709 14228896 21579620 10956366 -5119161 -13155617
4742a3155617j483972k730075k861829L172109N647184l525849j3516265o607852
4734c5062166J4991475K7352771J4310520j0348914j8253806J25312K5202425
4727A8317617L0010201O107247l0195289n0850740l8408681m754166J4835470
4720e4938341j563372l2939152l7923941p761223K3532132K8214066J9874500
4713f3505331K3535818L3708807K8631395J0909300J894021J756281j1026147
4706B5904144l7185597m5774107j8249068K1082585L4674371J5135843j4820831
4699a9232660l1907971k8344200r813649R005067J3442234L047610p935358q387490
4691h0126417p24643Q365496J5442211J5571109M797362p743373o396718N818857
$$ plain form
4742 -13155617 -14639589 -17369664 -20231493 -17059384 -11412200 -14938049 -28454314 -35062166
4734 -35062166 -20070691 7282080 21592600 11243686 -7010120 -6884808 18317617
4727 18317617 48327818 54435065 24239776 -26610964 -65019645 -69773811 -54938341
4720 -54938341 -56501713 -89440865 -127364806 -135126029 -111593897 -83379831 -63505331
4713 -63505331 -39969513 -6260706 22370689 33279989 35174010 36930291 25904144
4706 25904144 -11281453 -57055560 -75304628 -54222043 -19547672 -4411829 -19232660
4699 -19232660 -51140631 -79484831 -89298480 -80293413 -66851179 -63803569 -71738927 -80126417
4691 -80126417 -80851060 -72485564 -57043353 -41472244 -36674882 -44418255 -50814973 -44996116
4683d4996116O865502r883857k0644220n327816K1422044L1780635K2389191J0261057
4675A1866420L699749n93773r61742N677432J0180447K906752p185345p595063
4667A7994877q212389k3474680l4554183p794719M3125509N5706639K425593n9178058
4659a3961411n6532042L44083L5318755J2665168k0979244j2380074K4443179
4652c1081586L9529242K1740791K298467k229310p086069j8407944j7118433J828766
4644a0526076J0985305m335338j3627188J1860469M3277857K9027738k4424031
4637D2238736n3616129k4917855K2608755L6333202J5248092o463735j1811618
4630A9619448r498548q884949j1910525j8291823j9972616l390774K6028459L8125846
$$ plain form
4683 -44996116 -38130614 -48014471 -68658691 -73986507 -52564463 -20783828 1605363 11866420
4675 11866420 15566169 14972396 14010654 19688086 29868533 32775285 25589940 17994877
4667 17994877 9782488 -13692192 -48246375 -56041094 -12915585 42791054 45216647 -13961411
4659 -13961411 -70493453 -70149370 -34830615 -22165447 -43144691 -55524765 -31081586
4652 -31081586 8447656 30188447 32486914 30257604 23171535 4763591 -12354842 -10526076
4644 -10526076 459229 -3876109 -17503297 -5642828 37635029 66662767 42238736
4637 42238736 -11377393 -36295248 -13686493 22646709 37894801 31431066 19619448
4630 19619448 10120900 1235951 -10674574 -28966397 -48939013 -52329787 -26301328 11824518
4622A1824518J6631519j3183004j9050175q118180r858955k3995165k0089459
4615f5838901J1251149L9029982L3275341L160056j8032803j2176341Q986392
4608c45125K0742424J1369488o378300j1044865m19220N990766l425725j5628168
4600H61275j5598967q163786k364222O824299K0784782K0889546l031580k4954723
4592d753376j5790989R351344J3480984l181856q150791M215035N053385j3480834
4584a3257098k2240950p619942M368496l984066j1153897J695713J5251522Q742197
4576b8198025k21058J2687807L2331285K6647423k102903k4268993k8910601k9186962
4568d1222027k9632584k0543891k610095J0591582J4653004J6606418J7065770
$$ plain form
4622 11824518 28456037 15273033 -3777142 -11895322 -21754277 -45749442 -65838901
4615 -65838901 -54587752 -15557770 17717571 20877627 2844824 -9331517 -345125
4608 -345125 20397299 31766787 25388487 14343622 13924402 19915168 16489443 861275
4600 861275 -14737692 -22901478 -25265700 -18441401 2343381 23232927 20201347 -4753376
4592 -4753376 -20544365 -11193021 2287963 -893893 -9044684 -4829649 223736 -13257098
4584 -13257098 -35498048 -43117990 -38749494 -42733560 -53887457 -52191744 -36940222 -28198025
4576 -28198025 -28419083 -15731276 16600009 43247432 41144529 16875536 -12035065 -41222027
4568 -41222027 -70854611 -91398502 -94008597 -83417015 -68764011 -52157593 -35091823
4561c5091823J0872054K779225K004841L557545n289950k2098506l1535774k7888170
4553a02690558j7320126k007538J8043522L1278097K4770465O888408j518116
4546d2555846K231318K668251l662429k546390J0190971J9647802J6782993R511945
4538A2268615J924437j3109688l0225603k6496550K529469K4824436J3269254
4531a5015630j2760873j4920873O515476J4610117o136966k6006506j4862212
4524f8577467J5225499L0309538K0257366K912965p399166j2226104j2040984
4517c1538353m44220J8260205K4959501J0400103j0496838k0539916k1877492
4510c1277010k1178805r641878J8690120M0500288K6569811j0262408k3956509
$$ plain form
4561 -35091823 -24219769 -21440544 -19435703 -15878158 -21168108 -43266614 -74802388 -102690558
4553 -102690558 -120010684 -122018222 -103974700 -72696603 -47926138 -41037730 -42555846
4546 -42555846 -40324528 -37656277 -41318706 -43865096 -33674125 -14026323 2756670 12268615
4538 12268615 14193052 1083364 -29142239 -55638789 -53109320 -28284884 -15015630
4531 -15015630 -27776503 -42697376 -36181900 -21571783 -27708749 -53715255 -68577467
4524 -68577467 -53351968 -23042430 -2785064 127901 -7271265 -19497369 -31538353
4517 -31538353 -31982573 -13722368 11237133 21637236 11140398 -9399518 -31277010
4510 -31277010 -52455815 -62097693 -43407573 -2907285 23662526 13400118 -10556391
4503a0556391O50642K5548780J7096341n186444l289687J9419601K6150810L191385
4495G3025037k3714845k7807663j0033563J2175754K3089294J3265259j4141943
4488D5857330l7080190l1521424q89006K4006218J9578544n796906k5170265k2687870
4480c3703569o494328L125698k746884r996516K20055K1377036K5451845L918712
4472A152049j5374252q234767R400893R285630k746750n51550J3738279J2624369
4464A9293901p923785k0704679j2955782l783839o837197r573021k230519M686823
4456d0028098O213048J4023162K5023233J3221113k3578712m2833472j5157037
4449f3116763K5523013K8470749R09665q553515J0853658J8862373o801746l4131673
$$ plain form
4503 -10556391 -9905749 15643031 32739372 27552928 24263241 43682842 69833652 73025037
4495 73025037 49310192 21502529 11468966 23644720 46734014 59999273 45857330
4488 45857330 8777140 -22744284 -23633290 372928 19951472 14154566 -11015699 -33703569
4480 -33703569 -40197897 -37072199 -39819083 -49815599 -49595544 -28218508 -2766663 1152049
4472 1152049 -14222203 -22456970 -13056077 -3770447 -6517197 -7068747 6669532 19293901
4464 19293901 11370116 -9334563 -22290345 -26074184 -32911381 -42484402 -44714921 -40028098
4456 -40028098 -33815050 -19791888 5231345 18452458 -5126254 -47959726 -63116763
4449 -63116763 -37593750 -9123001 -8213336 -16766851 -5913193 12949180 6147434 -27984239
4441b7984239k6841745L703602K0310951J1692841k168011m711509k11154J197695
4433b5011569j213062k311844l74819K277704L715389L066701j277527q603441
4425b9732468j0786517J178188K0157989K2731586r22166k5474597j9183082R316092
4417c2714975J9097725m274134k7433087j9539625N089726J6042917J2659216
4410c1072237J2280947J3203134L281173p806497r26345J4693453J1993917p550057
4402H097488j4142167J006518J2361914M000376p334666n554699J15079k28609
4394a678766K933335J4826969J8774840M001938j2004398j2179117r629663k2058403
4386a7013265l4405303j8311751K0558861M4641407L1640026m178734l5649396
$$ plain form
4441 -27984239 -54825984 -51122382 -30811431 -19118590 -21286601 -25998110 -26209264 -25011569
4433 -25011569 -26224631 -28536475 -28911294 -26633590 -22918201 -19851500 -21129027 -29732468
4425 -29732468 -40518985 -39340797 -19182808 3548778 2626612 -22847985 -42031067 -32714975
4417 -32714975 -13617250 -17891384 -45324471 -64864096 -59774370 -43731453 -31072237
4410 -31072237 -18791290 -5588156 -2306983 -10113480 -11039825 3653628 15647545 8097488
4402 8097488 -6044679 -5038161 7323753 11324129 3989463 -1565236 -1450157 -1678766
4394 -1678766 1254569 16081538 34856378 38858316 26853918 14674801 5045138 -17013265
4386 -17013265 -51418568 -69730319 -49171458 -4530051 27109975 22931241 -12718155
4379a2718155m5673346k8495690Q714478M1996519M6686134K2916819n814233
4372B7612526j9187856j4548061R0357J2630103J0636047n426285j6447578q500921
4364a3141668L441314l936290k3284623k4141849L69219K2276916K0438280P042161
4356a0936540J838637L831399K741615r06030j448386J778345R955049K3070407
4348B9924496K6014186J184417l4713324l7811608k54857K7328949O492334k7976347
4340i811754j9912005K0268034L2829379K660759k2041262r202007J4403267J6252646
4332B5447057M693062k084701j1028894k7751358l0929782p737098J3914938M859938
4324c0616838j6715749j3529912J2431953K8544793K4696423J7804948J2151691
$$ plain form
4379 -12718155 -58391501 -86887191 -78172713 -36176194 10509940 33426759 27612526
4372 27612526 8424670 -6123391 -6033034 6597069 17233116 11806831 -4640747 -13141668
4364 -13141668 -9700354 -13636644 -36921267 -61063116 -60693897 -38416981 -17978701 -10936540
4356 -10936540 -9097903 -5266504 -2524889 -3430919 -4879305 -3100960 6854089 29924496
4348 29924496 55938682 57123099 22409775 -15401833 -15656690 11672259 18164593 -9811754
4340 -9811754 -29723759 -9455725 23373654 26034413 3993151 -5208856 9194411 25447057
4332 25447057 30140119 28055418 17026524 -10724834 -41654616 -49391714 -35476776 -30616838
4324 -30616838 -47332587 -60862499 -48430546 -19885753 4810670 22615618 34767309
4317C4767309l369116k0893596j7509613K259266N848742j6511954l4664025k4412522
4309g4485509Q6906J4095501J5079839J2039074O372604J77271K823158J3120191
4301a0690965J3625626k311570j6213365j2153898p10510M64390o969408j0844150
4293d5803850p758236Q74855J5084493K5075045J4060575j1987255k1031232j315585
4285c2801190J5386767L760578r850893R104136L7640825K3795407k7627314n2661986
4277c3253670j9265453K9192953M0530506K0574459N276195R44096j0474166k6467535
4269G057385k3337152K600197K2947736J2368263k1111207m6368031m1052021
4262h6894830j1302658J5735590K0156903J0752451J1139747K4012888K4388080
$$ plain form
4317 34767309 31398193 10504597 -7005016 -4745750 1102992 -15408962 -50072987 -74485509
4309 -74485509 -74398603 -60303102 -45223263 -33184189 -26811585 -26634314 -23811156 -10690965
4301 -10690965 2934661 623091 -15590274 -27744172 -28454682 -27990292 -34959700 -45803850
4293 -45803850 -53562086 -52687231 -37602738 -12527693 1532882 -10454373 -31485605 -32801190
4285 -32801190 -17414423 -13653845 -23504738 -14400602 23240223 47035630 19408316 -33253670
4277 -33253670 -52519123 -23326170 17204336 37778795 43054990 43999086 33524920 7057385
4269 7057385 -16279767 -13679570 9268166 21636429 525222 -45842809 -86894830
4262 -86894830 -98197488 -82461898 -62304995 -51552544 -40412797 -16399909 7988171
4255G988171k964997l5365667l9100490j5093628L615162j412811j1443878k158993
4247i5937131J9530241K5653280O957327j4065813j2594631Q103395K3676363
4240c8676969J9516302M374485n072126k807693N388456J0179023M358882j1208210
4232a3947850k3224369j6807278M169874J8136784J3768193M279565M517703Q749152
4224c58226O048924K853280Q999928J3082568j933272k4849123k6894332n834436
4216b8884689R512880L117992q251899p275416r79618o23053j509305J113979
4208c3779129k135040j4701250j8606451K21624K4942159K6900594L294385k1620665
4200c5483773k7048932j3749226L430314J1363503J1232233J7615905L5311127
$$ plain form
4255 7988171 5023174 -30342493 -69442983 -84536611 -80921449 -82334260 -93778138 -95937131
4247 -95937131 -76406890 -50753610 -43796283 -57862096 -70456727 -62353332 -38676969
4240 -38676969 -19160667 -14786182 -19858308 -22666001 -17277545 -7098522 -2739640 -13947850
4232 -13947850 -37172219 -53979497 -49809623 -31672839 -17904646 -13625081 -9107378 -358226
4224 -358226 5690698 8543978 17543906 30626474 28693202 3844079 -23050253 -28884689
4216 -28884689 -19371809 -16253817 -24505716 -31781132 -32760750 -33383803 -34893108 -33779129
4208 -33779129 -35914169 -50615419 -69221870 -69000246 -44058087 -17157493 -13863108 -35483773
4200 -35483773 -62532705 -76281931 -72851617 -61488114 -50255881 -32639976 2671151
4193B671151M0813985R844293l5989123m3751744k978296L1724741J6334559j9476876
4185h07310k1040833Q632957K1588816L450163j1487156p83985J7033378K0232553
4177C6818583J2094208K452119o415743p809161N125648J7318728N485625k0358343
4169D4711664k3778183J021980J6765831K310183j4627539o570970Q615429K793279
4161C1241674j2958677j1591099q79546r246807l1805976l2573817j705895K6075704
4153d3444439K0715566l041193j0193089P344026K5156243K1234255K281179p956739
4145A2095809n3274J0425631P151600k239240J0956R150187K347431k1017339
4137A7871761l0445938r679953J4050269Q879803j3524483j7919317p56060Q394981
$$ plain form
4193 2671151 43485136 53329429 17340306 -26411438 -29389734 2335007 18669566 -807310
4185 -807310 -21848143 -13215186 8373630 11823793 336637 -447348 16586030 36818583
4177 36818583 48912791 51364910 44949167 37140006 42265654 59584382 65070007 44711664
4169 44711664 20933481 21955461 38721292 41031475 26403936 19832966 28448395 31241674
4161 31241674 18282997 6691898 5812352 -3434455 -35240431 -67814248 -69520143 -43444439
4153 -43444439 -22728873 -25770066 -35963155 -28619129 -3462886 17771369 20052548 12095809
4145 12095809 12042535 22468166 29619766 27380526 27391482 36541669 38889100 17871761
4137 17871761 -12574177 -22254130 -8203861 675942 -12848541 -30767858 -31523918 -23128937
4129b3128937k452441j0267252J966417J6958983J2343359l662409p000591M130631
4121a1112240Q268996m571713j6762056q380875J3802355K4345205J2138618o768552
4113A0959738j1991236l413204N070931P420817Q209902Q758337N823218K253075
4105C3091578K723113m50255j7983828l8254428l4284857l972969J9981640J3829373
4097b5320633m776224n313712J3039149K7122378K3479162P090385j1027740j7962039
4089F330726m646248J6364472J6394250q375592k3530247o506034J6155622J2564157
4081B4751106j305086N385474J6786196k860823l5426465k6470517K2800103M7767751
4073E1427739J9410847j3177546o079092J3965730O316999j3793486j1374915
$$ plain form
4129 -23128937 -25581378 -35848630 -33882213 -16923230 -4579871 -8242280 -15242871 -11112240
4121 -11112240 -2843244 -7414957 -24177013 -32557888 -18755533 5589672 17728290 10959738
4113 10959738 -1031498 -4444702 626229 8047046 16256948 25015285 30838503 33091578
4105 33091578 35814691 35364436 17380608 -20873820 -55158677 -59131646 -39150006 -25320633
4097 -25320633 -30096857 -35410569 -22371420 4750958 28230120 35320505 24292765 6330726
4089 6330726 1684478 18048950 34443200 26067608 2537361 -3968673 12186949 24751106
4081 24751106 23446020 28831494 45617690 42756867 7330402 -19140115 3659988 51427739
4073 51427739 70838586 57661040 51581948 65547678 71864677 58071191 46696276
4066D6696276K965991k329242j8208032j2216021J1020705J7792871K289458j1943095
4058C6068911j8815531l0855285l8673361j7734540K1909210L7859145J5335971
4051E094520j4261334k2551538j4374108j037123J7250479L0358886J8829239
4044A9309021q063965j2250275J5217962L2815547R915053k5657584l2537899
4037a252140j6625217r200370j0106821K679837K2611598K1316741J472000k647111
4029H248517J7875628L1030123J6570946m409016j0108182j2383142k5213688
4022B1611186k9709970m648331K9005701L2566012Q396713m798987O009980J0531889
4014F8964193j1453089l5986644l3437134j1448407M732764J0952400J5831805
$$ plain form
4066 46696276 49662267 47333025 29124993 16908972 27929677 45722548 48012006 36068911
4058 36068911 17253380 -13601905 -52275266 -70009806 -48100596 -10241451 5094520
4051 5094520 -9166814 -31718352 -46092460 -47129583 -29879104 479782 19309021
4044 19309021 11245056 -1005219 14212743 47028290 56943343 31285759 -1252140
4037 -1252140 -17877357 -27077727 -37184548 -34504711 -11893113 9423628 10895628 8248517
4029 8248517 26124145 57154268 73725214 69316198 59208016 46824874 21611186
4022 21611186 -8098784 -12747115 16258586 48824598 57221311 52422324 58432304 68964193
4014 68964193 57511104 21524460 -11912674 -23361081 -18628317 -7675917 8155888
4007H155888J3842123j574772j3117548k979939R865443m831962l2257905k7792302
3999e0690974Q964926K6553168K772996j8812065j753525K3290803J3367612j3692247
3991i999306j4191695M185218J212389j7614298p727545L1924418M7786037J5214624
3983E0789842k4150603k8044585o376533J3907723K8586041L3186493O681475
3976G4579853m5502808p1518424l7881551J6462753L2901413J2753573j553208
3969a9758399j219088j2443069l3771330k9300444Q960221M0068900L1307841
3962a6155368K5688j8474063j5412797l701663O766313J0506438J858815j3003608
3954d7590245j3279952J0289606L5849536L3142378K227033k3417663j4610996
$$ plain form
4007 8155888 21998011 20423239 7305691 4325752 14191195 9359233 -22898672 -50690974
3999 -50690974 -41726048 -15172880 -12399884 -31211949 -32965474 -9674671 3692941 -9999306
3991 -9999306 -24191001 -20005783 -18793394 -36407692 -44135237 -12210819 35575218 50789842
3983 50789842 26639239 -1405346 -7781879 6125844 34711885 67898378 74579853
3976 74579853 29077045 -42441379 -80322930 -63860177 -30958764 -18205191 -19758399
3969 -19758399 -20977487 -33420556 -67191886 -96492330 -87532109 -47463209 -16155368
3962 -16155368 -16129680 -34603743 -50016540 -53718203 -46951890 -36445452 -34586637 -47590245
3954 -47590245 -60870197 -50580591 -14731055 18411323 20638356 -2779307 -17390303
3947a7390303J9153317L8195770J7359648k2261116l6604925j3822007J1156274
3940d213342O313720j3371676j2416018J0117785K1888501Q518722p805682n777101
3932C254909O374266J0746047P263945P480474J4132398J8443649J0636132j1354543
3924F6977277l6067191m2838500k4611747l658795o403108k3490083j8397969
3917h8490116J8879591N1809849M4617148R319997j3260169o801016O152698o82555
3909B1545427k3990675l6965899k2715840M435276J6338786Q522423N748375K1037987
3901f044140K8319216k43661m3634664n3248037k1652630P727069O238111l096786
3893h5635522Q886137K9755711K9635468Q618321q108559p413150L827153J7341270
$$ plain form
3947 -17390303 1763014 39958784 57318432 35057316 -1547609 -15369616 -4213342
3940 -4213342 2100378 -11271298 -23687316 -13569531 8318970 16837692 9032010 3254909
3932 3254909 9629175 20375222 27639167 35119641 49252039 67695688 78331820 66977277
3924 66977277 30910086 -11928414 -36540161 -40198956 -46602064 -70092147 -88490116
3917 -88490116 -69610525 -17800676 26816472 36136469 22876300 16075284 22227982 21545427
3909 21545427 -2445248 -39411147 -62126987 -57691711 -41352925 -32830502 -27082127 -6044140
3901 -6044140 22275076 22031415 -21603249 -74851286 -96503916 -88776847 -82538736 -85635522
3893 -85635522 -76749385 -46993674 -17358206 -8739885 -16848444 -24261594 -20434441 -3093171
3885c093171K9519245L5758164L2960809K1354435j535353l4687474n8460162
3878B1816493m8897585j4412587Q813292P629853O048337J5880251J3434171j1273077
3870i60852k4816521m948830J5056489O45086k2058009j1752517J1986469J418092
3862c5430593l1969784l2663840M880091K8394135J6097903L130124R132900Q417254
3854c0011810p821641o427532K1564636L2281936L306470k1186177l936935J8950810
3846F719757j932463m5176273n3104115k0571393R239676J7733432K2768615K8851284
3838c5471480J9305531l545523j5575602r666622j042692L844610R750326R682885
3830b2718567m508869j4574203K398290K8773461K4582656q665748k5551224m981266
$$ plain form
3885 -3093171 26426074 62184238 95145047 116499482 114964129 80276655 21816493
3878 21816493 -27081092 -41493679 -32680387 -25050534 -19002197 -3121946 10312225 -960852
3870 -960852 -25777373 -30726203 -15669714 -15024628 -37082637 -48835154 -36848685 -35430593
3862 -35430593 -67400377 -100064217 -95184126 -66789991 -50692088 -47561964 -38429064 -30011810
3854 -30011810 -37833451 -44260983 -22696347 9585589 12892059 -8294118 -12231053 6719757
3846 6719757 4787294 -40388979 -93493094 -114064487 -104824811 -87091379 -64322764 -35471480
3838 -35471480 -16165949 -19711472 -35287074 -44953696 -45996388 -42151778 -32401452 -22718567
3830 -22718567 -27227436 -41801639 -39403349 -10629888 13952768 5287020 -20264204 -25245470
3822b5245470K0440120J6077533j0071531l0104122l2770639k1607076k999454
3815h6280639J0042131N785582m717414J333350J9639898K1314889K160787o663259
3807c7384675Q256372J7091996k653999k5931958k0330993M230181J9104377K2969400
3799a4649299K7829672K3529158j764239k4486600j5115151P791455K208641k4872612
3791a9528975k4029628J2674571L1672089K235271l2050297k0849361J6987263
3784c2889067L0067290J5671774J1156090K0932715J0426083k5113057m1739334
3777a1487506j6192470J2727385M015249k0454518j2621046K2809147L5419487
3770A4215728R625288j1894124K499203K4543671J3454830j9949579l2588709
$$ plain form
3822 -25245470 -4805350 11272183 1200652 -28903470 -61674109 -83281185 -86280639
3815 -86280639 -76238508 -70452926 -75170340 -73836990 -54197092 -32882203 -30721416 -37384675
3807 -37384675 -29128303 -12036307 -14690306 -40622264 -60953257 -56723076 -37618699 -14649299
3799 -14649299 13180373 36709531 34945292 10458692 -4656459 3134996 5343637 -19528975
3791 -19528975 -43558603 -30884032 788057 3023328 -29026969 -49876330 -32889067
3784 -32889067 -2821777 12849997 24006087 44938802 55364885 30251828 -11487506
3777 -11487506 -27679976 -14952591 -10937342 -31391860 -44012906 -21203759 14215728
3770 14215728 23841016 11946892 14446095 38989766 52444596 32495017 -93692
3763i3692j5100561j18114q315396k1340661j5856939L088525J5807522J5943844
3755b5985472J0790640O128862K994163K050179K918190M510530Q753344J5909260
3747B8069696J6588546K056310j6444921j6760645O76332Q860863o090862k2513570
3739e558251j6825650j18587J431625j1681433j6267791m026727J1235547K0234715
3731b1576552K5645493K3034415J982980k7508698l5474180j1174338J8316263
3724b6754617K2724541N321162r948038j3592922j4093990j4851695p785478R801229
3716d9179808K6553798K9366429J7188454R56441n876518J893471J4853567J5134885
3708E0890719n285394l2953896m4499086l0090840k252049J7867586J9380479
$$ plain form
3763 -93692 -15194253 -15312367 -23627763 -44968424 -60825363 -57736838 -41929316 -25985472
3755 -25985472 -15194832 -9065970 -6071807 -4021628 -1103438 3407092 12160436 28069696
3747 28069696 44658242 46714552 30269631 13508986 14185318 23046181 16955319 -5558251
3739 -5558251 -22383901 -22502488 -21070863 -32752296 -49020087 -53046814 -41811267 -21576552
3731 -21576552 4068941 27103356 29086336 1577638 -33896542 -45070880 -26754617
3724 -26754617 -4030076 1291086 -8656952 -22249874 -36343864 -51195559 -58981037 -49179808
3716 -49179808 -22626010 6740419 23928873 24885314 19008796 20902267 35755834 50890719
3708 50890719 45605325 12651429 -31847657 -61938497 -64190546 -46322960 -26942481
3701b6942481P285185o149804j2373219j0019967j991873O487379Q434977J018972
3693c4250831p027358k498132J2698815J9613489R767642K662619J7984967L9121450
3685E8072661L0165292j0548117m1859526l3814806m573804J1627702R807638
3678A8877040O503003O333713K791253k02734M696112O876647q879934l0760450
3670F234650k9635904k274772K1454756J9859034L622596q407855j3718847j5568660
3662a8435002r745764L728222J2725251J0764666P978965J1728434J1500039k358952
3654B7885859j8538042j9448303n965161O480826P931064k45437q489635n15754
3646a0904583L0716986N8957719M2276230j6559071n6260150l4249669R369601
$$ plain form
3701 -26942481 -19657296 -25807100 -38180319 -48200286 -50192159 -43704780 -35269803 -34250831
3693 -34250831 -41278189 -43776321 -31077506 -11464017 -1696375 966244 18951211 58072661
3685 58072661 88237953 77689836 35830310 2015504 -2558300 9069402 18877040
3678 18877040 25380043 31713756 34505009 34302275 38998387 45875034 36995100 6234650
3670 6234650 -23401254 -25676026 -4221270 15637764 19260360 10852505 -2866342 -18435002
3662 -18435002 -28180766 -24452544 -11727293 -962627 7016338 18744772 30244811 27885859
3654 27885859 9347817 -10100486 -16065647 -9584821 -1653757 -1899194 -10388829 -10904583
3646 -10904583 19812403 78770122 121046352 104487281 48227131 13977462 23347063
3639B3347063Q135617l1469104m3484597q088259K1804309J2280054M40170K0711354
3631C676607L7798684O722802m2200137m3889314k519418J4095850j7371522m0516627
3623h4203075j0635958L6501235M2439829J0916842q630553J652927J2356709
3616C97956J185814j6723921j8686010n765352O724460J1163725R504889N560141
3608f638298L558043N609074O211451j017229q355944N60562K3634288L3774843
3600E7336790J2615240k1076805l4020366k1660942q071219n969715k245400J0795597
3592a2296820J5874962n36505j9969569j6439700K752546P751612o946498j5227949
3584d5037921k676647J1043088N381174r209855j0937987r73874L195703k065788
$$ plain form
3639 23347063 31482680 13576 -43471021 -51559280 -29754971 -17474917 -17034747 3676607
3631 3676607 41475291 48198093 5997956 -37891358 -40410776 -26314926 -43686448 -84203075
3623 -84203075 -94839033 -58337798 -15897969 -4981127 -13611680 -11958753 397956
3616 397956 1583770 -15140151 -33826161 -39591513 -32867053 -21703328 -12198439 -6638298
3608 -6638298 -3080255 2528819 8740270 7723041 -632903 -72341 23561947 57336790
3600 57336790 69952030 48875225 14854859 -6806083 -14877302 -20847017 -23092417 -12296820
3592 -12296820 3578142 3041637 -16927932 -33367632 -30615086 -22863474 -29809972 -45037921
3584 -45037921 -47714568 -36671480 -31290306 -40500161 -51438148 -52412022 -49216319 -51282107
3576e1282107m796502p47162K056793J329236M734686J3515329J7491526J1113862
3568f584339J985011k038231l878209r062316j4281131j1285193R75157J2808787
3560c1360464J2493641r32579j2895652o150533J7007446L1324737J6069759j8006773
3552G549582l9545239l2345954r121455R869596J8925656K3472599K5079412J8129112
3544B2013309j054312k5528456l9352593l1944551j3004509m975113j3721468
3537a07567693j7030236M497992L4723912M0311280J7432441l797178l723322
3530c5152804L202055j410131r613121l991104J2041964K0458389J5272958M975761
3522E783967n309623j7003467k6220341k3959828q845595J0670960K6136060L2298011
$$ plain form
3576 -51282107 -56078609 -56825771 -54768978 -53439742 -48705056 -35189727 -17698201 -6584339
3568 -6584339 -4599328 -6637559 -10515768 -19578084 -33859215 -45144408 -44169251 -31360464
3560 -31360464 -18866823 -19799402 -32695054 -38845587 -21838141 9486596 25556355 7549582
3552 7549582 -31995657 -64341611 -73463066 -63593470 -44667814 -21195215 3884197 22013309
3544 22013309 20958997 -4569459 -43922052 -75866603 -88871112 -93846225 -107567693
3537 -107567693 -124597929 -120099937 -85376025 -45064745 -27632304 -31429482 -35152804
3530 -35152804 -31950749 -33360880 -42974001 -46965105 -34923141 -14464752 808206 5783967
3522 5783967 474344 -16529123 -42749464 -66709292 -75554887 -64883927 -38747867 -6449856
3514f449856K3312889k303711l1487194m1747588k2306676J3376601L9387917
3507b8217618M0552804K2884381K256756j3344876k4815488k7139284q506567
3500c6329892K5326407M0706716J3285048l0833265m0043222n769081K5109461
3493h547828J6549691j0872306k0236007j2148389p573062l668871J2770741K5436126
3485h289905Q842997j8373808j0826473K8172525M0263518l38365m2193278l3111376
3477c5854165K11212k717855l7594394m0327287J2365832O3667600N6253286P879613
3469B3883842k2404331j4210907L762511P351982K758466K34084l540325p401435
3461i566113K230029K5769215L8385202K2277677n486516j7969796j6691133j9909606
$$ plain form
3514 -6449856 16863033 14559322 -16927872 -58675460 -80982136 -67605535 -28217618
3507 -28217618 12335186 35219567 37476323 24131447 -684041 -27823325 -36329892
3500 -36329892 -11003485 29703231 42988279 12155014 -27888208 -33657289 -8547828
3493 -8547828 8001863 -2870443 -23106450 -35254839 -42827901 -46496772 -33726031 -8289905
3485 -8289905 553092 -17820716 -28647189 -474664 39788854 39450489 -2742789 -35854165
3477 -35854165 -35642953 -38360808 -75955202 -116282489 -103916657 -40249057 16004229 23883842
3469 23883842 1479511 -12731396 -8968885 -1616903 1141563 1375647 -2164678 -9566113
3461 -9566113 -7336084 18433131 56818333 79096010 73609494 55639698 38948565 19038959
3453A9038959k4072024r401665J8091278K5325140J897544k0556806j5011720
3446d689294K301527J608493j4321268j9895800p494391P749615J4777310J4661571
3438e302237Q827034L40924m24979Q309476Q123259j2030453k8202142j1854756
3430c2213874J9903495K1651050j1587457l2308521r503354K6356726K9457935
3423A1756000K186394j5659170n452917J0633602N257295j9163253l4864402k0007420
3415f5313871J6151625M0170877L1516906P909038O94016J0332398R081734j1053658
3407C9489065k2022043l988126K0216947J6405461j2812699l4604861l0608849
3400b7925105j3551290l659012n843201r782682k704858J5636733K7262875J5217623
$$ plain form
3453 19038959 -5033065 -14434730 3656548 28981688 30879232 10322426 -4689294
3446 -4689294 -2387767 -779274 -15100542 -34996342 -42490733 -34741118 -19963808 -5302237
3438 -5302237 3524797 3865721 3440742 11750218 19873477 7843024 -20359118 -32213874
3430 -32213874 -12310379 9340671 -2246786 -34555307 -44058661 -17701935 11756000
3423 11756000 13942394 -1716776 -7169693 3463909 8721204 -10442049 -45306451 -65313871
3415 -65313871 -49162246 -8991369 22525537 30434575 31128591 41460989 50542723 39489065
3407 39489065 17467022 13478896 33695843 50101304 37288605 2683744 -27925105
3400 -27925105 -41476395 -45135407 -50978608 -60761290 -63466148 -47829415 -20566540 -5348917
3392e348917q016068r292820J8050277L6916829J5175526k6377025m0241292j5183328
3384c4316818J4679767J9443320M994991p319488r085122n040208j161715p64689
3376a8569962k888137k93986J3274316L2112087M1305850L0498533J294557l3344345
3368F3388913n1762525l6684136K175590K8106715J5992599j5559683k7203744
3361b1546271q131598J6601377K4416226J9015859J3515580J0180673N065633
3354E9117479j252999o224155j0471621j5232070j9814333k2334907j8564198
3347c4776804m497298J3037080J6624579Q73426j4176214q289479Q806515J2790740
3339i607455L023412j67827O762913N864963n428035m889882J4646136K6476206
$$ plain form
3392 -5348917 -13364985 -22657805 -4607528 32309301 47484827 21107802 -19133490 -34316818
3384 -34316818 -19637051 -193731 4801260 -2518228 -11603350 -16643558 -17805273 -18569962
3376 -18569962 -21458099 -21752085 -8477769 23634318 64940168 95438701 96733258 63388913
3368 63388913 11626388 -25057748 -22882158 5224557 21217156 5657473 -21546271
3361 -21546271 -29677869 -13076492 11339734 30355593 43871173 54051846 59117479
3354 59117479 57864480 51640325 41168704 25936634 6122301 -16212606 -34776804
3347 -34776804 -39274102 -26237022 -9612443 -8739017 -22915231 -31204710 -22398195 -9607455
3339 -9607455 -6584043 -6751870 11043 5876006 447971 -4441911 10204225 36680431
3331C6680431J1374789q336801l168598J5013611J2352048r575716j3819666J0985118
3323E1505216K6674331J748805l6059516l5016237M246934K4440652q243166n2308787
3315b3011768m5124768J0136415M7439930K6035873k0454788l6322929j4715733
3308e6017768P939387Q323550j841106k173719J2182431K9991999L1667728N513020
3300C5585522k8878531k9010535J5874679N5487147L6533098k2160931n2432344
3293A0998105k9400112M152405J0029514J856562K385567L55202j8425635l2831308
3285e0879700j7786338R128354J0705823j3489205k8880303j7342011M932422
3278a03610958J9718434K8307543L5363968L2776206J0321879k5886141n1670700
$$ plain form
3331 36680431 48055220 39718419 36549821 51563432 63915480 54339764 40520098 51505216
3323 51505216 78179547 79928352 43868836 8852599 13099533 37540185 29297019 -23011768
3315 -23011768 -68136536 -58000121 -10560191 15475682 -4979106 -41302035 -56017768
3308 -56017768 -48078381 -39754831 -41595937 -43769656 -31587225 -1595226 30072502 35585522
3300 35585522 6706991 -22303544 -6428865 49058282 85591380 63430449 10998105
3293 10998105 -18402007 -14249602 -4220088 -2363526 22041 377243 -18048392 -50879700
3285 -50879700 -68666038 -59537684 -48831861 -62321066 -91201369 -108543380 -103610958
3278 -103610958 -83892524 -55584981 -20221013 12555193 22877072 -3009069 -54679769
3271e4679769m2931822j448100L7914767L9350318R092747j0759035K257480K3225755
3263B022341K0181072r09899j2260260o834566O4790l61542m313516j0495122
3255a2906702j9590048k3715222j4220610M682660K2578431L3735684L1097792
3248B1661985O599847k7748933m0148555k0607328J20441k500189o979793J3560663
3240e6041862L7076511K4858129r638719j7602024O230378J7401691j783476j5823039
3232a5322411j340173J3242423q97513k4594363k4446120k979099J4326583J7373018
3224b4637655J1262344p02116j1789253r615581K889962N673959n030221q557276
3216d0505837J66477k862832k2525128k2482012J5065192M5379387K2877941k2936893
$$ plain form
3271 -54679769 -97611591 -99059691 -61144924 -21794606 -12701859 -23460894 -21203414 2022341
3263 2022341 22203413 21293514 9033254 2198688 2263478 1901936 -2411580 -12906702
3255 -12906702 -32496750 -56211972 -70432582 -65749922 -43171491 -9435807 21661985
3248 21661985 28261832 512899 -39635656 -60242984 -60122543 -62622732 -69602525 -56041862
3240 -56041862 -18965351 5892778 -3745941 -21347965 -15117587 2284104 500628 -15322411
3232 -15322411 -16662584 -3420161 -4317674 -28912037 -53358157 -56337256 -42010673 -24637655
3224 -24637655 -13375311 -14077427 -25866680 -35482261 -32592299 -26918340 -31948561 -40505837
3216 -40505837 -40339360 -43202192 -65727320 -88209332 -73144140 -27764753 -4886812 -27823705
3208b7823705k7829466R425594K9284682O305019j8462147r489954J3108044J6473739
3200i008194M113825m223922p837472j2721563j0439912L327871J0304085k858636
3192b9343918j5419505j9901L1305589L8606326R664036k2473393k3147935K842895
3184g985806K3196111J7685305m873172k1829383j8682461J638332K2730007K6595542
3176C8474475Q223696j7541778k7686260j4387907O408285J4808108R918388L525980
3168B1742987k723626j5947210k8991711k2877524k97932Q719741q795857k3327403
3160g2498535o770883K0455937K0389317q43588m984950J1981221J4414560o512442
3152b4369363j2073427J7834532M4291718K7882538r874254k3544896j3149319
$$ plain form
3208 -27823705 -55653171 -46227577 -16942895 -10637876 -29100023 -38589977 -25481933 -9008194
3200 -9008194 -4894369 -9118291 -16955763 -29677326 -40117238 -36789367 -26485282 -29343918
3192 -29343918 -44763423 -44783324 -13477735 25128591 34792627 12319234 -10828701 -7985806
3184 -7985806 15210305 32895610 28022438 6193055 -12489406 -10851074 11878933 38474475
3176 38474475 46698171 29156393 1470133 -12917774 -6509489 8298619 18217007 21742987
3168 21742987 19019361 3072151 -25919560 -48797084 -49095016 -40375275 -49171132 -72498535
3160 -72498535 -79269418 -58813481 -38424164 -39267752 -44252702 -32271481 -17856921 -24369363
3152 -24369363 -36442790 -18608258 25683460 53565998 43691744 20146848 6997529
3145F997529j0682630j7327116n923677K0364670K4228503l378784k3450062q744277
3137a7915844J5487517J4132157n730856j3931298o067692k144618q194562q679418
3129c3044614M727840J9195115J8601813K084732j6523924k0204100l375951J8118973
3121a0420116J9154264m181525k6205328k4645830r756030m399739p072499K001439
3113f5525364K3633684L4718720K2989144L553625o117498q235578j2890513k0185936
3105b8059716k3417962j7962131j450179K1460070L1391385J0559180k5895748
3098c3375101l6556913n405669L2780606L6332088Q881413j3107346j0965616
3091b1416538J595579N730945l184937j8022124k3369359m892098K6566009L4043753
$$ plain form
3145 6997529 -3685101 -21012217 -26935894 -6571224 17657279 14278495 -9171567 -17915844
3137 -17915844 -2428327 11703830 5972974 -7958324 -14026016 -16170634 -24365196 -33044614
3129 -33044614 -28316774 -9121659 9480154 11564886 -4959038 -25163138 -28539089 -10420116
3121 -10420116 8734148 4552623 -21652705 -46298535 -56054565 -60454304 -67526803 -65525364
3113 -65525364 -41891680 -7172960 15816184 19369809 13252311 5016733 -7873780 -28059716
3105 -28059716 -51477678 -69439809 -70889988 -49429918 -18038533 -7479353 -33375101
3098 -33375101 -69932014 -75337683 -42557077 -6224989 2656424 -10450922 -21416538
3091 -21416538 -19820959 -14090014 -17274951 -35297075 -58666434 -63558532 -36992523 -2948770
3083b948770K532616k7532243r881507L5952109M7503986J1632350j8472252r741954
3075B9044335L478165j2246308k6202558K971938M7901260M6271934l272697l8905619
3067D9040450k7878739n074884p820262k2068779j7510142J851466J2354708J0764481
3059f341701J0181898J1614907O248434l191083o273583m675804q572631j6381850
3051a7391413j5727748m233804N822388N916102K689583O934521J8251313K4595743
3043B6856685J5069187p126820k4484608k1970541n176685M733456k969866j5699862
3035c0769054j5812966k921998J0313151J6722194J7530755J2093755j258061
3028E897776j4294014j2253082O480429K2741786J6149903j0390209l1275502
$$ plain form
3083 -2948770 -416154 -27948397 -37829904 -1877795 45626191 57258541 38786289 29044335
3075 29044335 32522500 20276192 -5926366 -2954428 44946832 91218766 87946069 49040450
3067 49040450 21161711 16086827 8266565 -13802214 -31312356 -29460890 -17106182 -6341701
3059 -6341701 3840197 15455104 21703538 18512455 12238872 7563068 -1009563 -17391413
3051 -17391413 -33119161 -37352965 -31530577 -25614475 -22924892 -15990371 2260942 26856685
3043 26856685 41925872 34799052 10314444 -11656097 -16832782 -12099326 -15069192 -30769054
3035 -30769054 -46582020 -49504018 -39190867 -22468673 -4937918 7155837 5897776
3028 5897776 -8396238 -20649320 -14168891 8572895 24722798 14332589 -16942913
3021a6942913k4393469N155183K9783843K8919808J0561870j805682j066879l797770
3013B6413991k1945696m0297583l4931968o962894J8061586K3455871J8068122
3006a8138571J5576978J2828074K94274j6068601j9491632p573199J821651m867020
2998c5618046j7143708j5046864K053437J3668127O340772q064358r296918M139829
2990e8967729J5391234J3128734K965975n526725j0672087j2266537m639121J3189680
2982d7396576K6536688J7203033j2226265l5668569l0150416j273993K2310496
2975f0665602J9648231O0469p473304J2202058M1551233M9425430K6119990q032471
2967G2836034k7820473k6444869j1924636O211004J8061424J2863835q219310
$$ plain form
3021 -16942913 -41336382 -36181199 -6397356 22522452 33084322 31278640 30211761 26413991
3013 26413991 4468295 -35829288 -70761256 -77724150 -59662564 -36206693 -18138571
3006 -18138571 -2561593 10266481 10560755 -5507846 -24999478 -32572677 -30751026 -35618046
2998 -35618046 -52761754 -67808618 -65755181 -52087054 -45746282 -53810640 -63107558 -58967729
2990 -58967729 -43576495 -30447761 -27481786 -33008511 -43680598 -55947135 -60586256 -47396576
2982 -47396576 -20859888 -3656855 -15883120 -51551689 -81702105 -82976098 -60665602
2975 -60665602 -41017371 -40956902 -48430206 -36228148 5323085 54748515 80868505 72836034
2967 72836034 45015561 18570692 6646056 12857060 30918484 43782319 35563009
2960C5563009k4178079j3920327J6122131L6083136K5942361m486449k9552321
2953D1573461l2791584j7312075k34102J891244j0218573j7070846m371594J4490259
2945b4043810J4085304n441684j5410440m7479J7886548P498300k6857482m9939812
2937h2270555l7826080j231040L0377484L5851309J5998475q681814j5037022
2930f2819243k69879J5061934J3474643J762411m365905n272578r091019q039898
2922e9559534J1385336L6893847L7945294J0750958j2458230j1199619n919506
2915G838546j9723698l6242558k4577684J0104239L2902208K8033488J0634117
2908H968658n659034k0183001k3990465k957898K8475559L1426925j530019k5619532
$$ plain form
2960 35563009 11384930 -2535397 13586734 49669870 75612231 71125782 41573461
2953 41573461 8781877 -8530198 -8764300 -6873056 -17091629 -34162475 -38534069 -24043810
2945 -24043810 -9958506 -15400190 -30810630 -30858109 -12971561 -5473261 -32330743 -82270555
2937 -82270555 -120096635 -121327675 -90950191 -55098882 -39100407 -47782221 -62819243
2930 -62819243 -63089122 -48027188 -34552545 -32790134 -37156039 -42428617 -51519636 -59559534
2922 -59559534 -48174198 -11280351 26664943 37415901 24957671 13758052 7838546
2915 7838546 -11885152 -48127710 -72705394 -62601155 -29698947 -1665459 8968658
2908 8968658 3309624 -16873377 -40863842 -43821740 -15346181 16080744 14550725 -11068807
2900a1068807m613587L3585772L5453021j196479k7494193j5841161O943506O447524
2892B2215596j2506981k3007394j6921449p828564n620557o862444n657824j018170
2884e7207787M881724Q778242R447550J1309100J7925908K0690393O910504j5963724
2876F771910k1083415Q33370K1693970J2435512j3257564j7129156P158333K5127406
2868B2550366J3453930q135595j0947417J494132Q132966P453436J1284211J1994628
2860E7280657r821800m2793449m5061501l747493L4535379K0564484k7618243
2853a6661966m5775533r664916L5103593L7378881L135123k4612887k4450135
2846d5547840r676678K967047J0237636J2297887Q812592N362447O521527M928890
$$ plain form
2900 -11068807 -15682394 17903378 53356399 52159920 24665727 8824566 15768072 22215596
2892 22215596 9708615 -13298779 -30220228 -38048792 -43669349 -50531793 -56189617 -57207787
2884 -57207787 -52326063 -43547821 -34100271 -22791171 -4865263 15825130 22735634 6771910
2876 6771910 -14311505 -13478135 8215835 20651347 7393783 -9735373 -2577040 22550366
2868 22550366 36004296 27868701 16921284 18415416 26548382 34001818 45286029 57280657
2860 57280657 47458857 4665408 -40396093 -44143586 -9608207 10956277 -16661966
2853 -16661966 -62437499 -72102415 -36998822 380059 3515182 -21097705 -45547840
2846 -45547840 -55224518 -52257471 -42019835 -29721948 -20909356 -15546909 -9025382 -4096492
2838d096492n773870j3102979l249780R126020j664068k5384575k2147593J5152351
2830e1140986M2293208K7192463l679106j0911248j764752n585790j5033313O3109
2822a8566415L2254574L9904968J1496054j9017786k7403108k6304505k6156967
2815c3793185j2642792J6852977L3300818J8854289k532527n129196k674058j7744650
2807e508324l5262603k3912062J1939849L7739350L6749270K1033726L045623
2800D5824829j3023592j8656217r964914l174058j2119330j8768363N82602K7971327
2792a327716K3277960j0417440k5504430j781031K3932643J6314193j0279634
2785A4214545k4347647k2432330j4945820K339507L1255226M9202878L6221460
$$ plain form
2838 -4096492 -9870362 -22973341 -26223121 -17097101 -18761169 -44145744 -66293337 -51140986
2830 -51140986 -8847778 18344685 14665579 3754331 1989579 -3596211 -18629524 -18566415
2822 -18566415 13688159 53593127 65089181 46071395 18668287 -7636218 -33793185
2815 -33793185 -46435977 -29583000 3717818 22572107 20039580 14910384 12236326 -5508324
2807 -5508324 -40770927 -64682989 -52743140 -15003790 21745480 42779206 45824829
2800 45824829 32801237 14145020 4180106 1006048 -11113282 -29881645 -29299043 -1327716
2792 -1327716 21950244 11532804 -13971626 -15752657 8179986 24494179 14214545
2785 14214545 -10133102 -32565432 -47511252 -45171745 -13916519 35286359 71507819
2778G1507819P328226j0574676j7761332k9019021l8353660k9167580q141542
2771e4181766M467163J0056130K2906099L2455647J3651912k2716671l0484769
2764b3846255O938576M5748076L7707301o759804l6014789k4051222M168247J0898437
2756A4788567r841878l1271475k8542955o116945J1905982J3395601Q798800Q868262
2748a8016041Q874633N448650J0385944K7504130L2265791L735237l3305371l3565161
2740C327812K873572K7260149J1401661j7238357k3989946j4245476r264863o394586
2732b6270034N927546J6740714R858381k570978K597271J7824002J4135741j0819608
2724B7423035k6418553j4949311M429946P062707m237885r873361j569073J2111902
$$ plain form
2778 71507819 78836045 68261369 50500037 21481016 -16872644 -46040224 -54181766
2771 -54181766 -49714603 -39658473 -16752374 15703273 29355185 6638514 -23846255
2764 -23846255 -16907679 28840397 66547698 59787894 23773105 -278117 3890130 14788567
2756 14788567 4946689 -26324786 -54867741 -60984686 -49078704 -35683103 -26884303 -18016041
2748 -18016041 -9141408 -3692758 6693186 34197316 66463107 70198344 36892973 3327812
2740 3327812 6201384 33461533 44863194 27624837 3634891 -10610585 -19875448 -26270034
2732 -26270034 -20342488 -3601774 6256607 3685629 6282900 24106902 38242643 27423035
2724 27423035 1004482 -13944829 -9514883 -2452176 -6690061 -16563422 -18132495 -6020593
2716f020593J8761620J2155256l577503j4594451r394137N836946J1697805k29715
2708A4635228j5200889j3538719L801284J5196299M530914j6751503j9097244
2701b6424630J0120780M5446012M7998249J2753612k2428185k3136398o55521
2694D3673919O528988j5883140m3905357m9403579k9083006K498122L0072474
2687e5501579M0578787K5517204o386279k8600051k2892440j476626R725798O743860
2679c2291326R865867K7072558L4788841J1432028k3179182k8451688j660526
2672b423428J4845731l326669k3642274o851572K9175414L4408168J729650k7226586
2664A6688434k8555554k1604012k0892458j0777752J3557677K5527288J4396411
$$ plain form
2716 -6020593 12741027 24896283 21318780 6724329 -2669808 3167138 14864943 14635228
2708 14635228 -565661 -14104380 -10303096 4893203 9424117 -7327386 -26424630
2701 -26424630 -16303850 29142162 77140411 89894023 67465838 44329440 43673919
2694 43673919 50202907 34319767 -9585590 -58989169 -88072175 -85574053 -55501579
2687 -55501579 -14922792 10594412 4208133 -24391918 -47284358 -48760984 -39035186 -32291326
2679 -32291326 -22425459 4647099 39435940 50867968 27688786 -762902 -2423428
2672 -2423428 12422303 9095634 -14546640 -21398212 7777202 42185370 43915020 16688434
2664 16688434 -11867120 -33471132 -54363590 -65141342 -51583665 -26056377 -11659966
2657a1659966J0713701L0946932L7567959j871957n0805153n1721177j3358269
2650e0187930P662297k685219m519443J9879693L8465546K7167073L696779j0527537
2642B8951259j7906345j9517948l909880K2178248K9144951P778705j5749974
2635C0969016k1768480j9931494j7880178n106997J5423350J7697286m816751
2628e414248k2343479j5065802j028813K845945R402471K5707803K7621052J242192
2620B2967121k4811743k1663467l123731N561646Q343141J3585685N385957j9719751
2612a3475142k5055590P963101L0391492m762743n4231070l9588210K5580408
2605g3177754M6559735q952009n9881827l2615103L6186724O2226294K9664523
$$ plain form
2657 -11659966 -946265 30000667 67568626 65696669 14891516 -36829661 -50187930
2650 -50187930 -42525633 -45210852 -49730295 -29850602 8614944 35782017 39478796 28951259
2642 28951259 11044914 -8473034 -12382914 9795334 38940285 46718990 30969016
2635 30969016 9200536 -10730958 -28611136 -33718133 -18294783 -597497 -5414248
2628 -5414248 -27757727 -42823529 -43852342 -41006397 -31603926 -5896123 21724929 22967121
2620 22967121 -1844622 -23508089 -26631820 -21070174 -12727033 858652 6244609 -13475142
2612 -13475142 -38530732 -30567631 -176139 -4938882 -59169952 -98758162 -73177754
2605 -73177754 -26618019 -35570028 -95451855 -128066958 -91880234 -29653940 10583
2598A0583p098871r627635O613831J2580961M647354l074462l773481n341287
2590e063007j6862133l0964178k6151113M929037L6907168L7970163J1171187
2583A1937124j0219071q248632N24785m430739j8596944k3053281r646581J2987394
2575d8745945K9547932L0165123J9217866J1423614J3168488J4343853O738033
2568G5858964j683246l899411r972421k6844936l7263202k3435906J432165J2502171
2560a3305822J1523944J5044043J6876589q60653k6786390k9745965p223584J3331717
2552b1146121J9829489K3054976K0474574k941053l3382875l3814135k203157
2545c0128302J8952829N698668j5467232j4858231L07180J1134230J6008995J6128777
$$ plain form
2598 10583 -7088288 -16715923 -10102092 2478869 7126223 4051761 278280 -5063007
2590 -5063007 -21925140 -52889318 -79040431 -74111394 -37204226 765937 11937124
2583 11937124 1718053 -6530579 -6005794 -10436533 -29033477 -52086758 -61733339 -48745945
2575 -48745945 -19198013 10967110 30184976 41608590 54777078 69120931 75858964
2568 75858964 74175718 70276307 60303886 33458950 -3804252 -27240158 -25807993 -13305822
2560 -13305822 -1781878 13262165 30138754 29278101 2491711 -27254254 -34477838 -21146121
2552 -21146121 -1316632 21738344 42212918 39271865 5888990 -27925145 -30128302
2545 -30128302 -11175473 -5476805 -20944037 -35802268 -35495088 -24360858 -8351863 7776914
2537G776914N816211o940826l715760Q787428L892092j4622491j2275896J3398144
2529B115816K1789827k39356j3157835L242957J1975888j0993367k8294515q662842
2521b2223427J3927078K247208j7307740j1205528r388911m5754157p4062176
2514a63767653l0445069N0486306P4434039K7977926j0834429j05385J7857650
2507c4396615P123029q386461n697425l072046j0744582n641643J5874638J9702963
2499b5238142k130729p519530K2433334M2215441J4255085k6868194k7950158
2492a0802893M337052K3847700J3562161q009962k4407271k7963487j0892098
2485d0328798J7180715K4134677k031405k8362357k3902391n289572k300824m976948
$$ plain form
2537 7776914 13593125 6652299 2936539 11723967 15616059 993568 -11282328 2115816
2529 2115816 23905643 23666287 10508452 13751409 25727297 14733930 -13560585 -22223427
2521 -22223427 -8296349 -6049141 -23356881 -34562409 -43951320 -89705477 -163767653
2514 -163767653 -194212722 -143726416 -69292377 -41314451 -52148880 -52254265 -34396615
2507 -34396615 -27273586 -35660047 -41357472 -44429518 -55174100 -60815743 -44941105 -25238142
2499 -25238142 -27368871 -34888401 -12455067 29760374 44015459 17147265 -10802893
2492 -10802893 -6465841 17381859 30944020 22934058 -1473213 -29436700 -40328798
2485 -40328798 -23148083 986594 -1044811 -29407168 -53309559 -58599131 -60899955 -65876903
2477f5876903J3525704M1273363M0028851M868342k8594355l3615094j6189906
2470d4579998O525032K0961900J4422349j1861865k9357127j1437699K5214005
2463c0113403L7700272J5876781o057545j813561J2932697J0388090r920184k7549801
2455A443346l0332599k1220943o607914P445928J3088998Q053057L749042J4067038
2447a0314047L2687313L2502011q10780l9896575l9554648M244393L9811588K2360536
2439D1029791k6102676m7537427k6963529l247051j945094j465193J8697675L6712465
2431a0821039K4052354o477725k0292424r914480M503903R043836M550928n506614
2423a0861261j2318340j474278K1701366K4836584o351580l5420366k1965870
$$ plain form
2477 -65876903 -52351199 -11077836 28951015 33819357 5225002 -28390092 -44579998
2470 -44579998 -38054966 -17093066 -2670717 -14532582 -43889709 -55327408 -30113403
2463 -30113403 7586869 23463650 17406105 15592544 28525241 38913331 28993147 1443346
2455 1443346 -28889253 -50110196 -56718110 -49272182 -36183184 -28130127 -24381085 -10314047
2447 -10314047 22373266 54875277 54064497 14167922 -25386726 -21142333 18669255 41029791
2439 41029791 14927115 -32610312 -59573841 -62820892 -64765986 -66231179 -47533504 -10821039
2431 -10821039 13231315 6753590 -13538834 -23453314 -18949411 -9905575 -5354647 -10861261
2423 -10861261 -23179601 -24653879 -2952513 21884071 15532491 -19887875 -41853745
2416d1853745J6066338K7901165O585430o739033O360790J6062672Q92379j5472900
2408I803096o640393J2287871J0645904j1082313k6957479k3268547q558856L893318
2400c9877399O244987k994369j4352935j1335258R703175L0966502L3417052J7591244
2392B9362999k564350j6148738j8009103o944835Q433462J1957299j201950j5536994
2384a0652210j4254016P3898J1898537J1743636J210014j2242861j7532613o647286
2376c6402901J1786878J5754868k574474k2526900k0734978j583800J3093784
2369d3187523J5620554J4687562J2002722K96735j3921837r662959J6327865L5436084
2361B7599203K0327179j9131723m7361857m2957278j4815758J3769675K3230305
$$ plain form
2416 -41853745 -25787407 2113758 8699188 1960155 8320945 24383617 25275996 9803096
2408 9803096 3162703 15450574 26096478 15014165 -11943314 -35211861 -43770717 -39877399
2400 -39877399 -33632412 -36626781 -50979716 -62314974 -52611799 -21645297 11771755 29362999
2392 29362999 26798649 10649911 -7359192 -14304027 -5870565 6086734 4884784 -10652210
2384 -10652210 -24906226 -24832328 -12933791 -1190155 19859 -12223002 -29755615 -36402901
2376 -36402901 -24616023 -8861155 -11435629 -33962529 -54697507 -56281307 -43187523
2369 -43187523 -27566969 -12879407 -876685 -579950 -14501787 -24164746 -7836881 27599203
2361 27599203 47926382 28794659 -18567198 -61524476 -76340234 -62570559 -39340254
2354c9340254P070875j9934846k7464674k716169K5037781J6733955j8176418
2347e8789750k6056240J5492468N8001599M5089771q781513l9465129k0746962
2340c5255756J0422734J6030822L094861m025572j816655J413788N796948J0430895
2332F092065M880048j0846266j7533363o126163M744439j79320o784670L10976
2324b5442254P439402j281129r737799J388998J1798346p646619l4754274k0326030
2316g8561359K7827680M3111251j037571m4647124k6124163K9422030N0657037
2309F47781K1052170r850688n957515J2461823J2614882k476299r591140o065822
2301A2835192r878548k5782222l3281069j5062550J5057459K5705407P357630
$$ plain form
2354 -39340254 -32269379 -52204225 -79668899 -82385068 -57347287 -40613332 -58789750
2347 -58789750 -84845990 -69353522 -11351923 33737848 24956335 -14508794 -35255756
2340 -35255756 -24833022 -8802200 -5707339 -9732911 -11549566 -10135778 -4338830 6092065
2332 6092065 10972113 125847 -17407516 -23533679 -18789240 -18968560 -25753230 -25442254
2324 -25442254 -18002852 -19283981 -29021780 -27632782 -15834436 -23481055 -58235329 -78561359
2316 -78561359 -50733679 -7622428 -8659999 -53307123 -79431286 -50009256 647781
2309 647781 21699951 11849263 5891748 18353571 30968453 28492154 18901014 12835192
2301 12835192 2956644 -22825578 -56106647 -71169197 -56111738 -30406331 -23048701
2294b3048701j5249100j5173693M327961J9541445J7940103N600020q918373k0003256
2286c4983594j9160619l832592J0152326O207816m520218K125053J8923011J0108432
2278a4980385k9942558n4271222k3656361L5966307O6229567M9614847J8406575
2271D7366770R35513o425334j3485317j4885052n465269N183171O722769K979179
2263B2926430K153553K112141m788441j8271781k9152082k8622578j4657669O856974
2255f1443453K3760949K4296360P748914j1125933j2478817Q609463L1533430
2248A0900913K6879412q931556m2121577l8011888n453325J4274880M506795n813937
2240d3770283R918267L2519508K6053131o718819k8569958k1075178l630849J711279
$$ plain form
2294 -23048701 -38297801 -53471494 -49143533 -29602088 -11661985 -6061965 -14980338 -34983594
2286 -34983594 -54144213 -57976805 -47824479 -41616663 -46136881 -44011828 -25088817 -14980385
2278 -14980385 -44922943 -99194165 -122850526 -86884219 -20654652 28960195 47366770
2271 47366770 48302283 41876949 28391632 13506580 8041311 13224482 19947251 22926430
2263 22926430 25079983 27192124 22403683 4131902 -25020180 -53642758 -68300427 -61443453
2255 -61443453 -37682504 -13386144 -5637230 -16763163 -29241980 -20632517 10900913
2248 10900913 37780325 28848769 -13272808 -51284696 -56738021 -42463141 -37956346 -43770283
2240 -43770283 -33852016 -1332508 24720623 18001804 -10568154 -31643332 -35274181 -33562902
2232c3562902l030957o346266m817715K733731J8281485L1560671K2159829j3145121
2224A3832755m8779365n6428854l1841276Q872299M3238102M7970684J4126409
2217i009246l0550380l8210027Q93471L8532630L0726790j792473q089911J5016817
2209b482329K2744722l609729k8783227k1629804l79890L330713n348721J18622
2201c6039643K1053392L2114119J8602370p986193k8298907l2457471k2469683
2194e5482016r389623l568725q93065J0752981K5658886K0328136q112969k6378078
2186d7084473r163174K1923348L0307737J6562689O399465K806345j0487834k6790797
2178a5526694k0714483N302170J9425986R898806j951973l114031l968024n516847
$$ plain form
2232 -33562902 -36593859 -42940125 -47757840 -45024109 -26742624 4818047 26977876 13832755
2224 13832755 -34946610 -91375464 -123216740 -114344441 -71106339 -23135655 -9009246
2217 -9009246 -39559626 -77769653 -76876182 -38343552 -7616762 -9409235 -17499146 -2482329
2209 -2482329 20262393 16652664 -12130563 -33760367 -34140257 -30809544 -36158265 -36039643
2201 -36039643 -14986251 17127868 35730238 27744045 -554862 -33012333 -55482016
2194 -55482016 -64871639 -68440364 -69333429 -58580448 -32921562 -12593426 -20706395 -47084473
2186 -47084473 -56247647 -34324299 -4016562 12546127 18945592 21751937 11264103 -15526694
2178 -15526694 -36241177 -30939007 -11513021 -1614215 -3566188 -6680219 -10648243 -16165090
2170a6165090N972811K1162775R585131k4757377l5991707n925695K5432573K4510857
2162C824278J0787253P108953m534186l4276932m2170824j211461M0165859K3780926
2154C473866k3681772l2412002j65100J5496945j16297n684048R625025R399086
2146b4064297j0556918o406682K9522335M4778507J6095991r111514K800599J4238509
2138E7296530j0239015l5363219j6736905J9694047K1536025n301265j7786807
2131A3099391j1495322j2350899j5135207M787021K9895870J5048732l5342324
2124a1492738o2609733l6479051O897031K4254058J9195166J6195607J6428131
2117b7611529P245267o155082o460082O328894J2578201J045330j4504077j3348074
$$ plain form
2170 -16165090 -10192279 10970496 20555627 -4201750 -40193457 -46119152 -20686579 3824278
2162 3824278 14611531 21720484 17186298 -17090634 -59261458 -60472919 -20307060 3473866
2154 3473866 -20207906 -52619908 -52785008 -37288063 -37404360 -43088408 -33463383 -24064297
2146 -24064297 -34621215 -41027897 -11505562 33272945 49368936 40257422 43058021 57296530
2138 57296530 47057515 11694296 -5042609 14651438 36187463 30886198 13099391
2131 13099391 1604069 -10746830 -25882037 -21095016 8800854 23849586 -11492738
2124 -11492738 -74102471 -110581522 -103684491 -79430433 -60235267 -44039660 -27611529
2117 -27611529 -20366262 -26521344 -32981426 -26652532 -14074331 -13029001 -27533078 -40881152
2109d0881152L663976J4450561O473590o197828o707171j292677k094476M96009
2101c2089168J7794070K7471225R17044l7835457l2572806J7185776M5292898
2094F163582J7168668j9159952j4349588P026822J253535j5323270m069219J7261305
2086d028117L699403l2131976l5063867K434242L0957025K3773897N930363P09605
2078c719425J918271N264286J6813427K3854632N149338k3763493k2623069R561212
2070A2455179K9204509J4545327q773128j7202739j8201204j8995270j1462173
2063a8429499k39656l136002j2907213j805561K6556034L5668893J6007759j810535
2055C9904220l749497r912142k3241255j7931009L739574L564192k1191664k2730623
$$ plain form
2109 -40881152 -37217176 -22766615 -16293025 -22490853 -29198024 -30490701 -32585177 -32089168
2101 -32089168 -14295098 13176127 14093171 -23742286 -56315092 -39129316 6163582
2094 6163582 23332250 4172298 -10177290 -3150468 -1896933 -17220203 -21289422 -4028117
2086 -4028117 -328714 -32460690 -67524557 -65090315 -34133290 -10359393 -4429030 -3719425
2078 -3719425 -1801154 3463132 20276559 44131191 49280529 25517036 2893967 12455179
2070 12455179 41659688 56205015 47431887 30229148 12027944 -6967326 -18429499
2063 -18429499 -18669155 -21805157 -34712370 -36517931 -9961897 25706996 41714755 39904220
2055 39904220 36154723 26242581 3001326 -14929683 -11190109 -7625917 -28817581 -51548204
2047e1548204J1770297K8016187k096756k4982819L272512L6890303J9247204
2040B0568724j7524177j2274177J3426145m578032n1139248m8454334J3185357
2033h6789742N5316116L2506288r409123j7623955k580883M972392O236254J0594579
2025f778074Q036132l905274o292604K705270l794861k9387724l3815436M000908
2017f9231663M2434486L4844952k621997k2982839k0716694k4325122l3961471
2010i6560348j8960339K2640011M8753423L0605585q009565k5300329j1367841
2003e8199403J2959835K8524002L0362858J9507639J579490j0060967n601591
1996A9071863O025260N574163j0173339k1375695j0189654J5381666L0662919
$$ plain form
2047 -51548204 -39777907 -11761720 -13858476 -38841295 -35568783 1321520 20568724
2040 20568724 3044547 -9229630 4196515 -381517 -51520765 -99975099 -86789742
2033 -86789742 -31473626 1032662 -8376461 -26000416 -28581299 -23608907 -17372653 -6778074
2025 -6778074 1258058 -2647216 -8939820 -6234550 -10029411 -39417135 -73232571 -69231663
2017 -69231663 -26797177 8047775 5425778 -17557061 -38273755 -62598877 -96560348
2010 -96560348 -115520687 -92880676 -44127253 -13521668 -21531233 -46831562 -58199403
2003 -58199403 -45239568 -16715566 13647292 33154931 34734421 24673454 19071863
1996 19071863 25097123 30671286 20497947 -877748 -11067402 4314264 34977183
1989C4977183K2712464J814014j2909158j2290268k644089K057398n224519j4959648
1981A3533377j1512950K816124N400888j3933364k9817820j1444762K9916435
1974a5042072M8184442K0181411k6251398m9024172l7144165j0185378R731425
1967e9549907J3409301N012632j936429K936164J3941888J8380888J6770202J7467230
1959B6431969J3879165p734888l5294835l6001268m832959K1716956J6092952
1952e742908m213468j0440927n384404p629206j5136895j1870712M133850K1925000
1944c4359670L3090789K8826580R60485l5320060m3240329j2645106J7284448
1937d5402863J0983853j1794965r936847J5443059K9873700K1908541R943863
$$ plain form
1989 34977183 57689647 59503661 46594503 34304235 31660146 33717544 28493025 13533377
1981 13533377 2020427 4836551 10237439 -3695925 -33513745 -44958507 -15042072
1974 -15042072 33142370 53323781 27072383 -21951789 -59095954 -69281332 -59549907
1967 -59549907 -46140606 -41127974 -43064403 -40128239 -26186351 -7805463 8964739 26431969
1959 26431969 40311134 32576246 -2718589 -38719857 -43552816 -21835860 -5742908
1952 -5742908 -9956376 -20397303 -25781707 -33410913 -48547808 -60418520 -56284670 -34359670
1944 -34359670 -1268881 27557699 28518184 -6801876 -50042205 -62687311 -45402863
1937 -45402863 -34419010 -46213975 -56150822 -40707763 -10834063 11074478 21018341
1930B1018341K310381r491870k1371260j6721169L651378K0650274K4084619J6591063
1922D0721757j068263k2525376k6088168k727761J9469848J2001826p542252l552054
1914H689557J7777234K1330021N123196j26023J0463783Q982052j0593404j9946165
1906D1700251p008415N599670K217389o619555j3991855k4932526k9161568q338152
1898d0534761K2873279K6722865o8317k3063243k7975645l1472761l0912860l359587
1890a07791030L4868132L3534011p315293k6384401o29847J6262277q461713k5803055
1882i1720919N639163M1011050K7557273o35222J4132462M5573912K8693326k1606115
1874D8644930l1696374P185200K8734906L694426k4040420k2993427j6259816
$$ plain form
1930 21018341 23328722 13836852 -7534408 -24255577 -20604199 46075 24130694 40721757
1922 40721757 39653494 17128118 -8960050 -11687811 7782037 19783863 12241611 8689557
1914 8689557 26466791 47796812 52920008 52793985 63257768 72239820 61646416 41700251
1906 41700251 34691836 40291506 42508895 35889340 21897485 -3035041 -32196609 -40534761
1898 -40534761 -17661482 9061383 8993066 -14070177 -42045822 -73518583 -104431443 -107791030
1890 -107791030 -72922898 -39388887 -46704180 -73088581 -73718428 -57456151 -65917864 -91720919
1882 -91720919 -86081756 -45070706 -17513433 -18148655 -4016193 41557719 70251045 48644930
1874 48644930 16948556 24133756 52868662 56563088 32522668 9529241 -6730575
1867f730575j9937987j1531435J5548581K9599306J9155923J5033501K6833355
1860F7970669J7413416k4744411m6506086j0028587L8128095L3097068j1100849
1853F4229315l0826537j3368306l420710j9301058k7696774r897453M375960q198223
1845d4103786k1373331k910615L0421149L8043709J7433391L285077J1449270
1838C2244864K0282019J2406031J515580K851816M859075p177706k0328945j4995549
1830C1657185k541197r315920k9211468k7502673M969459L5678121L8059621K3061962
1822F4855090R011173p642969k9762435l6710279j3283279J8564528K5984198
1815C1016027Q690735j0003606k0573234k7273362k4298616m358109J6436989
$$ plain form
1867 -6730575 -26668562 -38199997 -22651416 6947890 26103813 41137314 67970669
1860 67970669 85384085 60639674 14133588 4105001 42233096 75330164 64229315
1853 64229315 33402778 20034472 16613762 -2687296 -30384070 -40281523 -35905563 -44103786
1845 -44103786 -65477117 -68387732 -37966583 77126 17510517 20795594 32244864
1838 32244864 52526883 64932914 66448494 69300310 74159385 66981679 46652734 31657185
1830 31657185 29115988 19800068 -9411400 -36914073 -31944614 3733507 41793128 64855090
1822 64855090 73866263 66223294 36460859 -249420 -13532699 5031829 31016027
1815 31016027 39706762 29703156 9129922 -18143440 -42442056 -46800165 -30363176
1808c0363176J4084270o065414j6874701j1708424q857447j3657390q501020J2502153
1800f9441149K8478634K3600437R799354L364864j170739j6431964l5015126l5926469
1792i2742158j4458547R111357J4178792N341109N228387K1564623L2725878J8185108
1784h65451n633616l945255K1710483K8723458l218652l5746968k5126200J3601713
1776a0500488L0800529J4254100k313136K819001J1761351L128931j5439905k2709431
1768A1800952j1845766O523059J6669353R159293j0367602k4085451k1116422
1761b3262584q509728K718047J0094725J0717724j188100j5909896j1096455J0841062
1753b5595205J6755651l705061j2643816J5708273M5114940L2209729j890005
$$ plain form
1808 -30363176 -16278906 -22344320 -39219021 -50927445 -59784892 -73442282 -81943302 -69441149
1800 -69441149 -40962515 -17362078 -7562724 -4197860 -5368599 -21800563 -56815689 -92742158
1792 -92742158 -107200705 -98089348 -83910556 -78569447 -73341060 -51776437 -19050559 -865451
1784 -865451 -6499067 -10444322 11266161 39989619 36770967 1023999 -24102201 -10500488
1776 -10500488 20300041 34554141 32241005 35060006 46821357 49950288 34510383 11800952
1768 11800952 -44814 6478245 23147598 32306891 21939289 -2146162 -23262584
1761 -23262584 -31772312 -29054265 -18959540 -8241816 -9429916 -25339812 -36436267 -25595205
1753 -25595205 -8839554 -12544615 -25188431 -9480158 35634782 67844511 65954506
1746F5954506r968822o43222j5896173m5361926l7726451O591563K9815300J1203496
1738C968271n852908M074844J0815000m433100j3497511j980194j13554j8647159
1730b5666311j7734375J9303673M2494491J4345179k3339045j7302588J1439805
1723C540829J1481372r253859m879282K3299194K9384133l90048l0351313l2052375
1715i221349j3826882M577066J2652526Q117436r8455K479767J0900501L299420
1707A8880030j6768779j6012178R406642J5903273j4652719l5321199j1285347
1700d9850277J6335584J003157k5409720r084322K8881387L0709253K016802r111202
1692a4509338k070414m238073P441633O1453013R1848543Q054800j35267119j72616443
$$ plain form
1746 65954506 55985684 55342462 39446289 -5915637 -43642088 -37050525 -7235225 3968271
1738 3968271 -1884637 2190207 13005207 8572107 -4925404 -6905598 -7019152 -25666311
1730 -25666311 -43400686 -24097013 18397478 32742657 9403612 -7898976 3540829
1723 3540829 15022201 5768342 889060 24188254 53572387 53182339 22831026 -9221349
1715 -9221349 -23048231 -18471165 -5818639 2298797 2200342 4680109 15580610 18880030
1707 18880030 2111251 -13900927 -4494285 11408988 -3243731 -38564930 -49850277
1700 -49850277 -33514693 -32511536 -57921256 -67005578 -38124191 -7414938 -5398136 -14509338
1692 -14509338 -16579752 -20817825 -13376192 48076821 139925364 147980164 12713045 -159903398
1684a59903398o1291893N0614106M2962461j6423823j1148334L8201131L8909957
1677g8079793n230410j4813060K0411526L6239581J4675510L510419J8096168
1670e190059J8864245m007812q551106J7750023K9266949J002395k7733521j9969157
1662A431957K084961K470897r564643n544392Q362751M235613j7685388k8561964
1654d2770208j5497426K278741M916051q11629M585291K2307543L1603560J9275890
1646B5887813O60136k246898L690129p949181l6849828m7913641k2587565J0243794
1638g7065241J6672281N287076L761455J1155198R400491M408037J4004973K5715515
1630A3339785J1983674j5553005j4738236J8042566L4840571Q184538k7218452
$$ plain form
1684 -159903398 -221195291 -170581185 -127618724 -144042547 -155190881 -116989750 -78079793
1677 -78079793 -83310203 -98123263 -77711737 -41472156 -26796646 -23286227 -5190059
1670 -5190059 13674186 9666374 1115268 18865291 48132240 49134635 21401114 1431957
1662 1431957 3516918 5987815 -3576828 -9121220 -758469 3477144 -14208244 -42770208
1654 -42770208 -58267634 -55988893 -51072842 -51884471 -47299180 -24991637 6611923 25887813
1646 25887813 26547949 24301051 27991180 20041999 -16807829 -64721470 -87309035 -77065241
1638 -77065241 -60392960 -55105884 -51344429 -40189231 -30788740 -26380703 -12375730 13339785
1630 13339785 25323459 9770454 -4967782 13074784 47915355 56099893 28881441
1623B8881441k9139997p095232L844733p90685q47691N017376p48944j7722014
1615a8601013k3027689o203622J5290472K0942649J1028886l94382n325497q180691
1607a4470887j6083104k5954220k3968806l333714J9590735J9784420k360850
1600d6796426j6838417l613948J8123039J6176352r040157k4899043j0571874
1593g7460474J7960278L1811207K4212157J2090030R436569J0396069J663597
1586C0109433j4828004k0897083o544991J3036433J4553555l041261j7228914
1579d840832j1329348O401577J5957460P765144j1362266k5124202j8864024N584891
1571c5811600K5302420J9556835j684133r245514L577654J2829421L652181p709388
$$ plain form
1623 28881441 -258556 -7353788 -3509055 -4299740 -5147431 -130055 -878999 -18601013
1615 -18601013 -41628702 -47832324 -32541852 -11599203 -570317 -964699 -6290196 -14470887
1607 -14470887 -30553991 -56508211 -80477017 -83810731 -64219996 -44435576 -46796426
1600 -46796426 -63634843 -67248791 -49125752 -32949400 -41989557 -66888600 -77460474
1593 -77460474 -59500196 -27688989 -3476832 8613198 18049767 28445836 30109433
1586 30109433 15281429 -5615654 -12160645 875788 15429343 12388082 -4840832
1579 -4840832 -16170180 -9768603 6188857 13954001 2591735 -22532467 -41396491 -35811600
1571 -35811600 -10509180 9047655 7363522 -1881992 1695662 14525083 18177264 10467876
1563A0467876n311956l65517n619050p889422N582302J4815297l987845l2865790
1555b5174105l4703869j1635593J837109m25214R434568L3425540L4338696P84449
1547G881581k3532640o176773K0481746J1546661j8166492k0742222Q213123K8642004
1539H146988K0552937K146901j2693667k8793960l8397015k0527793J6654074
1532e2911535L2695354J0808867j7225357k0134144q126424k824900J486344J6302741
1524c9929054K4673382N636151k2522168k2096473N979523K0754609K082790k0250931
1516d5672171j1560907J8831767L3682423J9142591q54366K72938J7856306K4021347
1508E5719928L794412k5516668l4344867j5184208J0795044J9998783R420054
$$ plain form
1563 10467876 5155920 4790403 -828647 -8718069 -3135767 11679530 7691685 -25174105
1555 -25174105 -59877974 -71513567 -69676458 -70101672 -60667104 -27241564 7097132 7881581
1547 7881581 -15651059 -21827832 -1346086 10200575 -7965917 -28708139 -20495016 8146988
1539 8146988 28699925 30846826 18153159 -10640801 -49037816 -69565609 -52911535
1532 -52911535 -20216181 -9407314 -26632671 -46766815 -54893239 -57718139 -56231795 -39929054
1524 -39929054 -15255672 -9619521 -32141689 -54238162 -48258639 -27504030 -25421240 -45672171
1516 -45672171 -57233078 -38401311 -4718888 14423703 13569337 13842275 31698581 55719928
1508 55719928 59514340 33997672 -347195 -15531403 -4736359 15262424 24682478
1501B4682478p950550j8782747j5202138K877261K2197218K3366675M054463j4653553
1493B0589107j6108465j1017332j7458935k8913374k3325948J178362K2407720
1486e2648865K6063556J9740514J1676848j998829j9835077k5226944q803152
1479e1031949J3161883J8124052N884923o386678j0092939j0251166q511922J461378
1471d7642418J8571871K8185006J9103385j474039j7546219k3112190k2788178
1464d6702782j7881271m471641J2726771J8043780N397565r057113p737188K866195
1456d6815684M527973q56412M369184J7083554J0969687j7715134l1837161m505331
1448f4779324L5177707L9000996P038477j7198250j1745421J356850O70827m170354
$$ plain form
1501 24682478 16731928 -2050819 -17252957 -14375696 7821522 31188197 35242660 20589107
1493 20589107 4480642 -6536690 -23995625 -52908999 -76234947 -75056585 -52648865
1486 -52648865 -26585309 -6844795 4832053 2833224 -17001853 -42228797 -51031949
1479 -51031949 -37870066 -19746014 -13861091 -20247769 -30340708 -40591874 -49103796 -47642418
1471 -47642418 -29070547 -885541 18217844 16743805 -802414 -23914604 -46702782
1464 -46702782 -64584053 -69055694 -56328923 -38285143 -32887578 -41944691 -49681879 -46815684
1456 -46815684 -42287711 -43144123 -38774939 -21691385 -10721698 -28436832 -60273993 -64779324
1448 -64779324 -29601617 9399379 16437856 -760394 -12505815 -11148965 -10478138 -14648492
1440a4648492J626238J1113493J0345542j041047j5979135k7288071k0973313
1433e6844785J2968493N1791179N0472307K69798m8960192m9602120j6839462
1426e6744782J206975n373114m938337J6136225L1701102K0726646j00014n593154
1418b978453n71962p593023k7436701l3405824p251040L2416973M7192478K2785774
1410B3158222j3219806k3905541o306259J0932260R638819J736914K072427L993257
1402H100293l678951j3514926j2448100n128014m940398j1558763j5754328j6792017
1394g5715204j6749924q742156R095244K0590577J5310828J0018823J8086830
1387b8104982J6197140j7572203m7807271k0217163M4874728O2438325M631787
$$ plain form
1440 -14648492 -13022254 -1908761 8436781 7395734 -8583401 -35871472 -56844785
1433 -56844785 -43876292 7914887 58387194 58656992 9696800 -39905320 -56744782
1426 -56744782 -55537807 -60910921 -65849258 -49713033 -18011931 2714715 2614701 -2978453
1418 -2978453 -3550415 -11143438 -38580139 -71985963 -79237003 -46820030 372448 23158222
1410 23158222 9938416 -13967125 -20273384 -9341124 297695 2034609 4107036 8100293
1402 8100293 4421342 -9093584 -21541684 -26669698 -31610096 -43168859 -58923187 -75715204
1394 -75715204 -92465128 -101207284 -92112040 -71521463 -56210635 -46191812 -28104982
1387 -28104982 -11907842 -29480045 -77287316 -97504479 -52629751 9808574 14440361
1380A4440361n2133349l8755799Q534072J7313875m438877L918381M0917898M2566947
1372C2363509n071715l6643839j1929148K3701073J9347242l433791j479527J1186518
1364B8040322m818748l6557018l6966037n020796J3775540L383458m531276N773301
1356c6921254Q157626j0972352k2748931o420349J2653639P385603l996413P873165
1348d4989266K9563441K5826240k318680j9907081r607788J3748828L3283452
1341B5599146M1169968K5842734j5260253n1257826m3945643l648822J7424098
1334d076598k427339k4996625j2316361J7759233K2743775k222173k3952872k0126219
1326d9615179r79383J2714920J1195352l560142k1700562k8792862j6127260J0489156
$$ plain form
1380 14440361 -37692988 -76448787 -67914715 -50600840 -55039717 -51121336 -10203438 32363509
1372 32363509 27291794 -9352045 -21281193 2419880 21767122 18333331 16853804 28040322
1364 28040322 23221574 -13335444 -50301481 -55322277 -41546737 -38163279 -42694555 -36921254
1356 -36921254 -28763628 -39735980 -62484911 -68905260 -56251621 -48866018 -52862431 -44989266
1348 -44989266 -15425825 10400415 8081735 -11825346 -21433134 -7684306 25599146
1341 25599146 66769114 92611848 77351595 26093769 -17851874 -21500696 -4076598
1334 -4076598 -6503937 -31500562 -43816923 -26057690 -3313915 -5536088 -29488960 -49615179
1326 -49615179 -50594562 -37879642 -26684290 -30244432 -51944994 -80737856 -96865116 -86375960
1318h6375960L5476302M3773377K7454858o100132l0574514k1615803J1200965
1311b6760907K9383303J2437399j6283113k2831702n360894J2632350J7809051
1304A025487J6265665J5151980J2517357L087197j4956795l3774969l4264018
1297c4948096n856832K8435124L0551437O58441j7352726p62961J5959311o21781
1289A6061917k3549048r184807K6121258K9369495j964843j7546055O8524R944326
1281B9320767j1457596k8450925r543923J8043575J6542153L83248N456141K3997142
1273D4290582J8982180j1325012k9932018j9089308j760792j175393j1250369
1266a1260130j5011049p775007N790414J8725243K0286161L871317j9334961k9206924
$$ plain form
1318 -86375960 -50899658 -7126281 20328577 14228445 -16346069 -37961872 -26760907
1311 -26760907 2622396 15059795 -1223318 -24055020 -29415914 -16783564 1025487
1304 1025487 17291152 32443132 44960489 48047686 33090891 -684078 -34948096
1297 -34948096 -40804928 -12369804 18181633 18840074 1487348 724387 16683698 16061917
1289 16061917 -7487131 -16671938 9449320 38818815 36853972 19307917 19376441 29320767
1281 29320767 17863171 -10587754 -20131677 -2088102 14454051 14837299 20293440 44290582
1273 44290582 63272762 51947750 22015732 2926424 1165632 -9761 -11260130
1266 -11260130 -26271179 -34046186 -28255772 -9530529 10755632 14626949 -4708012 -33914936
1258c3914936k1410984r069570m600R873319J9059544J7220987N861476J706308
1250a0678456Q720212O461522j7376975l9875118l1207871O1164J6676572O075361
1242f1143589l819648R884698K9939299K7658017P400259l119513K688997L716992
1234A3205512j0570249k1816568j1664615J1167808K4075218J6318319o839002
1227A3876423l0666427l4557695q000330K7447473L4095073R219043n741400J2889418
1219A8561578K9774378M741777l7537206l9048742K907196L0733373J1824735
1212B1957089k1744057l1200546k1878167j4463077o187238J0271829K0222722
1205d3021445R878054o681090j0334137o517211p056459l376952J4403700L0030672
$$ plain form
1258 -33914936 -55325920 -64395490 -64400090 -54526771 -35467227 -18246240 -12384764 -10678456
1250 -10678456 -1958244 4503278 -12873697 -52748815 -83956686 -83895522 -67218950 -61143589
1242 -61143589 -64963237 -55078539 -25139240 2518777 9919036 6799523 9488520 13205512
1234 13205512 2635263 -19181305 -30845920 -19678112 4397106 20715425 13876423
1227 13876423 -16790004 -51347699 -59348029 -31900556 2194517 11413560 5672160 18561578
1219 18561578 48335956 53077733 15540527 -23508215 -20601019 10132354 21957089
1212 21957089 213032 -30987514 -52865681 -67328758 -73515996 -63244167 -43021445
1205 -43021445 -33143391 -39824481 -50158618 -56675829 -63732288 -67109240 -52705540 -22674868
1197b2674868K2750900K582455n193248N27902J423285n524503p098786j274983
1189a4481846K106522L395445R677856J3998945M654113q844493o913829N543730
1181I136443M932516j0862755j8689429r772125j546156k023488N646519K8351670
1173E173195M1759206K4883891o326653k2932608k3258703k4490355k6983177
1166c2175204j5804922N642557J2217106n519750k2722243j2878250J5384114
1159e5856592L0606516J9924694K23424j0257878j1684426q623403L280610K2137981
1151a0249074K8507692J1313943o858311K047657K4642623K0572941j5024890
1144E4952581m0786257l1412602j2270128j1054606j2086123Q979847L4917002
$$ plain form
1197 -22674868 76032 2658487 -2534761 -2006859 -583574 -6108077 -13206863 -14481846
1189 -14481846 -12375324 -8979879 697977 14696922 19351035 10506542 3592713 9136443
1181 9136443 14068959 3206204 -15483225 -25255350 -26801506 -28824994 -23178475 5173195
1173 5173195 46932401 71816292 65489639 42557031 19298328 -5192027 -32175204
1166 -32175204 -47980126 -42337569 -30120463 -35640213 -58362456 -71240706 -55856592
1159 -55856592 -25250076 -5325382 -5101958 -15359836 -27044262 -35667665 -32387055 -10249074
1151 -10249074 18258618 29572561 22714250 24761907 49404530 69977471 54952581
1144 54952581 14166324 -17246278 -29516406 -40571012 -52657135 -43677288 -8760286
1137h760286L1166833P68819k4248197l1700884l0587669j7702880J2980092L6830253
1129c1253919K3202916q175382o315326K9705202M1415207m08547m8463715m8174178
1121d8467742j1356809J4155860J4713423J1578631J4380708J2663975K364355
1114A0032401j0172395k2325221k9886610j9542729R946001L2163208K4008835
1107e776510P88396n533552P467488J5951792J0787044M964452L386761m623474
1099B7412397k0019509k7331435j8701222l616994R230197J9804979K3326337
1092A0104750J0693442j0979735j8251738j728200J9117541K1378940O071323
1085C6406323r310104j4341973j1737098p690602n219730l404642R32335P082960
$$ plain form
1137 -8760286 22406547 23175366 -1072831 -32773715 -63361384 -81064264 -68084172 -31253919
1129 -31253919 -8051003 -16226385 -22541711 7163491 48578698 48170151 -293564 -48467742
1121 -48467742 -59824551 -45668691 -30955268 -19376637 -4995929 7668046 10032401
1114 10032401 -139994 -22465215 -52351825 -71894554 -61948553 -29785345 -5776510
1107 -5776510 -4988114 -10521666 -3054178 12897614 23684658 28649110 32035871 27412397
1099 27412397 7392888 -19938547 -38639769 -42256763 -33026566 -13221587 10104750
1092 10104750 20798192 9818457 -8433281 -10161481 8956060 30335000 36406323
1085 36406323 27096219 12754246 1017148 -6673454 -11893184 -15297826 -14365491 -7282531
1077g282531O694071n504607j8121233j3195452P035668J7628028L416634j7710899
1069b7040321j6361607R489018L0072202J9303427j3762307l4178908k0656622
1062e3135118R167198J9279093M28688j7541576o594657J9882771K7296948J1382377
1054A0165724K029623J3185765J9328494k639043l3428215l7563433j3140319
1047d2061404J0942892J7354541J3236692O946851l56551k120946O469467Q847789
1039A9259331j4554476m5222197m0166298K196685K9233949R331409j9239559
1032e9161156r159383K1627378K4572139L944240N869530L3575859L8380857L585698
1024F3235162k5159750j6358391k484616j7706678l5235355j4806067K3372197
$$ plain form
1077 -7282531 -588460 -6093067 -24214300 -37409752 -30374084 -12746056 -9329422 -27040321
1069 -27040321 -43401928 -33912910 -3840708 15462719 1700412 -32478496 -53135118
1062 -53135118 -43967920 -24688827 -24260139 -41801715 -48396372 -28513601 -1216653 10165724
1054 10165724 12195347 25381112 44709606 42070563 8642348 -28921085 -42061404
1047 -42061404 -31118512 -13763971 -527279 6419572 6063021 3942075 10411542 19259331
1039 19259331 4704855 -40517342 -80683640 -78486955 -49253006 -39921597 -59161156
1032 -59161156 -68320539 -46693161 -22121022 -18176782 -12307252 21268607 59649464 63235162
1024 63235162 38075412 21717021 19232405 1525727 -33709628 -48515695 -25143498
1017b5143498K6809256p209737l0725178j8221432O780685J7428192J4350381
1010a5931331P158691j69027j191553P227990J1273111l80781r481878O526860
1002E032082K9410488K1398130j0829545k0424152N217788K3463700N856383j8466645
994D0658229j3849430P907239J4980135M477225o651762j2917319j4111645k641838
986A7850834J5942308J4890930j3444459l4851778k0872686O784726J3409305
979b90820P032574J5939922L1391105K0280097j5497380l8912400l4166783k0637920
971c4861605j0786368L676216J9511870J7357409p64972p085912O088262J1754215
963D889115m897881j9541457r986662O748938N891575j861449Q792273L0101548
$$ plain form
1017 -25143498 1665758 -5543979 -36269157 -54490589 -47709904 -30281712 -15931331
1010 -15931331 -8772640 -8941667 -10133220 -2905230 8367881 7987100 -1494778 5032082
1002 5032082 34442570 55840700 45011155 24587003 29804791 53268491 59124874 40658229
994 40658229 26808799 34716038 49696173 54173398 47521636 34604317 20492672 17850834
986 17850834 33793142 48684072 35239613 387835 -20484851 -13700125 -290820
979 -290820 6741754 22681676 54072781 74352878 58855498 19943098 -14223685 -34861605
971 -34861605 -45647973 -41971757 -22459887 -5102478 -5867450 -12953362 -6865100 4889115
963 4889115 -8766 -19550223 -29536885 -22787947 -16896372 -18757821 -9965548 20136000
955B0136000L0111197M042780j6943691j2926660j346049k971467o984277O831451
947A9949284K6617713K0054359j3713256l5478418k1426137J407921j490840j7023404
939b1102778p629761K4451058L8589224J9911063j904358n902442p741171j8351038
931B0319797j9246402l784255L82646j7089862j7854891K1662016N4822014K8753499
923F7964562k5834621l4198057Q896792L4812564R298778k4297835k4592366j1341924
915G07893j6440761k6816725j3447289J6433899L1538439K1137991J106316j1169971
907C049792j0454638l173518j834778q846430p908781J0683452K5550251J4053641
899B1118991m359771M051084K3501408O235104m2785672n9676950j7976661K9181195
$$ plain form
955 20136000 50247197 54289977 37346286 24419626 23073577 20102110 13117833 19949284
947 19949284 46566997 66621356 52908100 17429682 -3996455 -2588534 -4079374 -21102778
939 -21102778 -28732539 -4281481 34307743 54218806 52314448 46412006 38670835 20319797
931 20319797 1073395 -2710860 -2328214 -19418076 -37272967 -15610951 39211063 67964562
923 67964562 42129941 7931884 16828676 51641240 60940018 36642183 12049817 707893
915 707893 -15732868 -42549593 -55996882 -39562983 -8024544 13113447 14219763 3049792
907 3049792 -7404846 -10578364 -12413142 -21259572 -29168353 -18484901 7065350 21118991
899 21118991 16759220 20810304 44311712 50546816 7761144 -51915806 -69892467 -40711272
891d0711272L2572649J4983917J6163714K2875589N097688j9999486j6708679
884A4274120O124710J4496412Q365975R787219J2462766m393862k7790860k8662671
876D663809j5552185j9113806l3029513k3531558P840761K4868086J8842003J6312129
868a8700274K1936897R206726k1574991l0747874l670203K1212358J2544157q646004
860a8439208j0698057m63316m24594p471247n714563K501019O251699Q033095
852b6425172J2623122J2075520K869483j271030N480778M682839j3263562k1959315
844b5187337L067292L5950137K8186937k0181323n4265904l5442393J1809672
837e6062919L7420130K7092232P387115K271227O132473J465822j2172613j8733661
$$ plain form
891 -40711272 -8138623 6845294 23009008 45884597 50982285 30982799 14274120
884 14274120 20398830 34895242 43261217 53048436 65511202 61117340 33326480 4663809
876 4663809 -10888376 -30002182 -63031695 -86563253 -78722492 -53854406 -35012403 -18700274
868 -18700274 3236623 12443349 -9131642 -39879516 -43549719 -22337361 -9793204 -18439208
860 -18439208 -29137265 -29600581 -30025175 -37496422 -43210985 -40709966 -34458267 -26425172
852 -26425172 -13802050 -1726530 1142953 -128077 5352701 10035540 -3228022 -25187337
844 -25187337 -22120045 13830092 42017029 21835706 -32430198 -67872591 -56062919
837 -56062919 -18642789 8449443 15836558 18107785 24240258 25706080 13533467 -5200194
829e200194j1774306o222326j6017089k9343476k1813277O909878K7402904J8514305
821c7543581l618135p592630J1020405K5469029J5331449o028544r484254J0783051
813a663210K8073790J7468551r612479j8784938K1918J6762975L169262k5294749
805A0141120k9234453Q14K8002728K1956242j0725826l5262834k8768616R4091
797d3796734K3470314K2264899M798070m985721n84155k081194k1043531l2385902
789e4343954o040639M1616548N8937469K4275440k7777302n2570159m2221346
782e8123943j6557351P527328K2235483K3743508J7069822J3238642J1892159
775B1025648J693733j5309438k0558429j0004712m566084j5025894k0763133l400463
$$ plain form
829 -5200194 -16974500 -23196826 -39213915 -68557391 -90370668 -83460790 -56057886 -37543581
821 -37543581 -41161716 -48754346 -37733941 -12264912 3066537 -2962007 -12446261 -1663210
813 -1663210 26410580 43879131 34266652 15481714 15503632 32266607 35435869 10141120
805 10141120 -19093333 -19092519 8910209 30866451 20140625 -15122209 -43890825 -43796734
797 -43796734 -20326420 1938479 6736549 1750828 1166673 -914521 -21958052 -54343954
789 -54343954 -60384593 -18768045 40169424 64444864 36667562 -15902597 -58123943
782 -58123943 -74681294 -67153966 -44918483 -21174975 -4105153 9133489 21025648
775 21025648 22719381 7409943 -13148486 -23153198 -27719282 -42745176 -63508309 -66908772
767f6908772K0674676K5373657J3257206K856529m583592j6081660j9876548j796044
759d7084548K0658760J7018331o788495j4802321J625678J1578526j254963j1046028
751c0095060M331689K4022282J8480330k848511j0815376n920089j1908942k8057009
743d2810686k6571246j692111J4979286L356938j1641878o430K2753335J7960297
735b3672495j3600238k8273641l301481K9188609K8172650j321837k1911824j6266929
727e0987186o13539O190168K468788o299856j5952703j8672223o134886J7314429
719g2687008L5481138L6501087K0698451l705338k2649783k1483657k567880J0427663
711a9985327K870514o733068M285677K1548752J3747962j2855213j9716333K129806
$$ plain form
767 -66908772 -46234096 -20860439 -7603233 -4746704 -9330296 -25411956 -45288504 -47084548
759 -47084548 -26425788 -9407457 -16195952 -30998273 -29372595 -17794069 -19049032 -30095060
751 -30095060 -25763371 -1741089 16739241 13890730 3075354 -2844735 -14753677 -42810686
743 -42810686 -69381932 -71074043 -56094757 -52737819 -64379697 -64386127 -41632792 -23672495
735 -23672495 -37272733 -65546374 -68847855 -39659246 -11486596 -12808433 -34720257 -50987186
727 -50987186 -51600725 -45410557 -42941769 -49241625 -65194328 -83866551 -90001437 -72687008
719 -72687008 -37205870 -704783 19993668 16288330 -6361453 -27845110 -30412990 -19985327
711 -19985327 -17114813 -23847881 -19562204 1986548 15734510 2879297 -16837036 -14707230
703a4707230J7561229N049072j2901520j3837929r007703j0237060l016078J8438096
695b2659123K6701796N836156j4242016o283227N497779r652330k7289297o440401
687d8530663L3441186L6770411J508466j9813773p661096N17586j6236404k7247124
679d7251411j0162397Q571647K479803j0284371k544655J7613760K8081022K7422166
671A3925564K1306867M142732j8966636k1586219M188137K5374104J5135509n940734
663C7579324p863428j848646j3635396l0551329k1123548P412832J8152084M316532
655g561575n266628L34256m36317j6279260k4249195r684468R416063J3665829
647d0061295Q794824M821442m108492k0058981k5262657p973547J3870296J7588132
$$ plain form
703 -14707230 2853999 7903071 -4998449 -18836378 -27844081 -38081141 -41097219 -22659123
695 -22659123 4042673 9878829 -4363187 -10646414 -5148635 -14800965 -42090262 -48530663
687 -48530663 -15089477 21680934 23189400 3375627 -4285469 -3767883 -20004287 -47251411
679 -47251411 -57413808 -48842161 -46362358 -56646729 -59191384 -41577624 -13496602 13925564
671 13925564 35232431 39375163 20408527 -1177692 3010445 28384549 43520058 37579324
663 37579324 29715896 27867250 14231854 -16319475 -37443023 -30030191 -11878107 -7561575
655 -7561575 -12828203 -12493947 -12930264 -29209524 -53458719 -63143187 -53727124 -40061295
647 -40061295 -31266471 -26445029 -30553521 -50612502 -75875159 -83848706 -69978410 -52390278
639e2390278R933478J2310087K2441025J8048722l665151j7219545o550725J0206162
631f886225P505015j0210462j5958852q9494J6180222J2089657k831067l449569
623c650775J3287585K1987766L244454k8698087m1740079k2870335R396164K6636612
615b2406695J7469287n968736k2714660k2939074j4428485q709615m094222R442438
607g4349762K8880749L4656905J5789854j1998146k4053216j5536896j008357
600d7618869Q816370J6002971K2931583K4766627J7515625M465786q325606j6691706
592B1862781j7844282j1941962m869116l106134n384385n523880l230932m612479
584c4650389j0792954j3326869m130537J4532983L1955741L7299190K5917143
$$ plain form
639 -52390278 -42456800 -30146713 -7705688 10343034 6677883 -10541662 -17092387 -6886225
631 -6886225 618790 -9591672 -25550524 -25640018 -9459796 2629861 -201206 -3650775
623 -3650775 9636810 31624576 34869030 6170943 -35569136 -58439471 -49043307 -22406695
615 -22406695 -4937408 -10906144 -33620804 -56559878 -70988363 -79697978 -83792200 -74349762
607 -74349762 -45469013 -10812108 4977746 -7020400 -31073616 -46610512 -47618869
600 -47618869 -38802499 -22799528 132055 24898682 42414307 46880093 38554487 21862781
592 21862781 4018499 -7923463 -12792579 -15898713 -21283098 -26806978 -30037910 -34650389
584 -34650389 -45443343 -58770212 -62900749 -48367766 -16412025 20887165 46804308
577D6804308K866102j7933961k2718628r757178Q821723J8176696J2901311j118655
569C8041718j3864162j8525020j3342965k53369J4242265J8444152M655216j6148526
561A3249309j8920548M352130K6359841J5616248j8045764l3045125j3868335
554b4302244Q580611O408572m486421L149981J8649228J0993595j6283634k5557257
546b2847569j698265K5194690K3440554P7032j5915336j1549302L211923J3610510
538A3524237J2654153K866513o561917q853102p060279n964935r96306J1833458
530A1441822K0033252Q232758j3788858j9768884o265227K074739o558482j2701142
522a7300022j801068Q703716K21204j2199933l871525J6552551J9008750n12292
$$ plain form
577 46804308 49670410 31736449 9017821 -739357 8082366 26259062 39160373 38041718
569 38041718 24177556 5652536 -7690429 -7943798 6298467 24742619 29397835 13249309
561 13249309 -5671239 -1319109 25040732 40656980 22611216 -10433909 -24302244
554 -24302244 -15721633 -9313061 -13799482 -10649501 7999727 18993322 2709688 -22847569
546 -22847569 -24545834 648856 24089410 24166442 8251106 -3298196 -86273 13524237
538 13524237 26178390 29044903 22482986 13629884 6569605 604670 -391636 11441822
530 11441822 31475074 39707832 25918974 6150090 -115137 1959602 -4598880 -17300022
522 -17300022 -19101090 -10397374 -10176170 -22376103 -26247628 -9695077 9313673 8801381
514H801381j4586765o402757R230399J1830847R10112j1264611j6077579j1140594
506b8699567R8410O080345k869617j7415645j5308153Q382791K9381108K2813368
498B463040m516039k1906669j1622503J2195730K2612402J0370626r758392k0001423
490b0163228j8865835j5208621j0390089J366142J5766364J7637401M270050n595515
482c1183331J087311R052413j782611j9846214j4486561J5628948L4024998J6330233
474H825186j4202350j8585741N864719K6396467K0449580p42259j4334156j2992594
466F78852l812804N515536R653069L986711q790390j5465506o797675P187363
458g844844Q267935l703493r720255j145656N737320l616443j5596603q663162
$$ plain form
514 8801381 -5785384 -12188141 -2957742 8873105 9783217 -1481394 -17558973 -28699567
506 -28699567 -28601157 -22520812 -25390429 -42806074 -58114227 -49731436 -20350328 2463040
498 2463040 -2052999 -23959668 -35582171 -23386441 -774039 9596587 -161805 -20163228
490 -20163228 -39029063 -54237684 -64627773 -63261631 -47495267 -29857866 -25587816 -31183331
482 -31183331 -30096020 -21043607 -22826218 -42672432 -57158993 -41530045 -7505047 8825186
474 8825186 -5377164 -23962905 -18098186 8298281 28747861 28005602 13671446 678852
466 678852 -3133952 2381584 12034653 16021364 7230974 -8234532 -15032207 -7844844
458 -7844844 423091 -3280402 -13000657 -14146313 -8408993 -12025436 -27622039 -36285201
450c6285201R098765Q825545j2998410k5687102j0687543J0418994J1520416J395287
442d4399249K162130O784891q722534l7990835m4279234j2764336K6285310L7749131
434g5174726K2414426M339645l848644o774138r546786j1182818r664572l417710
426i2855323P955899J8658575J9330744J0105806L058092O194437J3533428J6251691
418B233349J3836961Q496525j58618p729393m981803N277714M566960j4945066
410F596629l2688015k4915888J502423J8990859J6637554P683592K806062k354172
402e740956j0505578j3620913p614569o53612L95874j375697l812459j0709970
394e3637880j8264526j2474449P760979J9989549P888569j0459734o550662J2795463
$$ plain form
450 -36285201 -27186436 -18360891 -31359301 -57046403 -67733946 -57314952 -45794536 -44399249
442 -44399249 -42237119 -35452228 -44174762 -82165597 -126444831 -139209167 -112923857 -75174726
434 -75174726 -52760300 -48420655 -52269299 -59043437 -68590223 -79773041 -89437613 -92855323
426 -92855323 -84899424 -66240849 -46910105 -36804299 -33746207 -27551770 -14018342 2233349
418 2233349 16070310 24566835 24408217 16678824 11697021 16974735 21541695 6596629
410 6596629 -26091386 -51007274 -49504851 -30513992 -13876438 -6192846 -3386784 -5740956
402 -5740956 -16246534 -29867447 -37482016 -38135628 -37739754 -39115451 -42927910 -53637880
394 -53637880 -71902406 -84376855 -76615876 -56626327 -48737758 -59197492 -65748154 -52952691
386e2952691J1524343j9886290m3222422k3670116J9618228L9513361K5511035
379d3564552J1660042J9972006K8218824Q908445k5224768l9853801k8809257
372f8693061j6332064j3874938m785386K1066867M3869486M0919084J8846300
365B1016288N18153p432814j3936333j8680001j0974350O674493J4929281M409271
357c476012r376125p415589P148777J5511620R335968n80119j193968N714804
349A5669356P398415j876328j1804629q292409P060806J6276350O916840j1441913
341A9906488j9246050j1184483K57085L483639K05279k095763j293872n42687
333a0510364k936224r233229j6569116j8477865j1617188k790773j954476o899888
$$ plain form
386 -52952691 -41428348 -61314638 -104537060 -128207176 -108588948 -69075587 -43564552
379 -43564552 -31904510 -11932504 16286320 25194765 -30003 -39883804 -68693061
372 -68693061 -85025125 -98900063 -103685449 -82618582 -38749096 2169988 21016288
365 21016288 21534441 14101627 165294 -18514707 -29489057 -22814564 -7885283 -3476012
357 -3476012 -12852137 -20267726 -13118949 2392671 11728639 11148520 9954552 15669356
349 15669356 23067771 21191443 9386814 1094405 8155211 24431561 31348401 19906488
341 19906488 660438 -10524045 -10266960 -6783321 -6578042 -8673805 -9967677 -10510364
333 -10510364 -13446588 -22679817 -39248933 -57726798 -69343986 -72134759 -74089235 -80989123
325h0989123l905718J2112133K6656839K2217439P63903j7394413j4934535O705528
317d8767947K9830427L4971771J6705863j0461507k4653527j8029174k506796
310b2910890O625567N771566l71681o754550o295994Q203433K9461784L3462786
302D7192021P483041k6610564l5311966j5889864M349635R482138J0468333J4459672
294A5622446P547104j5345695k8682767j0615755J7952490J9504756l903950j4486540
286a2407911J792184J5326166K706260j6908458j5962107k669496l116489j6201051
278d7440902j7497988r30527J3473702J3959768J1971764J6377164J6390779J942408
270H246168j6297211k0901868j0929516K74487L126973j205733o076265n164579
$$ plain form
325 -80989123 -84894841 -72782708 -46125869 -23908430 -23144527 -40538940 -55473475 -48767947
317 -48767947 -18937520 16034251 32740114 22278607 -2374920 -20404094 -22910890
310 -22910890 -16285323 -10513757 -10885438 -17639988 -23935982 -15732549 13729235 47192021
302 47192021 54675062 28064498 -7247468 -23137332 -18787697 -9305559 1162774 15622446
294 15622446 23169550 7823855 -20858912 -31474667 -13522177 5982579 2078629 -12407911
286 -12407911 -10615727 4710439 7416699 -9491759 -25453866 -28123362 -31239851 -47440902
278 -47440902 -64938890 -65869417 -52395715 -38435947 -26464183 -10087019 6303760 8246168
270 8246168 -8051043 -28952911 -39882427 -39607940 -36480967 -37686700 -43762965 -48927544
262d8927544K095412Q014445O145145L060558R256538J8458262J3228366m835792
254F495390j1669678K183110J3558542L448470r653953O48226K2121609K0466322
246D7598038m919445j8629332n825770N221763r139370k9189471k3342916L859150
238c4367353K1323889J6114382L531997j360369L73378L003861M340704Q27608
230A3788097r814232j8669413j2593900N448188J6262534R533429l448331q913735
222h407363j0058382j6235805k2291692j4544250N116487J7332310J1572598N91641
214c6924456J20660N663886K983250o001351n905197M956367J0405009M641024
$$ plain form
262 -48927544 -46832132 -38817687 -32672542 -29611984 -20355446 -1897184 11331182 6495390
254 6495390 -5174288 -2991178 10567364 14015834 4361881 5010107 27131716 47598038
246 47598038 42678593 24049261 18223491 23445254 14305884 -14883587 -38226503 -34367353
238 -34367353 -13043464 3070918 6602915 5242546 5615924 8619785 12960489 13788097
230 13788097 3973865 -14695548 -27289448 -21841260 -5578726 3954703 506372 -8407363
222 -8407363 -18465745 -34701550 -56993242 -71537492 -66421005 -49088695 -37516097 -36924456
214 -36924456 -36803796 -31139910 -28156660 -34158011 -40063208 -35106841 -24701832 -20060808
$$ [...]
##END NTUPLES=NMR SPECTRUM
##END=
