##TITLE=31Pdec_LR-725-C1-Et20
 CDCl3, 124 sc
 30.10.2020
##JCAMPDX= 6.0         $$ Bruker NMR JCAMP-DX V2.0
##DATA TYPE= NMR SPECTRUM
##DATA CLASS= NTUPLES
##ORIGIN= UXNMR, Bruker Analytische Messtechnik GmbH
##OWNER= root
$$ XWIN-NMR		Version 3.5
$$ Fri Oct 30 11:27:34 2020 Russian Standard Time (UT+4h)  she@DPX200
##.OBSERVE FREQUENCY= 81.013821
##.OBSERVE NUCLEUS= ^31P
##.ACQUISITION MODE= SIMULTANEOUS
##.ACQUISITION SCHEME= undefined
##.AVERAGES= 124
##.DIGITISER RES= 17
##SPECTROMETER/DATA SYSTEM= spect
##.PULSE SEQUENCE= zgpg30
##.SOLVENT NAME= Pyr
##.SHIFT REFERENCE= (INTERNAL, Pyr, 0, 182.463)
##AUDIT TRAIL= $$ (NUMBER, WHEN, WHO, WHERE, WHAT)
$$ ##TITLE= Audit trail, XWIN-NMR		Version 3.5
$$ ##JCAMPDX= 5.01
$$ ##ORIGIN= Bruker BioSpin GmbH
$$ ##OWNER= she
$$ F:/spectra/data/she/nmr/P31/1/pdata/1/auditp.txt
$$ ##AUDIT TRAIL=  $$ (NUMBER, WHEN, WHO, WHERE, WHAT)
(   1,<2020-10-30 11:26:27.17 +0400>,<she>,<DPX200>,
      <continue with go, POWCHK disabled, PULCHK disabled
       configuration hash MD5:
       00 E9 B6 7A A2 85 ED C7 34 08 36 98 17 FE 4E 26
       data hash MD5: 32K
       75 7A 56 81 0B 46 96 74 31 1E 29 7E E7 D1 0D 0B>)
(   2,<2020-10-30 11:26:46.45 +0400>,<she>,<DPX200>,
      <Start of raw data processing
       efp BC_mod = 2 LB = 1 FT_mod = 6 PKNL = 1 PHC0 = -2413.732 PHC1 = 144.8008 SI = 64K 
       data hash MD5: 64K
       F9 8B E7 54 19 EA 55 CD 1D 5C E7 23 08 DA 4A 9F>)
(   3,<2020-10-30 11:26:59.87 +0400>,<she>,<DPX200>,
      <pk PHC0 = 2.268177 PHC1 = 0 
       data hash MD5: 64K
       97 AF 14 20 F5 BD 21 A6 FE 61 02 3B 37 5C D0 6A>)
(   4,<2020-10-30 11:27:03.92 +0400>,<she>,<DPX200>,
      <abs ABSG = 5 
       data hash MD5: 64K
       33 2D 9C 90 F3 38 7C 9B DD E5 66 25 66 01 74 4B>)
$$ ##END=
$$ 
$$ hash MD5
$$ 77 9D DF F1 B5 54 65 4B 48 2E 26 5F A3 66 E3 90
##$RELAX= 
##$RELAX= 
##$RELAX= 
##$RELAX= 
##$RELAX= 
##$RELAX= 
##$RELAX= 
##$RELAX= 
$$ Bruker specific parameters
$$ --------------------------
##$DU= <F:/spectra>
##$EXPNO= 1
##$NAME= <P31>
##$PROCNO= 1
##$TYPE= <nmr>
##$USER= <she>
##$AMP= (0..31)
100 100 100 100 100 100 100 100 100 100 100 100 100 100 100 100 100 100 
100 100 100 100 100 100 100 100 100 100 100 100 100 100 
##$AQSEQ= 0
##$AQ_mod= 1
##$AUNM= <au_zg>
##$AUTOPOS= <>
##$BF1= 81.014009
##$BF2= 200.13
##$BF3= 200.13
##$BF4= 200.13
##$BF5= 200.13
##$BF6= 200.13
##$BF7= 200.13
##$BF8= 200.13
##$BYTORDA= 1
##$CFDGTYP= 0
##$CFRGTYP= 5
##$CHEMSTR= <none>
##$CNST= (0..31)
1 1 145 1 1 1 1 1 1 1 1 1 1 1 1 1 1 1 1 1 1 1 1 1 1 1 1 1 1 1 1 1 
##$CPDPRG= <waltz16>
##$CPDPRG1= <>
##$CPDPRG2= <waltz16>
##$CPDPRG3= <>
##$CPDPRG4= <mlev>
##$CPDPRG5= <mlev>
##$CPDPRG6= <mlev>
##$CPDPRG7= <mlev>
##$CPDPRG8= <mlev>
##$CPDPRGB= <>
##$CPDPRGT= <>
##$D= (0..31)
0 1 0 0 0 0 0 0 0 0 0 0.03 2e-05 3e-06 0 0 0 0 0 0 0 0 0 0 0 0 0 0 0 0 
0 0 
##$DATE= 1604042606
##$DBL= (0..7)
120 120 120 11 120 120 24 19 
##$DBP= (0..7)
150 150 150 150 150 150 150 150 
##$DBP07= 0
##$DBPNAM0= <>
##$DBPNAM1= <>
##$DBPNAM2= <>
$$ [...]
##$SUBNAM3= <"">
##$SUBNAM4= <"">
##$SUBNAM5= <"">
##$SUBNAM6= <"">
##$SUBNAM7= <"">
##$SUBNAM8= <"">
##$SUBNAM9= <"">
##$SW= 369.568048894756
##$SWIBOX= (0..15)
0 1 3 0 0 0 0 0 0 0 0 0 0 0 0 0 
##$SW_h= 29940.119760479
##$TD= 32768
##$TD0= 1
##$TE= 0
##$TE2= 300
##$TE3= 300
##$TEG= 300
##$TL= (0..7)
0 120 53 12 22 120 120 120 
##$TP= (0..7)
150 150 150 150 150 150 150 150 
##$TP07= 0
##$TPNAME0= <>
##$TPNAME1= <>
##$TPNAME2= <>
##$TPNAME3= <>
##$TPNAME4= <>
##$TPNAME5= <>
##$TPNAME6= <>
##$TPNAME7= <>
##$TPOAL= (0..7)
0.5 0.5 0.5 0.5 0.5 0.5 0.5 0.5 
##$TPOFFS= (0..7)
0 0 0 0 0 0 0 0 
##$TUNHIN= 0
##$TUNHOUT= 0
##$TUNXOUT= 0
##$USERA1= <user>
##$USERA2= <user>
##$USERA3= <user>
##$USERA4= <user>
##$USERA5= <user>
##$V9= 5
##$VALIST= <valist>
##$VCLIST= <CCCCCCCCCCCCCCC>
##$VD= 0
##$VDLIST= <DDDDDDDDDDDDDDD>
##$VPLIST= <PPPPPPPPPPPPPPP>
##$VTLIST= <TTTTTTTTTTTTTTT>
##$WBST= 1024
##$WBSW= 4
##$XGAIN= (0..3)
0 0 0 0 
##$XL= 0
##$YL= 0
##$YMAX_a= 78314
##$YMIN_a= -81314
##$ZGOPTNS= <>
##$ZL1= 120
##$ZL2= 120
##$ZL3= 120
##$ZL4= 120
##$ABSF1= 182.463
##$ABSF2= -187.1042
##$ABSG= 5
##$ABSL= 3
##$ALPHA= 0
##$AQORDER= 0
##$ASSFAC= 0
##$ASSFACI= 0
##$ASSFACX= 0
##$ASSWID= 0
##$AUNMP= <proc_1d>
##$AZFE= 0.1
##$AZFW= 0.5
##$BCFW= 0
##$BC_mod= 2
##$BYTORDP= 0
##$COROFFS= 0
##$CY= -3
##$DATMOD= 1
##$DC= 0
##$DFILT= <>
##$DTYPP= 0
##$F1P= 0
##$F2P= 0
##$FCOR= 1
##$FTSIZE= 65536
##$FT_mod= 6
##$GAMMA= 0
##$GB= 0
##$INTBC= 1
##$INTSCL= 5.30512e-09
##$ISEN= 30
##$LB= 1
##$LEV0= 0
##$LPBIN= 0
##$MAXI= 10000
##$MC2= 0
##$MEAN= 0
##$ME_mod= 0
##$MI= 50
##$NCOEF= 0
##$NC_proc= -8
##$NLEV= 6
##$NOISF1= 182.463
##$NOISF2= 159.3651
##$NSP= 0
##$NTH_PI= 0
##$NZP= 0
##$OFFSET= 182.463
##$PC= 4
##$PHC0= -2411.464
##$PHC1= 144.8008
##$PH_mod= 1
##$PKNL= yes
##$PPARMOD= 0
##$PSCAL= 0
##$PSIGN= 0
##$REVERSE= no
##$SF= 81.014009
##$SI= 65536
##$SIGF1= 159.3651
##$SIGF2= -187.1042
##$SINO= 113.3802
##$SIOLD= 16384
##$SREGLST= <1H.CDCl3>
##$SSB= 0
##$STSI= 65536
##$STSR= 0
##$SW_p= 29940.119760479
##$SYMM= 0
##$S_DEV= 0
##$TDeff= 32768
##$TDoff= 0
##$TI= <>
##$TILT= no
##$TM1= 0
##$TM2= 0
##$TOPLEV= 0
##$USERP1= <user>
##$USERP2= <user>
##$USERP3= <user>
##$USERP4= <user>
##$USERP5= <user>
##$WDW= 1
##$XDIM= 65536
##$YMAX_p= 437658082
##$YMIN_p= -81132917
$$ End of Bruker specific parameters
$$ ---------------------------------
##NTUPLES= NMR SPECTRUM
##VAR_NAME=  FREQUENCY,     SPECTRUM/REAL,   SPECTRUM/IMAG
##SYMBOL=    X,             R,               I
##VAR_TYPE=  INDEPENDENT,   DEPENDENT,       DEPENDENT
##VAR_FORM=  AFFN,          ASDF,            ASDF
##VAR_DIM=   65536,         65536,           65536
##UNITS=     HZ,            ARBITRARY UNITS, ARBITRARY UNITS
##FACTOR=    0.456856943014862, 1,           1
##FIRST=     14782.0589164895, 0,            0
##LAST=      -15158.0608439895, 0,           0
##MIN=       -15158.0608439895, -81132917,   0
##MAX=       14782.0589164895, 437658082,    0
$$ Real data points
##PAGE= N=1
##DATA TABLE= (X++(R..R)), XYDATA
$$ [...]
38527B779447K8389156N667878j3605538j0179750L338518P309409J334418l274919
$$ 2779447 31168603 36836481 23230943 13051193 16389711 23699120 25033538 21758619
38519B1758619j931442K854829Q584983J1479861P233763p97022m076361l434908
$$ 21758619 19827177 22682006 31266989 42746850 49980613 49183591 45107230 41672322
38511D1672322p798133j4576507r654905N472063Q389900q647908k0282651n616999
$$ 41672322 33874189 19297682 9642777 15114840 23504740 14856832 -5425819 -11042818
38503a1042818J6389563J5596119k061840p431827L415223Q601908K654602K315779
$$ -11042818 5346745 20942864 18881024 11449197 14864420 23466328 26120930 28436709
38495B8436709R361839M913957j2036926j6506100k54509J1550572L038006n973208
$$ 28436709 37798548 42712505 30675579 14169479 13914970 25465542 28503548 22530340
38487B2530340J929523Q508437o527231k4711974j6011833J0976836K1924217
$$ 22530340 24459863 32968300 26441069 1729095 -14282738 -3305902 18618315
38480A8618315R451418k237919o36582J529244k828362k916534M650809O182791
$$ 18618315 28069733 25831814 25195232 26724476 23896114 20979580 25630389 31813180
38472C1813180l701003j0520843m569358L549280L401039J480391M336532K867083
$$ 31813180 28112177 17591334 13021976 16571256 19972295 21452686 25789218 28656301
38464B8656301j0030052k0521002j1671555Q999002J9138946J3698730P993837
$$ 28656301 18626249 -1894753 -13566308 -4567306 14571640 28270370 36264207
38457C6264207R469581O580862p844874j9487386j2081907O165642J2070327M69888
$$ 36264207 45733788 52314650 44469776 24982390 12900483 19066125 31136452 31606340
38449C1606340r244673l643139M172022l197111j6876947j2891431R972211K5336819
$$ 31606340 22361667 18718528 22890550 19693439 2816492 -10074939 -102728 25234091
38441B5234091J6647052j291039q522376q322853j2540318j4671891j254668J8260186
$$ 25234091 41881143 40590104 32067728 23744875 11204557 -3467334 -4722002 13538184
38433A3538184J9257971k86162j3959656m782582J1873484J3256701L61320q736175
$$ 13538184 32796155 32509993 18550337 13767755 25641239 38897940 39259260 30523085
38425C0523085n113843M468686J0549878R607347L491344k227976k503324J14355
$$ 30523085 25409242 29877928 40427806 50035153 53526497 51298521 48795197 48909552
38417D8909552k625526j2397332k0556687k0206401j3926837n267402P398180
$$ 48909552 46284026 33886694 13330007 -6876394 -20803231 -26070633 -18672453
38410a8672453K1572719K5641097J3834749j587924n046270J025200K123825m764156
$$ -18672453 2900266 28541363 42376112 40788188 35741918 36767118 38890943 34126787
38402C4126787p549815Q24495J1578357J3026054M599130o217792j3161334j3126599
$$ 34126787 26576972 27401467 38979824 52005878 56605008 50387216 37225882 24099283
38394B4099283n732461L783826O406845l25945p411711n307417L037590O657954
$$ 24099283 18366822 22150648 28557493 28231548 20819837 15512420 18550010 25207964
38386B5207964L008810J681341Q544080J4002727N701453j0577130j4547323J072136
$$ 25207964 28216774 29898115 38442195 52444922 58146375 47569245 33021922 34094058
38378C4094058J7784405J4420461m987469j8037896j4161951m365329j272706
$$ 34094058 51878463 66298924 61311455 43273559 29111608 24746279 23473573
38371B3473573l733347n275240n236518m574868n92732O364800Q921489K984103
$$ 23473573 19740226 14464986 9228468 4653600 4060868 10425668 19347157 22331260
38363B2331260m844016p029963m941455j955994M445123J4502358J8966489J1921550
$$ 22331260 17487244 10457281 5515826 3559832 8004955 22507313 41473802 53395352
38355E3395352L292904M782773R598606K624768j2777949j6960360m187217P936825
$$ 53395352 56688256 61471029 71069635 73694403 60916454 43956094 39768877 47705702
38347D7705702N035655m431280n186542K531387P689332N889327Q48262m901386
$$ 47705702 52741357 48310077 43123535 45654922 53344254 59233581 60081843 55180457
38339E5180457j0318644j1408758n833498J023743K224323j274026l630730l008638
$$ 55180457 44861813 33453055 27619557 28643300 30867623 29593597 25962867 22954229
38331B2954229j233832J364302M296401M449594J820926K197758O517839M889530
$$ 22954229 21720397 23084699 27381100 31830694 33651620 35849378 42367217 47256747
38323D7256747p569530j6336144n339058J4779565J6848506k349014j4242273
$$ 47256747 39687217 23351073 18012015 32791580 49640086 47291072 33048799
38316C3048799p43929J7016659J0163880j3643137k1530472l981226J3543600
$$ 33048799 32304870 49321529 59485409 45842272 24311800 20330574 33874174
38309C3874174R477986o349987j2714440o315909J508662M808952N719940M409702
$$ 33874174 43352160 37002173 24287733 17971824 19480486 24289438 30009378 34419080
38301C4419080n52588n008923k850344M738117J1291115J3784608J2418105N543175
$$ 34419080 33866492 28857569 26007225 30745342 42036457 55821065 68239170 73782345
38293G3782345o692096j6655584j6503048r604166n919843p369446p045867k074094
$$ 73782345 67090249 50434665 33931617 24327451 18407608 11038162 3992295 1918201
38285A918201K923919N671908R163609J2786768J0564765J656051o273028p861717
$$ 1918201 4842120 10514028 19677637 32464405 43029170 44685221 38412193 30550476
38277C0550476o083885m177210m39961M600940M887657j344635o210956k964007
$$ 30550476 24466591 20289381 19849420 24450360 29338017 27993382 21782426 18818419
38269A8818419M544614Q933895Q935740O165013j73676q251006j0475262l600135
$$ 18818419 23363033 32296928 41232668 47397681 47224005 38972999 28497737 24897602
38261B4897602M094133L949989n97207j424285K38933k477826q409035r283598
$$ 24897602 28991735 32941724 32344517 30920232 31159165 28681339 20272304 10988706
38253A0988706k796904M439431O307147K419001m307797q912466o154099K537889
$$ 10988706 8191802 12631233 18938380 21357381 17049584 8137118 1983019 4520908
38245D520908P770409M383138n86469J52827J485439m093901j0848456p964803
$$ 4520908 12291317 16674455 16087986 16240813 17726252 13632351 2783895 -5180908
38237e180908J677399O073436M087356M675834Q074094N501946j884746k363597
$$ -5180908 -3503509 2569927 6657283 11333117 19407211 24909157 23024411 20660814
38229B0660814M784945N749506l671564q560372J152107J3334811J2016434J63769
$$ 20660814 25445759 31195265 27523701 18963329 20115436 33450247 45466681 45630450
38221D5630450q098010p752251l827387o55259n73543n385984j0005426l688329
$$ 45630450 37532440 29780189 25952802 25297543 24724000 19338016 9332590 5644261
38213E644261J2737896K0820872P509419j4382040k1725460j0283939M630469
$$ 5644261 18382157 39203029 46712448 32330408 10604948 321009 4951478
38206D951478J0859327R133495M042236j338617l292969p75293O77316l104830
$$ 4951478 15810805 24944300 28986536 27647919 24354950 23579657 24256973 21152143
38198B1152143o951700n134951k170944l961935m777806L091183J2106859Q251633
$$ 21152143 14200443 9065492 6894548 2932613 -1845193 1245990 13352849 21604482
38190B1604482n513148j1582492l765853N461484N944177K195876P65679J88784
$$ 21604482 16091334 4508842 742989 6204473 12148650 14344526 15110205 15298989
38182A5298989q32750J401368O027871N579458o2422j5396R549471J5648127O748551
$$ 15298989 14466239 15867607 21895478 27474936 27412514 27397118 36946589 52594716 59343267
38173E9343267r164174j6154586j2478463q882793r202402n525374O573456J7983508
$$ 59343267 50179093 34024507 21546044 12663251 3460849 -2064525 4508931 22492439
38165B2492439J6115760J299404j1583626r752404J087477K983187r241805j8026937
$$ 22492439 38608199 39907603 28323977 18571573 19659050 22642237 13400432 -4626505
38157d626505p001745J3461456J9852930R901024L490771Q775474J0113904k780727
$$ -4626505 -11628250 1833206 21686136 31587160 35077931 43853405 53967309 51186582
38149E1186582j5922850j4799597p811888q854475j2872533q665904k121119l934041
$$ 51186582 35263732 20464135 12652247 3797772 -9074761 -17740665 -19861784 -23795825
38141b3795825n305919Q306928K6378576K4548016M675831n435907M607572J4001927
$$ -23795825 -29101744 -20794816 5583760 30131776 34807607 29371700 33979272 47981199
38133D7981199Q486979K648198R312400J3048785l442827k5973234k7685512r508757
$$ 47981199 56468178 59116376 68428776 81477561 78034734 52061500 24375988 14867231
38125A4867231L746136J815395j160458N083044J1228046O390561m896133j1202853
$$ 14867231 18613367 20428762 19268304 24351348 35579394 41969955 37073822 25870969
38117B5870969r004454l115426O97722O18900J274508R859435K3392106K4963322
$$ 25870969 16866515 13751089 14448811 15067711 16342219 26201654 49593760 74557082
38109G4557082M214858k2591448k8436399j0718750O253664N835325k412372m631954
$$ 74557082 78771940 56180492 27744093 17025343 23279007 29114332 26701960 22070006
38101B2070006l764214o922823q212247k59780Q758784O824680j164914j643736
$$ 22070006 18305792 11382969 3170722 2910942 11669726 18494406 17329492 15685756
38093A5685756M136567L053911n708245q101470J048651Q830590M550807m832434
$$ 15685756 19822323 22876234 17167989 9066519 10115170 18945760 23496567 18664133
38085A8664133p449146l804960k350129n187482p048285m499868R07207O628165
$$ 18664133 11214987 7410027 5059898 -127584 -7175869 -11675737 -10768530 -4140365
38077d140365J1197166J3216342J1241354M748496m360156j0179662o271982M918966
$$ -4140365 7056801 20273143 31514497 36262993 31902837 21723175 15451193 20370159
38069B0370159J0608399L442059n518037j124344J1196462J0904391n613231j6473436
$$ 20370159 30978558 34420617 28902580 27778236 38974698 49879089 44265858 27792422
38061B7792422o082948J1179637J2866294J018636m796190J001373N048823l06535
$$ 27792422 21709474 32889111 45755405 46774041 41977851 42979224 48028047 47721512
38053D7721512o046146l713586J423919J028757l022876l093063K911612R951087
$$ 47721512 41675366 37961780 39385699 40414456 37391580 34298517 37210129 47161216
38045D7161216J1416060M069593p752489j2433990k677303J2098799J3858942
$$ 47161216 58577276 62646869 54894380 42460390 39783087 51881886 65740828
38038F5740828l15432j2199120o479599P874758J0173858l432033j5868471j3241580
$$ 65740828 65425396 53226276 46746677 54621435 64795293 61363260 45494789 32253209
38030C2253209j875928L011044k238603p648462m672049L751669Q930815P319976
$$ 32253209 30377281 33388325 31149722 23501260 18829211 22580880 31511695 38831671
38022C8831671K980523J277462K693873K809289k272627j0003098j1672333j675358
$$ 38831671 41812194 43089656 45783529 48592818 46320191 36317093 24644760 22969402
38014B2969402J2939510J6862859L846923j4345215k1126779j3700094k440215
$$ 22969402 35908912 52771771 56618694 42273479 21146700 7446606 5006391
38007E006391M720835Q621700J1259313J1749157J0427461P807645l56505j5745841
$$ 5006391 9727226 18348926 29608239 41357396 51784857 59592502 59235997 43490156
37999D3490156k5498397j3509131J2161549K1450472K008330k0743634j8451690
$$ 43490156 17991759 4482628 16644177 38094649 40102979 19359345 907655
37992I07655J027368R635222K032400k592543M216410R878474O719146L175303
$$ 907655 1935023 11570245 13602645 11010102 15226512 25104986 31824132 34999435
37984C4999435L531535q16468j1200857j3495551j683634Q450846L006592p792550
$$ 34999435 38530970 37714502 26513645 13018094 11334460 19785306 22791898 14999348
37976A4999348o372668N205207J1258006O869137L30144l212407n734184o994035
$$ 14999348 8626680 13831887 25089893 31959030 32289174 29076767 23342583 16348548
37968A6348548l856863K707232R415752J6068293K0489580J4241993m876253k1559525
$$ 16348548 12491685 15198917 24614669 40682962 61172542 75414535 70538282 48978757
37960D8978757j8805478k588100M485075n365350j5242238r105355O710228J4799989
$$ 48978757 30173279 27585179 32070254 26704904 11462666 2357311 9067539 23867528
37952B3867528R090206k570485j1016931j2382270o553427K904772R018904P744050
$$ 23867528 32957734 30387249 19370318 6988048 434621 3339393 12358297 20102347
37944B0102347L188616J875622L200140J129263m825061o948294o93964O760302
$$ 20102347 23290963 25166585 28366725 29495988 24670927 17722633 17028669 23788971
37936B3788971N550971j798586k515179P760541J6913346J2706044M76783m565939
$$ 23788971 29339942 27541356 25026177 32786718 49700064 62406108 62882891 58316952
37928E8316952R93278N821941K407127k933901k378001J036602J2622m953264
$$ 58316952 59310230 65132171 67539298 64605397 62227396 63263998 63276620 58323356
37920E8323356p589442o191070n607645j0214847j8194944k1534151j1867074
$$ 58323356 50733914 44542844 38935199 28720352 10525408 -11008743 -22875817
37913b2875817R038357K5177721K0911616J568083j0044756j975228J1957008
$$ -22875817 -13837460 11340261 32251877 33819960 23775204 21799976 33756984
37906C3756984J2346282k51034r661948o977110J710950O541967L467628m824524
$$ 33756984 46103266 45852232 36190284 29213174 30924124 37466091 40933719 36109195
37898C6109195j0300516n348281O574154J1527819L489562n130536j289026P917997
$$ 36109195 25808679 20460398 27034552 38562371 42051933 36921397 35632371 43550368
37890D3550368N971379o670895j3105303n956696L473391M785415K171279K600276
$$ 43550368 49521747 42850852 29745549 23788853 27262244 32047659 34218938 36819214
37882C6819214L030985k014981q856128r581401l729903K051511L142100O66040
$$ 36819214 39850199 37835218 28979090 19397689 15667786 17719297 20861397 21527437
37874B1527437j679922q50744L508959P642876O350742p58230p473508p299449
$$ 21527437 19847515 18996771 22505730 30148606 36499348 35741118 28267610 20968161
37866B0968161m68003O438699P199101J847895m015286n812612m363649j762476
$$ 20968161 20500158 26938857 34137958 35985853 31970567 26157955 21794306 20031830
37858B0031830M026960J4318037K1216186J3906281m374180j6276661j2577792
$$ 20031830 24058790 38376827 59593013 73499294 69125114 52848453 40270661
37851D0270661m192433m444353r558306p522650J724446P511701N059307m76527
$$ 40270661 36078228 31633875 22075569 14552919 16277365 23789066 28848373 28371846
37843B8371846l359756j529082M470929R087606M548416o351570r626766j478931
$$ 28371846 25012090 23483008 27953937 37041543 41589959 35238389 25611623 24132692
37835B4132692K639542o104799j0261630O904669K8075648K2956116m928105k2783146
$$ 24132692 26772234 20667435 10405805 17310474 45386122 68342238 63414133 40630987
37827D0630987j7546755q523779q363660m733887R021274J5973127M540425j0062721
$$ 40630987 23084232 14560453 6196793 1462906 10484180 26457307 30997732 20935011
37819B0935011j0989583m855157m026940l832697L401231R233982M430123j289634
$$ 20935011 9945428 5090271 1063331 -2769366 631865 9865847 14295970 13006336
37811A3006336M717098J4331327J1103871l082654j2143482q700228K643858J5789755
$$ 13006336 17723434 32054761 43158632 40075978 27932496 19232268 21876126 37665881
37803C7665881K2510445J2756168q816865j9193742o905704Q343090N428310m642784
$$ 37665881 60176326 72932494 64115629 44921887 38016183 46359273 51787583 47144799
37795D7144799k77071J0086871J563629k0485928k3636637l09125J7917044P721344
$$ 47144799 46867728 56954599 58518228 38032300 14395663 14086538 32003582 39724926
37787C9724926j3495518j7120896k337499J0824655J0902440J972119p503383
$$ 39724926 26229408 9108512 6771013 17595668 28498108 30470227 22966844
37780B2966844j0556823m805672K611797K012646k807012J970902J6429456K2671502
$$ 22966844 12410021 7604349 10216146 12228792 9421780 11392682 27822138 50493640
37772E0493640J1984779r15378k567200k921875j5754327l0144133k3370335L374111
$$ 50493640 62478419 61563041 58995841 56073966 40319639 10175506 -13194829 -9820718
37764i820718K3929531K2677294J1855023P956274P844790k74344j3558067j7567632
$$ -9820718 14108813 36786107 48641130 56597404 64442194 64167850 50609783 33042151
37756C3042151r236281j911252m281864p078715N07245J0797191P993495n329568
$$ 33042151 23805870 21894618 17612754 10534039 11041284 21838475 29831970 24502402
37748B4502402q782067N900535K1381162J9249952M488481n725813o190752l075661
$$ 24502402 15720335 21620870 43002032 62251984 66740465 61014652 54823900 51748239
37740E1748239J343283P311169P602534l591754j5282978j1075604M750074J0277904
$$ 51748239 53091522 60402691 68005225 64413471 49130493 38054889 42804963 53082867
37732E3082867k823055j7819443j7201325l877976P665550R305704K822063m581198
$$ 53082867 50259812 32440369 15239044 11361068 19026618 28332322 31154385 26573187
37724B6573187m489054L926613Q380487k187300j8140097j8599495j418508J3286215
$$ 26573187 22084133 26010746 34391233 32203933 14063836 -4535659 -5954167 7332048
37716G332048J2968616P314506O500408M538235m362155j0698064n683485K148456
$$ 7332048 20300664 27615170 34115578 38653813 34291658 23593594 17910109 20058565
37708B0058565J952060l33321N541313J3323231R873872k405858j0740479j3286866
$$ 20058565 22010625 21677304 27218617 40541848 50415720 48009862 37269383 23982517
37700B3982517j6723729j7088420l455163J9026838K9001683J6394198m933832
$$ 23982517 7258788 -9829632 -13284795 5742043 34743726 51137924 46204092
37693D6204092j6865192j6325253r883174j766754N269116P090030M633213O202558
$$ 46204092 29338900 13013647 3130473 1363719 6632835 13722865 18356078 24558636
37685B4558636J5386242K2153956J4472816m244782j7801873j7179105j0202695
$$ 24558636 39944878 62098834 76571650 72326868 54524995 37345890 27143195
37678B7143195q536005j1304915q210424L259549J2113600Q610282j877965o285480
$$ 27143195 18607190 7302275 -908149 2351400 14465000 23075282 21197317 14911837
37670A4911837r76492O563420J0456387J0992231P253642k984032j3480179j1979196
$$ 14911837 13935345 20498765 30955152 41947383 49201025 46216993 32736814 20757618
37662B0757618J645459J1022960N310710m922818m675026K015915J68307j0080348
$$ 20757618 22403077 33426037 38736747 33813929 29138903 31154818 31323125 21242777
37654B1242777j2404016J79845J4046277J4474032M808042j433609K15410K527433
$$ 21242777 8838761 9018606 23064883 37538915 42346957 40913348 41128758 43656191
37646D3656191m41296n807833p478935l611336L470258J0878159J5330867J2212986
$$ 43656191 43214895 37407062 29928127 26316791 29787049 40665208 55996075 68209061
37638F8209061p042j3806222j7283854q703870p61667l955979j0808786o394509
$$ 68209061 68202019 54395797 37111943 28408073 27646406 23690427 12881641 6487132
37630F487132Q279993J6038899Q158414l535128m764196J933170M674624J268471
$$ 6487132 14767125 30806024 38964438 35429310 30665114 32598284 37272908 38541379
37622C8541379K85105N694055R447839J772907j4479473k3126581j1637660J0933041
$$ 38541379 38826484 44520539 53968378 55741285 41261812 18135231 6497571 17430612
37614A7430612K0387091P097102r981167r784176O06176K50373r212537p176118
$$ 17430612 37817703 44914805 34933638 25149462 25755638 26006011 16793474 9617356
37606I617356P458538J1701683r81238o854779O978771J7989031O461023r108035
$$ 9617356 17075894 28777577 27796339 20941560 27920331 45909362 52370385 43262350
37598D3262350l288033J2045798Q357179j0389594j5443251j585588Q285458M110687
$$ 43262350 39974317 52020115 60377294 49987700 34544449 32958861 41244319 45355006
37590D5355006k44013J822653K38762n350520j264372J0493363Q447790j1298562
$$ 45355006 45110993 46933646 47172408 41821888 40557516 51050879 59498669 48200107
37582D8200107k2563881q386884J2214570J4263487K590777j794126M794846Q473104
$$ 48200107 25636226 17249342 29463912 43727399 46318176 44524050 49318896 57792000
37574E7792000J381348j0484035j7438809j4244139l885628K290033k662266p257951
$$ 57792000 59173348 48689313 31250504 17006365 13120737 15410770 12748504 5490553
37566E490553M933602K6278437K9700076P740174j5328037j9453822j3197686
$$ 5490553 10424155 36702592 66402668 74142842 58814805 39360983 26163297
37559B6163297r551157k735239J1966907J8821519O583832o306964J313209J6470882
$$ 26163297 16612140 13876901 25843808 44665327 51249159 44942195 46255404 62726286
37551F2726286J1770455r037898j7114638n247826L536557m188574j3393344r262553
$$ 62726286 74496741 65458843 48344205 43096379 46632936 42444362 29051018 19788465
37543A9788465k00562n67585p896586r252339J77954J3142026J8587711J1011122
$$ 19788465 19587903 19020318 11123732 1871393 2049347 15191373 33779084 44790206
37535D4790206k578320o863008K997311J2089071O145538o251045p685295j073691
$$ 44790206 42211886 35348878 38346189 50435260 56580798 50329753 42644458 41570767
37527D1570767l665892j5158351j6209270j152313J2084295J1398170O789809
$$ 41570767 37904875 22746524 6537254 5384941 17469236 28867406 35657215
37520C5657215P448181M877072p078812j5146002p377231M308980J652985j1012231
$$ 35657215 43105396 47982468 40903656 25757654 18380423 22689403 24342388 13330157
37512A3330157j5029934p099065p75472j665685k74733Q956477J7358194J5293675
$$ 13330157 -1699777 -8798842 -9574314 -11239999 -11514732 -2558255 14799939 30093614
37504C0093614M715966n674361r767240n721589M283944J2662018J0641341k223370
$$ 30093614 34809580 29135219 19367979 13646390 17930334 30592352 41233693 39010323
37496C9010323j5680744j8130386p012365R723252K0225180J7759503O096398
$$ 39010323 23329579 5199193 -1813172 7910080 28135260 45894763 51991161
37489E1991161m201722o298707k601471Q71355J894354J472093K52192l46634
$$ 51991161 47789439 41490732 38889261 39760616 41654970 43127063 43379255 43032621
37481D3032621K888996R825040J3729969Q729225j471670p812542p269864m397878
$$ 43032621 45921617 55746657 69476626 78205851 76734181 68921639 61651775 57253897
37473E7253897k740527j078579J525789K855659J083747l195920r022048j4641184
$$ 57253897 54513370 53434791 54960580 57816239 58899986 55704066 46682018 32040834
37465C2040834j5189758p051498M162306O997027r35672p895430l312395P271677
$$ 32040834 16851076 9799578 13961884 20958911 20023239 12127809 8815414 16087091
37457A6087091R952234J748214o511690n877581P24801N607557N449981N60473
$$ 16087091 26039325 27787539 21275849 15398268 16123069 21730626 27180607 27741080
37449B7741080p113524j1031535l320548J2353308J9046011P443100p747845n180156
$$ 27741080 20627556 9596021 6275473 18628781 37674792 45117892 37370047 32189891
37441C2189891J2518778K0741633P008176j2386957j6244621n716748K237781
$$ 32189891 44708669 65450302 72458478 60071521 43826900 38110152 40347933
37434D0347933r11468q778001j2108105p357324L159009J1894010J0625032Q56424
$$ 40347933 39436465 30658464 18550359 11193035 14352044 26246054 36871086 37727510
37426C7727510n335430j023771N893048O017255K734657L103659L552373k023087
$$ 37727510 32392080 31368309 37261357 43278612 46013269 49116928 52669301 50646214
37418E0646214p733958m882825P88567j413676n844402O05750J1287147N610607
$$ 50646214 42912256 38029431 38817998 37404322 31559920 32165670 43452817 49063424
37410D9063424j5438869k4523364p238126J5958009J9159863L749509j1402321
$$ 49063424 33624555 9101191 1863065 17821074 36980937 40730446 29328125
37403B9328125j6012858j0745897J818427J4015932J3587179J101773n434174
$$ 29328125 13315267 2569370 4387797 18403729 31990908 33092681 27658507
37396B7658507L649853J3465750Q730287j581308k231582Q48595o008184j5674129
$$ 27658507 31308360 44774110 53504397 51923089 49691507 50540102 44531918 28857789
37388B8857789j1166552K887296O604836j863853o230244k856433l852719r046317
$$ 28857789 17691237 20578533 27183369 25319516 19089272 16232839 12380120 3333803
37380C333803l892400J0161196J2227630k392946j0914079N9354J2336124P264725
$$ 3333803 -558597 9602599 21830229 19437283 8523204 8582558 20918682 28183407
37372B8183407m025319j638375J0017894J1929165Q54726j0001244j2128275o801351
$$ 28183407 24158088 22519713 32537607 44466772 45321498 35320254 23191979 16390628
37364A6390628L263296J2839873J2559174J267738q376895p911064n558769q900511
$$ 16390628 19653924 32493797 45052971 46320709 37943814 30032750 24473981 15573470
37356A5573470r351675M28183Q469818K547199o143393j213748Q709970M258496
$$ 15573470 6221795 6649978 15119796 17666995 11523602 10309854 19019824 23278320
37348B3278320r035858q867151M417244Q011036k709117n842322P556207J6158016
$$ 23278320 14242462 5375311 9792555 17803591 15094474 9252152 16808359 32966375
37340C2966375L674664j4619633j7226238p094529O26036L989113Q938247J2075190
$$ 32966375 36641039 22021406 4795168 -2299361 -1673325 2315788 11254035 23329225
37332B3329225P071401o29628r05257O045979J3284364J7578961J6359893M642784
$$ 23329225 30400626 29770998 28865741 34911720 48196084 65775045 82134938 86777722
37324H6777722j3899223k3599016j6479391m376949O51466M838369J6012911K1937880
$$ 86777722 72878499 49279483 32800092 28423143 29074609 33912978 49925889 71863769
37316G1863769O800195j9026192k8822492j6151374k62994M538264L982473N718858
$$ 71863769 78663964 59637772 30815280 14663906 14400912 18939176 22921649 28640507
37308B8640507N968530R22534m159619m786805m288801m818045j916955N906699
$$ 28640507 34609037 35531571 31371952 26585147 22296346 17478301 15561346 21468045
37300B1468045J1462964Q910582K465689K2389L333229P668754O888289j850858
$$ 21468045 32931009 41841591 44307280 44329669 47662898 55331652 62219941 60369083
37292F0369083j3698038j7886146r973780P22737L759675K989637Q115748J5411881
$$ 60369083 46671045 28784899 18811119 19533856 23293531 26283168 34398916 49810797
37284D9810797J2503741J074276l191298L579011N739661o503298k0359675j9644493
$$ 49810797 62314538 63388814 60197516 63776527 69516188 63012890 42653215 23008722
37276B3008722p416624K635094O865802J0515039J3305022J0014916K379617j333182
$$ 23008722 15592098 18227192 25092994 35608033 48913055 58927971 61307588 59974406
37268E9974406J491256M395872J098010p548136j5875132j8383486j2525230k00238
$$ 59974406 61465662 65861534 66959544 59411408 43536276 25152790 12627560 12427322
37260A2427322J2168520J6365467P870778p963872j6321915p109458R091942J0215794
$$ 12427322 24595842 40961309 48832087 40868215 24546300 17436842 26528784 36744578
37252C6744578n721582j2723702N687741K6554499J8795858o739073j1021560
$$ 36744578 31022996 18299294 23987035 50541534 69337392 62598319 51576759
37245E1576759J1531138K2502911n1831k7254818k5681875o408647K29418n445719
$$ 51576759 63107897 85610808 85558977 58304159 32622284 26213637 26443055 20997336
37237B0997336j103247J4023833J8627270O855798m089580l726239j01115o0695
$$ 20997336 19894089 33917922 52545192 59400990 55311410 51585171 51484056 51423361
37229E1423361R3560J159420k644701j0251626j2521717p193665j407723J637673
$$ 51423361 51516921 52676341 50031640 39780014 27258297 20064632 18656909 20294582
37221B0294582N368867R216484Q278325L359777j99974j794685l006438r55909
$$ 20294582 25663449 34879933 43158258 46518035 46318061 44523376 41516938 40561029
37213D0561029M016323K376963q030266j0305970O481140K1735016R513202j7533936
$$ 40561029 44577352 46954315 38924049 28618079 35099219 56834235 66347437 48813501
37205D8813501k2487433n62924J3896931K244276j2153218n849691Q644027Q801142
$$ 48813501 26326068 25763144 39660075 41904351 29751133 23901442 32545469 41346611
37197D1346611j730739n789735k527758j982809l374553P35544Q047735J0898111
$$ 41346611 39615872 33826137 31298379 29315570 25941017 26676561 34724296 45622407
37189D5622407R199517O580972K554125j576377j25920M786381K028894q778845
$$ 45622407 54821924 61402896 63957021 62380644 62254724 67041105 69069999 60291154
37181F0291154j2677948m551915M83835n189792n568437R149011J8948238M985246
$$ 60291154 47613206 43061291 43545126 38355334 32786897 41935908 60884146 65869392
37173F5869392j4921161j1610464Q493483J4685244K314712k918950R184518J6648345
$$ 65869392 50948231 39337767 47831250 62516494 64831206 61912256 71096774 87745119
37165H7745119K365940j9664165k7187730j8384084n570159M252825J0666566
$$ 87745119 90111059 70446894 43259164 24875080 19304921 23557746 34224312
37158C4224312J2306002Q515572L111453O60796K162170N148175M457371l977737
$$ 34224312 46530314 55045886 58157339 58818135 60980305 66128480 70585851 66608114
37150F6608114j4980306j5861212l687710P266053N078962k613544l597662j869075
$$ 66608114 51627808 35766596 32078886 39344939 44423901 41810357 38212695 36343620
37142C6343620o349324r781663m97034J3181544J4508542P766020R235455J3671562
$$ 36343620 29994296 20212633 19715599 32897143 47405685 55171705 64407160 78078722
37134G8078722J590131j9929817j9505074P007236K2595296L562569k3404737
$$ 78078722 79668853 59739036 40233962 47241198 69836494 73399063 49994326
37127D9994326k1749397K675963J6861812R928896j234733m630344m344253l626656
$$ 49994326 28244929 30920892 47782704 57711600 56476867 51846523 47502270 43875614
37119D3875614J02061L894077Q75399o658738r700583o916443m158397j695631
$$ 43875614 43977675 47871752 48747151 42088413 32387830 25471387 21312990 19617359
37111A9617359N526580J5766326J9904125J3449730J081605r944639j4602910
$$ 19617359 25143939 40910265 60814390 74264120 75345725 65401086 50798176
37104E0798176j1145554l684221m06484l823849p246208n240759n85726L840857
$$ 50798176 39652622 35968401 35561917 31738068 24491860 19251101 18665375 22506232
37096B2506232J0327857J6810103J3659296k59553j0041362n555458J723893k359991
$$ 22506232 32834089 49644192 63303488 63043935 53002573 47447115 49171008 46811017
37088D6811017j0191080n846923N768254N920209n695327r612124R34908R102474
$$ 46811017 36619937 30773014 36541268 42461477 36766150 27154026 28088934 37191408
37080C7191408K417643q331369q033569Q90606O925016P680307Q192801R552402
$$ 37191408 39609051 31277682 23244113 24134719 31059735 38740042 46932843 56485245
37072E6485245R590008Q922383P973090L334218n529799j1171324p426875J37241
$$ 56485245 66075253 74997636 82970726 86304944 80775145 69603821 62176946 62314187
37064F2314187O28358p500022j4893756j3714716n998113J236506N188352Q886838
$$ 62314187 62942545 55442523 40548767 26834051 20835938 22072444 27260796 36147634
37056C6147634J4220112J6256073Q370621o453946j4876190q236886N443082J0405037
$$ 36147634 50367746 66623819 74994440 68540494 53664304 45427418 50870500 61275537
37048F1275537J739091j0903490j6051327j0431201J892373J3246746J6081421
$$ 61275537 63014628 52111138 36059811 25628610 27520983 40767729 56849150
37041E6849150R607335J960326K12222J150199j178223l580108K76867O207550
$$ 56849150 66456485 68416811 68629033 69779232 68601009 65020901 65297768 71505318
37033G1505318N262524P23507L433185J0022645M287307j4906805k5913440j4433081
$$ 71505318 76767842 77491349 80924534 90947179 95234486 80327681 54414241 39981160
37025C9981160M909856J0111684J599258m320629j347695L666860O547917Q830951
$$ 39981160 44891016 55002700 56601958 52281329 50933634 54600494 61148411 69979362
37017F9979362Q761713L358788l011683m227232l364919o246696q318596j512344
$$ 69979362 78741075 82099863 79088180 74860948 71496029 65249333 56930737 55418393
37009E5418393R363223J1956035N856689J354254M64936l680137q943526n216038
$$ 55418393 64781616 76737651 82594340 83948594 84413530 80733393 71789867 66573829
37001F6573829M031962K357848j0740080j3192636N471230K3596950J7981276
$$ 66573829 70605791 72963639 62223559 49030923 54502153 78099103 96080379
36994I6080379j784399r962992k972605J959340j466485k762479J533794J662228
$$ 96080379 94295980 84332988 81360383 83319723 81853238 79090759 80624553 82286781
36986H2286781m945023p563556j701111L211129J764959J429695O150115P221961
$$ 82286781 77341758 69778202 68077091 71288220 73053179 74482874 80632989 87854950
36978H7854950j64939o017436k126718L363383r3861q197226j0889253q537417
$$ 87854950 87690011 81672575 79545857 82909240 82815379 74618153 63728900 55191483
36970E5191483o186647j301346Q665929J5092897R826445P11913k81806K532449
$$ 55191483 49004836 47703490 56369419 71462316 81288761 82000674 81718868 84251317
36962H4251317k485446j1230076r989594p98432J622079k707036J292132J4092740
$$ 84251317 81765871 70535795 60546201 59747769 61369848 58662812 59954944 74047684
36954G4047684J7189944N600876j332791N941102Q020559r474024k5659266j4101480
$$ 74047684 91237628 96838504 95505713 101446815 109467374 99993350 74334084 60232604
36946F0232604J3136235K0566723O19572j9073863j8343447p067784q15519J627668
$$ 60232604 73368839 93935562 94555134 75481271 57137824 50070040 49254521 50882189
36938E0882189O757284J1149441R427731M829490K190975K06681j984391j25678
$$ 50882189 57639473 68788914 78216645 83046135 85237110 85443791 83459400 83333722
36930H3333722O301029R740245O078012K018067M047762Q049657P019386J756700
$$ 83333722 89634751 99374996 105453008 107471075 111518837 119568494 126587880 128344580
36922A28344580l312773q052341j2922916j3707362p709908j18635K880596K459284
$$ 128344580 125031807 116979466 104056550 90349188 82639280 82520645 85401241 87860525
36914H7860525K204354N57809m452657q409432o596822k247728n52249Q25743
$$ 87860525 90064879 90622688 86170031 77760599 71163777 68916049 68363800 69189543
36906F9189543O100051J0473813N562518o265552j3250422r657213j086173N211322
$$ 69189543 75289594 85763407 91325925 85060373 71809951 62152738 61066565 66277887
36898F6277887P027431M768385M98379j169778J284602K006168k465985l745388
$$ 66277887 73305318 78073703 78572082 77402304 78686906 80693074 78227089 74481701
36890G4481701N610865J4534184O754108r560534q576610J1298209J8246324n146835
$$ 74481701 80092566 94626750 101380858 91820324 83243714 94541923 112788247 107641412
36882A07641412k9403974j8807147J3236541K2461583j60663j7291875m765273
$$ 107641412 78237438 59430291 72666832 95128415 94967752 77675877 72910604
36875G2910604J3483759P046179j3384417j6364212M88516J0906046L164047n813489
$$ 72910604 86394363 93440542 80056125 63691913 64180429 75086475 78250522 72437033
36867G2437033j612000O928788O676324J137456K36423K027909j620132q180369
$$ 72437033 70825033 77753821 84430145 85567601 85804024 87831933 86211801 78031432
36859G8031432o718406M862644J5711241J6454986R738625L665348R97590n33116
$$ 78031432 71313026 76175670 91886911 108341897 118080522 121745870 122743460 122210344
36851A22210344j226339O04758J928845m406784j7984459k5305696j4197133Q258909
$$ 122210344 120984005 121588763 123517608 119110824 101126365 75820669 61623536 69882445
36843F9882445K1900907J8428623R150985M209947k387507j6954268k7708292
$$ 69882445 91783352 110211975 119362960 123572907 121185400 104231132 76522840
36836G6522840j9136555J281123R849573J87941q542101j521735J0997263J2300189
$$ 76522840 57386285 58667408 68516981 68704922 60162821 58641086 69638349 81938538
36828H1938538M493478J973110Q025010J1725018N590443m645366q896486m833256
$$ 81938538 86432016 88405126 96430136 108155154 113745597 109100231 100203745 95370489
36820I5370489P28400L69790m677958n456379K025437Q950791N721286k003773
$$ 95370489 96098889 96468679 91790721 86334342 88359779 97310570 103031856 101028083
36812A01028083j265263N520126J788512j5551866k6738988j6578488L460402
$$ 101028083 99762820 105282946 107071458 91519592 64780604 48202116 51662518
36805E1662518J2551791P575319m03555n619700q264781m563761O945904J4986366
$$ 51662518 64214309 71789628 71386073 65766373 57501592 52937831 59883735 74870101
36797G4870101Q068626o003825r003019J541306J0568948R115397M348650M460924
$$ 74870101 82938727 76934902 67931883 69473189 80042137 89157534 93506184 97967108
36789I7967108P138946O308559J63442r533836j7980401j7700582o842300M838853
$$ 97967108 105106054 111414613 111578055 102044219 84063818 66363236 59520936 64359789
36781F4359789P097710K852026J075212J451460j440944m129186K92782O583489
$$ 64359789 71457499 74309525 75384737 76836197 75395253 71266067 71558849 78142338
36773G8142338L853209m661419n484376K673334P937265O182240M793770N477501
$$ 78142338 81995547 77334128 71849752 74523086 82460351 88642591 93436361 98913862
36765I8913862K197277l008355j695392K683313r36445p871058k501416J1159839
$$ 98913862 101111139 98102784 96407392 99090705 98154260 90283202 87781786 98941625
36757I8941625J0773608o497916j6282157o944155K568134j382335m240859M615883
$$ 98941625 109715233 103217317 86935160 79991005 82559139 81176804 76935945 81551828
36749H1551828P602275p502282j7566882M32381K6224077K4072333j962986j7208885
$$ 81551828 89154103 81651821 64084939 64517320 90741397 114813730 112850744 95641859
36741I5641859j0508337k117450k310181J094265J1877990J5116788M355942p589862
$$ 95641859 85133522 83016072 80705891 81800156 93678146 108794934 113150876 105561014
36733A05561014j1351278j1668413j1036169m871006L227902L053548k229673
$$ 105561014 94209736 82541323 71505154 66634148 69862050 72915598 70685925
36726G0685925O83380R940231R830943k24529l622665K441521J832478p672689
$$ 70685925 71369305 81309536 91140479 90915950 87293285 89734806 91567284 83894595
36718H3894595o347540J0695679J8847879L866870j1699138m920458R272377M192750
$$ 83894595 77547055 88242734 107090613 110957483 99258345 94337887 103610264 107803014
36710A07803014j3217209j4710238K573472J3541144O131896l929806k262212
$$ 107803014 94585805 79875567 82449039 95990183 102122079 98192273 95930061
36703I5930061M304922L868452k539546p031888o620746k711006K066356K738061
$$ 95930061 100234983 104103435 101563889 94532001 87911255 85200249 87266605 90004666
36695I0004666m163246j3123420j3669895l745964Q044010J4430300J5767684
$$ 90004666 85841420 72718000 59048105 55302141 63346151 77776451 93544135
36688I3544135J3062964M001796r441252j6735455r477053O201867J4494074Q365956
$$ 93544135 106607099 110608895 101167643 84432188 74955135 81157002 95651076 104017032
36680A04017032j496043l31808J0236725J2897587j034461j6253485j2130725
$$ 104017032 102520989 102189181 112425906 125323493 124289032 108035547 95904822
36673I5904822P957337J9597072J0057627o625700j2588103j0176317j2728062
$$ 95904822 103862159 123459231 133516858 126891158 114303055 104126738 91398676
36666I1398676k1529499k4990600j6218188l66686J3470324J9323167J5494404
$$ 91398676 69869177 44878577 28660389 28293703 41764027 61087194 76581598
36659G6581598O180427J52805J590921M655560K800335n16253K144654Q714076
$$ 76581598 82762025 82914830 84505751 89161311 91961646 91445393 93590047 102304123
36651A02304123R127712M08j0011638j1245974m176828K680645L269310L21057
$$ 102304123 111431835 111432243 101420605 90174631 85997803 88678448 91947758 92268815
36643I2268815P07179M762426M100341n529225j3649891p126328Q758145J4328572
$$ 92268815 92975994 97738420 101838761 96309536 82659645 75533317 84291462 98620034
36635I8620034K926260r964194j0680567n336946l994918j765069R285921K0637169
$$ 98620034 101546294 91582100 80901533 75564587 71569669 69804600 79090521 99727690
36627I9727690J7568171K601916q242798q733298o171881n222621m176154n052190
$$ 99727690 117295861 119897777 111654979 102921681 96749800 91527179 87351025 82298835
36619H2298835j0562348j2022776J664667K1702238K4902379O124561j2800895
$$ 82298835 71736487 59713711 61378378 83080616 107982995 114107556 101306661
36612A01306661j3808428n040792k380792m744047k620295O93581n473263j7372126
$$ 101306661 87498233 82457441 80076649 75332602 72712307 73405888 67932625 50560499
36604E0560499j7565625J003016K3835924L1571257K0212167J276621j2629102
$$ 50560499 32994874 33997890 57833814 89405071 109617238 110893859 98264757
36597I8264757j7990315j8397378j6628157j1188210j150322Q237368R202229
$$ 98264757 80274442 61877064 45248907 34060697 32910375 41147743 50349972
36590E0349972J488570n248675j703663J0416135J9893462J7003166K489076j2587052
$$ 50349972 51838542 46589867 44886204 55302339 75195801 92198967 94688043 82100991
36582H2100991j5765735m564976J0252185J4950252O902847l655201n927242L51525
$$ 82100991 66335256 61770280 72022465 86972717 93875564 90220363 84293121 84644646
36574H4644646P017141P913154M929836M006561O618294P262886J206061p097219
$$ 84644646 91661787 99574941 104504777 108511338 115129632 122392518 123598579 116501360
36566A16501360q231704r76092M905301J873237n697746r840545j0786266j3324267
$$ 116501360 108269656 107293564 112198865 114072102 108374356 98533811 87747545 74423278
36558G4423278j6270703j4344054p933905k175091K595678J0577557J9986358
$$ 74423278 58152575 43808521 35874616 33699525 36295203 46872760 66859118
36551F6859118K1163241Q791682q681787j5532689m383457J4663726K1673197
$$ 66859118 88022359 96814041 88132254 72599565 68216108 82879834 104553031
36544A04553031P650543j3107243j8991485r340679l989696j0888910j2018628
$$ 104553031 112203574 99096331 80104846 70764167 66774471 55885561 43866933
36537D3866933O005337K4895716J9460962k746664j2479236l410375K666007m760572
$$ 43866933 49872270 74767986 94228948 91482284 79003048 75592673 78258680 73498108
36529G3498108r885995k048167N460508R04628n255627j169479N118317K950601
$$ 73498108 63612113 61563946 67024454 67929082 62673455 61503976 66622293 69572894
36521F9572894L7335O190272J0875433k66747j6819367j6028029O05641P390412
$$ 69572894 69610229 75800501 86675934 86409187 69589820 53561791 54167432 61557844
36513F1557844o873049k1452234j2806571J3606472L1020465K3577385K006394
$$ 61557844 54684795 33232561 20425990 34032462 65052927 88630312 90636706
36506I0636706j1268440o938313M142809P742213M100502K746981M327485M67325
$$ 90636706 79368266 72429953 76572762 84314975 88415477 91162458 95489943 95957268
36498I5957268p904229p706368M667101J3544077N791477r819143j6313433j0763595
$$ 95957268 88053039 80346671 85013772 98557849 104349326 94530183 78216750 67453155
36490F7453155j248989P518611J2491610O972929p806270j5287470m379918J0691299
$$ 67453155 66204166 73722777 86214387 93187316 85381046 70093576 65713658 76404957
36482G6404957R359754l873760p513174K343162Q139112J076763p377103p986654
$$ 76404957 85764711 81890951 74377777 76720939 84860051 85936814 78559711 70573057
36474G0573057p034953r963994r565156k08383R779892J0118091L400618p37766
$$ 70573057 63538104 53574110 44008954 43800571 53580463 63698554 67099172 66361406
36466F6361406O29033K886230K323105M79639J672913O482807O983552n300285
$$ 66361406 66990439 69876669 72199774 72679413 74352326 80835133 87818685 82518400
36458H2518400k2479758k2498287P32667K1364605J3630613r862381j5241239
$$ 82518400 60038642 37540355 38273022 59637627 73268240 63405859 48164620
36451D8164620K812528J6074462Q245114m099874l822302J357817o30247m095882
$$ 48164620 50977148 67051610 75296724 71196850 67374548 68732365 68102118 64006236
36443F4006236p71024K292486k409686o190095J87106Q218702O220360l78577
$$ 64006236 63235212 65527698 63118012 56927917 57115023 65333725 71554085 71175508
36435G1175508n11391K121154k285149j0266792j1732579p681928m788379m09793
$$ 71175508 70664117 72785271 70500122 60233330 48500751 40818823 36030444 35620651
36427C5620651J0136488J8644711J3708275K0851p736279n271120R67450O937627
$$ 35620651 45757139 64401850 78110125 78130976 70394697 65123577 66091027 73028654
36419G3028654J0410819N837108m936988p126615M520341J0342071n026692k1321125
$$ 73028654 83439473 89276581 84339593 77212978 81733319 92075390 87048698 65727573
36411F5727573r973946J6676941J9440648o276876k2228364p880292R859399M355536
$$ 65727573 55753627 72430568 91871216 85594340 63365976 55485684 65345083 69700619
36403F9700619q867294l654972J1640581J2090935K95821r23412R924658J1343705
$$ 69700619 60833325 57178353 68818934 80909869 81205690 80282278 90206936 101550641
36395A01550641k760823j2220512l724725Q428232M729864j2257113k3889710
$$ 101550641 98789818 86569306 82844581 91272813 96002677 83745564 59855854
36388E9855854j9427897n036312O261969P122708J71743o625986q119705m610044
$$ 59855854 40427957 35391645 41653614 48776322 48948065 42322079 34202374 29592330
36380B9592330K790323J3815436K3547604K2410902P943232q883192j6147647
$$ 29592330 32382653 46198089 69745693 92156595 100099827 91216635 75068988
36373G5068988j4961002j3617377j3166905q369900O61067P990228J1096819J1332904
$$ 75068988 60107986 46490609 33323704 24953804 25614871 33605099 44701918 56034822
36365E6034822P492867j039610p037722l144352M095834J306153r252236r126641
$$ 56034822 63527689 62488079 55450357 52306005 56401839 57707992 48455756 39329115
36357C9329115Q775520K6025763K2133117K042947j1679442p939898L563451R088096
$$ 39329115 48104635 74130398 96263515 98306462 86627020 78687122 82250573 91338669
36349I1338669N544107j620295n886932l410931L622377O144089k526733j5085420
$$ 91338669 96882776 95262481 89375549 85964618 89586995 95731084 93204351 78118931
36341G8118931j5341667J484630K0005134K1618332N880485j0892029j5382685
$$ 78118931 62777264 64261894 84267028 105885360 111765845 100873816 85491131
36334H5491131r105344j621553J151367Q9622q72539Q57821L367350R74847q506722
$$ 85491131 76385787 74764234 75915601 76005223 75132684 75990505 79357855 80332702 71825980
36325G1825980j7606711j6055199n055238K413791q21319n969207k357532N711849
$$ 71825980 54219269 38164070 33108832 35522623 34701304 28732097 26374565 32086414
36317C2086414O665453J222377O34717O296666O412860k681221o695674N280747
$$ 32086414 38751867 39974244 40608961 46905627 53318487 50637266 43941592 49222339
36309D9222339K0877971J9289565R7079j6322121j5285423k303527R357711J3761628
$$ 49222339 70100310 89389875 89486954 73164833 57879410 55575883 64933594 78695222
36301G8695222J1498190L955637n244174r367220n560875L61210O44153n154554
$$ 78695222 90193412 94149049 88904875 79537655 73976780 74337990 74982143 69827589
36293F9827589j0774812j0584055l494513P506612J6281855J6468783P499138
$$ 69827589 59052777 48468722 44974209 52480821 68762676 85231459 92730597
36286I2730597l565904r492496j0610278j1410358j1423083n770274M352013Q818329
$$ 92730597 89164693 79672197 69061919 57651561 46228478 40458204 44810217 53628546
36278E3628546J379340r082897p726012O460379J8129524J5718024O398378M149857
$$ 53628546 55007886 45924989 38198977 44659356 62788880 78506904 84905282 89055139
36270H9055139Q708404P200459m299321j3175318r018236M25733J233789n343762
$$ 89055139 97763543 104964002 100664681 87489363 78471127 78896860 80130649 74786887
36262G4786887n150312O933863J8720753J7039205L531890j0172005j6094300
$$ 74786887 69636575 76570438 95291191 112330396 115862286 105690281 89595981
36255H9595981j3331609l743561Q161539J3856554P610849m484492q979092j258004
$$ 89595981 76264372 72520811 80682350 94538904 102149753 97665261 88686169 87428165
36247H7428165P936046O226049m196959j0075094n194263K169926J895028m238120
$$ 87428165 95364211 101590260 97393301 87318207 82123944 84293870 86188898 81950778
36239H1950778o541480j399224N178551O985258M404070Q09921k349343m368987
$$ 81950778 75409298 74010074 79188625 86173883 90577953 91387874 89038531 84669544
36231H4669544l173598K514986J0913649J8643687K2318342J8447549O129404
$$ 84669544 81495946 84010932 94924581 113568268 135886610 154334159 160463563
36224A60463563q233801j3565936n539523P198871J1965225N722319l040369m744467
$$ 160463563 152229762 138663826 133124303 140323174 152288399 158010718 154970349 150225882
36216A50225882J699551R243458J0744472O075622O79180k470802n264509o506973
$$ 150225882 151925433 161168891 171913363 177988985 178668165 176197363 170932854 164425881
36208A64425881J171724J8258645K9068615J9807576K543512K305088J8885296
$$ 164425881 165597605 183856250 212924865 232732441 235275953 237581041 256466337
36201B56466337K4345846P121461o379159P372325K8679045K2621693o939685
$$ 256466337 280812183 287933644 281554485 288926810 317605855 340227548 333287863
36194C33287863k3353769j1214611Q276791J6396228J8251497J8108535O109384
$$ 333287863 309934094 298719483 306996274 323392502 341643999 359752534 365861918
36187C65861918j5294959k0074953N129151L4847482L7124538J5612772k368594
$$ 365861918 350566959 330492006 335621157 370468639 407593177 423205949 420837355
36180D20837355n340530j903007K857387R816729J1390148o49824j5878663j6345530
$$ 420837355 415496825 413593818 416451205 426267934 437658082 437008258 421129595 404784065
36172D04784065n097991j152041p037884o123520M791270O395111j0032648k3981463
$$ 404784065 399686074 398534033 391496149 385372629 390163899 396559010 386526362 362544899
36164C62544899j5634771L265592O655324r005921k3222713k1288975r653545
$$ 362544899 346910128 350175720 356831044 347825123 324602410 303313435 293659890
36157B93659890k514865n339410j3203675j7635565j3533441l589895M188049
$$ 293659890 291145025 285805615 272601940 254966375 241432934 237843039 242031088
36150B42031088N460550L353610J285044k668050r618960j3252596o676463O039644
$$ 242031088 247491638 250845248 252130292 249462242 239843282 226590686 219914223 225953867
36142B25953867J2102985M712851q870572j5813927j2300544p492216j1786228
$$ 225953867 238056852 242769703 233899131 218085204 205784660 198292444 186506216
36135A86506216k2263574k4677131j2706713J242150K481420m141522k234727
$$ 186506216 164242642 139565511 126858798 128100948 130582368 126440846 124206119
36128A24206119P872649O852795j1391448k3612209q645494J8062185K2588014
$$ 124206119 132078768 138931563 127540115 103927906 95282412 113344597 135932611
36121A35932611N35570j5979517l599999K0533892K4419266M105171j5794064
$$ 135932611 136468181 120488664 116888665 137422557 161841823 165946994 150152930
36114A50152930j7610027q501805k143572N64054M413754N723889j813903j2510566
$$ 150152930 132542903 124041098 121897526 122461580 126875334 132599223 130785320 118274754
36106A18274754j3534303m276545J773783k172327n727088J047306J0149024P171877
$$ 118274754 104740451 100463906 102237689 100065362 94338274 95385580 105534604 112706481
36098A12706481o413832j5488552j2505719l350617O623509J7703329K4771555
$$ 112706481 106292649 90804097 78298378 74947761 81571270 99274599 124046154
36091A24046154J6647276n691731k2283450j6404310L658259J5266781Q964343
$$ 124046154 140693430 135001699 112718249 96313939 99972198 115238979 124203322
36084A24203322m452944j1317594r593234n723022m565647m890682j856367O372069
$$ 124203322 119750378 108432784 98839550 93116528 88550881 83660199 81803832 88175901
36076H8175901J3511703R928932m751636j8014549j8119157q062534n88042k037366
$$ 88175901 101687604 111616536 106864900 88850351 70731194 62668660 62080618 60043252
36068F0043252p412348j0160204j0007109r413166p132791Q02546J4022197K4198132
$$ 60043252 52630904 42470700 32463591 23050425 15917634 16720180 30742377 54940509
36060E4940509K1726560P524142n604806p908886n141905q165088j3444389p006789
$$ 54940509 76667069 84191211 78586405 70677519 65535614 57370526 43926137 36919348
36052C6919348J0792140K0048416Q811077p880832q992888K726530P434961j189537
$$ 36919348 47711488 67759904 76570981 68690149 59697261 62423791 69858752 68669215
36044F8669215q891779m301832N284956O059330l772343j2688567r183410N282405
$$ 68669215 59777436 55475604 60760560 66819890 63047547 50358980 41175570 46457975
36036D6457975J5456372P759083j1388245k0071381q573167P344073R368218J422501
$$ 46457975 61914347 69673430 58285185 38213804 29640637 36984710 46352928 47775429
36028D7775429j795604J95698j069825j403013Q685663J8875930Q327282j7204477
$$ 47775429 45979825 46175523 45105698 43702685 52388348 71264278 79591560 62387083
36020F2387083k5256865l263160K0208538J5730896p357322k0234328j5524146
$$ 62387083 37130218 33867058 54075596 69806492 62449170 42214842 26690696
36013B6690696p245559k742958K176115O883477N907315K343154L690629O953385
$$ 26690696 19445137 16702179 18878294 25761771 31669086 34012240 37702869 44656254
36005D4656254M007267j468047O05896O960548M919124m520263o770823R21177
$$ 44656254 48663521 47195474 47801370 54761918 59681042 55160779 48389956 49311133
35997D9311133L672538n524847j3062627p233883K563127K124023m290471k120098
$$ 49311133 52983671 47458824 34396197 27162314 29725441 31849464 27558993 25438895
35989B5438895R230230J5492141R020033j451853m309826M14072L504171p55758
$$ 25438895 34669125 50161266 59181299 57729446 53419620 53833692 57337863 56582105
35981E6582105p442585o527984M363631J4642057J2348810o726q291527o251435
$$ 56582105 49139520 42611536 46975167 61617224 73966034 73959308 65667781 59416346
35973E9416346k765166n612800q704190m214383J872394p11099p290617m168826
$$ 59416346 56651180 51038380 42334190 38119807 39992201 39281102 31990485 27821659
35965B7821659P564064J0926793m22565j0663824n625018N739152O848888N7633
$$ 27821659 35385723 46312516 45889951 35226127 29601109 35340261 42189149 42246782
35957D2246782N86627R054952R635271k592822j1415472m800312N451184K427927
$$ 42246782 42833409 51888361 61523632 58930810 47515338 42715026 48166210 50594137
35949E0594137q975464j0128021K451352J3408991J2436815N318938j068596q690484
$$ 50594137 41618673 31490652 33942004 47350995 59787810 65106748 64038152 55347668
35941E5347668j7172737j7262858n382752O448633O621869J221418K988780R968925
$$ 55347668 38174931 20912073 15529321 21977954 28599823 29821241 32810021 42778946
35933D2778946R514015j03138p322214o577291n266089q166774q398567m75390
$$ 42778946 52292961 52189823 44867609 38290318 33024229 24857455 16458888 15983498
35925A5983498Q541122R475572M811156K992973M364067K210482m706031r311720
$$ 15983498 24524620 34000192 38811348 41804321 46168388 48378870 43672839 34361119
35917C4361119n935026L299292J1879820J3869238O274365p818975j8295331j6081383
$$ 34361119 28426093 31725385 43605205 57474443 63748808 55929833 37634502 21553119
35909B1553119l857778O180679P138995M773377O896577J1085844R358902J798600
$$ 21553119 17695341 23876020 31015015 35788392 42684969 53770813 63129715 64928315
35901F4928315l025679j663594j004702n726952q441239o97634J0895764J0793347
$$ 64928315 61902636 60239042 59234340 53507388 45066149 44368515 55264279 66057626
35893F6057626k868656j2937733n719232R669129J2339831m562752k6725316l4903001
$$ 66057626 63188970 50251237 44532005 54201134 66540965 61978213 35252897 349896
35885C49896k1984427L415691K3234170K2043728J598185j6575953j1552965J2454888
$$ 349896 -21634531 -18218840 5015330 27059058 28657243 12081290 528325 12983213
35877A2983213K9815480K3812091M509833p724424p045046k303394K93435K716687
$$ 12983213 42798693 66610784 71120617 63396193 56351147 54047753 54341188 57057875
35869E7057875M890242P09866j1627751k2744543k1308346p135768Q983291J6829315
$$ 57057875 61948117 62657983 51030232 28285689 6977343 -158425 8824866 25654181
35861B5654181J5097414R685445O821265P623970P383963P18125j0769651j7459018
$$ 25654181 40751595 50437040 57258305 64882275 72266238 72984363 62214712 44755694
35853D4755694j1909445N12348O289626M54734p238465o851155k757155n396901
$$ 44755694 32846249 33358597 39648223 40102957 32864492 26013337 23256182 17859281
35845A7859281j2363150r608752O769951K1587897J9745019N566079n164807n763887
$$ 17859281 5496131 -4112621 2657330 24245227 43990246 49556325 44391518 38627631
35837C8627631j805292J357081L369403L211279o27697m068892r48199O287712
$$ 38627631 36822339 38179420 41548823 44760102 44132405 40063513 39115314 45403026
35829D5403026Q048277J342699o228868q073870n747371k084967L802390J0649381
$$ 45403026 53451303 54794002 48565134 40491264 34743893 32658926 36461316 47110697
35821D7110697J2610314P948278K778159P88228l172787j2576495j9637018j5189403
$$ 47110697 59721011 67669289 70447448 71235676 68062889 55486394 35849376 20659973
35813B0659973l143460M441639L833847J747980K246442J435817k782165m261809
$$ 20659973 17516513 21958152 25791999 27539979 29786421 31222238 28440073 24178264
35805B4178264K655478J2475844J3074199J157649j1507347j1081478R11924R107380
$$ 24178264 26833742 39309586 52383785 53541434 42034087 30952609 31864533 40971913
35797D0971913M848150k525103j337213L412549p02771r960961p913209N892809
$$ 40971913 45820063 43294960 41957747 45370296 44667525 34706564 26793355 32686164
35789C2686164J0247623n585536k1878895j5650693N645567J6183220Q820984
$$ 32686164 42933787 37348251 15469356 -181337 5464230 21647450 30468434
35782C0468434j71272J53436K322484k016065q813091j0989690q150106k170727
$$ 30468434 30297162 30450598 32773082 30757017 21943926 10954236 2804130 633403
35774F33403O408562J3916150J4842672J0098965N216013J6163r135776j6951361
$$ 633403 7041965 20958115 35800787 45899752 51115765 51131928 41996152 25044791
35766B5044791j2917562M22795P698812L710489R82382P430071J2077941M047702
$$ 25044791 12127229 12550024 20248836 23959325 24941707 32371778 44449719 48497421
35758D8497421p431933o024093P272543J6285528J1365726k105973j3090059j4041840
$$ 48497421 41065488 35041395 42313938 58599466 69965192 67859219 54769160 40727320
35750D0727320m930310M624211K571734r709460j5962462o546054P409361J0034024
$$ 40727320 35797010 40421221 42992955 33283495 17321033 10774979 18184340 28218364
35742B8218364J351498q442253j4880689j6488501o912812J3363541K6066195
$$ 28218364 29569862 21127609 6246920 -10241581 -17154393 -3790852 22275343
35735B2275343J5477049n641192j0868317K403214J1860263N469594n458280j0587356
$$ 22275343 37752392 32111200 21242883 23646097 35506360 40975954 35517674 24930318
35727B4930318j3715666j5384725o464335J0251674J4586384o15320j3871932
$$ 24930318 11214652 -4170073 -10634408 -382734 14203650 13588330 -283602
35720b83602o745577P450263P002100k221749J016385J5573632J9477810O068843
$$ -283602 -7029179 421084 7423184 5201435 6217820 21791452 41269262 47338105
35712D7338105o710524n275231L150220P650245P960686N250149m179540j7291751
$$ 47338105 40627581 35352350 38502570 46152815 54113501 59363650 55184110 37892359
35704C7892359k0730217q780365N940409Q938335J884523m162664m768600k324030
$$ 37892359 17162142 8381777 14322186 23260521 25145044 20982380 16213780 13889750
35696A3889750J880734N827163L387775o633940j2878222m237845J2248690J8048085
$$ 13889750 15770484 21597647 24985422 18351482 5473260 1235415 13484105 31532190
35688C1532190P825189l914843l863855L008793L969674k016889n246198k238495
$$ 31532190 39357379 35442536 31578681 34587474 38557148 36540259 31294061 29055566
35680B9055566o45156n286541r083958m272741M365161O904428N004154R099383
$$ 29055566 28410410 23123869 14039911 9767170 14132331 21036759 26040913 35140296
35672C5140296J8471263J8011242J255099j6000206j6599404p035569o329002
$$ 35140296 53611559 71622801 72877900 56877694 40278290 33242721 26913719
35665B6913719j5390698j5793275J25086J6142265J5990956N522768O94529M095632
$$ 26913719 11523021 -4270254 -4145168 11997097 27988053 33510821 34205350 38300982
35657C8300982N529340q4068o988437q871834o280826l769784m394958o333164
$$ 38300982 43830322 43746254 36757817 27885983 21605157 17835373 13440415 7107251
35649G107251l491165O630360J5183601J0218251m552164j0069909K259004J6327918
$$ 7107251 3616086 10246446 25430047 35648298 31096134 21026225 23285229 39613147
35641C9613147J3540955q82122q035260m010494j193508m770370o711772l829801
$$ 39613147 53154102 52271980 44236720 40226226 39032718 34262348 27550576 23720775
35633B3720775l489535o994240m460838O285152J1437019K466952p687480l270200
$$ 23720775 20231240 13237000 8776162 15061314 26498333 28965285 21277805 18007605
35625A8007605R315062J0991796o81813q414684k013436O978563M027093n870201
$$ 18007605 27322667 38314463 37632650 29217966 27204530 34183093 38210186 32339985
35617C2339985n467936Q426107J7844283P548509j2364052j8746293q093278j933639
$$ 32339985 26872049 35298156 53142439 60690948 48326896 29580603 21487325 19553686
35609A9553686j3271323k3360578q607228J9642793K6331181K985527j9025433
$$ 19553686 6282363 -17078215 -25685443 -6042650 20288531 23274058 4248625
35602D248625j3640822N706292J2392930O068274L826910P080994L484298n671394
$$ 4248625 -9392197 -3685905 8707025 14775299 18602209 25683203 29167501 23496107
35594B3496107o530342O67677J182214o264893n920566N292048R241175k208235
$$ 23496107 16965765 17633442 18815656 12550763 6630197 11922245 21163420 18955185
35586A8955185j0839000j772247J1068857Q155296l824978n694803R52623p64173
$$ 18955185 8116185 6343938 17412795 25568091 21743113 16048310 17000933 16236760
35578A6236760j0831810j1628038Q86248R775097N611879K76536L864469P487228
$$ 16236760 5404950 -6223088 -5336840 4438257 10050136 10326672 14191141 21678369
35570B1678369J351848o056882j970653Q798940J1894244O272981L482167P397245
$$ 21678369 23030217 16973335 15002682 23801622 35695866 41968847 45451014 52848259
35562E2848259R078729J995600r103184j5827039j3880307k994255J2071936K0137643
$$ 52848259 61926988 63922588 54819404 38992365 25112058 22117803 34189739 54327382
35554E4327382J2453834n291562j7912060j9020994j5698725j3311125o701413
$$ 54327382 66781216 61489654 43577594 24556600 8857875 -4453250 -11154663
35547a1154663P815508K1352816K2326623J1837936P19036n028761p649011q951420
$$ -11154663 -3339155 18013661 40340284 52178220 52897256 47868495 40219484 31268064
35539C1268064o847840r50769M934454P274041N640152J092157m326887p195317
$$ 31268064 24420224 23469455 28403909 35677950 41318102 42410259 38083372 30888055
35531C0888055o255138n591646r342765j3897791j1351289j265959P438734Q581983
$$ 30888055 24632917 19041271 9698506 -4199285 -15550574 -16816533 -9377799 -795816
35523g95816O698973Q946813J3792353J3448075N590910l046057n652905l892488
$$ -795816 5903157 14849970 28642323 42090398 47681308 44635251 38982346 35089858
35515C5089858m760487j0429194j4682303j1014370j834602M294616M204990L670612
$$ 35089858 30329371 19900177 5217874 -5796496 -7631098 -3336482 868508 4539120
35507D539120P154094R477493L319137q119516j2971683n473761O426245R699322
$$ 4539120 11693214 21170707 24489844 16370328 3398645 -2075116 4351129 14050451
35499A4050451l34506j5349830k0813549r037268J2078953K5781002K4183355
$$ 14050451 13715945 -1633885 -22447434 -31484702 -19405749 6375253 30558608
35492C0558608J4705063O150335k697691j2902746j4397832l09554J4655368R893258
$$ 30558608 45263671 51414006 48716315 35813569 21415737 21106183 35761551 45654809
35484D5654809q805598j4610203k51453J0695098K237637q849388l118426P936853
$$ 45654809 36849211 22239008 21987555 32682653 34920290 26070902 22952476 30889329
35476C0889329K335023j3720717j5834630k311287M249053m178149q700142L447294
$$ 30889329 33224352 19503635 3669005 1357718 5606771 1428622 -7271520 -3824226
35468c824226J7731265J5876510K574466m591198N5605P166762O244335n315688
$$ -3824226 13907039 29783549 32358015 27766817 27822422 34989184 41233519 35917831
35460C5917831k0359644k4873118j1173598R247586J7120805J1652055J0287682
$$ 35917831 15558187 -9314931 -20488529 -11240943 5879862 17531917 27819599
35453B7819599J7961355J6066500o242546k8130121k3083953L281918K1716098
$$ 27819599 45780954 61847454 55604908 27474787 4390834 7672752 29388850
35446B9388850J8532177O137053k256666p906326j4303683j7010146j1895915
$$ 29388850 47921027 54058080 51801414 43895088 29591405 12581259 685344
35439F85344k388353O104459J0938088R885531K729262m004661k993361K673127
$$ 685344 -1703009 4401450 15339538 25225069 27954331 23949670 20956309 23629436
35431B3629436L601102q11891k535153o35021l641279j2909359j6959008q576310
$$ 23629436 27230538 26418647 23883494 23248473 19607194 6697835 -10261173 -18837483
35423a8837483M134695J0900792J2424299J2282647P057447m348261j1245000
$$ -18837483 -14702788 -3801996 8622303 20904950 27962397 23614136 12369136
35416A2369136m820066N176694K260199j1661623j8330905j0010522J275948M778111
$$ 12369136 7549070 12725764 14985963 3324340 -15006565 -25017087 -23741139 -18963028
35408a8963028O205078J3730824K1008511J6501618L328899l326943K292882Q913002
$$ -18963028 -12757950 972874 21981385 38483003 41811902 38484959 40777841 49690843
35400D9690843M970524n705747j0676839o208177n97111j222905n252651o257088
$$ 49690843 54661367 48955620 38278781 32070604 31473493 30250588 24997937 18740849
35392A8740849m962331o825447j0157700n289745R955145K1163475J3303624o772717
$$ 18740849 13778518 6953071 -3204629 -8494374 1460771 22624246 35927870 29155153
35384B9155153j5504646k781628J4565122J6082440L842837n782899p832898j0228519
$$ 29155153 13650507 10868879 25434001 41516441 45359278 39576379 31743481 21514962
35376B1514962j3370144p484080O461261J1716922L86749j2717733j2422406m746543
$$ 21514962 8144818 660738 7121999 18838921 19225670 6507937 -5914469 -10661012
35368a0661012j315162L452823J8604206L0608860J7899105j1138625k2918959
$$ -10661012 -11976174 -8523351 10080855 40689715 58588820 47450195 24531236
35361B4531236o119967J2674279J0925993J376456M561813J3660141J0373348
$$ 24531236 18411269 31085548 42011541 43387997 47949810 61609951 71983299
35354G1983299j210767l478036K493805P73132q949888j1594081n582111m899412
$$ 71983299 70772532 67294496 69788301 70561433 61611545 50017464 44435353 39535941
35346C9535941j0906532q984100J809213L239959q504121j1246709N870657J9323869
$$ 39535941 28629409 19645309 21454522 24694481 16190360 4943651 10814308 30138177
35338C0138177P096485j3967629j3798512L323000P869330n625661j0978611N564109
$$ 30138177 37234662 23267033 9468521 12791521 20660851 15035190 4056579 9620688
35330I620688K3164562J8764475r43260j3847902j2776964o793256k596751R40392
$$ 9620688 32785250 51549725 50606465 36758563 23981599 17188343 14591592 15531984
35322A5531984M393190N238631K676423j163933l598394k522520J345077K480250
$$ 15531984 19925174 25163805 27840228 26676295 23077901 20555381 21900458 24380708
35314B4380708l139592r116513m919952O921281J1369569L639188j475290P512913
$$ 24380708 21241116 12124603 7204651 14125932 25495501 29134689 27659399 35172312
35306C5172312J8698473J3733892l824260j4103220j0525586n759558q019227
$$ 35172312 53870785 67604677 63780417 49677197 39151611 33392053 25372826
35299B5372826r545428l713679K303396O91281l301864p68589O483144J0369042
$$ 25372826 15827398 12113719 14417115 15108396 11806532 11037943 17521087 27890129
35291B7890129Q339610K246380p387005j6612960j4827797K053824K0375440K3119548
$$ 27890129 36229739 38476119 31089114 14476154 -351643 1702181 22077621 45197169
35283D5197169J1880787J605341l199191j1030691k2390560k4317654j1410448
$$ 45197169 57077956 58683297 55484106 44453415 22062855 -2254799 -13665247
35276a3665247L688107R204599R636568J2410877J2748015M781275l796588l337206
$$ -13665247 -9977140 -772541 8864027 21274904 34022919 38804194 35007606 31670400
35268C1670400P60067j221557m075943K026040Q953665J067638j4705309j4871106
$$ 31670400 32430467 31208910 27132967 29159007 38112672 39180310 24475001 9603895
35260I603895K107617J0264100k438133j4148473n779961P479486L330301r460658
$$ 9603895 11711512 21975612 19537479 5389006 -390955 7088531 10418832 958174
35252I58174p434720O904986J0836716P16361m720152J008113L425398l718639
$$ 958174 -6476546 428440 11265156 11981517 7261365 8269478 11694876 7976237
35244G976237q178329m787734n071921j1793405r478479O538616J6065887O150298
$$ 7976237 -202092 -4989826 -10061747 -21855152 -31333631 -24795015 -8729128 -2578830
35236b578830n002640L062611J9509228K1428388J0755496N440434N647268k205364
$$ -2578830 -7581470 -4518859 14990369 36418757 47174253 52614687 58261955 56056591
35228E6056591j4295405j2239166L623806J1807108L661553n884713o531388o486994
$$ 56056591 41761186 29522020 33145826 44952934 48614487 42729774 36198386 29711392
35220B9711392j0407633p820921M746663J1741411L111950p205280k878567R549274
$$ 29711392 19303759 11482838 16229501 27970912 31082862 23877582 20999015 30548289
35212C0548289J2681349L695920o896279j1825417r288450J368826J3573502J3354400
$$ 30548289 43229638 46925558 40029279 28203862 18915412 20284238 33857740 47212140
35204D7212140j992258j5367710j2730408l024464j113250l397788J854241J0946972
$$ 47212140 45219882 29852172 17121764 14097300 12984050 9586262 11440503 22387475
35196B2387475J1859765O648811N754735O395882j499891j2412341j0939027J946524
$$ 22387475 34247240 40896051 46650786 53046668 51546777 39134436 28195409 30141933
35188C0141933J0518193J0419492J0286071R014726k350268j4856196o965137
$$ 30141933 40660126 51079618 61365689 70380415 68030147 53173951 46208814
35181D6208814J7675438K7097641P606197j4358177j3393076j968592m232581
$$ 46208814 63884252 90981893 98588090 84229913 70836837 68868245 64635664
35174F4635664j5376816j4253553j394437M243352j154167k722706N123109J0579136
$$ 64635664 49258848 35005295 33610858 37854210 36700043 33977337 39100446 49679582
35166D9679582O068419j092335l148114k144627k167873k746163k368519J65476
$$ 49679582 55748001 54655666 51507552 49362925 47195052 44448889 42080370 42245846
35158D2245846P626916J8974993K4179866J4438690l905340j5460821j4544272
$$ 42245846 49872762 68847755 93027621 107466311 103560971 88100150 73555878
35151G3555878q650184n051547l645911k057464R93189O346355J1238379Q884189
$$ 73555878 64905694 59854147 56208236 54150772 55143961 61490316 72728695 81612884
35143H1612884r15405o170913J761722J2235605P904164r808997k1469748j5027039
$$ 81612884 80697479 74526566 76288288 88523893 96428057 86619060 65149312 50122273
35135E0122273K029507J5561802J8042623R271038m458625j1654907o604321J635393
$$ 50122273 52151780 67713582 85756205 95027243 90568618 78913711 72309390 73944783
35127G3944783J106955n288548n839761L02572M487320O154656J1153998J4062005
$$ 73944783 75051738 69763190 63923429 64226001 68713321 74867977 86021975 100083980
35119A00083980L024828j5458592j8697791j768012J1767942M097383j0844690
$$ 100083980 103108808 87650216 68952425 67184413 78952355 83049738 72205048
35112G2205048j0224422M210672J2703829P501044p21947j521107M325088J0606257
$$ 72205048 61980626 66191298 78895127 86396171 85674224 84153117 88478205 99084462
35104I9084462J2386353Q123491J409532j731546o68732k85625j206726J553736
$$ 99084462 111470815 119594306 121003838 119272292 118603560 118317935 117111209 118664945
35096A18664945O986081O319254j268379l336389O416117J4974499Q148317p472156
$$ 118664945 125651026 131970280 130701901 127365512 133781629 148756128 156904445 149432289
35088A49432289j4319054q930465k841308k180476j071973M296038P843019L953639
$$ 149432289 135113235 126182770 123341462 121160986 120089013 124385051 132228070 136181709
35080A36181709k658193k934705L791110P518951j61021j2773042j3581755K304508
$$ 136181709 133523516 130588811 134379921 141898872 141737851 128964809 115383054 117687562
35072A17687562J7453725J4009080L00927n54633J3320525J8764419M384785j0908260
$$ 117687562 135141287 149150367 149451294 148896661 162217186 180981605 185366390 174458130
35064A74458130p765618M992134Q262279L136096L465840R129649Q181679J06680
$$ 174458130 166692512 171684646 179946925 183083021 186548861 195678510 203860189 203966869
35056B03966869k979015L121714R407638R084331N113858K132743J058458J155840
$$ 203966869 200987854 204109568 213517206 222601537 227715395 229848138 230906596 232062436
35048B32062436J30768m697222r816003p342075O69106J186750p934879r794841
$$ 232062436 232193204 227495982 217679979 210337904 211007010 212193760 204258881 194464040
35040A94464040M736410J8091621J2209532j720215k844653L731981o91469j0390807
$$ 194464040 199200450 217292071 229501603 227781388 224936735 228668716 227977247 217586440
35032B17586440k961974J7823884K2003384J225145j6350298r754585N473672
$$ 217586440 214624466 232448350 254451734 255676879 239326581 229571996 235045668
35025B35045668O519424l337769q385760p283174p105651n594239K203374R864955
$$ 235045668 241565092 238227323 229841563 222558389 215452738 209858499 212061873 221926828
35017B21926828Q090950N4460m157571k161971J288114L274738L610175K728796
$$ 221926828 230017778 230072238 225914667 223752696 225040810 228315548 231925723 234654519
35009B34654519L193398O232400N600677m276344j4043382q906627N959613Q878914
$$ 234654519 237847917 244080317 249680994 245404650 231361268 222454641 228414254 237293168
35001B37293168m437925j2305035j995900R177502K692272j1538808j3379665
$$ 237293168 232855243 220550208 218554308 227731810 230424082 218885274 205505609
34994B05505609m068998J077176p81455j393181k20338k476156n450727m174567
$$ 205505609 201436611 202513787 201732332 200339151 200118813 197642657 192191930 188017363
34986A88017363l671100r160414j2194193m035649N465786J828261q410823p431101
$$ 188017363 184346263 175185849 162991656 158956007 164421793 166250054 157839231 150408130
34978A50408130L274339N157540n237030r463939K993986J7602502J5218279l901987
$$ 150408130 153682469 158840009 153602979 144139040 147133026 164735528 179953807 176051820
34970A76051820k3004966k6276960j0558738J1334633J8424213K201041k1134469
$$ 176051820 153046854 126769894 116211156 127545789 145970002 148171043 127036574
34963A27036574k8590020j7775531m840545J088078N807298J3010986J5842958
$$ 127036574 98446554 80671023 75830478 76918556 82725854 95736840 111579798
34956A11579798R197723k020648j0136865j0632266j423877J2672751J7204812
$$ 111579798 120777521 118756873 108620008 97987742 96563865 109236616 126441428
34949A26441428L797242j3570445j4248119j242498L345641o468204j2320166
$$ 126441428 130238670 116668225 102420106 101177608 104523249 98055045 85734879
34942H5734879l355617O979540N976401J627210L570821L800252n864553j3512730
$$ 85734879 82379262 89358802 95335203 96962413 100533234 104333486 98468933 84956203
34934H4956203n273448Q144130N644417j0160290j5789241k626034J1311331R287028
$$ 84956203 79682755 87826885 93471302 83311012 67521771 64895737 76207068 85494096
34926H5494096j987390o009667q2032M586823O92776n712221l920240O649721
$$ 85494096 83506706 77497039 77415007 82001830 82694606 76982385 73062145 79711866
34918G9711866J3277745M579703j2753268j9230388p548860O663973O368840l384470
$$ 79711866 92989611 97569314 84816046 65585658 58036798 64700771 71069611 67685141
34910F7685141n398454K332790N187607k638479q221570j693907O233296K05306
$$ 67685141 62286687 64619477 69807084 67168605 58947035 57253128 63486424 63691730
34902F3691730j4675047j7771981j764094J5973876J5555761j46188j0563892
$$ 63691730 49016683 31244702 29480608 45454484 61010245 60864057 50300165
34895E0300165m731815N870770M668629p509997j5156773r918502L84566N735654
$$ 50300165 45568350 51439120 56107749 48597752 33440979 23522477 23907043 29642697
34887B9642697O401231N910714J388203q635067j3393128j370253J8242681K1090222
$$ 29642697 36043928 41954642 43342845 34707778 21314650 19944397 38187078 59277300
34879E9277300R4509k1072724j7338956M619712J6458580O626775p290303o438168
$$ 59277300 59371809 38299085 20960129 25579841 42038421 48665196 41374893 34936725
34871C4936725M338816P886608O91620m810925k80546P740961Q895129K878157
$$ 34936725 39275541 47162149 47853769 43042844 42762298 50503259 59398388 62276545
34863F2276545k048883p35887K747645P22885p890381j4772346j1613989j202020
$$ 62276545 60227662 59491775 62239420 62962305 55071924 40299578 28685589 27483569
34855B7483569N473549L583902o07670j543810k492026n882849m785563N460409
$$ 27483569 32957118 36541020 35933350 34389540 31897514 26014665 21229102 26689511
34847B6689511J4648527J0663795M3795q83024O840765N706457q080569j5970274
$$ 26689511 41338038 52001833 52045628 51162604 58003369 63709826 55629257 39658983
34839C9658983o368114O706591O447279j872704m074729j388074l888979r483000
$$ 39658983 33290869 39997460 46444739 44572035 40497306 39109232 35220253 25737253
34831B5737253q019920n86753K650690L96491L54267M068488O137929O028855
$$ 25737253 17717333 17130580 19781270 20177761 20532028 24600516 30738445 36767300
34823C6767300O803414N207768k469071q066357j219023J1008046J1477627p74001
$$ 36767300 43570714 48778482 46309411 38243054 37024031 48032077 59509704 58735703
34815E8735703r506195p064647k483346j369079K605942J0339098J0341662j815716
$$ 58735703 49229508 42164861 39681515 38312436 40918378 51257476 61599138 59783422
34807E9783422j3044694j1548015k547063L818975P002017Q947386N595088l555467
$$ 59783422 46738728 35190713 32643650 36462625 43464642 52412028 58007116 54451649
34799E4451649q882845m840031j91389k802397m844072L532778J4721874J3191981
$$ 54451649 45568804 40728773 40537384 37734987 32890915 36423693 51145567 64337548
34791F4337548m98192j0070564o715308O29158k46745r108134j5155781j0272312
$$ 64337548 63839356 53768792 47053484 47682642 47435897 38327763 23171982 12899670
34783A2899670J830065R594377P443026K909363N217126J0699580R269396K675707
$$ 12899670 14729735 24324112 31767138 34676501 39893627 50593207 59862603 62538310
34775F2538310K465505R396936J1009830L373336j872091J289725K770813l551911
$$ 62538310 65003815 74400751 85410581 88783917 86911826 88201551 90972364 87420453
34767H7420453p473523k754018j512262j1681248j7241976k393382J8131049J7793440
$$ 87420453 79946930 77192912 75680650 63999402 46757426 44364044 62495093 80288533
34759H0288533j122636j1724098m153352L017128m242700j4433147j0736873M608728
$$ 80288533 79165897 67441799 63288447 66305575 62062875 47629728 36892855 41501583
34751D1501583J5409331J0871776n761534k0659876j9997439m334365R177601
$$ 41501583 56910914 67782690 62021156 41361280 21363841 17029476 26207077
34744B6207077P156830k031858j886276O663255R144044K954241j96885K989799
$$ 26207077 33363907 31332049 29445773 36109028 45253072 48207313 48010428 51000227
34736E1000227K254832n114034p444348J83921N618268k11446q156145o896931
$$ 51000227 53255059 48141025 40696677 40880598 46498866 46287420 38131275 31234344
34728C1234344j296874k266761p793478o962394K460405J1487432J2441591O048891
$$ 31234344 29937470 27670709 19877231 12914837 15375242 26862674 39304265 45353156
34720D5353156k369906p971028q412137m274627K343323R095302J1953921O532234
$$ 45353156 42983250 35012222 26600085 22325458 24668781 33764083 45718004 52250238
34712E2250238m171698q219076Q40217J2272351J1137243j043925j0840366j4136017
$$ 52250238 48078540 39859464 40699681 52972032 64109275 63065350 52224984 38088967
34704C8088967j7281412j9268000j1452800K925370P803567j699828j1214980
$$ 38088967 20807555 1539555 -9913245 -6987875 815692 -884136 -12099116
34697a2099116r005236L41083R465028J7345487J8472929L840961j7263359j8694128
$$ -12099116 -21104352 -20763269 -11298241 6047246 24520175 28361136 11097777 -7596351
34689g596351M818131K3321630J3901458m190494j467152J3584743J0138606j2506589
$$ -7596351 -2778220 20543410 34444868 30254374 28787222 42371965 52510571 40003982
34681D0003982k3721176j1136700K856176M27486o452840k266695O096966N937458
$$ 40003982 16282806 5146106 8002282 8429768 1976928 -289767 5807199 11744657
34673A1744657J756804L564099O053232j906416j5155341j6981063l075211J2810386
$$ 11744657 13501461 17065560 23118792 21212376 6057035 -10924028 -13999239 -1188853
34665a188853J6736237Q300993l305431r157505o159169J441814N554045K737959
$$ -1188853 15547384 23848377 20542946 11385441 5226272 6668086 12222131 14960090
34657A4960090j565419q8033O740456J1454805Q425726l96492p509972o541067
$$ 14960090 13394671 13306638 20047094 31501899 39927625 39531133 32021161 25480094
34649B5480094J008228N443158o91605j1141425j1111934K700237J4041999O518614
$$ 25480094 26488322 31931480 31239875 20098450 8986516 11686753 25728752 32247366
34641C2247366j3000110k0533058n573631J4141132J4692599l278948j5780315
$$ 32247366 19247256 -1285802 -6859433 7281699 21974298 18695350 2915035
34634B915035p238166R491739J1584857k459880j1797545k825916J3007583J6745405
$$ 2915035 -4323131 5168608 16753465 14293585 2496040 -329876 12677707 29423112
34626B9423112P041084k112867k562299N13840Q9151m252990r441047j1868287
$$ 29423112 36464196 34351329 31789030 32302870 32392021 28139031 18697984 6829697
34618F829697p473296K775387Q906360L822147k421682N673379K2094726K1962495
$$ 6829697 -643599 2131788 11038148 14860295 12438613 18111992 40206718 62169213
34610F2169213j881297k3417779j8416371R70508O134582m669959p294784P772993
$$ 62169213 60287916 36870137 18453766 19424274 25558856 20888897 13594113 21367106
34602B1367106K1640756J8214757O185354o5767k288604p609870j1341687o731473
$$ 21367106 43007862 61222619 67407973 67342206 65053602 57443732 46102045 39370572
34594C9370572j145986n540634j4508944j3493780k153031N731866M675162M115237
$$ 39370572 38224586 32683952 18175008 4681228 2528197 8260063 12935225 17050462
34586A7050462J0484711J6511896J3380300L578292l325157j291508P808823J4574199
$$ 17050462 27535173 44047069 57427369 61005661 57680504 56388996 64197819 78772018
34578G8772018P992336j0938025k4000455j5508746M558746J1429484o09150j2479317
$$ 78772018 86764354 75826329 51825874 36317128 40875874 52305358 51696208 39216891
34570C9216891j1364207p278412r848969r155250M242419J6818610J0637961o066726
$$ 39216891 27852684 20574272 10725303 1570053 5812472 22631082 33269043 27202317
34562B7202317r513780L084450J0253939O20081j0609603o806688M857035N214509
$$ 27202317 17688537 20772987 31026926 31647007 21037404 14230716 19087751 24302260
34554B4302260q420260j7748896p378632J4141115K2594248P745817j1893844
$$ 24302260 15882000 -1866896 -9245528 4895587 27489835 35235652 23341808
34547B3341808j2096097L695307R242259m970542j7092015q319913Q513013J2177621
$$ 23341808 11245711 14941018 24183277 19212735 2120720 -6199193 2313820 14491441
34539A4491441O922751R187525J4016235M282121j2826952j0462722J4357003
$$ 14491441 21414192 30601717 44617952 48900073 36073121 25610399 39967402
34532C9967402L1076412J7779024j0842098k7456852k3974054r959528K973585
$$ 39967402 71043814 88822838 77980740 50523888 26549834 16590306 19563891
34525A9563891O099200j612718p093105K852047J7828329J3816607r208990k3443048
$$ 19563891 25663091 24050373 16957268 19809315 37637644 51454251 42245261 18802213
34517A8802213j4538848r19054j27341k595418M057706R840636L248288m260490
$$ 18802213 4263365 3344311 3216970 621552 4679258 14519894 17768182 13507692
34509A3507692J262510R323283L676129p329867n375615M943236M656468o427276
$$ 13507692 14770202 24093485 27769614 20439747 15064132 20007368 24663836 18236560
34501A8236560j0698146j937856Q715811J1818028O084267p428007k0239454j6113046
$$ 18236560 7538414 5600558 14316369 26134397 32218664 24790657 4551203 -11561843
34493a1561843M884053J5481562k066459k2954260j2925067J8290213L1550543
$$ -11561843 -6677790 8803772 6737313 -16216947 -29142014 -10851801 20698742
34486B0698742J8104493N877127Q093590O913035n879853j1991057l243609R37806
$$ 20698742 38803235 44680362 52773952 59686987 53807134 41816077 38572468 39510274
34478C9510274j0281547j7265660m087668J2909030J2270314Q2943o006993n429008
$$ 39510274 29228727 11963067 7875399 20784429 33054743 33137686 27130693 21701685
34470B1701685o035258m303512M523948J1118544O895447J178061M916449J0109731
$$ 21701685 15666427 11362915 15886863 27005407 33900854 35078915 39995364 50105095
34462E0105095M256168o929397j0572824r013163j0986768j0836944J417352J6560036
$$ 50105095 54361263 47431866 36859042 27845879 16859111 6022167 7439519 23999555
34454B3999555J5551375o34894j1609291p640232J13039J331822P48953N111700
$$ 23999555 39550930 38916036 27306745 19666513 19779552 21111374 21860327 26972027
34446B6972027R668015N730802n564251j3849757j1901915m060448p21299l771117
$$ 26972027 36640042 42370844 36806593 22956836 11054921 6994473 6273174 2502057
34438B502057k134779J1206450K2662430J2856992j2311569k3831133q587291
$$ 2502057 367278 11573728 34236158 47093150 34781581 10950448 2363157
34431B363157J2433392J5189692L739101l956999m666470n686031m948443L525983
$$ 2363157 14796549 29986241 33725342 29768343 25101873 19415842 14467399 17993382
34423A7993382J1997265P175830p641122j5941925j1117910j581016M332742N240654
$$ 17993382 29990647 37166477 29525355 13583430 2465520 884504 5217246 10457900
34415A0457900J800617k977015k616723L088996M077910l402685o479006L873578
$$ 10457900 12258517 9281502 6664779 9753775 13831685 10429000 3949994 7823572
34407G823572J3641336O031655q817493p052176J1448373K2267842J1991724o641430
$$ 7823572 21464908 27496563 18679070 11626894 23075267 45343109 57334833 50693403
34399E0693403j5963788j1476037J554584J3022837J0796241n523607j7362546
$$ 50693403 34729615 23253578 24808162 37830999 48627240 43103633 25741087
34392B5741087j0218935L181729K873068m788920l13517J0418076M604404j3420787
$$ 25741087 15522152 18703881 21576949 16788029 16474512 26892588 31496992 18076205
34384A8076205j4846176K956960Q984552o844975j3205376Q177729K6807877J1736115
$$ 18076205 3230029 6186989 15171541 8326566 -4878810 3298919 30106796 41842911
34376D1842911j7040518k1065077k756375O188913r52125k995267N946052Q437710
$$ 41842911 24802393 3737316 980941 7169854 6217729 3222462 9168514 17606224
34368A7606224j214427p054178j247421L944034O54499j554706M569644J0322092
$$ 17606224 16391797 9337619 8090198 12034232 12688731 11134025 15703669 26025761
34360B6025761O372113k190076m330770K349751J0108248Q353772o690336k3687282
$$ 26025761 32397874 30207798 25877028 28226779 38335027 46688799 39998463 16311181
34352A6311181k3446851l378172J4209027J0931525j342126p36985R070186P830571
$$ 16311181 -7135670 -10513842 3695185 14626710 13284584 12547599 21617785 29448356
34344B9448356m031066o213223M581101R020488O83025l257876M111566N128554
$$ 29448356 25417290 19204067 23785168 32805656 33488681 30230805 34342371 39470925
34336C9470925q801383j8195768r306497j23597q276249j6733639j752645K2900059
$$ 39470925 30669542 12473774 3167277 3043680 -5232569 -21966208 -23718853 -818794
34328h18794K4245267K606838r871284p56829P772376M24254p754894j598824
$$ -818794 23426473 26033311 16162027 15405198 23177574 23601828 15846934 14248110
34320A4248110Q200717O168520k251198m218546k050135l858542n321698O3973
$$ 14248110 22448827 28617347 26366149 22147603 20097468 16238926 10917228 10981201
34312A0981201L714907m438120j3443995n124494J3809100J7737096J576048j0162717
$$ 10981201 14696108 10257988 -3186007 -8310501 5498599 23235695 24811743 14649026
34304A4649026j146129J2843694J1287852O81336m74105N591882K058435j0019253
$$ 14649026 13502897 26346591 37634443 38315779 37841674 43433556 45491991 35472738
34296C5472738j1141055K576472R188322n030537k1454442j5515513O354275J6238811
$$ 35472738 24331683 26908155 36096477 31065940 9611498 -5904015 450260 16689071
34288A6689071N063090p304842l388935R213915J3823656Q926111M940204N157727
$$ 16689071 21752161 14447319 11058384 20272299 34095955 43022066 47962270 53119997
34280E3119997K459997p075130j6903929j7458140n891246J1219072K1436592
$$ 53119997 55579994 48504864 31600935 14142795 8251549 19470621 40907213
34273D0907213J5461043k293185j4789975j0495169J822255M466818m331725p864930
$$ 40907213 56368256 54075071 39285096 28789927 30612182 35079000 30747275 22882345
34265B2882345L983650J8510586J7089424L08993j4323599j5665703q804963k752264
$$ 22882345 26865995 45376581 62466005 62774998 48451399 32785696 23980733 21228469
34257B1228469K18966L50588m058631j0923104j1828801k718612P899214R305087
$$ 21228469 21447435 21798023 17739392 6816288 -5012513 -7731125 168089 9473176
34249I473176L762279K628742Q629566J1798752N231252m278260o867017l955468
$$ 9473176 13235455 15864197 24493763 36292515 41523767 37245507 30378490 26423022
34241B6423022m047278q003283p779671M4329Q153765R240306O029831N235045
$$ 26423022 22375744 14372461 6592790 6637119 14790884 24031190 30061021 35296066
34233C5296066O368532L475239m344962j1337099j3534874j1794062o070033M999260
$$ 35296066 41664598 45139837 40794875 29457776 15922902 4128840 -1941193 3058067
34225C058067J6135446J6245145L611064p628230n379040K268882j135192j4104036
$$ 3058067 19193513 35438658 39049722 31421492 26042452 28311334 27176142 13072106
34217A3072106j7859330m698102R862946J0068748J598054l81093N392277Q025555
$$ 13072106 -4787224 -9485326 377620 10446368 12044422 11663329 17055606 25081161
34209B5081161L614026r27256q64753J460562L867697N789233L445908n358596
$$ 25081161 28695187 27767931 26903178 28363740 32231437 38020670 41466578 36107982
34201C6107982j2330404p144735M459259N275505p175724j4384167m407489R146688
$$ 36107982 23777578 16632843 21092102 26367607 19191883 4807716 400227 9546915
34193I546915Q063731k678202m604889L900211N816036o308001j7861418j3508405
$$ 9546915 17610646 14932444 10327555 14227766 20043802 13735801 -4125617 -17634022
34185a7634022J682727J0536628N727443m008434n962337L225291J4414759J4374024
$$ -17634022 -15951295 -5414667 312776 -3695658 -9657995 -6432704 7982055 22356079
34177B2356079K81501j4220144j2871344K919240J5121310J2595164M518865M626325
$$ 22356079 22637580 8417436 -4453908 -1534668 13586642 26181806 30700671 35326996
34169C5326996J0624536R233231k996769j5155366j7639429j2200476m556127
$$ 35326996 45951532 55184763 52187994 37032628 19393199 7192723 2636596
34162B636596L688806J1143601J2012178K553884j0881812j6649701j0507481
$$ 2636596 6325402 17469003 29481181 32035065 21153253 4503552 -6003929
34155f003929L41665N814298K483916n389535j1043285r968246j785433R629876
$$ -6003929 -5662264 152034 2635950 -2753585 -13796870 -23765116 -25550549 -15920673
34147a5920673J7388677J5426113M309129o627256o764976L493715J1140439N890566
$$ -15920673 1468004 16894117 21203246 14575990 7811014 11304729 22445168 28335734
34139B8335734n338719o353072N892626J5503628Q446773q453768j6800887j0107723
$$ 28335734 22997015 16643943 22536569 38040197 46486970 38033202 21232315 11124592
34131A1124592J122770O091090N586685M897855L442175k262940r513765j0479757
$$ 11124592 12247362 18338452 23925137 28822992 32265167 30002227 20488462 10008705
34123A0008705k919655N045071M195253l526689o696796m4126O691640J782674
$$ 10008705 7089050 12134121 16329374 12802685 6105889 6061763 12753403 14536077
34115A4536077r652682j0176269M827999J8084914J3484281j740936q416527j614694
$$ 14536077 4883395 -5292874 -464875 17620039 31104320 29363384 20946857 19332163
34107A9332163O996848Q006879K249402o534729j3133706q143573J0038786K2557671
$$ 19332163 26329011 34335890 36585292 30050563 16916857 8773284 18812070 41369741
34099D1369741R006459j9642320k9076707q755721J2154900P546701r818921j3228362
$$ 41369741 50376200 30733880 1657173 -7098548 5056352 12603053 2784132 -10444230
34091a0444230k720638K935177O49914K412967P892081M739862n472927o647861
$$ -10444230 -13164868 -10229691 -9579777 -7166810 725271 5465133 -7794 -6655655
34083f655655M437151J2289087Q060717O14720k238331m162028o517766l370513
$$ -6655655 -2218504 10070583 18131300 18746020 16507689 12345661 5827895 2457382
34075B457382K846511j67994j1631788j2591798M213489J8011759R821514o872309
$$ 2457382 5303893 5135899 -6495889 -19087687 -14874198 3137561 12959075 6086766
34067F086766n320038J4513173K6400918J4870210p117672j8639362j4085377
$$ 6086766 766728 15279901 41680819 56551029 49433357 30793995 16708618
34060A6708618k811169L420403q75124j0951932j4225762k976894J4203131K0288857
$$ 16708618 13897449 17317852 16442728 5490796 -8734966 -11711860 2491271 22780128
34052B2780128J0766318j21155K128214J2851974J3874016k213348k0346006k0495327
$$ 22780128 33546446 33425291 35553505 48405479 62279495 60066147 39720141 19224814
34044A9224814l291696J0488256P247413k969772l938953K968186M907628N30761
$$ 19224814 15933118 26421374 33668787 30699015 26760062 29728248 34635876 35166637
34036C5166637L32655N920485O464464j470734p032624l572466Q91621j169003
$$ 35166637 35499292 41419777 47884241 46413507 39380883 35808417 36700038 35531035
34028C5531035m860953m240975k911595m407326l940735R97899L381180m17550
$$ 35531035 30670082 26429107 23517512 19110186 15169451 16167350 19548530 19130980
34020A9130980k146615L466703P297985J045445p610231p970625l516912k397373
$$ 19130980 16984365 20451068 27749053 28794498 21184267 13213642 9696730 7299357
34012G299357j564042M297673Q214030K277016n340458k774395L918970R00130
$$ 7299357 5735315 10032988 18247018 20524034 15183576 12409181 16328151 17228281
34004A7228281q085346p390441L326793Q950277M690279J210199L402467M065415
$$ 17228281 9142935 1752494 5079287 14029564 18719843 19930042 23332509 27397924
33996B7397924N90888j357409l157568j2545062k4181301k1367650l114150J0490091
$$ 27397924 27988812 26631403 23473835 10928773 -13252528 -34620178 -37734328 -27244237
33988b7244237Q067307K788038P929819J5002115J0297283j729637p523558o046180
$$ -27244237 -19176930 -16388892 -8459073 6543042 16840325 15110688 7587130 1540950
33980A540950n541414o079674o02155J0107833J6413822J3113115M738413j819500
$$ 1540950 -4000464 -10080138 -10682293 -574460 15839362 28952477 33690890 31871390
33972C1871390l590838j672839Q3256j746761n092190l670014L617371Q726372
$$ 31871390 28280552 26607713 26690969 24944208 19852018 16182004 19799375 28525747
33964B8525747M207438n878266r066786J533392J7746343K2021103N907805j6639352
$$ 28525747 32733185 26854919 17788133 19321525 37067868 59088971 64996776 48357424
33956D8357424k1628615m853486J0374609M314056j1137115j0736407O164139
$$ 48357424 26728809 21875323 32249932 36563988 25426873 14690466 20854605
33949B0854605J6547811R385084k267168o802789r160434j3765987j3107817l632065
$$ 20854605 37402416 46787500 44520332 37717543 28557109 14791122 1683305 -1948760
33941a948760L861086N74162p192455j0066805p376099o5716J2650452K2525342
$$ -1948760 1912326 2486488 -4705967 -14772772 -22148871 -22214587 -9564135 12961207
33933A2961207J6115203j572990o742288Q317928K0716020J2173570k973283m826879
$$ 12961207 29076410 27503420 20761132 29079060 49795080 61968650 58995367 54168488
33925E4168488j823641j1248278k2829595j3673870R480091J6075090j133158
$$ 54168488 52344847 41096569 18266974 4593104 14073195 30148285 29015127
33918B9015127j5426578p837071P094846P360702n259707j2427788m673566J0747918
$$ 29015127 13588549 5751478 12846324 20207026 14947319 2519531 -2154035 8593883
33910H593883J9686463J3114153m463597j6851468j2927801l24022N474429J928982
$$ 8593883 28280346 41394499 36930902 20079434 7151633 6827611 12302040 14231022
33902A4231022j600362j690915l422696o700351n066642J069068M196526M042157
$$ 14231022 12630660 10939745 7517049 816698 -4249944 -3180876 1015650 5057807
33894E057807P949784J4785988J3269674R60593q682315m933321N221817P788566
$$ 5057807 13007591 27793579 41063253 42023846 33341531 28408210 33630027 41418593
33886D1418593k92976r940441j1616778m565880K498318J04595r394902j2396180
$$ 41418593 41125617 31185176 19568398 15002518 17500836 17605431 8210529 -4185651
33878d185651k936611O465138K901580o268977n472470L325582N255665j272563
$$ -4185651 -7122262 -657124 2244456 -4024521 -9496991 -6171409 -915744 -2188307
33870b188307l645107Q32587J680227k106748J433373J3236018J7844737R383795
$$ -2188307 -5833414 -5000827 -3320600 -5427348 -3993975 9242043 27086780 36470575
33862C6470575J450157J952666k44079j1503392j7402655o415571Q425159R175320
$$ 36470575 37920732 39873398 39629319 28125927 10723272 4307701 12732860 21908180
33854B1908180l95407n224578l068983q60791J390305N698203N644465k211721
$$ 21908180 21512773 16288195 13219212 12358421 13748726 19446929 25091394 22879673
33846B2879673o885694K6752P235819K560965l083217O502255K0743960J5032862
$$ 22879673 15993979 16020731 23256550 25817515 22734298 29236553 49980513 65013375
33838F5013375q927770k3378553j5850006l581995k005993m168651n28923K974735
$$ 65013375 56085605 32707052 16857046 13275051 11269058 7100407 6571484 9546219
33830I546219j033769o330410m408590J963284O272049P790786O024021k013966
$$ 9546219 8512450 2182040 -2226550 -263266 6008783 13799569 19823590 17809624
33822A7809624j1962955j2791956m209753J132108k73144L549451J4329581J2647224
$$ 17809624 5846669 -6945287 -11155040 -10022932 -10296076 -6746625 7582956 20230180
$$ [...]
##END NTUPLES=NMR SPECTRUM
##END=
