##TITLE=31Pdec_LR-724-R2-CR21
 CDCl3, 24 sc
 11.3.2025
##JCAMPDX= 6.0         $$ Bruker NMR JCAMP-DX V2.0
##DATA TYPE= NMR SPECTRUM
##DATA CLASS= NTUPLES
##ORIGIN= UXNMR, Bruker Analytische Messtechnik GmbH
##OWNER= root
$$ XWIN-NMR		Version 3.5
$$ Tue Mar 11 15:01:52 2025 Russian Standard Time (UT+4h)  she@DPX200
##.OBSERVE FREQUENCY= 81.013821
##.OBSERVE NUCLEUS= ^31P
##.ACQUISITION MODE= SIMULTANEOUS
##.ACQUISITION SCHEME= undefined
##.AVERAGES= 24
##.DIGITISER RES= 17
##SPECTROMETER/DATA SYSTEM= spect
##.PULSE SEQUENCE= zgpg30
##.SOLVENT NAME= D2O
##.SHIFT REFERENCE= (INTERNAL, D2O, 0, 198.062)
##AUDIT TRAIL= $$ (NUMBER, WHEN, WHO, WHERE, WHAT)
$$ ##TITLE= Audit trail, XWIN-NMR		Version 3.5
$$ ##JCAMPDX= 5.01
$$ ##ORIGIN= Bruker BioSpin GmbH
$$ ##OWNER= she
$$ F:/spectra/data/she/nmr/P31/2/pdata/1/auditp.txt
$$ ##AUDIT TRAIL=  $$ (NUMBER, WHEN, WHO, WHERE, WHAT)
(   1,<2025-03-11 15:00:38.00 +0400>,<she>,<DPX200>,
      <created by zg, POWCHK disabled, PULCHK disabled
       configuration hash MD5:
       00 E9 B6 7A A2 85 ED C7 34 08 36 98 17 FE 4E 26
       data hash MD5: 32K
       BC E3 93 03 0C 62 D3 27 24 8A FA C5 EB 6F 4E E9>)
(   2,<2025-03-11 15:00:40.42 +0400>,<she>,<DPX200>,
      <Start of raw data processing
       efp BC_mod = 2 LB = 1.5 FT_mod = 6 PKNL = 1 PHC0 = 1812.962 PHC1 = -25.5056 SI = 64K 
       data hash MD5: 64K
       82 6B 6E 9F BF 76 B5 C9 B0 5A B1 D3 43 8F CA 5B>)
(   3,<2025-03-11 15:01:00.65 +0400>,<she>,<DPX200>,
      <pk PHC0 = -5.311318 PHC1 = 15.4 
       data hash MD5: 64K
       17 40 2C AD 65 A0 E8 C3 7E 41 82 EB 6B 65 5B 16>)
(   4,<2025-03-11 15:01:04.06 +0400>,<she>,<DPX200>,
      <abs ABSG = 5 
       data hash MD5: 64K
       14 36 74 F3 6C 65 6F B5 E8 B7 83 89 C2 3D 59 36>)
$$ ##END=
$$ 
$$ hash MD5
$$ A3 FD F2 94 76 D0 64 D9 FC 47 38 95 60 7E 86 87
##$RELAX= 
##$RELAX= 
##$RELAX= 
##$RELAX= 
##$RELAX= 
##$RELAX= 
##$RELAX= 
##$RELAX= 
$$ Bruker specific parameters
$$ --------------------------
##$DU= <F:/spectra>
##$EXPNO= 2
##$NAME= <P31>
##$PROCNO= 1
##$TYPE= <nmr>
##$USER= <she>
##$AMP= (0..31)
100 100 100 100 100 100 100 100 100 100 100 100 100 100 100 100 100 100 
100 100 100 100 100 100 100 100 100 100 100 100 100 100 
##$AQSEQ= 0
##$AQ_mod= 1
##$AUNM= <au_zg>
##$AUTOPOS= <>
##$BF1= 81.014009
##$BF2= 200.13
##$BF3= 200.13
##$BF4= 200.13
##$BF5= 200.13
##$BF6= 200.13
##$BF7= 200.13
##$BF8= 200.13
##$BYTORDA= 1
##$CFDGTYP= 0
##$CFRGTYP= 5
##$CHEMSTR= <none>
##$CNST= (0..31)
1 1 145 1 1 1 1 1 1 1 1 1 1 1 1 1 1 1 1 1 1 1 1 1 1 1 1 1 1 1 1 1 
##$CPDPRG= <waltz16>
##$CPDPRG1= <>
##$CPDPRG2= <waltz16>
##$CPDPRG3= <>
##$CPDPRG4= <mlev>
##$CPDPRG5= <mlev>
##$CPDPRG6= <mlev>
##$CPDPRG7= <mlev>
##$CPDPRG8= <mlev>
##$CPDPRGB= <>
##$CPDPRGT= <>
##$D= (0..31)
0 1 0 0 0 0 0 0 0 0.06 0 0.03 2e-05 3e-06 0 0 0.0002 0 0 0 0 0 0 0 0 0 
0 0 0 0 0 0 
##$DATE= 1741690837
##$DBL= (0..7)
120 120 120 11 120 120 24 19 
##$DBP= (0..7)
150 150 150 150 150 150 150 150 
##$DBP07= 0
##$DBPNAM0= <>
##$DBPNAM1= <>
$$ [...]
##$SUBNAM3= <"">
##$SUBNAM4= <"">
##$SUBNAM5= <"">
##$SUBNAM6= <"">
##$SUBNAM7= <"">
##$SUBNAM8= <"">
##$SUBNAM9= <"">
##$SW= 400.765351723535
##$SWIBOX= (0..15)
0 1 3 0 0 0 0 0 0 0 0 0 0 0 0 0 
##$SW_h= 32467.5324675325
##$TD= 32768
##$TD0= 1
##$TE= 0
##$TE2= 300
##$TE3= 300
##$TEG= 300
##$TL= (0..7)
0 120 53 12 22 120 120 120 
##$TP= (0..7)
150 150 150 150 150 150 150 150 
##$TP07= 0
##$TPNAME0= <>
##$TPNAME1= <>
##$TPNAME2= <>
##$TPNAME3= <>
##$TPNAME4= <>
##$TPNAME5= <>
##$TPNAME6= <>
##$TPNAME7= <>
##$TPOAL= (0..7)
0.5 0.5 0.5 0.5 0.5 0.5 0.5 0.5 
##$TPOFFS= (0..7)
0 0 0 0 0 0 0 0 
##$TUNHIN= 0
##$TUNHOUT= 0
##$TUNXOUT= 0
##$USERA1= <user>
##$USERA2= <user>
##$USERA3= <user>
##$USERA4= <user>
##$USERA5= <user>
##$V9= 5
##$VALIST= <valist>
##$VCLIST= <CCCCCCCCCCCCCCC>
##$VD= 0
##$VDLIST= <DDDDDDDDDDDDDDD>
##$VPLIST= <PPPPPPPPPPPPPPP>
##$VTLIST= <TTTTTTTTTTTTTTT>
##$WBST= 1024
##$WBSW= 4
##$XGAIN= (0..3)
0 0 0 0 
##$XL= 0
##$YL= 0
##$YMAX_a= 8597
##$YMIN_a= -16354
##$ZGOPTNS= <>
##$ZL1= 120
##$ZL2= 120
##$ZL3= 120
##$ZL4= 120
##$ABSF1= 198.0616
##$ABSF2= -202.7028
##$ABSG= 5
##$ABSL= 3
##$ALPHA= 0
##$AQORDER= 0
##$ASSFAC= 0
##$ASSFACI= 0
##$ASSFACX= 0
##$ASSWID= 0
##$AUNMP= <proc_1d>
##$AZFE= 0.1
##$AZFW= 0.5
##$BCFW= 0
##$BC_mod= 2
##$BYTORDP= 0
##$COROFFS= 0
##$CY= -3
##$DATMOD= 1
##$DC= 0
##$DFILT= <>
##$DTYPP= 0
##$F1P= 0
##$F2P= 0
##$FCOR= 1
##$FTSIZE= 65536
##$FT_mod= 6
##$GAMMA= 0
##$GB= 0
##$INTBC= 1
##$INTSCL= 9.790993e-09
##$ISEN= 30
##$LB= 1.5
##$LEV0= 0
##$LPBIN= 0
##$MAXI= 10000
##$MC2= 0
##$MEAN= 0
##$ME_mod= 0
##$MI= 50
##$NCOEF= 0
##$NC_proc= -7
##$NLEV= 6
##$NOISF1= 182.463
##$NOISF2= 159.3651
##$NSP= 0
##$NTH_PI= 0
##$NZP= 0
##$OFFSET= 198.0616
##$PC= 4
##$PHC0= 1807.651
##$PHC1= -10.1056
##$PH_mod= 1
##$PKNL= yes
##$PPARMOD= 0
##$PSCAL= 0
##$PSIGN= 0
##$REVERSE= no
##$SF= 81.0140089999434
##$SI= 65536
##$SIGF1= 159.3651
##$SIGF2= -187.1042
##$SINO= 113.3802
##$SIOLD= 16384
##$SREGLST= <1H.CDCl3>
##$SSB= 0
##$STSI= 65536
##$STSR= 0
##$SW_p= 32467.5324675325
##$SYMM= 0
##$S_DEV= 0
##$TDeff= 32768
##$TDoff= 0
##$TI= <>
##$TILT= no
##$TM1= 0
##$TM2= 0
##$TOPLEV= 0
##$USERP1= <user>
##$USERP2= <user>
##$USERP3= <user>
##$USERP4= <user>
##$USERP5= <user>
##$WDW= 1
##$XDIM= 65536
##$YMAX_p= 281798340
##$YMIN_p= -16931137
$$ End of Bruker specific parameters
$$ ---------------------------------
##NTUPLES= NMR SPECTRUM
##VAR_NAME=  FREQUENCY,     SPECTRUM/REAL,   SPECTRUM/IMAG
##SYMBOL=    X,             R,               I
##VAR_TYPE=  INDEPENDENT,   DEPENDENT,       DEPENDENT
##VAR_FORM=  AFFN,          ASDF,            ASDF
##VAR_DIM=   65536,         65536,           65536
##UNITS=     HZ,            ARBITRARY UNITS, ARBITRARY UNITS
##FACTOR=    0.49542278885378, 1,            1
##FIRST=     16045.7642231865, 0,            0
##LAST=      -16421.768244346, 0,            0
##MIN=       -16421.768244346, -16931137,    0
##MAX=       16045.7642231865, 281798340,    0
$$ Real data points
##PAGE= N=1
##DATA TABLE= (X++(R..R)), XYDATA
$$ [...]
$$ plain form
45366 -1775437 -3286206 -3887427 -3764137 -3475670 -3256746 -3124588 -3157381 -3290210 -3084945
45357 -3084945 -2137745 -731835 264144 337799 -37352 15881 657544 1138972 821817 44839
45347 44839 -340763 -132607 -56992 -799794 -2069586 -2856549 -2487577 -1204313 247034
45338 247034 1337812 1963109 2121703 1680456 572953 -881550 -2038600 -2399126 -2031885
45329 -2031885 -1528810 -1502326 -2017682 -2471697 -2156609 -1072149 -65835 53269 -497483
45320 -497483 -636637 364439 2059952 3337050 3523380 2825551 1887109 1208630 939426
45311 939426 932622 872757 469085 -338697 -1321357 -2113331 -2477142 -2468781 -2304418 -2031450
45301 -2031450 -1477491 -667127 -81810 -164166 -673342 -969753 -906828 -895792 -1022413 -810592
$$ packed form
45366a775437j510769o01221J23290K88467K18924J32158l2793j32829K05265
45357c084945R47200J405910R95979P3655l75151N3233O41663M81428l17155p76978
45347D4839l85602K08156P5615p42802j269792p86963L68972J283264J451347
45338B47034J090778O25297J58594m41247j107503j454503j157050l60526L67241
45329b031885N03075K6484n15356m54015L15088J084460J006314J19104n50752
45320d97483j39154J001076J695513J277098J86330o97829r38442o78479k69204
45311I39426o804n9865m03672q07782r82660p91974l63811Q361J64363K72968
45301b031450N53959Q10364N85317q2356n09176k96411O2925J1036j26621K11821
$$ plain form
45291 -810592 -194095 8374 -775644 -1834620 -2081441 -1612706 -1416225 -1713835 -1676700 -926931
45281 -926931 -269056 -458646 -1069373 -1197781 -686955 -1821 640855 1301622 1756202 1614898
45271 1614898 945390 226260 -302873 -776041 -1200415 -1299563 -961136 -473977 -168780 -45741
45261 -45741 152667 649686 1406011 2019047 1929017 971209 -316392 -1180485 -1410245 -1370337
45251 -1370337 -1378856 -1430646 -1541210 -1909984 -2528194 -2956430 -2792579 -2192053 -1668257 -1476429
45241 -1476429 -1404584 -1090923 -344121 773571 1918458 2509485 2102958 932990 -74702
45232 -74702 -115883 623036 1118094 632884 -494752 -1351990 -1531146 -1390859 -1349395 -1379371
45222 -1379371 -1320069 -1257912 -1319389 -1418118 -1525257 -1858050 -2365461 -2345432 -1234613 326463
$$ packed form
45291h10592O16497K02469p84018j058976k46821M68735J96481k97610L7135P49769
45281i26931O57875j89590o10727j28408N10826O85134O42676O60767M54580j41304
45271A614898o69508p19130n29133m73168m24374r9148L38427M87159L05197J23039
45261d5741J98408M97019P56325O13036r0030r57808j287601q64093k29760L9908
45251a370337q519n1790j10564l68774o18210m28236J63851O00526N23796J91828
45241a476429P1845L13661P46802J117692J144887N91027m06527j169968j007692
45232g4702m1181P38919M95058m85210j127636q57238j79156J40287M1464k9976
45222a379371N9302O2157o1477r8729j07139l32793n07411K0029J110819J561076
$$ plain form
45212 326463 983308 402232 -199892 318093 1450608 1738759 705778 -620545 -1075212
45203 -1075212 -585879 135047 570660 674047 463894 -157453 -1109180 -1932557 -2102808
45194 -2102808 -1542035 -710241 -115696 179106 411760 562939 293783 -419087 -952832
45185 -952832 -712945 85749 760308 1137287 1621730 2274482 2471956 1774531 620371
45176 620371 -242500 -627040 -789803 -784397 -433285 262681 1138348 2088022 2829901 2721382
45166 2721382 1444254 -242383 -1089406 -703564 262014 1175761 1948338 2470296 2398266
45157 2398266 1755347 975345 96769 -1223900 -2561295 -2646526 -1139464 493837 803468
45148 803468 204106 -85725 -111017 -716831 -1574680 -1439985 -334294 270041 -223030 -640600
$$ packed form
45212C26463O56845n81076o02124N17985J132515K88151j032981j326323m54667
45203a075212M89333P20926M35613J03387k10153o21347r51727q23377j70251
45194b102808N60773Q31794N94545K94802K32654J51179k69156p12870n33745
45185i52832K39887P98694O74559L76979M84443O52752J97474o97425j154160
45176F20371q62871l84540j62763N406L51112O95966Q75667R49674P41879j08519
45166B721382j277128j686637q47023L85842R65578R13747P72577N21958p2030
45157B398266o42919p80002q78576j320669j337395q5231J507062J633301L09631
45148H03468n99362k89831k5292o05814q57849J34695J105691O04335m93071m17570
$$ plain form
45138 -640600 -73595 712083 775158 565016 853725 1195342 771025 -7633 -118583 349634
45128 349634 463768 151713 270459 975900 1316100 727497 -127829 -435161 -303022 -293339
45118 -293339 -484041 -468516 68606 1082230 2222066 3022212 3273360 3203733 3039716 2571619
45108 2571619 1576656 447825 -188721 -322021 -361044 -255852 355064 1165953 1346511
45099 1346511 857726 678000 1346867 2158114 2293318 1948930 1720453 1580294 1215860
45090 1215860 856044 975484 1484561 1872739 1921906 1744584 1399676 994205 861052 1095445
45080 1095445 1222440 878445 487124 631527 1075510 1126321 719188 368269 226661 52623
45070 52623 46342 790677 2188580 3267743 3315497 2555984 1519925 505586 -36261 566191
$$ packed form
45138f40600N67005P85678O3075k10142K88709L41617m24317p78658j10950M68217
45128C49634J14134l12055J18746P05441L40200n88603q55326l07332J32139R683
45118b93339j90702J5525N37122J013624J139836Q00146K51148o9627j64017m68097
45108B571619r94963j128831o36546j33300l9023J05192O10916Q10889J80558
45099A346511m88785j79726O68867Q11247J35204l44388k28477j40159l64434
45090A215860l59816J19440N09077L88178M9167j77322l44908m05471j33153K34393
45080A095445J26995l43995l91321J44403M43983N0811m07133l50919j41608j74038
45070E2623o281P44335J397903J079163M7754p59513j036059j014339n41847O02452
$$ plain form
45060 566191 2250915 3771446 3908245 2834371 1719988 1267234 1216127 1068959 629115
45051 629115 -158823 -1281089 -2378808 -2818385 -2288884 -1156614 -131573 270792 -44552
45042 -44552 -788953 -1443121 -1559161 -1053540 -183192 702437 1248365 1065837 -6414 -1486519
45032 -1486519 -2395679 -2095314 -890130 359343 1091193 1320208 1236622 904703 413676
45023 413676 3231 -166225 -215143 -365289 -685117 -1133636 -1689487 -2264301 -2651033 -2773500
45013 -2773500 -2825926 -2901462 -2672129 -1845535 -830551 -415580 -712696 -959660 -591641 -7261
45003 -7261 79286 -387033 -925732 -1272508 -1472907 -1450908 -1062981 -499769 -94106 247888
44993 247888 877836 1622077 1757050 991476 -19181 -466508 -327545 -138263 -101191 120348
$$ packed form
45060E66191J684724J520531J36799j073874j114383m52754n1107j47168m39844
45051F29115p87938j122266j097719m39577N29501J132270J025041M02365l15344
45042d4552p44401o54168j16040N05621Q70348Q85629N45928j82528j072251j480105
45032a486519r09160L00365J205184J249473P31850K29015q3586l31919m91027
45023D13676m10445j69456m8918j50146l19828m48519n55851n74814l86732j22467
45013b773500n2426p5536K29333Q26594J014984M14971k97116k46964L68019N84380
45003g261Q6547m66319n38699l46776k00399K1999L87927N63212M05663L41994
44993B47888O29948P44241J34973p65574j010657m47327J38963J89282L7072K21539
$$ plain form
44983 120348 752756 1438574 1592061 1116776 604684 722587 1434843 2037170 2066976 1898789
44973 1898789 2100734 2419151 1969641 479543 -1233742 -2258646 -2552340 -2549045 -2302116
44964 -2302116 -1643878 -962282 -1058108 -2047212 -2939082 -2666139 -1273198 225984 989871
44955 989871 977220 512526 -261711 -1206509 -1812923 -1571036 -733900 -197935 -387581 -686750
44945 -686750 -339141 467525 941069 850371 697031 779924 762436 304779 -454135 -1232540
44935 -1232540 -1873074 -2057354 -1350363 101690 1418660 1927127 1795491 1361716 428696
44926 428696 -1155347 -2729908 -3456137 -3446804 -3454583 -3598077 -3262092 -2265296 -1251967 -724049
44916 -724049 -453999 -143907 53759 62612 261835 807647 1098201 524147 -598397 -1429133
$$ packed form
44983A20348O32408O85818J53487m75285n12092J17903P12256O02327K9806j68187
44973A898789K01945L18417m49510j490098j713285j024904k93694L295K46929
44964b302116O58238O81596r5826r89104q91870K72943J392941J499182P63887
44955I89871j2651m64694p74237r44798o06414K41887Q37136N35965j89646k99169
44945f86750L47609Q06666M73544r0698j53340Q2893j7488m57657p58914p78405
44935a232540o40534j84280P06991J452053J316970N08467j31636m33775r33020
44926D28696j584043j574561p26229R333p779j43494L35985R96796J013329N27918
44916g24049K70050L10092J97666Q853J99223N45812K90554n74054j122544q30736
$$ plain form
44906 -1429133 -1663848 -1597943 -1354779 -766234 -21273 263131 -150081 -757654 -1046636 -1140049
44896 -1140049 -1332415 -1346314 -609627 818833 2128504 2661320 2506038 2017159 1209220
44887 1209220 52733 -955015 -1154544 -652623 -293992 -545957 -974368 -1123755 -1317860
44878 -1317860 -2002761 -2737780 -2654952 -1802158 -1204114 -1442405 -1900123 -1731136 -971740 -256815
44868 -256815 93721 202628 196294 180239 446679 1160042 1894644 1973106 1310596 525990
44858 525990 133874 -13941 -336155 -883656 -1350365 -1573003 -1742866 -2071343 -2407802 -2339791
44848 -2339791 -1653592 -545935 656508 1771438 2616912 2900851 2631944 2397086 2646286
44839 2646286 2813750 1928126 217235 -801628 -281168 777174 1026685 655139 713224
$$ packed form
44906a429133k34715O5905K43164N88545P44961K84404m13212o07573k88982r3413
44896a140049j92366j3899P36687J428460J309671N32816j55282m88879q07939
44887A209220j156487j007748j99529N01921L58631k51965m28411j49387j94105
44878a317860o84901p35019Q2828Q52794N98044k38291m57718J68987P59396P14925
44868b56815L50536J08907o334j6055K66440P13363P34602P8462o62510p84606
44858E25990l92116j47815l22214n47501m66709k22638j69863l28477l36459O8011
44848b339791O86199J107657J202443J114930Q45474K83939k68907k34858K49200
44839B646286J67464q85624j710891j018863N20460J058342K49511l71546N8085
$$ plain form
44830 713224 1166477 995240 80181 -457403 -71763 360028 64976 -399348 -240911 182563
44820 182563 63669 -414570 -386027 300861 954063 1137594 1056845 931568 748300 611983
44810 611983 660418 646074 243450 -269801 -306672 85036 282859 98279 -42414 20190
44800 20190 -3597 57771 961245 2736727 4059830 3666191 1880676 80240 -923564
44791 -923564 -1286962 -1311965 -1037259 -540800 26095 712662 1578005 2293699 2437805 2127587
44781 2127587 1860061 1769932 1567130 1191375 947582 892722 650360 54570 -490966 -577539
44771 -577539 -350155 -203919 -197489 -84645 212437 415380 146514 -702016 -1755733 -2294799
44761 -2294799 -1797562 -450901 981542 1817411 1893783 1483639 1054526 1049602 1553464 2121097
$$ packed form
44830G13224M53253j71237r15059n37584L85640M31791k95052m64324J58437M23474
44820A82563j18894m78239K8543O86888O53202J83531q0749j25277j83268j36317
44810F11983M8435j4344m02624n13251l6871L91708J97823j84580j40693O2604
44800B0190k3787O1368R03474J775482J323103l93639j785515j800436j003804
44791i23564l63398k5003K74706M96459N66895O86567Q65343P15694J44106l10218
44781B127587k67526r0129k02802l75755k43793n4860k42362n95790n45536q6573
44771e77539K27384J46236O430J12844K97082K02943k68866q48530j053717n39066
44761b294799M97237J346661J432443Q35869P6372m10144m29113m924N03862N67633
$$ plain form
44751 2121097 2236124 1971118 1863818 2102240 2236153 1833727 1056170 413526 281034
44742 281034 773263 1663456 2227491 1664515 53439 -1487050 -1994666 -1694222 -1438810
44733 -1438810 -1504616 -1505172 -1239935 -964637 -874265 -901102 -1044376 -1375433 -1680624 -1628713 -1365534
44722 -1365534 -1376180 -1597333 -1273602 -34875 1414728 2159677 2214857 2232228 2356459 2087114
44712 2087114 1247245 354244 -221671 -839565 -1852041 -2739892 -2657061 -1690530 -882696
44703 -882696 -900934 -1320753 -1486528 -1450267 -1561045 -1653030 -1366252 -971216 -1056323 -1496413
44693 -1496413 -1589545 -1276320 -1287593 -1787043 -1831477 -811635 346559 260518 -1111798 -2567050
44683 -2567050 -3186822 -2942457 -2054415 -700768 642018 1397773 1558031 1532621 1349285
$$ packed form
44751B121097J15027k65006j07300K38422J33913m02426p77557o42644j32492
44742B81034M92229Q90193N64035n62976j611076j540489n07616L00444K55412
44733a438810o5806n56K65237K75298R0372k6837j43274l31057l05191N1911K63179
44722a365534j0646k21153L23731J238727J449603P44949N5180J7371J24231k69345
44712B087114q39869q93001n75915o17894j012476q87851Q2831R66531Q07834
44703h82696j8238m19819j65775L6261j10778r1985K86778L95036q5107m40090
44693a496413r3132L13225j1273m99450m4434J019842J158194q6041j372316j455252
44683b567050o19772K44365Q88042J353647J342786P55755J60258k5410j83336
$$ plain form
44674 1349285 704590 -199398 -701966 -702205 -779648 -1038326 -713428 595728 2085768 2778567
44664 2778567 2782792 2839506 3090981 3067950 2620605 2106759 1721717 1255535 563839 -138084
44654 -138084 -477534 -178347 726855 1659171 1749661 774555 -380660 -678430 -164328 302388
44644 302388 385953 625848 1400320 2273687 2683631 2688163 2579487 2192244 1178080 -217508
44634 -217508 -1240627 -1553278 -1601671 -1859193 -2096726 -1803164 -1107123 -706325 -794825 -658721
44624 -658721 230200 1158880 910098 -566317 -1963640 -2230803 -1670961 -1126061 -774067
44615 -774067 -335434 36031 -127414 -737616 -1088864 -722442 130854 990382 1539768 1564218
44605 1564218 993583 232087 65635 904909 2229657 2989764 2572447 1352295 313355
$$ packed form
44674A349285o44695r03988n02568k39p7443k58678L24898J309156J490040O92799
44664B778567M225N6714K51475k3031m47345n13846l85042m66182o91696p01923
44654a38084l39450K99187R05202R32316R0490r75106j155215k97770N14102M66716
44644C02388Q3565K39895P74472Q73367M09944M532j08676l87243j014164j395588
44634b17508j023119l12651m8393k57522k37533K93562O96041M00798q8500J36104
44624f58721Q88921R28680k48782j476415j397323k67163N59842N44900L51994
44615g74067M38633L71465j63445o10202l51248L66422Q53296Q59528N49386K4450
44605A564218n70635p61496j66452Q39274J324748P60107m17317j220152j038940
$$ plain form
44596 313355 103445 460621 660121 437925 149080 5224 -302111 -916316 -1284041 -868149
44586 -868149 -37855 400489 338044 335939 595841 740276 667630 828325 1378260 1722945
44576 1722945 1297129 319556 -588320 -1125976 -1308392 -1123381 -620730 -119559 43673
44567 43673 -115949 -308339 -292538 -44080 196531 30790 -598848 -988602 -255857 1464236
44557 1464236 2916015 3125045 2412390 1636870 1004844 303432 -106197 506143 1965936
44548 1965936 2941095 2386039 802324 -368476 -377678 231903 600475 647656 906146 1530681
44538 1530681 2011334 1992406 1853644 2041100 2208090 1712739 828234 619891 1424121 2221331
44528 2221331 1944206 781117 -338479 -987175 -1299975 -1236570 -615199 267305 809177
$$ packed form
44596C13355k09910L57176J99500k22196k88845j43856l07335o14205l67725M15892
44586h68149Q30294M38344o2445k105K59902J44435p2646J60695N49935L44685
44576A722945m25816r77573r07876n37656j82416J85011N02651N01171J63232
44567D3673j59622j92390J5801K48458K40611j65741o29638l89754P32745J720093
44557A464236J451779K09030p12655p75520o32026p01412m09629O12340J459793
44548A965936R75159n55056j583715j170800r202O09581L68572M7181K58490O24535
44538A530681M80653j8928j38762J87456J66990m95351q84505k08343Q04230P97210
44528B221331k77125j163089j119596o48696l12800O3405O21371Q82504N41872
$$ plain form
44519 809177 916115 1014947 1227153 1169559 724284 398813 605499 1008158 927364 144953
44509 144953 -941977 -1756838 -1932767 -1484035 -837450 -581782 -974462 -1710747 -2272265
44500 -2272265 -2459256 -2495450 -2606525 -2549195 -1696842 198606 2342464 3364304 2705585
44491 2705585 1260147 282837 -67757 -584499 -1608685 -2525352 -2807990 -2840731 -3230333
44482 -3230333 -3796622 -3866195 -3327703 -2734833 -2354045 -1742284 -553477 691446 1108816
44473 1108816 547848 -285769 -802552 -1157035 -1709939 -2289934 -2418870 -2053131 -1606044
44464 -1606044 -1275609 -828190 -113187 658389 1260279 1620045 1518532 699804 -429336
44455 -429336 -843734 -191407 471027 -52882 -1442498 -2283529 -1968176 -1273345 -993517
$$ packed form
44519H09177J06938R8832K12206n7594m45275l25471K06686M02659q0794p82411
44509A44953j086930q14861j75929M48732O46585K55668l92680p36285n61518
44500b272265j86991l6194j11075N7330Q52353J895448K143858J021840o58719
44491B705585j445438r77310l50594n16742j024186r16667k82638l2741l89602
44482c230333n66289o9573N38492N92870L80788O11761J188807J244923M17370
44473A108816n60968q33617n16783l54483n52904n79995j28936L65739M47087
44464a606044L30435M47419P15003P71576O01890L59766j01513q18728j129140
44455d29336m14398O52327O62434n23909j389616q41031L15353O94831K79828
$$ plain form
44446 -993517 -934330 -653273 -441375 -915420 -2004624 -2953917 -3242378 -3058204 -2836616 -2645956
44436 -2645956 -2196967 -1370498 -551661 -271509 -545044 -850190 -887916 -1000044 -1510868 -2008910
44426 -2008910 -1820379 -1006922 -303273 -130726 -247879 -352133 -415977 -389668 -206589 -201045
44416 -201045 -900169 -2229533 -3495589 -4279696 -4712996 -4758838 -4047344 -2743350 -1773231
44407 -1773231 -1711594 -2115308 -2382646 -2514731 -2544647 -2104316 -1269317 -951760 -1530502 -1915857
44397 -1915857 -1119815 -24438 -153706 -1153045 -1148373 423715 1985811 2143952 1352665
44388 1352665 687716 307236 -34331 -53099 460125 863340 479554 -323390 -720911 -655048
44378 -655048 -665068 -893880 -1076047 -1196222 -1348218 -1185550 -330400 821710 1484047 1554215
$$ packed form
44446i93517N9187K81057K11898m74045j089204r49293k88461J84174K21588J90660
44436b645956M48989Q26469Q18837K80152k73535l05146l7726j12128n10824m98042
44426b008910J88531Q13457P03649J72547j17153j04254o3844K6309J83079N544
44416b01045o99124j329364j266056p84107m33300m5842P11494J303994R70119
44407a773231O1637m03714k67338j32085k9916M40331Q34999L17557n78742l85355
44397a915857P96042J095377j29268r99339M672J572088J562096J58141p91287
44388A352665o64949l80480l41567j8768N13224M03215l83786q02944l97521O5863
44378f55048j0020k28812j82167j20175j51996J62668Q55150J152110O62337P0168
$$ plain form
44368 1554215 1543236 1536618 1092563 224466 -388786 -399995 -241747 -300101 -354200 -185864
44358 -185864 -61017 -140657 -8577 662580 1438327 1668346 1309878 653542 -356593 -1811422
44348 -1811422 -3119365 -3451133 -2935670 -2677736 -3376784 -4494512 -5040701 -4704315 -3895927
44339 -3895927 -3042234 -2209967 -1265629 -171555 779599 977368 4074 -1755087 -3308293
44330 -3308293 -4032637 -4169907 -4172054 -3921221 -2983533 -1441700 -50341 480461 156287
44321 156287 -365194 -450613 -172270 -262578 -1156624 -2194788 -2315250 -1605333 -1405205 -2444447
44311 -2444447 -3637351 -3523923 -2347140 -1652738 -2079285 -2695409 -2614039 -2157746 -2021207
44302 -2021207 -2154624 -2013501 -1314648 -121324 1283268 2288286 2349468 1854383 1931038
$$ packed form
44368A554215j0979o618m44055q68097o13252j1209J58248n8354n4099J68336
44358a85864J24847p9640J32080O71157P75747K30019l58468o56336j010135j454829
44348a811422j307943l31768N15463K57934o99048j117728n46189L36386Q08388
44339c895927Q53693Q32267R44338J094074R51154J97769r73294j759161j553206
44330c308293p24344j37270k147K50833R37688J541833J391359N30802l24174
44321A56287n21481q5419K78343r0308q94046j038164j20462P09917K00128j039242
44311b444447j192904J13428J176783O94402m26547o16124Q1370M56293J36539
44302b021207j33417J41123O98853J193324J404592J005018O1182m95085P6655
$$ plain form
44293 1931038 2969146 4006899 4038068 3161161 1895353 307759 -1306274 -1816702 -635069
44284 -635069 895301 933502 -303039 -872240 66695 1302785 1699189 1717753 2145450
44275 2145450 2608080 2326457 1456120 703197 229233 -193374 -447038 -334240 -201697
44266 -201697 -532496 -1198362 -1760703 -2173956 -2526149 -2461676 -1668974 -691984 -398697 -725572
44256 -725572 -757955 -68786 809279 1365636 1796830 2396692 2860789 2640810 1690000 520942
44246 520942 -340160 -778193 -1047067 -1352692 -1471659 -990635 -66447 423820 -88840 -973496
44236 -973496 -1096834 -256733 665311 886584 448984 -156132 -398497 215111 1632887
44227 1632887 2678543 1884168 -679986 -3166141 -4047382 -3780066 -3788291 -4455231 -4950316
$$ packed form
44293A931038J038108J037753L1169q76907j265808j587594j614033n10428J181633
44284f35069J530370L8201j236541n69201R38935J236090L96404J8564M27697
44275B145450M62630k81623q70337p52923m73964m22607k53664J12798J32543
44266b01697l30799o65866n62341m13253l52193O4473P92702R76990K93287l26875
44256g25572l2383O89169Q78065N56357M31194N99862M64097k19979r50810j169058
44246E20942q61102m38033k68874l05625j18967M81024R24188M90267n12660q84656
44236i73496j23338Q40101R22044K21273m37600o05116k42365O13608J417776
44227A632887J045656p94375k564154k486155q81241K67316q225o66940m95085
$$ plain form
44218 -4950316 -4644989 -3796776 -2905789 -2121795 -1368529 -572965 252436 814568 580275
44209 580275 -551075 -1777294 -2118129 -1548156 -936176 -930614 -1390415 -1845707 -1976325 -1631401
44199 -1631401 -904890 -242252 -4264 61354 400405 782368 553443 -188779 -501317 22357
44189 22357 554513 215746 -685736 -1205043 -1051340 -656202 -312032 30365 262818 96790
44179 96790 -438942 -981495 -1352018 -1691348 -2071011 -2343435 -2411862 -2333311 -2118027 -1683366
44169 -1683366 -1035945 -329897 216303 357483 -33180 -681346 -1021706 -831057 -486756
44160 -486756 -350168 -273460 -82776 -94251 -573247 -1059866 -933576 -365405 50659 350756
44150 350756 982524 1710966 1811215 1369960 1242520 1512620 1255549 319287 22168 1147981
$$ packed form
44218d950316L05327Q48213Q90987P83994P53266P95564Q25401N62132k34293
44209E80275j131350j226219l40835N69973O11980N562m59801m55292j30618L44924
44199a631401P26511O62638K37988O5618L39051L81963k28925p42222l12538N23674
44189B2357N32156l38767r01482n19307J53703L95138L44170L42397K32453j66028
44179I6790n35732n42553l70523l39330l79663k72424o8427P8551K15284M34661
44169a683366O47421P06048N46200J41180l90663o48166l40360J90649L44301
44160d86756J36588P6708J90684j1475m78996m86619J26290N68171M16064L00097
44150C50756O31768P28442J00249m41255j27440K70100k57071r36262k97119J125813
$$ plain form
44140 1147981 2343134 1781159 -250691 -1756702 -1678320 -829740 -256564 68913 616600
44131 616600 1370158 2012797 2380570 2316844 1582264 286815 -959904 -1634501 -1768852
44122 -1768852 -1677445 -1551880 -1492800 -1584045 -1687313 -1440678 -732228 -4226 164738 -259835
44112 -259835 -643659 -275148 876883 1971232 2001889 825439 -654801 -1463401 -1510007
44103 -1510007 -1391437 -1513912 -1732807 -1651722 -932683 477027 2024405 2663984 1803128
44094 1803128 89587 -1141877 -1151925 -240048 832656 1414282 1222556 609159 377726
44085 377726 780343 965128 117133 -1147615 -1451676 -563084 435378 904182 1377504
44076 1377504 2223548 2754136 2303968 1273597 410137 -169123 -546264 -358066 582697
$$ packed form
44140A147981J195153n61975k031850j506011P8382Q48580N73176L25477N47687
44131F16600P53558O42639L67773o3726p34580j295449j246719o74597j34351
44122a768852R1407J25565N9080r1245j03268K46635P08450P28002J68964m24573
44112b59835l83824L68511J152031J094349L0657j176450j480240q08600m6606
44103a510007J18570j22475k18895Q1085P19039J409710J547378O39579q60856
44094A803128j713541j231464j0048R11877J072704N81626j91726o13397k31433
44085C77726M02617J84785q47995j264748l04061Q88592R98462M68804M73322
44076A377504Q46044N30588m50168j030371q63460n79260l77141J88198R40763
$$ plain form
44067 582697 1588677 1855019 1503747 1134073 751685 -37475 -1047167 -1541706 -1180504
44058 -1180504 -345199 386175 644394 336043 -277105 -778007 -1172308 -1876538 -2826377
44049 -2826377 -3213898 -2625608 -1778608 -1443296 -1320583 -867882 -561690 -1155808 -2121904
44040 -2121904 -2168755 -1212671 -562915 -1032171 -1992956 -2523273 -2464370 -2064464 -1489836 -993262
44030 -993262 -789369 -577718 26082 542505 110427 -967339 -1347148 -659534 -172540
44021 -172540 -851782 -1927074 -2190524 -1672444 -1084118 -555131 -60896 -301140 -1785366
44012 -1785366 -3486299 -3772616 -2551267 -1258544 -746494 -435667 200781 548099 -92200
44003 -92200 -1182322 -1486951 -589206 706298 1316884 845004 -260365 -1182725 -1421890
$$ packed form
44067E82697J005980K66342l51272l69674l82388p89160j009692m94539L61202
44058a180504Q35305P31374K58219l08351o13148n00902l94301p04230r49839
44049b826377l87521N88290Q47000L35312J22713M52701L06192n94118r66096
44040b121904m6851R56084O49756m69256r60785n30317N8903L99906N74628M96574
44030i93262K03893K11651O03800N16423m32078j077766l79809O87614M86994
44021a72540o79242j075292k63450N18080N88326N28987M94235k40244j484226
44012a785366j700933k86317J221349J292723N12050L10827O36448L47318o40299
44003i2200j090122l04629Q97745J295504O10586m71880j105369r22360k39165
$$ plain form
43994 -1421890 -1181679 -1039836 -1190920 -1195247 -591337 445287 1280750 1556428 1458854 1207392
43984 1207392 588991 -647664 -2016420 -2425998 -1403483 168847 1045151 1141111 1408415
43975 1408415 2206125 2631525 1854367 416690 -441666 -316084 200074 609388 993720
43966 993720 1429226 1636281 1429241 1041227 792398 780103 1028024 1559892 2120158 2157515
43956 2157515 1378375 138469 -937653 -1586571 -1983803 -2366092 -2808531 -3248302 -3435815
43947 -3435815 -2906346 -1379075 629887 1883580 1503930 -43863 -1377070 -1665506 -1328557
43938 -1328557 -1134978 -1099473 -748478 -141870 105788 -158200 -287690 213077 960592 1297295
43928 1297295 1175525 945746 590307 -200352 -1231946 -1680361 -1023211 202713 892089
$$ packed form
43994a421890K40211J41843j51084m327O03910J036624Q35463K75678r7574k51462
43984A207392o18401j236655j368756m09578J022515J572330Q76304R5960K67304
43975A408415P97710M25400p77158j437677q58356J25582N16158M09314L84332
43966I93720M35506K07055k07040l88014k48829j2295K47921N31868N60266L7357
43956B157515p79140j239906j076122o48918l97232l82289m42439m39771j87513
43947c435815N29469J527271K008962J253693l79650j547793j333207k88436L36949
43938a328557J93579L5505L50995O06608K47658k63988j29490N00767P47515L36703
43928A297295j21770k29779l55439p90659j031594m48415O57150J225924O89376
$$ plain form
43919 892089 573706 -130288 -372838 -196386 -375920 -1113327 -1483445 -677257 648142
43910 648142 1085311 424810 -32266 704140 2065066 2910873 2957944 2604442 2023213 1243954
43900 1243954 699405 821709 1265309 1258922 642174 -65548 -504676 -714577 -580648 228779
43890 228779 1569737 2599327 2559881 1577951 557879 392603 1219017 2299192 2737240
43881 2737240 2388204 1804359 1269429 484698 -522420 -961306 -417130 230962 -66933
43872 -66933 -974309 -1361166 -1098366 -1087793 -1670546 -2284205 -2755098 -3564850 -4478106 -4257366
43862 -4257366 -2468408 -484773 176076 -327729 -892156 -1247899 -1921977 -2884220 -3380912
43853 -3380912 -3056136 -2333931 -1618339 -856093 -45361 440456 315552 -198864 -647139
$$ packed form
43919H92089l18383p03994k42550J76452j79534p37407l70118Q06188J325399
43910F48142M37169o60501m57076P36406J360926Q45807M7071l53502n81229p79259
43900A243954n44549J22304M43600o387o16748p07722m39128k09901J33929Q09427
43890B28779J340958J029590l9446r81930j020072j65276Q26414J080175M38048
43881B737240l49036n83845n34930p84731j007118m38886N44176O48092k97895
43872f6933r07376l86857K62800J0573n82753o13659m70893q09752r13256K20740
43862d257366J788958J983635O60849n03805n64427l55743o74078r62243m96692
43853c380912L24776P22205P15592P62246Q10732M85817j24904n14416m48275
$$ plain form
43844 -647139 -824379 -846524 -867964 -847820 -604072 -96163 433410 747992 977786 1455692
43834 1455692 2239878 3082083 3787241 4208746 3979933 2837424 1267618 183766 -215754
43825 -215754 -589795 -1205225 -1341054 -452980 779255 1279148 948292 513294 423357 624748
43815 624748 1061053 1604498 1748439 1163507 372407 79427 5760 -702807 -1958353 -2623614
43805 -2623614 -2133632 -1307050 -1126961 -1470181 -1588035 -1281440 -988237 -1039477 -1392596 -1950688
43795 -1950688 -2685480 -3446750 -3928938 -3872672 -3244605 -2314887 -1562949 -1285766 -1232529 -854326
43785 -854326 18738 1001145 1695741 2059043 2085506 1545850 394765 -822401 -1398930
43776 -1398930 -1241048 -871951 -662123 -389877 286929 1158588 1554797 1136700 383573
$$ packed form
43844f47139j77240k2145k1440K0144K43748N07909N29573L14582K29794M77906
43834A455692P84186Q42205P05158M21505k28813j142509j569806j083852l99520
43825b15754l74041o15430j35829Q88074J232235M99893l30856m34998q9937K01391
43815F24748M36305N43445J43941n84932p91100k92980p3667p08567j255546o65261
43805b623614M89982Q26582J80089l43220j17854L06595K93203n1240l53119n58092
43795a950688p34792p61270m82188N6266O28067R29718P51938K77183N3237L78203
43785h54326Q73064R82407O94596L63302K6463n39656j151085j217166n76529
43776a398930J57882L69097K09828K72246O76806Q71659L96209m18097p53127
$$ plain form
43767 383573 89401 435640 832641 767652 504745 649474 1224609 1628586 1517782 1265557
43757 1265557 1329716 1527288 1309336 587804 -123310 -426891 -552749 -947311 -1569048 -1896714
43747 -1896714 -1598536 -879837 -78404 749202 1566640 1960512 1469662 255506 -997300
43738 -997300 -1860792 -2386487 -2537245 -2051924 -1147806 -699694 -1180434 -1898428 -1903794 -1284088
43728 -1284088 -885377 -1051385 -1436404 -1899917 -2665071 -3486274 -3527549 -2409317 -745886
43719 -745886 655302 1535893 1856661 1442451 486167 -151332 194989 1134301 1772543
43710 1772543 1850178 1777143 1789578 1732951 1598111 1607133 1670361 1337080 511445 -239503 -399490
43699 -399490 -210774 -331686 -959489 -1621125 -1799202 -1495576 -1108658 -942208 -971378 -994633
$$ packed form
43767C83573k94172L46239L97001o4989k62907J44729N75135M03977j10804k52225
43757A265557O4159J97572k17952p21532p11114l03581j25858l94562o21737l27666
43747a896714K98178P18699Q01433Q27606Q17438L93872m90850j214156j252806
43738i97300q63492n25695j50758M85321R04118M48112m80740p17994n366O19706
43728a284088L98711j66008l85019m63513p65154q21203m1275J118232J663431
43719g45886J401188Q80591L20768m14210r56284o37499L46321R39312O38242
43710A772543P7635p3035J2435n6627j34840R022O3228l33281q25635p50948j59987
43699c99490J88716j20912o27803o61636j78077L03626L86918J66450k9170k3255
$$ plain form
43689 -994633 -832020 -373763 338043 917026 714673 -557657 -2260722 -3208799 -2807006
43680 -2807006 -1617759 -632624 -193322 113986 668393 1308446 1653058 1594549 1275621
43671 1275621 754577 -47869 -1045832 -1804960 -1824650 -1057744 -101424 229517 -398700 -1529885
43661 -1529885 -2286571 -2056831 -913864 497849 1448883 1615579 1233762 811239 658531
43652 658531 669748 530439 95916 -457530 -833243 -913678 -813812 -664074 -479068 -336779
43642 -336779 -518059 -1167031 -1830340 -1735969 -752303 242815 303846 -446282 -1000463 -696756
43632 -696756 147281 834688 1086321 1070430 978468 852635 699525 572733 565212 747413
43622 747413 1018107 1061630 668813 95053 -180330 -103155 -128574 -525958 -960578 -1043002
$$ packed form
43689i94633J62613M58257P11806N78983k02353j272330j703065r48077M01793
43680b807006J189247R85135M39302L07308N54407O40053L44612n8509l18928
43671A275621n21044q02446r97963p59128j9690P66906R56320L30941o28217j131185
43661a529885p56686K29740J142967J411713R51034J66696l81817m22523j52708
43652F58531J1217j39309m34523n53446l75713q0435R9866J49738J85006J42289
43642c36779j81280o48972o63309R4371R83666R95118O1031p50128n54181L03707
43632f96756Q44037O87407K51633j5891r1962j25833j53110j26792p521J82201
43622G47413K70694M3523l92817n73760k75383P7175k5419l97384m34620q2424
$$ plain form
43612 -1043002 -976696 -1214839 -1614753 -1469961 -538139 366758 175187 -1154285 -2487219
43603 -2487219 -2731481 -1953547 -1074568 -642917 -319849 339169 1030590 1016672 94082 -1198702
43593 -1198702 -2328941 -3287595 -4204499 -4807456 -4607456 -3545142 -2200766 -1276700 -937421
43584 -937421 -748457 -314758 121152 -61321 -996003 -2058406 -2632515 -2796800 -2941242
43575 -2941242 -3075353 -3001471 -2846640 -2743889 -2180903 -518504 1769733 3220830 3039118
43566 3039118 1926244 952804 363497 -41270 -145732 73431 -65245 -1236275 -3002790
43557 -3002790 -4190918 -4242332 -3541101 -2583926 -1598582 -917038 -879233 -1198320 -1138059 -557395
43547 -557395 -134352 -280881 -498120 -234955 202391 177295 -274923 -641388 -858332 -1282238
$$ packed form
43612a043002O6306k38143l99914J44792R31822R04897j91571j329472j332934
43603b487219k44262P77934Q78979M31651L23068O59018O91421j3918r22590j292784
43593a198702j130239r58654r16904o02957K00000J062314J344376R24066L39279
43584i37421J88964M33699M35910j82473r34682j062403n74109j64285j44442
43575b941242j34111P3882J54831J02751N62986J662399K288237J451097j81712
43566C039118j112874r73440n89307m04767j04462K19163j38676j171030j766515
43557c002790j188128n1414P01231R57175R85344O81544L7805l19087O0261N80664
43547e57395M23043j46529k17239K63165M37346k5096m52218l66465k16944m23906
$$ plain form
43537 -1282238 -1769606 -1586768 -543413 415630 291204 -659637 -1303696 -1160586 -867151
43528 -867151 -1030032 -1327964 -1172243 -706974 -505055 -575750 -424180 -39154 -57072 -756180
43518 -756180 -1546849 -1783825 -1532685 -1142323 -572338 322891 1214856 1618491 1622251 1757055
43508 1757055 2193968 2541187 2457288 2090552 1847763 1966336 2313000 2440623 1955429 1007766
43498 1007766 235289 8026 -12991 -282245 -648766 -635982 -151659 587219 1579948 2855572
43488 2855572 3895811 3952103 2991138 1715538 592424 -490998 -1516615 -2064699 -2097511
43479 -2097511 -2314613 -3190697 -4172778 -4433615 -4044483 -3734808 -3715567 -3486247 -2838043 -2336827
43469 -2336827 -2481352 -2859813 -2621475 -1595507 -471160 155816 476196 955710 1448843
$$ packed form
43537a282238m87368J82838J043355R59043j24426r50841o44059J43110K93435
43528h67151j62881k97932J55721M65269K01919p0695J51570L85026j7918o99108
43518g56180p90669k36976K51140L90362N69985Q95229Q91965M03635L760J34804
43508A757055M36913L47219q3899l66736k42789J18573L46664J27623m85194r47663
43498A007766p72477k27263k1017k69254l66521J2784M84323P38878R92729J275624
43488B855572J040239N6292r60965j275600j123114j083422j025617n48084l2812
43479b097511k17102q76084r82081k60837L89132L09675J9241K29320O48204N01216
43469b336827j44525l78461K38338J025968J124347O26976L20380M79514M93133
$$ plain form
43460 1448843 1306193 365588 -622406 -792550 -97483 816619 1413512 1598047 1408192
43451 1408192 818390 -70412 -913369 -1320726 -1114527 -446393 244152 525188 391158
43442 391158 261802 417691 625907 502679 -11988 -786914 -1772200 -2738166 -3058983 -2348816
43432 -2348816 -1198044 -693248 -1180502 -1968032 -2236628 -1769538 -826440 125153 483351
43423 483351 -97480 -1183062 -1867906 -1776216 -1371684 -1193005 -1250808 -1304138 -1230111 -916182
43413 -916182 -246797 571643 1081324 1168892 1175454 1229743 962416 179955 -625849 -838115
43403 -838115 -498448 -197208 -385054 -1029305 -1757114 -2157755 -2109725 -1891196 -1805410 -1781331
43393 -1781331 -1626337 -1463731 -1417114 -1080955 -51589 1114675 1395209 835596 577786
$$ packed form
43460A448843j42650r40605r87994j70144O95067R14102N96893J84535j89855
43451A408192n89802q88802q42957m07357K06199O68134O90545K81036j34030
43442C91158j29356J55889K08216j23228n14667p74926r85286r65966l20817P10167
43432b348816J150772N04796m87254p87530k68596M67090R43098R51593L58198
43423D83351n80831j085582o84844R1690M04532J78679n7803n3330P4027L13929
43413i16182O69385Q18440N09681Q7568O562N4289k67327p82461q05804k12266
43403h38115L39667L01240j87846o44251p27809m00641M8030K18529Q5786K4079
43393a781331J54994J62606M6617L36159J029366J166264K80534n59613k57810
$$ plain form
43384 577786 1088234 1437443 844884 -117598 -571179 -590349 -544322 -104568 972548 1776789
43374 1776789 1215200 -340419 -1533312 -1851287 -1832421 -1678996 -941687 341530 1345003
43365 1345003 1581435 1449949 1418167 1440277 1418734 1518746 1756187 1857465 1713142 1458324
43355 1458324 1065204 443601 -72172 -33735 313643 301172 -28661 94295 880125 1545807
43345 1545807 1468944 955009 491063 48488 -391445 -382979 277059 951377 897157 193833
43335 193833 -569954 -1121855 -1511094 -1673029 -1520235 -1192203 -777769 -75238 969131
43326 969131 1893311 2207466 1980347 1592279 1249761 1116903 1486669 2270165 2671430 2037152
43316 2037152 854138 257370 601219 1114866 1001779 302273 -492317 -1160522 -1734634
$$ packed form
43384E77786N10448L49209n92559r62482m53581j9170M6027M39754J077116Q04241
43374A776789n61589j555619j192893l17975J8866J53425P37309J283217J003473
43365A345003K36432j31486l1782K2110k1543J00012K37441J01278j44323k54818
43355A458324l93120o21603n15773L8437L47378j2471l29833J22956P85830O65682
43345A545807p6863n13935m63946m42575m39933Q466O60038O74318n4220p03324
43335A93833p63787n51901l89239j61935J52794L28032M14434P02531J044369
43326I69131R24180L14155k27119l88068l42518j32858L69766P83496M01265o34278
43316B037152j183014n96768L43849N13647j13087o99506p94590o68205n74112
$$ plain form
43307 -1734634 -2057963 -1802420 -997692 -289738 -399475 -1273314 -2004674 -1817774 -963153
43298 -963153 -329753 -326591 -616469 -894856 -1307449 -1917708 -2346452 -2287499 -1948731 -1658674
43288 -1658674 -1446188 -1316724 -1462467 -1778169 -1636585 -690927 461818 1000585 975143
43279 975143 1068439 1484082 1751365 1581021 1257162 1056831 791111 147003 -780389 -1438426
43269 -1438426 -1239581 -173498 894915 903057 -100188 -717073 186313 1940371 2821710
43260 2821710 2141490 795744 -198544 -760978 -1083028 -852952 143509 1175864 1149331
43251 1149331 -17876 -1174078 -1222180 -299066 477009 235096 -854646 -1939491 -2392536
43242 -2392536 -2204546 -1636361 -878370 -176583 95602 -144496 -404071 -133828 564201
$$ packed form
43307a734634l23329K55543Q04728P07954j09737q73839p31360J86900Q54621
43298i63153O33400L162k89878k78387m12593o10259m28744N8953L38768K90057
43288a658674K12486J29464j45743l15702J41584R45658J152745N38767k5442
43279I75143R3296M15643K67283j70344l23859k00331k65720o44108r27392o58037
43269a438426J98845J066083J068413Q142j003245o16885R03386J754058Q81339
43260B821710o80220j345746r94288n62434l22050K30076R96461J032355k6533
43251A149331j167207j156202m8102R23114P76075k41913j089742j084845m53045
43242b392536J87990N68185P57991P01787K72185k40098k59575K70243O98029
$$ plain form
43233 564201 1091393 1131378 919217 792789 853640 1063510 1295710 1238629 601335 -461905
43223 -461905 -1366781 -1620536 -1192591 -435035 164037 269535 6752 -145733 -22450 -77626
43213 -77626 -634897 -1139132 -788522 234713 874313 548864 -282769 -946752 -1223473 -1079458
43203 -1079458 -524360 -12290 -233885 -1123281 -1751225 -1615055 -1332841 -1546772 -1844887
43194 -1844887 -1454494 -426355 619370 1440563 2065910 2153252 1366480 192175 -470853
43185 -470853 -447041 -261413 -123639 222172 680402 753327 458886 460638 1014956 1535102
43175 1535102 1538403 1353891 1484531 1840041 2035563 1974149 1716592 1203411 518463 37383
43165 37383 -86176 -202932 -552167 -801982 -692283 -707565 -1457450 -2650734 -3370728 -3260380
$$ packed form
43233E64201N27192L9985k12161j26428O0851K09870K32200n7081o37294j063240
43223d61905r04876k53755M27945P57556N99072J05498k62783j52485J23283n5176
43213g7626n57271n04235L50610J023235O39600l25449q31633o63983k76721J44015
43203a079458N55098N12070k21595q89396o27944J36170K82214k13931k98115
43194a844887L90393J028139J045725Q21193O25347Q7342p86772j174305o63028
43185d70853K3812J85628J37774L45811M58230P2925k94441J752N54318N20146
43175A535102L301j84512J30640L55510J95522o1414k57557n13181o84948m81080
43165C7383j23559j16756l49235k49815J09699j5282p49885j193284p19994J10348
$$ plain form
43155 -3260380 -2800659 -2475039 -2322481 -2351567 -2681813 -3037754 -2738511 -1594492 -357831
43146 -357831 149476 -4138 -226651 -403858 -920186 -1793760 -2458780 -2568593 -2456785 -2474269
43136 -2474269 -2327226 -1592485 -631048 -329402 -874507 -1381119 -1009114 36181 1025392
43127 1025392 1786272 2601791 3229321 2868514 1354038 -288506 -962334 -767748 -646087
43118 -646087 -1054731 -1604443 -1909756 -2126199 -2441084 -2558288 -2105198 -1299518 -767646 -709703
43108 -709703 -612092 32395 947495 1333123 891233 248849 150913 515198 688322 479290
43098 479290 356901 534638 504597 -119339 -792437 -656100 300893 1279329 1731739 1821673
43088 1821673 1858384 1808063 1434687 539458 -895409 -2390367 -2967585 -2100184 -599927
$$ packed form
43155c260380M59721L25620J52558k9086l30246l55941K99243J144019J236661
43146c57831N07307j53614k22513j77207n16328q73574o65020j09813J11808j7484
43136b474269J47043P34741R61437L01646n45105n06612L72005J045295R89211
43127A025392P60880Q15519O27530l60807j514476j642544o73828J94586J21661
43118f46087m08644n49712l05313k16443l14885j17204M53090Q05680N31872N7943
43108g09703R7611O44487R15100L85628m41890o42384r7936L64285J73124k09032
43098D79290j22389J77737l0041o23936o73098J36337R56993R78436M52410Q9934
43088A821673L6711n0321l73376q95229j434867j494958n77218Q67401J500257
$$ plain form
43079 -599927 170809 -7251 -141164 256411 478228 124000 146959 1425496 3102783
43070 3102783 3557572 2598647 1477138 908549 352286 -609261 -1371559 -1258585 -492090
43061 -492090 315797 966271 1468905 1619436 1337593 1006441 974621 1050908 914419 681689
43051 681689 622508 623837 404757 22266 -271449 -434252 -453190 -28610 987934 1982119
43041 1982119 2029683 1024577 -138488 -607134 -366456 106101 494676 674204 455009
43032 455009 -264660 -1153452 -1573263 -1165215 -225509 556426 715274 346450 -144840 -506700
43022 -506700 -711510 -659445 -166827 580682 888916 260752 -877444 -1560953 -1410235 -986114
43012 -986114 -930099 -1154704 -1150586 -781946 -373057 -142731 785 65585 -176479 -707372
$$ packed form
43079e99927P70736j78060j33913L97575K21817l54228K2959J278537J677287
43070C102783M54789r58925j121509n68589n56263r61547p62298J12974P66495
43061d92090Q07887O50474N02634J50531k81843l31152l1820P6287j36489k32730
43051F81689n9181J329k19080l82491k93715j62803j8938M24580J016544R94185
43041A982119M7564j005106j163065m68646K40678M72557L88575J79528k19195
43032D55009p19669q88792m19811M08048R39706P81935J58848l68824m91290l61860
43022e06700k04810N2065M92618P47509L08234o28164j138196o83509J50718M24121
43012i86114N6015k24605M118L68640M08889K30326J43516O4800k42064n30893
$$ plain form
43002 -707372 -978487 -533010 228279 372938 -431304 -1547345 -2255302 -2515671 -2553268 -2218860
42992 -2218860 -1393469 -703895 -990948 -2019651 -2517778 -1807704 -735961 -510664 -1153565
42983 -1153565 -1732391 -1774783 -1692212 -1849345 -1941058 -1566778 -944950 -642525 -775088 -858895
42973 -858895 -512820 -37435 -51808 -621129 -1080939 -904922 -429618 -297221 -364447 204967
42963 204967 1655365 3078496 3509781 3128052 2893513 3287026 3887745 4032123 3459084
42954 3459084 2399720 1390383 905867 860789 599210 -294266 -1321988 -1596276 -934268
42945 -934268 -22124 475922 555717 564188 629572 591261 313794 -113251 -510373 -902645
42935 -902645 -1528858 -2382662 -2934640 -2743787 -2238116 -2224702 -2570267 -2250103 -1053316 -239147
$$ packed form
43002g07372k71115M45477P61289J44659q04242j116041p07957k60369l7597L34408
42992b218860Q25391O89574k87053j028703m98127P10074J071743K25297o42901
42983a153565n78826m2392Q2571j57133r1713L74280O21828L02425j32563q3807
42973h58895L46075M75385j4373n69321m59810J76017M75304J32397o7226N69414
42963B04967J450398J423131M31285l81729k34539L93513O00719J44378n73039
42954C459084j059364j009337m84516m5078k61579q93476j027722k74288O62008
42945i34268R12144M98046P9795Q471O5384l8311k77467m27045l97122l92272
42935i02645o26213q53804n51978J90853N05671J3414l45565L20164J196787Q14169
$$ plain form
42925 -239147 -756785 -1719863 -1705208 -831950 -235016 6549 816785 2111473 2535549 1608720
42915 1608720 656805 911938 1889895 2472027 2574846 2766869 2971270 2596829 1595799
42906 1595799 559795 -47532 -203844 -124907 -153153 -500911 -776856 -259960 1003055
42897 1003055 1994797 2074940 1829862 1973884 2149037 1668250 838840 535956 856738 1213734
42887 1213734 1485252 2014718 2603680 2602663 2078519 1859314 2172820 2180173 1283425 123364
42877 123364 -277817 159729 675144 788473 773979 1033820 1377208 1166078 212036 -662311
42867 -662311 -331733 1263981 2882141 3376297 2909430 2407673 2315147 2487312 2863497
42858 2863497 3420710 3705629 3288479 2599748 2460923 2792814 2687905 1876905 1192025
$$ packed form
42925b39147n17638r63078J4655Q73258N96934K41565Q10236J294688M24076r26829
42915A608720r51915K55133R77957N82132J02819J92023K04401l74441j001030
42906A595799j036004o07327j56312P8937k8246l47758k75945N16896J263015
42897A003055R91742Q0143k45078J44022J75153m80787q29410l02884L20782L56996
42887A213734K71518N29466N88962j017n24144k19205L13506P353q96748j160061
42877A23364m01181M37546N15415J13329j4494K59841L43388k11130r54042q74347
42867f62311L30578J595714J618160M94156m66867n01757r2526J72165L76185
42858B863497N57213K84919m17150o88731j38825L31891j04909q11000o84880
$$ plain form
42849 1192025 1274053 1673064 1669180 1257652 816764 414990 752 -190105 69306 663849
42839 663849 1498200 2747599 4287961 5314626 5111259 3943822 2706617 1926309 1567154
42830 1567154 1518920 1685006 1744893 1440601 1105979 1385810 2328360 3192587 3333892 2958870
42820 2958870 2777215 3106579 3589125 3775458 3749095 3954124 4429553 4535459 3714456 2343499
42810 2343499 1424976 1452001 1974226 2297775 2137503 1475946 356272 -850296 -1460068
42801 -1460068 -1236885 -816053 -899935 -1294964 -1266687 -668287 -128238 -122250 -394385 -433682
42791 -433682 -118423 285054 455655 183806 -527502 -1325398 -1660071 -1295268 -584226 -72889
42781 -72889 120044 371959 1008193 1840552 2355406 2289587 1865546 1434909 1071668 661560
$$ packed form
42849A192025Q2028L99011l884m11528m40888m01774m14238j90857K59411N94543
42839F63849Q34351J249399J540362J026665k03367j167437j237205p80308l59155
42830A567154m8234J66086N9887l04292l34622K79831R42550Q64227J41305l75022
42820B958870j81655L29364M82546J86333k6363K05029M75429J05906q21003j370957
42810B343499r18523K7025N22225L23549j60272o61557j119674j206568o09772
42801a460068K23183M20832q3882l95029K8277N98400N40049N988k72135l9297
42791d33682L15259M03477J70601k71849p11308p97896l34673L64803P11042N11337
42781g2889J92933K51915O36234Q32359N14854o5819m24041m30637l63241m10108
$$ plain form
42771 661560 250127 50406 123514 274882 278059 -5502 -689389 -1694834 -2433723 -2084778
42761 -2084778 -541880 1140405 1675172 906040 -85350 -261987 346645 1089559 1772635
42752 1772635 2735805 3862762 4180834 2968389 933110 -405187 -483297 -153939 -258548
42743 -258548 -557697 -494431 -191672 53339 560527 1534720 2065100 1149011 -462142 -849701
42733 -849701 432316 1645613 1278961 -69383 -929715 -951223 -699518 -371155 177960
42724 177960 716351 985390 1291392 1799754 1775143 624851 -768179 -1021899 -252008
42715 -252008 317104 610524 1924655 4537066 6695925 6861772 5729651 4947463 4762841
42706 4762841 4224447 3163317 2549574 2858331 3270818 2908801 2067561 1681323 2003079
$$ packed form
42771F61560m11433j99721P3108J51368L177k83561o83887j005445p38889L48945
42761b084778J542898J682285N34767p69132r91390j76637O08632P42914O83076
42752A772635R63170J126957L18072j212445k035279j338297p8110L29358j04609
42743b58548k99149O3266L02759K45011N07188R74193N30380r16089j611153l87559
42733h49701J282017J213297l66652j348344q60332k1508K51705L28363N49115
42724A77960N38391K69039L06002N08362k4611j150292j393030k53720P69891
42715b52008N69112K93420J314131K612411K158859J65847j132121p82188j84622
42706D762841n38394j061130o13743L08757M12487l62017q41240l86238L21756
$$ plain form
42697 2003079 2346464 2010457 1084195 288383 190633 647317 1008279 883475 659559 1121991
42687 1121991 2526083 4204352 5238208 5386101 5096717 4690002 3981538 2907382 2028131
42678 2028131 1872763 2058422 1774087 1093814 994777 1846572 2709922 2644645 1995373 1661254
42668 1661254 1683439 1500876 1252098 1711774 2901107 3784661 3677629 3169625 3224473 3960240
42658 3960240 4775625 5226401 5300297 5129909 4887832 4820010 5033912 5304931 5304274 4982463
42648 4982463 4623146 4568124 4908036 5363730 5511661 5210460 4674638 4043134 3211119 2361732
42638 2361732 2208690 3101363 4181254 4199772 3099556 2034872 1841731 2296365 2933468
42629 2933468 3643187 4176836 4009500 3209076 2654424 2812149 3003980 2531799 1872571
$$ packed form
42697B003079L43385l36007r26262p95812r7750M56684L60962j24804k23916M62432
42687A121991J404092J678269J033856J47893k89384m06715p08464j074156q79251
42678B028131j55368J85659k84335o80273r9037Q51795Q63350o5277o49272l34119
42668A661254K2185j82563k48778M59676J189333Q83554j07032n08004N4848P35767
42658C960240Q15385M50776P3896j70388k42077o7822K13902K71019o57l21811
42648D982463l59317n5022L39912M55694J47931l01201n35822o31504q32015q49387
42638B361732j53042Q92673J079891J8518j100216j064684j93141M54634O37103
42629B933468P09719N33649j67336q00424n54652J57725J91831m72181o59228
$$ plain form
42620 1872571 1979984 2888134 3813668 4323525 4652592 5067052 5556551 6001203 6144477
42611 6144477 5661861 4743009 4237828 4655527 5429801 5839125 6187157 7190434 8559468
42602 8559468 9251777 9019077 8648444 8627046 8616263 8449966 8624120 9374340 10119988 10329528
42592 10329528 10270893 10447391 10904182 11541356 12506049 13761961 14820829 15471065 16305347
42583 16305347 17915974 19943067 21566815 22700045 24075386 26289067 29316042 32887537
42575 32887537 36814988 40948988 45329160 50512411 57409560 66640995 78219783 91889088
42567 91889088 107594490 125646770 146616218 170994192 198526164 227427866 254067752
42560 254067752 273631316 281798340 276696107 259797587 234992655 206687107 178512681
$$ packed form
42620A872571J07413R08150R25534N09857L29067M14460M89499M44652J43274
42611F144477m82616r18852n05181M17699P74274M09324L48032J003277J369034
42602H559468O92309k32700l70633k1398j0783j66297J74154P50220P45648K09540
42592A0329528n8635J76498M56791O37174R64693J255912J058868O50236Q34282
42583A6305347J610627K027093J623748J133230J375341K213681L026975L571495
42575C2887537L927451M134000M380172N183251O897149R231435J1578788J3669305
42567I1889088J5705402J8052280K0969448K4377974K7531972K8901702K6639886
42560B54067752J9563564Q167024n102233j6898520k4804932k8305548k8174426
$$ plain form
42553 178512681 152995394 131343803 113281732 97793082 84466595 73709142 65501992
42546 65501992 58754053 52440713 46723500 42241289 38854354 35904843 33226405 30927765
42538 30927765 28568818 25711716 23101061 21970796 22020382 21377539 19023901 16099401
42530 16099401 14190659 13420736 13038857 12863193 13009794 12938722 12071368 10983196 10734031
42521 10734031 11150629 10954769 9630908 8045768 7038162 6482166 6088147 6072126 6446740
42512 6446740 6552592 6073991 5867007 6920718 8894965 10533868 11359098 12197451 14023579
42503 14023579 16872847 19949505 22295851 23237036 22603152 20777559 18408015 16004130
42495 16004130 13842212 12064776 10652111 9465614 8571356 8316434 8764587 9288160 9169421
$$ packed form
42553A78512681k5517287k1651591j8062071j5488650j3326487j0757453q207150
42546F5501992o747939o313340n717213m482211l386935k949511k678438k298640
42538C0927765k358947k857102k610655j130265M9586o42843k353638k924500
42530A6099401j908742p69923l81879j75664J46601p1072q67354j088172k49165
42521A0734031M16598j95860j323861j585140j007606n55996l94019j6021L74614
42512F446740J05852m78601k06984J053711J974247J638903Q25230Q38353J826128
42503A4023579K849268L076658K346346R41185o33884j825593k369544k403885
42495A6004130k161918j777436j412665j186497q94258k54922M48153N23573j18739
$$ plain form
42486 9169421 8449034 7677076 6966101 5957780 4762947 4178821 4632500 5488895 5850512
42477 5850512 5600327 5170331 4677458 3952122 3270730 3358234 4481399 5974945 6882143
42468 6882143 6800909 5974293 4862537 3867800 3256791 3030368 2908019 2676362 2545518
42459 2545518 2931321 3836704 4686007 4925117 4611360 4209750 3957348 3725436 3443280
42450 3443280 3287325 3372917 3585887 3826089 4057128 3972435 3109367 1667177 732545 1068974
42440 1068974 1979681 2121715 1344749 898281 1684090 3103765 3993319 4025957 3697182
42431 3697182 3443264 3340314 3327783 3195647 2593313 1512574 528539 129637 76740 -94398
42421 -94398 -220628 239345 1291010 2387673 3245388 4011233 4614643 4663390 4177393 3804098
$$ packed form
42486I169421p20387p71958p10975j008321j194833n84126M53679Q56395L61617
42477E850512k50185m29996m92873p25336o81392Q7504J123165J493546R07198
42468F882143q1234q26616j111756r94737o11009k26423j22349k31657j30844
42459B545518L85803R05383Q49303K39110l13757m01610k52402k31912k82156
42450C443280j55955Q5592K12970K40202K31039q4693q63068j442190r34632L36429
42440A068974R10707J42034p76966m46468P85809J419675Q89554L2638l28775
42431C697182k53918j02950j2531j32136o02334j080739r84035l98902n2897j71138
42421i4398j26230M59973J051665J096663Q57715P65845O03410M8747m85997l73295
$$ plain form
42411 3804098 3994810 4441644 4642296 4629501 4841007 5607717 7050822 9164777 11721249
42402 11721249 14387559 17212449 20718791 25298626 30868530 37313298 44630361 52002105
42394 52002105 57187166 57834347 53615615 46546494 39115584 32582493 27097503 22651696
42386 22651696 19299473 16785391 14577644 12371729 10348063 8925699 8350761 8423261
42378 8423261 8537283 8149394 7331153 6677918 6519927 6449711 5886403 4914783 4191397 4061772
42368 4061772 4139608 3849368 3094738 2228745 1557911 1082731 684111 417240 512844 999804
42358 999804 1369770 914225 -363538 -1412042 -1154866 191870 1307208 1360801 910690
42349 910690 961747 1639151 2273558 2454858 2382322 2257685 1923441 1251061 485343 -13169
$$ packed form
42411C804098J90712M46834K00652j2795K11506P66710J443105K113955K556472
42402A1721249K666310K824890L506342M579835N569904O444768P317063P371744
42394E2002105N185061O47181m218732p069121p430910o533091n484990m445807
42386B2651696l352223k514082k207747k205915k023666j422364n74938P2500
42378H423261J14022l87889q18241o53235j57991p0216n63308r71620p23386j29625
42368D061772P7836k90240p54630q65993o70834m75180l98620k66871R5604M86960
42358I99804L69966m55545j277763j048504K57176J346736J115338N3593m50111
42349I10690N1057O77404O34407J81300p2536j24637l34244o72380p65718m98512
$$ plain form
42339 -13169 -162633 -162933 -232919 -398933 -449535 -126408 540396 1183726 1502216 1528745 1326904
42328 1326904 734710 -198832 -799730 -407969 603736 1058125 356267 -860857 -1579759
42319 -1579759 -1465725 -867292 -258866 32103 -79413 -314188 -253586 157796 623145 1044894
42309 1044894 1600181 2187136 2410434 2329173 2520846 3029655 3004337 1991558 909120
42300 909120 910137 1774888 2345073 2207760 1931392 1768814 1210194 20825 -1172195 -1690204
42290 -1690204 -1564352 -1183118 -729239 -268616 71877 319131 682571 1141450 1333420
42281 1333420 1018735 336760 -476514 -1226449 -1542884 -1017809 254681 1688042 2871265
42272 2871265 3746652 4022524 3098453 972706 -1328416 -2730679 -3133247 -3011754 -2456686
$$ packed form
42339a3169j49464l00o9986j66014n0602L23127O66804O43330L18490K6529k01841
42328A326904n92194r33542o00898L91761J011705M54389p01858j217124p18902
42319a579759J14034N98433O08426K90969j11516k34775O0602M11382M65349M21749
42309A044894N55287N86955K23298q1261J91673N08809k5318j012779j082438
42300I09120J017Q64751N70185j37313k76368j62578n58620j189369j193020n18009
42290a690204J25852L81234M53879M60623L40493K47254L63440M58879J91970
42281A333420l14685o81975q13274p49935l16435N25075J272490J433361J183223
42272B871265Q75387K75872r24071k125747k301122j402263m02568J21493N55068
$$ plain form
42263 -2456686 -1262502 260429 1281468 1359995 924157 724791 1072359 1647659 1845022
42254 1845022 1286847 173213 -874318 -1407494 -1506164 -1472421 -1383738 -1139943 -768721 -436832
42244 -436832 -263201 -297485 -516904 -646410 -226118 792000 1668632 1521035 349363
42235 349363 -913699 -1399072 -1044460 -361617 113593 9084 -792502 -1880643 -2397245
42226 -2397245 -1840990 -738267 -127618 -372864 -900204 -1187321 -1467278 -2076829 -2574143
42217 -2574143 -2183082 -970989 118855 484662 460246 506008 495353 206252 -72533 35293
42207 35293 417898 863783 1580855 2693620 3615743 3655612 2957425 2104464 1108523 -303670
42197 -303670 -1638777 -1981044 -1437196 -1157773 -1669213 -2177504 -1890000 -1091511 -433167
$$ packed form
42263b456686J194184J522931J021039P8527m35838j99366L47568N75300J97363
42254A845022n58175j113634j047531n33176r8670L3743Q8683K43795L71222L31889
42244d36832J73631l4284k19419j29506M20292J018118Q76632j47597j171672
42235C49363j263062m85373L54612O82843M75210j04509q01586j088141n16602
42226b397245N56255J102723O10649k45246n27340k87117k79957o09551m97314
42217b574143L91061J212093J089844L65807k4416M5762j0655k89101k78785J07826
42207C5293L82605M45885P17072J112765R22123L9869o98187q52961r95941j412193
42197c03670j335107l42267N43848K79423n11440n08291K87504P98489O58344
$$ plain form
42188 -433167 -6641 314654 365757 126690 35614 306365 529721 456571 505887 936979
42178 936979 1250543 1096121 1027472 1493578 1754629 863720 -724839 -1641385 -1455998 -978305
42168 -978305 -801182 -609032 -70437 490467 614015 292272 -160635 -378794 -63245 713302
42158 713302 1385703 1540189 1481571 1583741 1378083 170623 -1530258 -2233704 -1375037
42149 -1375037 -148683 -16435 -1033319 -2095191 -2326643 -1747393 -925784 -452722 -616324
42140 -616324 -1246980 -1850462 -1974562 -1464957 -525846 304320 461988 -27679 -400450 43056
42130 43056 1126471 2088811 2430172 2107171 1264684 330484 20211 521205 913627 199720
42120 199720 -1243369 -2066380 -1688494 -726201 262873 1384300 2531043 2951206 2225177
$$ packed form
42188d33167M26526L21295N1103k39067r1076K70751K23356p3150M9316M31092
42178I36979L13564j54422o8649M66106K61051q90909j588559r16546J85387M77693
42168i78305J77123J92150N38595N60904J23548l21743m52907k18159L15549P76547
42158G13302O72401J54486n8618J02170k05658j207460j700881p03446Q58667
42149a375037J226354J32248j016884j061872k31452N79250Q21609M73062j63602
42140f16324o30656o03482j24100N09605R39111Q30166J57668m89667l72771M43506
42130D3056J083415R62340L41361l23001q42487r34200l10273N00994L92422p13907
42120A99720j443089q23011L77886R62293R89074J121427J146743M20163p26029
$$ plain form
42111 2225177 972227 113055 -53296 247817 713912 1039730 1069312 1056779 1245506 1168917
42101 1168917 116925 -1628167 -2893469 -3114468 -2813519 -2424020 -1756673 -964950 -780355
42092 -780355 -1174857 -1022498 96525 967258 639653 84408 633829 1762383 1991482
42083 1991482 1304460 958204 1300701 1559653 1691562 2566793 3964310 4131453 2167396
42074 2167396 -453646 -1678863 -1244215 -334209 323801 942729 1657265 2068530 1859649
42065 1859649 1219516 528048 -25383 -472955 -959100 -1582187 -2178568 -2351322 -1898434
42056 -1898434 -1150484 -711338 -861835 -1307176 -1522649 -1324080 -1066487 -1203877 -1675661
42047 -1675661 -1951906 -1787668 -1631210 -1984591 -2579286 -2601865 -1673070 -218238 1128390
$$ packed form
42111B225177j252950q59172j66351L01113M66095L25818K9582j2533J88727p6589
42101A168917j051992j745092j265302k20999L00949L89499O67347P91723J84595
42092g80355l94502J52359J119023Q70733l27605n55245N49421J128554K29099
42083A991482o87022l46256L42497K58952J31909Q75231J397517J67143j964057
42074B167396k621042j225217M34648R10006O58010O18928P14536M11265k08881
42065A859649o40133o91468n53431m47572m86145o23087n96381j72754M52888
42056a898434P47950M39146j50497m45341k15473J98569K57593j37390m71784
42047a675661k76245J64238J56458l53381n94695k2579R28795J454832J346628
$$ plain form
42038 1128390 2105572 2740310 3039937 2979117 2640232 2221876 1937700 1905723 2089943 2391860
42028 2391860 2787064 3208128 3328128 2834486 2035389 1721848 2118819 2441651 1950887
42019 1950887 994357 381707 135128 -293769 -797800 -634145 221631 723118 141289
42010 141289 -992889 -1820342 -2303226 -2777476 -2950196 -2270835 -1116237 -681015 -1448968
42001 -1448968 -2409854 -2214088 -776612 687395 1105602 649235 347952 915732 2143164
41992 2143164 3259241 3639290 3236903 2576427 2299704 2486766 2489789 1766909 805186 685131
41982 685131 1622250 2566481 2597938 2111042 2007772 2184225 1664295 123895 -1522015
41973 -1522015 -2214313 -1843806 -1037524 -323802 192256 596495 900109 992806 841753 746533
$$ packed form
42038A128390R77182O34738K99627o0820l38885m18356k84176l1977J84220L01917
42028B391860L95204M21064J20000m93642p99097l13541L96971L22832m90764
42019A950887r56530o12650k46579m28897n04031J63655Q55776N01487n81829
42010A41289j134178q27453m82884m74250j72720O79361J154598M35222p67953
42001a448968r60886J95766J437476J464007M18207m56367l01283N67780J227432
41992B143164J116077L80049m02387o60476k76723J87062L023p22880r61723j20055
41982F85131R37119R44231L1457m86896j03270J76453n19930j540400j645910
41973a522015o92298L70507Q06282P13722N16058M04239L03614R2697j51053r5220
$$ plain form
41963 746533 1167943 2084515 2760938 2520079 1588357 795476 581517 720960 889893 997051
41953 997051 988652 833711 765147 1112114 1824697 2515566 2969315 3227189 3187851 2585937
41943 2585937 1481259 437649 107535 789579 2251430 3725911 4331656 3920517 3308144
41934 3308144 3247367 3479878 3348633 2964304 2964184 3369604 3609622 3563739 3600042 3609230 3084228
41923 3084228 2267888 2051342 2431818 2282890 1184421 278896 503073 1046624 654559
41914 654559 -334956 -509923 452127 1335500 1071433 -63781 -1075220 -1410097 -1288119
41905 -1288119 -1236440 -1432619 -1454550 -843526 115391 664451 715276 1007021 1806930 2270874
41895 2270874 1705201 728966 391203 739130 1135739 1455988 1952456 2336457 2125527
$$ packed form
41963G46533M21410R16572O76423k40859r31722p92881k13959J39443J68933J07158
41953I97051q399j54941o8564L46967P12583O90869M53749K57874l9338o01914
41943B585937j104678j043610l30114O82044J461851J474481O05745m11139o12373
41934C308144o0777K32511j31245l84329j20M05420K40018m5883L6303R188n25002
41923C084228q16340k16546L80476j48928j098469r05525K24177N43551l92065
41914F54559r89515j74967R62050Q83373k64067j135214j011439l34877J21978
41905a288119N1679j96179k1931O11024R58917N49060N0825K91745P99909M63944
41895B270874n65673r76235l37763L47927L96609L20249M96468L84001k10930
$$ plain form
41886 2125527 1725546 2038530 2982390 3462472 2953582 2107811 1551246 1071934 443903
41877 443903 173005 751445 1734327 2224502 1963474 1373506 691390 -377177 -1998162
41868 -1998162 -3490146 -3603975 -1772050 944881 2566858 2142815 682521 -202070 -169983
41859 -169983 -46910 -195549 27599 1038420 2113166 2221339 1334539 463001 566080
41850 566080 1648264 2796798 3050056 2390145 1795443 2052836 2725598 2785384 2100188
41841 2100188 1574620 1741971 1991674 1543904 562994 -195167 -421777 -428928 -529807 -697567
41831 -697567 -746818 -553694 -160157 185691 245119 170766 451088 1304652 2345480 3035680
41821 3035680 3271590 3329101 3403027 3403715 3109413 2393310 1390226 485118 12147 -21779
$$ packed form
41886B125527l99981L12984R43860M80082n08890q45771n56565m79312o28031
41877D43903k70898N78440R82882M90175k61028n89968o82116j068567j620985
41868a998162j491984j13829J831925K716931J621977m24043j460294q84591L2087
41859a69983J23073j48639K23148J010821J074746J08173q86800q71538J03079
41850E66080J082184J148534K53258o59911n94702K57393O72762N9786o85196
41841B100188n25568J67351K49703m47770r80910p58161k26610p151j00879j67760
41831f97567m9251J93124L93537L45848N9428p4353K80322Q53564J040828O90200
41821C035680K35910N7511P3926O88k94302p16103j003084r05108m72971l3926
$$ plain form
41811 -21779 244501 852334 1818615 2692914 2833686 2215924 1457537 894825 214509 -703478
41801 -703478 -1208708 -691927 494176 1560942 2359073 3172400 3692598 3175974 1752680
41792 1752680 655983 683421 1129966 874093 -2498 -468174 -125485 361052 443180 384834
41782 384834 440494 164119 -779941 -1664923 -1424722 -128067 1091626 1566928 1755452
41773 1755452 2209822 2669367 2571144 1874465 922291 -75923 -991043 -1577006 -1737052 -1673778
41763 -1673778 -1452775 -815130 224554 1068969 1290719 1233352 1332116 1323924 820090 260713
41753 260713 485734 1560572 2753874 3489498 3616345 2999722 1724624 577651 388892
41744 388892 845666 817044 -48514 -885251 -911341 -347374 182573 410128 339568 100105
$$ packed form
41811b1779K66280O07833R66281Q74299J40772o17762p58387n62712o80316r17987
41801g03478n05230N16781J186103J066766P98131Q13327N20198n16624j423294
41792A752680j096697K7438M46545k55873q76591m65676L42689M86537Q2128n8346
41782C84834N5660k76375r44060q84982K40201J296655J219693M75302J88524
41773A755452M54370M59545r8223o96679r52174r98214r15120n85963j60046O3274
41763a673778K21003O37645J039684Q44415K21750n7367R8764q192n03834n59377
41753B60713K25021J074838J193302P35624J26847o16623j275098j146973j88759
41744C88892M56774k8622q65558q36737k6090N63967N29947K27555p0560k39463
$$ plain form
41734 100105 99438 651688 1283146 1136972 243071 -409512 -281043 93602 159698 75066
41724 75066 -48451 -684814 -2034823 -3417609 -4197753 -4620062 -5017353 -4841642 -3308099
41715 -3308099 -597943 2242003 4245674 4931555 4374858 3484575 3574995 4890326 6056020
41706 6056020 5748132 4388085 3332081 2879560 2148456 702069 -759718 -1397651 -1114144
41697 -1114144 -338499 430601 801279 751772 772818 1318628 2133343 2492171 2033907 1050242
41687 1050242 123212 -254706 6302 372939 167221 -455651 -554565 224947 1055439 1238875
41677 1238875 1264077 1755097 2235110 2056665 1824254 2497918 3561500 3636097 2749823 2403330
41667 2403330 3210265 3963873 3497732 2217286 1209350 857879 946352 1302101 1739784
$$ packed form
41734A00105o67N52250O31458j46174q93901o52583J28469L74645O6096q4632
41724G5066j23517o36363j350009j382786p80144m22309l97291J75711J533543
41715c308099K710156K839946K003671O85881n56697q90283R0420J315331J165694
41706F056020l07888j360047j056004m52521p31104j446387j461787o37933K83507
41697a114144P75645P69100L70678m9507K1046N45810Q14715L58828m58264r83665
41687A050242r27030l77918K61008L66637k05718o22872r8914P79512Q30492J83436
41677A238875K5202M91020M80013j78445k32411O73664J063582P4597q86274l46493
41667B403330Q06935P53608m66141j280446j007936l51471Q8473L55749M37683
$$ plain form
41658 1739784 1947939 1844303 1589864 1154632 490426 87629 475272 1138276 980231
41649 980231 40869 -360033 493314 1810624 2692284 3257572 3785852 3870912 3225197 2370323
41639 2370323 1718151 850468 -448476 -1299642 -807314 683324 2280195 3743095 5042930
41630 5042930 5523987 4734630 3581342 3409252 4188178 4692683 4260761 3337959 2477176
41621 2477176 1878239 1853261 2696562 3978282 4820133 4987077 5009508 5228590 5428502 5389746
41611 5389746 5120645 4612962 4052435 4095133 5101354 6222392 6184943 4973000 3795524
41602 3795524 3372749 3295632 3211146 3460863 4075314 4170156 3065254 1347748 222456
41593 222456 303700 1437065 3070862 4330467 4393022 3419518 2624435 2858078 3598985
$$ packed form
41658A739784K08155j03636k54439m35232o64206m02797L87643O63004j58045
41649I80231r39362m00902Q53347J317310Q81660N65288N28280Q5060o45715q54874
41639B370323o52172q67683j298944q51166M92328J490638J596871J462900J299835
41630E042930M81057p89357j153288j72090P78926N04505m31922r22802q60783
41621B477176n98937k4978Q43301J281720Q41851J66944K2431K19082J99912l8756
41611E389746k69101n07683n60527M2698J006221J121038l7449j211943j177476
41602C795524m22775p7117q4486K49717O14451R4842j104902j717506j125292
41593B22456Q1244J133365J633797J259605O2555r73504p95083K33643P40907
$$ plain form
41584 3598985 3888991 3684159 3542252 3479766 3106110 2680184 3019524 4206452 5190566
41575 5190566 5032557 4033620 3278691 3369705 3913164 4107839 3623426 2911891 2681829 3063039
41565 3063039 3447086 3289474 2843605 2793893 3334135 4040144 4596084 5125687 5663148 5787481
41555 5787481 5134817 3988088 2988524 2407027 2021324 1609159 1221449 977144 881636
41546 881636 871521 791307 361469 -477377 -1174349 -1002696 -81525 532919 158236 -565142
41536 -565142 -586634 84553 585447 635045 778621 1126109 920583 -167251 -1240480 -1385659
41526 -1385659 -955451 -814268 -919037 -670146 -259599 -468994 -1186231 -1303611 -358701
41517 -358701 710877 870648 253767 -338495 -532914 -486222 -428151 -565325 -982141 -1256716
$$ packed form
41584C598985K90006k04832j41907o2486l73656m25926L39340J186928R84114
41575E190566j58009r98937p54929R1014N43459J94675m84413p11535k30062L81210
41565C063039L84047j57612m45869m9712N40242P06009N55940N29603N37461J24333
41555E787481o52664j146729r99564n81497l85703m12165l87710k44305r5508
41546H81636j0115q0214m29838q38846o96972J71653R21171O14444l74683p23378
41536e65142k1492O71187N00894M9598J43576L47488k05526j087834j073229j45179
41526a385659M30208J41183j04769K48891M10547k09395p17237j17380R44910
41517c58701J069578J59771o16881n92262j94419M6692N8071j37174m16816k74575
$$ plain form
41507 -1256716 -698478 606201 1549438 1341267 570230 308814 665456 979845 1020668
41498 1020668 1051091 938271 243218 -751401 -1105281 -605894 -221620 -712869 -1520343 -1644745
41488 -1644745 -1091194 -726676 -1002511 -1528547 -1827267 -1862344 -1732954 -1396056 -933961 -703939
41478 -703939 -892203 -1122577 -829291 25931 839582 978842 345474 -666903 -1564145
41469 -1564145 -2001762 -1845505 -1231899 -543581 -111581 102171 351866 597538 398770
41460 398770 -489452 -1597897 -2121923 -1804830 -1197062 -991700 -1312731 -1740614 -1839669 -1500253
41450 -1500253 -880776 -207572 356728 751041 973151 1023579 948092 914651 1102167 1448988
41440 1448988 1668163 1648729 1684674 2055093 2463446 2267688 1383742 597833 645671 1184338
$$ packed form
41507a256716N58238J304679R43237k08171p71037k61416L56642L14389M0823
41498A020668L0423j12820o95053r94619l53880M99387L84274m91249q07474j24402
41488a644745N53551L64518k75835n26036k98720l5077J29390L36898M62095K30022
41478g03939j88264k30374K93286Q55222Q13651J39260o33368j012377q97242
41469a564145m37617J56257O13606O88318M32000K13752K49695K45672j98768
41460C98770q88222j108445n24026L17093O07768K05362l21031m27883r9055L39416
41450a500253O19477O73204N64300L94313K22110N0428p5487l3441J87516L46821
41440A448988K19175j9434L5945L70419M08353j95758q83946p85909M7838N38667
$$ plain form
41430 1184338 1141738 125522 -960548 -964931 143820 1327111 1763839 1663724 1717220
41421 1717220 2110303 2384098 2133097 1522754 1027802 832554 670594 274762 -142230
41412 -142230 -12929 931416 2243847 3128968 3196939 2727770 2218422 1880100 1672320 1613493
41402 1613493 1783528 2042328 2006779 1438883 529194 -327867 -936460 -1321688 -1442999 -1160697
41392 -1160697 -564034 -75149 11354 -26886 362879 1249435 2008568 2009162 1371011 882229
41382 882229 1183332 2119962 2924109 3004095 2473208 1796004 1019865 -251890 -1944814
41373 -1944814 -3046124 -2639336 -1205790 -174709 -127000 -190271 534496 1705800 2388194
41364 2388194 2311425 1828967 1138796 327873 -153835 86986 629521 655291 41360 -644921
$$ packed form
41430A184338m2600j016216j086070m383J108751J183291M36728j00115N3496
41421A717220L93083K73795k51001o10343m94952j95248j61960l95832m16992
41412a42230J29301R44345J312431Q85121O7971m69169n09348l38322k07780n8827
41402A613493J70035K58800l5549n67896r09689q57061o08593l85228j21311K82302
41392a160697N96663M88885Q6503l8240L89765Q86556P59133N94o38151m88782
41382H82229L01103R36630Q04147P9986n30887o77204p76139j271755j692924
41373a944814j101310M06788J433546J031081M7709o3271P24767J171304O82394
41364B388194p6769m82458o90171q10923m81708K40821N42535K5770o13931o86281
$$ plain form
41354 -644921 -1091331 -1395780 -1407400 -846022 -102728 42294 -373094 -551689 -359129 -538595
41344 -538595 -1161107 -1153924 -69731 918339 797052 383956 926482 1907851 1800135 505066
41334 505066 -576451 -758958 -781058 -1170007 -1389078 -1030652 -574985 -404584 -160320 317539
41324 317539 416827 -168445 -658425 -264507 669077 1370016 1818552 2361707 2698403 2237480
41314 2237480 1198575 456445 385585 608419 818249 1124934 1545415 1790178 1698343 1440404
41304 1440404 1217923 1128068 1297787 1732804 2032116 1678103 699654 -244417 -477479 185610
41294 185610 1384899 2370529 2416950 1528686 634134 642190 1381279 1892791 1650974 980383
41284 980383 358932 -77179 -300889 -286349 -282708 -658617 -1314682 -1755033 -1863342 -2014391
$$ packed form
41354f44921m46410l04449j1620N61378P43294J45022m15388j78595J92560j79466
41344e38595o22512P183J084193R88070j21287m13096N42526R81369j07716j295069
41334E05066j081517j82507k2100l88949k19071L58426M55667J70401K44264M77859
41324C17539R9288n85272m89980L93918R33584P00939M48536N43155L36696m60923
41314B237480j038905p42130p0860K22834K09830L06685M20481K44763r1835k57939
41304A440404k22481q9855J69719M35017K99312l54013r78449r44071k33062O63089
41294A85610J199289R85630M6421q88264q94552Q056P39089N11512k41817o70591
41284I80383o21451m36111k23710J4540L641l75909o56065m40351j08309j51049
$$ plain form
41274 -2014391 -2228459 -1903822 -771257 525559 1332040 1911041 2794447 3609590 3370266
41265 3370266 1854497 -10137 -1222136 -1627838 -1657991 -1653830 -1729896 -1991529 -2538754 -3254128
41255 -3254128 -3731176 -3536252 -2669535 -1751302 -1509016 -1969500 -2413606 -2292984 -1878413
41246 -1878413 -1723533 -1815085 -1697604 -1226072 -666594 -100088 762978 2055596 3376689
41237 3376689 4055397 3647449 2292537 827433 305652 940615 1668537 1297391 -548
41228 -548 -968471 -1016440 -928144 -1611427 -2897963 -4008371 -4575647 -4657307 -4241134 -3405317
41218 -3405317 -2673148 -2554237 -2827840 -2769307 -2007472 -788985 406915 1068157 693532
41209 693532 -736693 -2341916 -2961459 -2335420 -1281195 -624042 -353932 33046 729364
$$ packed form
41274b014391k14068L24637J132565J296816Q06481N79001Q83406Q15143k39324
41265C370266j515769j864634j211999m05702l0153M161p6066k61633n47225p15374
41255c254128m77048J94924Q66717R18233K42286m60484m44106J20622M14571
41246a878413J54880r1552J17481M71532N59478N66506Q63066J292618J321093
41237C376689O78708m07948j354912j465104n21781O34963P27922l71146j297939
41228e48r67923m7969Q8296o83283j286536j110408n67276q1660M16173Q35817
41218c405317P32169J18911k73603N8533P61835J218487J195900O61242l74625
41209F93532j430225j605223o19543O26039J054225O57153K70110L86978O96318
$$ plain form
41200 729364 1381855 1488459 897983 -17759 -718462 -1075216 -1386027 -1681032 -1434479 -397331
41190 -397331 691395 923354 501516 346164 517723 92592 -1159096 -2097690 -1858769
41181 -1858769 -1229639 -1446775 -2291846 -2522792 -1876237 -1418719 -1812481 -2329290 -2018840
41172 -2018840 -1031764 -183215 246813 601124 998462 1054759 505448 -308923 -738391 -439533
41162 -439533 357993 1078787 1275005 974320 567189 278842 -184668 -1277251 -2860799
41153 -2860799 -4051246 -4073012 -3190428 -2451113 -2403729 -2427826 -1640027 -175333 940019
41144 940019 1097074 699443 355584 99594 -236878 -395580 15550 856006 1573850 1851655
41134 1851655 1735288 1308739 705984 316465 476872 966636 1192950 815615 -135722
$$ packed form
41200G29364O52491J06604n90476r15742p00703l56754l10811k95005K46553J037148
41190c97331J088726K31959m21838j55352J71559m25131j251688r38594K38921
41181a858769O29130k17136q45071k30946O46555M57518l93762n16809L10450
41172b018840R87076Q48549M30028L54311L97338N6297n49311q14371m29468K98858
41162d39533P97526P20794J96218l00685m07131k88347m63510j092583j583548
41153b860799j190447k1766Q82584P39315M7384k4097P87799J464694J115352
41144I40019J57055l97631l43859k55990l36472j58702M11130Q40456P17844K77805
41134A851655j16367m26549o02755l89519J60407M89764K26314l77335r51337
$$ plain form
41125 -135722 -1503724 -2828214 -3225060 -2274290 -955688 -743255 -1621088 -2027130 -1145398
41116 -1145398 -136242 -321906 -1176389 -1324721 -868542 -1209849 -2666043 -3743321 -3213828
41107 -3213828 -1763353 -890645 -982022 -1242904 -1006730 -352653 276795 419988 -217101
41098 -217101 -1287607 -1671872 -499892 1656486 3200113 3244390 2429675 1866416 1831698
41089 1831698 1863741 1672348 1393025 1137530 853835 647121 765332 1121232 1213264 768369
41079 768369 194895 94596 477331 786609 676776 460345 685284 1458784 2304344 2582431
41069 2582431 1989531 771541 -438852 -1051784 -892734 -199412 666044 1403465 1768708
41060 1768708 1638641 1161147 657694 293008 10972 -160092 -27600 386210 707116
$$ packed form
41125a35722j368002j324490l96846R50770J318602K12433q77833m06042Q81732
41116a145398J009156j85664q54483j48332M56179l41307j456194j077278N29493
41107c213828J450475Q72708r1377k60882K36174O54077O29448J43193o37089
41098b17101j070506l84265J171980K156378J543627M4277q14715n63259l4718
41089A831698L2043j91393k79323k55495k83695k06714J18211L55900R2032m44895
41079G68369n73474j00299L82735L09278j09833k16431K24939P73500Q45560K78087
41069B582431n92900j217990j210393o12932J59050O93322Q65456P37421L65243
41060A768708j30067m77494n03453l64686k82036j71064J32492M13810L20906
$$ plain form
41051 707116 741248 854335 1399134 1980675 1850838 992524 215299 47670 109696 -145517
41041 -145517 -600115 -797259 -677819 -496707 -324674 -188222 -459126 -1427205 -2538621
41032 -2538621 -2761181 -1874801 -810235 -444446 -581071 -486057 17381 484787 607535
41023 607535 509074 368756 198220 22182 -62069 -86267 -239820 -632197 -1171732 -1663993
41013 -1663993 -1878010 -1588674 -785638 172658 824518 1026564 945166 714920 389326 197573
41003 197573 463221 1095427 1429433 837391 -554921 -1887552 -2291960 -1613006 -512907
40994 -512907 150541 155171 77789 513129 1295156 1786432 1808544 1825327 2172923 2617131
40984 2617131 2871273 3070910 3387662 3562239 3281954 2799564 2723989 3281708 4122804 4746899
$$ packed form
41051G07116L4132J13087N44799N81541j29837q58314p77225j67629O2026k55213
41041a45517m54598j97144J19440J81112J72033J36452k70904r68079j111416
41032b538621k22560Q86380J064566L65789j36625R5014N03438M67406J22748
41023F07535r8461j40318j70536j76038q4251k4198j53553l92377n39535m92261
41013a663993k14017K89336Q03036R58296O51860K02046q1398k30246l25594j91753
41003A97573K65648O32206L34006n92042j392312j332631m04408O78954J100099
40994e12907O63448M630p7382M35340P82027M91276K2112J6783L47596M44208
40984B617131K54142J99637L16752J74577k80285m82390p5575N57719Q41096O24095
$$ plain form
40974 4746899 4796881 4086636 2771704 1467687 809883 845263 1125525 1341484 1527144
40965 1527144 1704126 1778822 1862497 2259733 2966943 3536732 3638984 3445125 3229989 2893414
40955 2893414 2225951 1515226 1514023 2662419 4431125 5569770 5161897 3525771 1942995
40946 1942995 1347653 1443512 1319640 656737 -130999 -729972 -1189344 -1321908 -673217 540962
40936 540962 1203665 634040 -367413 -545708 99736 471498 63177 -455910 -484128 -412458
40926 -412458 -824323 -1395268 -1217992 62982 1954015 3762149 5057288 5584216 5242823
40917 5242823 4310004 3357036 2739789 2299116 1658056 691517 -365649 -1141264 -1360560
40908 -1360560 -973875 -197023 579747 999027 893541 308743 -499461 -1068783 -924468
$$ packed form
40974D746899M9982p10245j314932j304017o57804L5380K80262K15959J85660
40965A527144J76982P4696Q3675L97236P07210N69789J02252j93859k15136l36575
40955B893414o67463p10725j203J148396J768706J138645m07873j636126j582776
40946A942995n95342R5859j23872o62903p87736n98973m59372j32564O48691J214179
40936E40962O62703n69625j001453j78295O45444L71762m08321n19087k8218P1670
40926d12458m11865n70945J77276J280974J891033J808134J295139N26928l41393
40917E242823r32819r52968o17247m40673o41060r66539j057166p75615k19296
40908a360560L86685P76852P76770M19280j05486n84798q08204n69322J44315
$$ plain form
40899 -924468 28878 1327132 2289197 2542047 2142960 1311466 293615 -521405 -699999
40890 -699999 -215923 371362 458764 79239 -169449 132285 753133 1141082 1084642 929365
40880 929365 1149166 1775893 2360489 2564794 2633685 2994650 3439828 3172927 1877583 283811
40870 283811 -730274 -1188245 -1563723 -1609650 -557791 1434606 2969428 3024760 2226101
40861 2226101 1874117 2158307 2087260 1011092 -563653 -1811600 -2615936 -3384673 -4183045
40852 -4183045 -4520033 -4011944 -2937601 -1929942 -1240381 -580115 277353 1055654 1355207
40843 1355207 1197637 846688 329946 -366762 -805906 -484400 251564 415313 -257658
40834 -257658 -860792 -615882 49869 274541 37516 -13523 386920 928317 1305473 1377184
$$ packed form
40899i24468R53346J298254R62065K52850l99087q31494j017851q15020j78594
40890f99999M84076N87285Q7402l79525k48688L01734O20848L87949n6440j55277
40880I29365K19801O26727N84596K04305O8891L60965M45178k66901j295344j593772
40870B83811j014085m57971l75478m5927J051859J992397J534822N5332p98659
40861B226101l51984K84190p1047j076168j574745j247947q04336p68737p98372
40852d183045l36988N08089J074343J007659O89561O60266Q57468P78301K99553
40843A355207j57570l50949n16742o96708m39144L21506P35964J63749o72971
40834b57658o03134K44910O65751K24672k37025n1039M00443N41397L77156P1711
$$ plain form
40824 1377184 1015108 407412 226068 831612 1595642 1724086 1432216 1443618 1618412 1161767
40814 1161767 100249 -641307 -768335 -1004414 -1609984 -1751318 -977633 -201454 -332482
40805 -332482 -855140 -769096 -196212 76192 98451 562911 1388245 1753351 1535524 1534861
40795 1534861 2045557 2269938 1591940 574578 133641 336207 558661 375048 -197723
40786 -197723 -944612 -1470809 -1314842 -518169 194728 266927 74449 329037 958391 1242535
40776 1242535 1006753 951926 1585067 2433699 2708984 2297107 1627710 906392 73355 -627180
40766 -627180 -709742 -224122 69460 -383669 -1184805 -1488976 -1046578 -409572 -206865 -496257
40756 -496257 -803810 -620853 99255 841809 1049143 794872 665590 839151 709887 -200075
$$ packed form
40824A377184l62076o07696j81344O05544P64030J28444k91870J1402J74794m56645
40814A161767j061518p41556j27028k36079o05570j41334P73685P76179j31028
40805c32482n22658Q6044N72884K72404K2259M64460Q25334L65106k17827o63
40795A534861N10696K24381o77998j017362m40937K02566K22454j83613n72771
40786a97723p46889n26197J55967P96673P12897P2199j92478K54588O29354K84144
40776A242535k35782n4827O33141Q48632K75285m11877o69397p21318q33037p00535
40766f27180q2562M85620K93582m53129q01136l04171M42398O37006K02707k89392
40756d96257l07553J82957P20108P42554K07334k54271j29282J73561j29264r09962
$$ plain form
40746 -200075 -1360520 -1834005 -1480221 -890958 -327104 420241 1095649 906573 -206327
40737 -206327 -1066328 -691629 329996 606370 -271115 -1385167 -1715075 -1042443 244762
40728 244762 1577647 2360892 2260435 1556137 902537 630446 529920 327128 39871
40719 39871 -221505 -482855 -745128 -775423 -250147 902745 2326290 3376379 3538324
40710 3538324 2863559 1995663 1650019 2027135 2730703 3185237 3112503 2708898 2414861 2473511
40700 2473511 2791523 3314833 4243709 5463634 6033334 5038377 3048972 1842267 2232446
40691 2232446 2984358 2583440 1392547 1070077 2243817 3858102 4771838 4981743 5067079
40682 5067079 5272994 5474323 5419499 4735294 3254307 1579298 737578 958898 1322674
$$ packed form
40746b00075j160445m73485L53784N89263N63854P47345O75408j89076j112900
40737b06327q60001L74699J021625K76374q77485j114052l29908O72632J287205
40728B44762J332885P83245j00457p04298o53600k72091j00526k02792k87257
40719C9871k61376k61350k62273l0295N25276J152892J423545J050089J61945
40710C538324o74765q67896l45644L77116P03568M54534p2734m03605k94037N8650
40700B473511L18012N23310R28876J219925N69700r94957j989405j206705L90179
40691B232446P51912m00918j190893l22470J173740J614285R13736K09905Q5336
40682E067079K05915K01329n4824o84205j480987j675009q41720K21320L63776
$$ plain form
40673 1322674 978309 248987 108778 920832 2121103 2939157 3088371 2863200 2761880
40664 2761880 2926883 2965696 2576564 2246275 2785990 4095721 5026854 4766657 3797619
40655 3797619 3124721 3127276 3649939 4614219 5768981 6222612 5167437 3093304 1524526
40646 1524526 1357843 2008059 2368432 2070056 1497006 1039004 829579 1017411 1765633
40637 1765633 2861262 3640757 3555900 2765310 2025831 2012436 2838578 4146745 5373189
40628 5373189 5845154 5005984 2953607 636998 -876720 -1354423 -1366812 -1413836 -1465489
40619 -1465489 -1323748 -970463 -472605 52250 317611 156377 -39139 266598 794331
40610 794331 625614 -353967 -952450 -206790 1195716 1795475 1256811 583647 676283 1472594
$$ packed form
40673A322674l44365p29322j40209Q12054J200271Q18054J49214k25171j01320
40664B761880J65003L8813l89132l30289N39715J309731R31133k60197r69038
40655C797619o72898K555N22663R64280J154762M53631j055175k074133j568778
40646A524526j66683O50216L60373k98376n73050m58002k09425J87832P48222
40637A765633J095629P79495q4857p90590p39479j3395Q26142J308167J226444
40628E373189M71965q39170k052377k316609j513718m77703j2389m7024n1653
40619a465489J41741L53285M97858N24855K65361j61234j95516L05737N27733
40610G94331j68717r79581n98483P45660J402506N99759n38664o73164R2636P96311
$$ plain form
40600 1472594 2432672 3100507 3140027 2519713 1805900 1681455 2031116 2053009 1400461 620081
40590 620081 277246 298867 518314 1217401 2526008 3709594 3787289 2774111 1702756
40581 1702756 1341699 1411529 1280289 969785 995133 1373839 1382563 557327 -438832 -426643
40571 -426643 878600 2520649 3442805 3523948 3287213 3084204 3012377 3256084 3863800 4307558
40561 4307558 3926001 2930687 2430289 3170931 4591415 5430080 5104884 4260114 3987152
40552 3987152 4612000 5276837 4797799 2998954 1038854 268733 970373 2427561 3905709
40543 3905709 5078866 5716307 5640632 5085536 4530253 4039644 3309437 2524280 2503779 3564297
40533 3564297 4772075 4948514 4155369 3595698 4147330 5532772 6945672 7965127 8639316
$$ packed form
40600A472594R60078O67835L9520o20314p13813j24445L49661K1893o52548p80380
40590F20081l42835K1621K19447O99087J308607J183586P7695j013178j071355
40581A702756l61057O9830j31240l10504K5348L78706Q724q25236r96159J2189
40571d26643J305243J642049R22156Q1143k36735k03009p1827K43707O07716M43758
40561D307558l81557r95314n00398P40642J420484Q38665l25196q44770k72962
40552C987152O24848O64837m79038j798845j960100p70121P01640J457188J478148
40543C905709J173157O37441p5675n55096n55283m90609p30207p85157k0501J060518
40533C564297J207778J76439p93145n59671N51632J385442J412900J019455O74189
$$ plain form
40524 8639316 9060282 9258774 9468234 10182489 11749499 13917772 15911522 17049850 17280229
40515 17280229 17093142 17020671 17278141 17705431 17847970 17229948 15827437 14202398 12888874
40506 12888874 11738492 10240746 8418059 6887611 5952435 5211840 4375363 3929473 4451815
40497 4451815 5562553 6185216 5830538 5095351 4753033 4780944 4585943 3941312 3296467
40488 3296467 3134652 3357291 3524018 3492193 3453626 3385980 2939036 2046115 1199070 771870
40478 771870 483490 16247 -236056 241570 992633 987146 140438 -479406 -205321 353489
40468 353489 434925 308447 675775 1504117 2212719 2620416 2972029 3277500 3307946 3104286
40458 3104286 2912725 2752496 2566830 2621854 3195356 4012004 4536567 4687532 4715909 4588456
$$ packed form
40524H639316M20966J98492K09460P14255J567010K168273J993750J138328K30379
40515A7280229j87087p2471K57470M27290J42539o18022j402511j625039j313524
40506A2888874j150382j497746j822687j530448r35176p40595q36477m45890N22342
40497D451815J110738O22663l54678p35187l42318K7911j95001o44631o44845
40488C296467j61815K22639J66727l1825l8567o7646m46944q92921q47045m27200
40478G71870k88380m67243k52303M77626P51063n487q46708o19844K74085N58810
40468C53489Q1436j26478L67328Q28342P08602M07697L51613L05471L0446k03660
40458C104286j91561j60229j85666N5024N73502Q16648N24563J50965K8377j27453
$$ plain form
40448 4588456 4194674 4040696 4885922 6552561 7862970 8042301 7535021 7099194 6731423
40439 6731423 6026413 5163121 4871368 5498418 6593229 7492833 8017254 8453600 9045733
40430 9045733 9752217 10563677 11812463 13819168 16248296 18248563 19420726 20241151 21251062
40421 21251062 22278322 22889747 23151737 23310375 23078498 22034705 20565441 19594537 19391730
40412 19391730 19409858 19314344 19372415 19742895 20224033 20868574 21955600 23074949 23192771
40403 23192771 22116514 21014615 20838442 21005253 20398195 18978815 17508987 16219104
40395 16219104 14806121 13499597 13072547 13709542 14661166 15175070 15153875 14774334 14062379
40386 14062379 13101758 12233793 11743650 11523356 11210065 10608057 9978828 9924261 10804300
$$ packed form
40448D588456l93782j53978Q45226J666639J310409J79331n07280m35827l67771
40439F731423p05010q63292k91753O27050J094811Q99604N24421M36346N92133
40430I045733P06484Q11460J248786K006705K429128K000267J172163Q20425J009911
40421B1251062J027260O11425K61990J58638k31877j043793j469264r70904k02807
40412A9391730J8128r5514N8071L70480M81138O44541J087026J119349J17822
40403B3192771j076257j101899j76173J66811o07058j419380j469828j289883
40395A6219104j412983j306524m27050O36995R51624N13904k1195l79541p11955
40386A4062379r60621q67965m90143k20294l13291o02008o29229n4567Q80039
$$ plain form
40377 10804300 12196720 13183099 13254699 12601909 11466949 9814078 7901906 6470543 5822996
40368 5822996 5352690 4632728 4298027 4934123 5692618 5261896 3968930 3573882 4850737
40359 4850737 6609330 7492191 7643074 8002150 8821298 9636541 10243762 11091645 12856390
40350 12856390 15738592 18798548 20078504 18187678 13960967 9783094 7083170 5379374
40342 5379374 3967181 3230013 3525319 3977542 3599216 2868770 2943611 3774798 4227000
40333 4227000 3790503 2984550 2199797 1331013 614298 704983 1656099 2694486 3233797
40324 3233797 3342845 3118231 2494371 1862372 1939032 2718478 3449848 3953876 4923576 6438244
40314 6438244 7323984 6832479 5944744 5891433 6205375 5655120 4615320 4853894 6926412
$$ packed form
40377A0804300J392420R86379P1600o52790j134960j652871j912172j431363o47547
40368E822996m70306p19962l34701O36096P58495m30722j292966l95048J276855
40359D850737J758593Q82861J50883L59076Q19148Q15243O07221Q47883J764745
40350A2856390K882202L059956J279956j890826m226711m177873k699924j703796
40342E379374j412193p37168K95306M52223l78326p30446P4841Q31187M52202
40333D227000m36497q05953p84753q68784p16715R0685R51116J038387N39311
40324C233797J09048k24614o23860o31999P6660P79446P31370N04028R69700J514668
40314F438244Q85740m91505q87735n3311L13942n50255j039800K38574K072518
$$ plain form
40305 6926412 9409247 11234444 13261661 16418638 19358405 19552062 16505217 12525012
40297 12525012 10031156 9192749 8735119 8083493 7666911 7557110 7062865 5931111 4991329
40288 4991329 4981008 5324235 4844719 3409081 2056302 1519848 1422398 1166548 879028
40279 879028 952858 1183981 1072368 772811 1033045 2099878 3256656 3713346 3566378
40270 3566378 3510420 3798401 3909814 3304714 2180018 1250802 958586 1212574 1857537
40261 1857537 2941330 4301559 5308477 5479893 5100285 4693809 4098107 2818568 1269958
40252 1269958 681941 1383477 2107904 1731171 943033 1175384 2344908 2878524 1937848
40243 1937848 485426 -87951 586442 2117775 4110546 6073649 7342238 7813997 8258460
$$ packed form
40305F926412K482835J825197K027217L156977K939767J93657l046845l980205
40297A2525012k493856q38407m57630o51626m16582j09801m94245j131754r39782
40288D991329j0321L43227m79516j435638j352779n36454r7450k55850k87520
40279H79028P3830K31123j11613k99557K60234J066833J156778M56690j46968
40270C566378n5958K87981J11413o05100j124696r29216k92216K53988O44963
40261A857537J083793J360229J006918J71416l79608m06476n95702j279539j548610
40252A269958n88017P01536P24427l76733p88138K32351J169524N33616r40676
40243A937848j452422n73377O74393J531333J992771J963103J268589M71759M44463
$$ plain form
40234 8258460 9241756 10187054 10156515 9133743 7778972 6294088 4466728 2675037 1804041
40225 1804041 1975344 2242810 1906309 1404642 1477598 2083655 2692369 3130262 3487774 3545465
40215 3545465 3019228 2234762 1856201 1912717 1751060 1143272 824115 1493622 2682029
40206 2682029 3173688 2490031 1491645 1393874 2484089 3985488 4997141 5336186 5479202
40197 5479202 5853235 6285669 6147533 5019420 3194491 1485810 539896 396294 692815
40188 692815 1112815 1500837 1724755 1750061 1863002 2481899 3559590 4416558 4440013 3814034
40178 3814034 3273145 3221925 3434789 3602418 3730950 3800314 3422070 2281530 803297
40169 803297 -66694 147711 965173 1578051 1704089 1593944 1438257 1176251 865745 792536
$$ packed form
40234H258460R83296R45298l0539j022772j354771j484884j827360j791691q70996
40225A804041J71303K67466l36501n01667P2956O06057O08714M37893L57512N7691
40215C545465n26237p84466l78561N6516j61657o07788l19157O69507J188407
40206B682029M91659o83657r98386r7771J090215J501399J011653L39045J43016
40197E479202L74033M32434j38136j128113j824929j708681r45914j43602K96521
40188F92815M20000L88022K23918K5306J12941O18897J077691Q56968K3455o25979
40178C814034n40889n1220K12864J67629J28532O9364l78244j140540j478233
40169H03297q69991K14405Q17462O12878J26038j10145j55687k62006l10506p3209
$$ plain form
40159 792536 994875 1024537 549304 -23470 -9976 516751 733006 293877 -10554 693770
40149 693770 2031077 2744750 2315446 1558970 1438878 1828940 1850313 1157578 459767 737240
40139 737240 2110810 3531019 3654361 2207902 457004 13523 1098106 2317495 2313677
40130 2313677 1232902 250761 41772 280184 487682 716588 1222717 1926854 2505743
40121 2505743 2787268 2804492 2589442 2139441 1565434 1122565 1033259 1282951 1593308 1636253
40111 1636253 1317754 833336 451118 321404 466092 744673 792367 306575 -420465 -595585
40101 -595585 97833 905248 891597 267889 206672 1272376 2631328 3075182 2364411 1224629
40091 1224629 368199 -59743 -218879 -160294 202442 781131 1076798 524730 -686180
$$ packed form
40159G92536K02339K9662m75233n72774J3494N26727K16255m39129l04431P04324
40149F93770J337307P13673m29304p56476j20092L90062K1373o92735o97811K77473
40139G37240J373570J420209J23342j446459j750898m43481J084583J219389l818
40130B313677j080775r82141k08989K38412K07498K28906N06129P04137N78889
40121B505743K81525J7224k15050m50001n74007m42869q9306K49692L10357M2945
40111A636253l18499m84418l82218j29714J44688K78581M7694m85792p27040j75120
40101e95585O93418Q07415j3651o23708o1217J065704J358952M43854p10771j139782
40091A224629q56430m27942j59136N8585L62736N78689K95667n52068j210910
$$ plain form
40082 -686180 -1423817 -779586 684437 1518301 1250420 895104 1369998 2268759 2721081
40073 2721081 2680308 2608636 2514974 2184106 1879955 1860590 1571125 419025 -834520 -663929
40063 -663929 1129916 3027060 3739677 3494803 2997859 2228155 982216 -232963 -705499
40054 -705499 -418819 210162 995053 1753709 1950336 1314107 428064 -8394 -146035 -520407
40044 -520407 -1033825 -1235601 -1268323 -1559228 -1775092 -1179174 -54226 355845 -375938 -1155186
40034 -1155186 -933947 -112044 282350 122538 105435 562001 1127900 1433500 1466944 1293156
40024 1293156 954687 682911 753439 1030803 1000139 384434 -491387 -1043958 -970619 -393264
40014 -393264 351940 950129 1244576 1303861 1392919 1788438 2500041 3158148 3322191 3011198
$$ packed form
40082f86180p37637O44231J464023Q33864k67881l55316M74894Q98761M52322
40073B721081m0773p1672r3662l30868l04151j9365k89465j152100j253545J70591
40063f63929J793845J897144P12617k44874m96944p69704j245939j215179m72536
40054g05499K86680O28981P84891P58656J96627o36229q86043m36458j37641l74372
40044e20407n13418k01776l2722k90905k15864N95918J124948M10071p31783p79248
40034a155186K21239Q21903L94394j59812j7103M56566N65899L05600L3444j73788
40024A293156l38469k71776P0528K77364l0664o15705q75821n52571P3339N77355
40014c93264P45204N98189K94447N9285Q9058L95519P11603O58107J64043l10993
$$ plain form
40004 3011198 2800975 3196771 3961314 4278862 3614155 2280602 1176851 1057767 1932140
39995 1932140 2970372 3126553 2131690 815736 214096 499003 1104063 1674009 2326704
39986 2326704 3025740 3344634 3048217 2416634 1801310 1303028 1035360 1184009 1572084
39977 1572084 1673499 1333877 995993 950850 920679 715588 691414 1080342 1426719 1237007
39967 1237007 685188 119022 -559507 -1330252 -1476609 -528598 617633 614539 -424118
39958 -424118 -969894 -117575 1343347 2067021 1563062 292295 -891019 -1169739 -324458
39949 -324458 895045 1536701 1690693 2290294 3568357 4538130 4315398 3223262 2217053
39940 2217053 1832890 1995431 2224546 1794808 437142 -860342 -638681 1056674 2445193
$$ packed form
40004C011198k10223L95796P64543L17548o64707j333553j103751j19084Q74373
39995A932140J038232J56181r94863j315954o01640K84907O05060N69946O52695
39986B326704O99036L18894k96417o31583o15324m98282k67668J48649L88075
39977A572084J01415l39622l37884m5143l0171k05091k4174L88928L46377j89712
39967A237007n51819n66166o78529p70745j46357R48011J146231l094j038657
39958d24118n45776Q52319J460922P23674n03959j270767j183314k78720Q45281
39949c24458J219503O41656J53992N99601J278063R69773k22732j092136j006209
39940B217053l84163J62541K29115m29738j357666j297484K21661J695355J388519
$$ plain form
39931 2445193 2287704 1366098 962538 972902 651029 284446 660202 1408311 1444068 896209
39921 896209 1074625 2352651 3453103 3265738 2233659 1374524 867907 314296 -241032
39912 -241032 -249735 633180 2155517 3555644 3948455 3064750 1756342 1315240 2144749
39903 2144749 3524797 4693241 5521240 6003633 5829715 4832570 3349338 1885861 931200
39894 931200 1158530 2927458 5229349 6073943 4645414 2397391 1272033 1448465 1680758
39885 1680758 1278987 665360 237557 -168137 -561868 -474190 341671 1487549 2450841
39876 2450841 3113562 3599383 4040691 4599120 5317274 5887620 5970920 5779740 5912770 6556273
39866 6556273 7282005 7686429 7771565 7631435 7273791 6893979 6822789 6995853 6934887 6481273
$$ packed form
39931B445193j57489r21606m03560J0364l21873l66583L75756P48109L5757n47859
39921H96209J78416J278026J100452j87365j032079q59135n06617n53611n55328
39912b41032q703Q82915J522337J400127L92811q83705j308408m41102Q29509
39903B144749J380048J168444Q27999M82393j73918r97145j483232j463477r54661
39894I31200K27330J768928K301891Q44594j428529k248023j125358J76432K32293
39885A680758m01771o13627m27803m05694l93731Q7678Q15861J145878R63292
39876B450841O62721M85821M41308N58429P18154N70346Q3300j91180J33030O43503
39866F556273P25732M04424Q5136j40130l57644l79812p1190J73064o0966m53614
$$ plain form
39856 6481273 6091824 6129448 6294417 6105748 5597303 5192369 5181499 5634719 6534045 7670443
39846 7670443 8677201 9449432 10223808 10976184 11176004 10550571 9640245 9031934 8471104
39837 8471104 7484595 6545331 6619439 7573620 8055120 7231276 5752809 4590621 3808637
39828 3808637 3119062 2828287 3286938 3934142 3962134 3680822 4100526 5154818 5513922
39819 5513922 4528227 3303370 3193168 4065231 4872623 5244024 5449435 5222276 3908755
39810 3908755 1875352 611898 990535 2271506 3310625 3931397 4434940 4520494 3740625
39801 3740625 2688419 2618480 3787568 5053737 5365395 4896104 4376285 4035821 3771917
39792 3771917 3813489 4475697 5464263 6075533 6055820 5738004 5326669 4590829 3420694 2230734
$$ packed form
39856F481273l89449L7624J64969j88669n08445m04934j0870M53220Q99326J136398
39846G670443J006758P72231P74376P52376J99820o25433r10326o08311n60830
39837H471104r86509r39264P4108R54181M81500q23844j478467j162188p81984
39828C808637o89575k90775M58651O47204K7992k81312M19704J054292L59104
39819E513922r85695j224857j10202Q72063Q07392L71401K05411k27159j313521
39810C908755k033403j263454L78637J280971J039119O20772N03543Q5554p79869
39801C740625j052206o9939J169088J266169L11658m69291n19819l40464k63904
39792C771917M1572O62208R88566O11270j9713l17816m11335p35840j170135j189960
$$ [...]
##END NTUPLES=NMR SPECTRUM
##END=
