##TITLE=31Pdec_LR-724-R2-C1
 CDCl3, 24 sc
 11.10.2024
##JCAMPDX= 6.0         $$ Bruker NMR JCAMP-DX V2.0
##DATA TYPE= NMR SPECTRUM
##DATA CLASS= NTUPLES
##ORIGIN= UXNMR, Bruker Analytische Messtechnik GmbH
##OWNER= root
$$ XWIN-NMR		Version 3.5
$$ Fri Oct 11 16:11:50 2024 Russian Standard Time (UT+4h)  she@DPX200
##.OBSERVE FREQUENCY= 81.013821
##.OBSERVE NUCLEUS= ^31P
##.ACQUISITION MODE= SIMULTANEOUS
##.ACQUISITION SCHEME= undefined
##.AVERAGES= 24
##.DIGITISER RES= 17
##SPECTROMETER/DATA SYSTEM= spect
##.PULSE SEQUENCE= zgpg30
##.SOLVENT NAME= DMSO
##.SHIFT REFERENCE= (INTERNAL, DMSO, 0, 198.062)
##AUDIT TRAIL= $$ (NUMBER, WHEN, WHO, WHERE, WHAT)
$$ ##TITLE= Audit trail, XWIN-NMR		Version 3.5
$$ ##JCAMPDX= 5.01
$$ ##ORIGIN= Bruker BioSpin GmbH
$$ ##OWNER= she
$$ F:/spectra/data/she/nmr/P31/2/pdata/1/auditp.txt
$$ ##AUDIT TRAIL=  $$ (NUMBER, WHEN, WHO, WHERE, WHAT)
(   1,<2024-10-11 16:10:16.37 +0400>,<she>,<DPX200>,
      <created by zg, POWCHK disabled, PULCHK disabled
       configuration hash MD5:
       00 E9 B6 7A A2 85 ED C7 34 08 36 98 17 FE 4E 26
       data hash MD5: 32K
       F3 38 D1 C4 62 D5 52 9E 60 B8 4E 4B 87 C9 86 39>)
(   2,<2024-10-11 16:10:19.70 +0400>,<she>,<DPX200>,
      <Start of raw data processing
       efp BC_mod = 2 LB = 1.5 FT_mod = 6 PKNL = 1 PHC0 = 2435.444 PHC1 = 507.6879 SI = 64K 
       data hash MD5: 64K
       8C CE 0F EE 3C 3F 78 C4 14 0A 1B 42 33 A4 0E 86>)
(   3,<2024-10-11 16:10:47.67 +0400>,<she>,<DPX200>,
      <pk PHC0 = 185.1432 PHC1 = -339.9999 
       data hash MD5: 64K
       9C BF BB 31 63 C3 C0 C5 DD 56 73 E6 D2 B8 52 EF>)
(   4,<2024-10-11 16:10:52.28 +0400>,<she>,<DPX200>,
      <abs ABSG = 5 
       data hash MD5: 64K
       5A B3 4E 8F 05 58 6A 5E B3 DA E9 20 C1 C9 0C C9>)
$$ ##END=
$$ 
$$ hash MD5
$$ 76 13 4A 15 CC 18 76 60 B4 82 93 6E 52 6C 04 97
##$RELAX= 
##$RELAX= 
##$RELAX= 
##$RELAX= 
##$RELAX= 
##$RELAX= 
##$RELAX= 
##$RELAX= 
$$ Bruker specific parameters
$$ --------------------------
##$DU= <F:/spectra>
##$EXPNO= 2
##$NAME= <P31>
##$PROCNO= 1
##$TYPE= <nmr>
##$USER= <she>
##$AMP= (0..31)
100 100 100 100 100 100 100 100 100 100 100 100 100 100 100 100 100 100 
100 100 100 100 100 100 100 100 100 100 100 100 100 100 
##$AQSEQ= 0
##$AQ_mod= 1
##$AUNM= <au_zg>
##$AUTOPOS= <>
##$BF1= 81.014009
##$BF2= 200.13
##$BF3= 200.13
##$BF4= 200.13
##$BF5= 200.13
##$BF6= 200.13
##$BF7= 200.13
##$BF8= 200.13
##$BYTORDA= 1
##$CFDGTYP= 0
##$CFRGTYP= 5
##$CHEMSTR= <none>
##$CNST= (0..31)
1 1 145 1 1 1 1 1 1 1 1 1 1 1 1 1 1 1 1 1 1 1 1 1 1 1 1 1 1 1 1 1 
##$CPDPRG= <waltz16>
##$CPDPRG1= <>
##$CPDPRG2= <waltz16>
##$CPDPRG3= <>
##$CPDPRG4= <mlev>
##$CPDPRG5= <mlev>
##$CPDPRG6= <mlev>
##$CPDPRG7= <mlev>
##$CPDPRG8= <mlev>
##$CPDPRGB= <>
##$CPDPRGT= <>
##$D= (0..31)
0 1 0 0 0 0 0 0 0 0.06 0 0.03 2e-05 3e-06 0 0 0.0002 0 0 0 0 0 0 0 0 0 
0 0 0 0 0 0 
##$DATE= 1728648615
##$DBL= (0..7)
120 120 120 11 120 120 24 19 
##$DBP= (0..7)
150 150 150 150 150 150 150 150 
##$DBP07= 0
##$DBPNAM0= <>
##$DBPNAM1= <>
$$ [...]
##$SUBNAM3= <"">
##$SUBNAM4= <"">
##$SUBNAM5= <"">
##$SUBNAM6= <"">
##$SUBNAM7= <"">
##$SUBNAM8= <"">
##$SUBNAM9= <"">
##$SW= 400.765351723535
##$SWIBOX= (0..15)
0 1 3 0 0 0 0 0 0 0 0 0 0 0 0 0 
##$SW_h= 32467.5324675325
##$TD= 32768
##$TD0= 1
##$TE= 0
##$TE2= 300
##$TE3= 300
##$TEG= 300
##$TL= (0..7)
0 120 53 12 22 120 120 120 
##$TP= (0..7)
150 150 150 150 150 150 150 150 
##$TP07= 0
##$TPNAME0= <>
##$TPNAME1= <>
##$TPNAME2= <>
##$TPNAME3= <>
##$TPNAME4= <>
##$TPNAME5= <>
##$TPNAME6= <>
##$TPNAME7= <>
##$TPOAL= (0..7)
0.5 0.5 0.5 0.5 0.5 0.5 0.5 0.5 
##$TPOFFS= (0..7)
0 0 0 0 0 0 0 0 
##$TUNHIN= 0
##$TUNHOUT= 0
##$TUNXOUT= 0
##$USERA1= <user>
##$USERA2= <user>
##$USERA3= <user>
##$USERA4= <user>
##$USERA5= <user>
##$V9= 5
##$VALIST= <valist>
##$VCLIST= <CCCCCCCCCCCCCCC>
##$VD= 0
##$VDLIST= <DDDDDDDDDDDDDDD>
##$VPLIST= <PPPPPPPPPPPPPPP>
##$VTLIST= <TTTTTTTTTTTTTTT>
##$WBST= 1024
##$WBSW= 4
##$XGAIN= (0..3)
0 0 0 0 
##$XL= 0
##$YL= 0
##$YMAX_a= 10711
##$YMIN_a= -13180
##$ZGOPTNS= <>
##$ZL1= 120
##$ZL2= 120
##$ZL3= 120
##$ZL4= 120
##$ABSF1= 198.0616
##$ABSF2= -202.7028
##$ABSG= 5
##$ABSL= 3
##$ALPHA= 0
##$AQORDER= 0
##$ASSFAC= 0
##$ASSFACI= 0
##$ASSFACX= 0
##$ASSWID= 0
##$AUNMP= <proc_1d>
##$AZFE= 0.1
##$AZFW= 0.5
##$BCFW= 0
##$BC_mod= 2
##$BYTORDP= 0
##$COROFFS= 0
##$CY= -3
##$DATMOD= 1
##$DC= 0
##$DFILT= <>
##$DTYPP= 0
##$F1P= 0
##$F2P= 0
##$FCOR= 1
##$FTSIZE= 65536
##$FT_mod= 6
##$GAMMA= 0
##$GB= 0
##$INTBC= 1
##$INTSCL= 9.790993e-09
##$ISEN= 30
##$LB= 1.5
##$LEV0= 0
##$LPBIN= 0
##$MAXI= 10000
##$MC2= 0
##$MEAN= 0
##$ME_mod= 0
##$MI= 50
##$NCOEF= 0
##$NC_proc= -6
##$NLEV= 6
##$NOISF1= 182.463
##$NOISF2= 159.3651
##$NSP= 0
##$NTH_PI= 0
##$NZP= 0
##$OFFSET= 198.0616
##$PC= 4
##$PHC0= 2620.587
##$PHC1= 167.688
##$PH_mod= 1
##$PKNL= yes
##$PPARMOD= 0
##$PSCAL= 0
##$PSIGN= 0
##$REVERSE= no
##$SF= 81.0140089999434
##$SI= 65536
##$SIGF1= 159.3651
##$SIGF2= -187.1042
##$SINO= 113.3802
##$SIOLD= 16384
##$SREGLST= <1H.CDCl3>
##$SSB= 0
##$STSI= 65536
##$STSR= 0
##$SW_p= 32467.5324675325
##$SYMM= 0
##$S_DEV= 0
##$TDeff= 32768
##$TDoff= 0
##$TI= <>
##$TILT= no
##$TM1= 0
##$TM2= 0
##$TOPLEV= 0
##$USERP1= <user>
##$USERP2= <user>
##$USERP3= <user>
##$USERP4= <user>
##$USERP5= <user>
##$WDW= 1
##$XDIM= 65536
##$YMAX_p= 576087443
##$YMIN_p= -4761174
$$ End of Bruker specific parameters
$$ ---------------------------------
##NTUPLES= NMR SPECTRUM
##VAR_NAME=  FREQUENCY,     SPECTRUM/REAL,   SPECTRUM/IMAG
##SYMBOL=    X,             R,               I
##VAR_TYPE=  INDEPENDENT,   DEPENDENT,       DEPENDENT
##VAR_FORM=  AFFN,          ASDF,            ASDF
##VAR_DIM=   65536,         65536,           65536
##UNITS=     HZ,            ARBITRARY UNITS, ARBITRARY UNITS
##FACTOR=    0.49542278885378, 1,            1
##FIRST=     16045.7642231865, 0,            0
##LAST=      -16421.768244346, 0,            0
##MIN=       -16421.768244346, -4761174,     0
##MAX=       16045.7642231865, 576087443,    0
$$ Real data points
##PAGE= N=1
##DATA TABLE= (X++(R..R)), XYDATA
$$ [...]
43082a472105J96430O86705L83360k23656l79251j8940L60127M60730M24820M34133
$$ -1472105 -1275675 -588970 -205610 -429266 -808517 -827457 -467330 -6600 418220 852353
43072H52353M15957J93083k52017p21663r47392p88940l35080J88740N97061P93506
$$ 852353 1268310 1461393 1209376 487713 -459679 -1248619 -1583699 -1394959 -797898 -4392
43062d392P19544M11275R6164K7207J47564J15726k10597n08040m04324j4510
$$ -4392 715152 1126427 1222591 1249798 1397362 1513088 1302491 794451 390127 375617
43052C75617K04773P7704j05932p6289J6534j44058n40896p77076n16407J42433
$$ 375617 580390 658094 552162 475873 492407 348349 -192547 -969623 -1486030 -1343597
43042a343597P43887Q75352M93337r5737n27773o21206l76735R3102N26656N65715
$$ -1343597 -599710 275642 768979 673242 145469 -475737 -852472 -759370 -232714 333001
43032C33001J03552m43361m86184L6539N47993N33801J13166k51108l51013k67523
$$ 333001 436553 -6808 -492992 -456453 91540 625341 738507 487399 136386 -131137
43022a31137k4219L90718P16893N59439n8555o04586o55745l58519j10042l1636
$$ -131137 -155356 235362 952255 1511694 1453139 848553 192808 -165711 -275753 -307389
43012c07389N384L0601l4841j18339l7283J78480K69700J25764n4886r8972j28156
$$ -307389 -302005 -271404 -306245 -424584 -461867 -283387 -13687 112077 57191 -41781 -169937
43001a69937k97957m50755l25196l6486P856k57076l58494M5334N88220O54107
$$ -169937 -467894 -918649 -1243845 -1280331 -1272475 -1529551 -1888045 -1842711 -1254491 -600384
42991f00384K56764J5256K42435N20937L70859n9491k89677k14688j26637j72401
$$ -600384 -343620 -328364 -85929 435008 805867 746376 456699 242011 115374 -57027
42981e7027j89850p4770L0955j1437j47901k62451l07289k58837j20099P221K8006
$$ -57027 -246877 -321647 -290692 -302129 -450030 -712481 -1019770 -1278607 -1398706 -1391485 -1363479
42970a363479L7919K05387M63350N49517L92230K14616J82468J86913P6161j26937
$$ -1363479 -1325560 -1120173 -656823 -107306 284924 499540 682008 868921 945082 818145
42960H18145l50193n73377o66909m00106J64618N20666K63814l48861o92040n39655
$$ 818145 467952 -105425 -772334 -1172440 -1007822 -487156 -223342 -572203 -1264243 -1803898
42950a803898k20709l7730J04914L72086O05625N23710J80849m8715K0661J06676
$$ -1803898 -2024607 -2062337 -1957423 -1585337 -979712 -456002 -275153 -323868 -303207 -196531
42940a96531j55105o38421p73840k60963M57763O76884L18079K4524K66800O74132
$$ -196531 -351636 -990057 -1763897 -2024860 -1567097 -890213 -572134 -547610 -280810 393322
42930C93322N53402j17194o38254n51329k11878j57890k61746J5886O41807Q63803
$$ 393322 946724 829530 191276 -360053 -571931 -729821 -991567 -975681 -333874 529929
42920E29929K70653m74723m30830L39349Q44787M95602k21279n51473m10610j79818
$$ 529929 800582 325859 -104971 234378 1079165 1574767 1353488 802015 391405 211587
42910B11587k1205J28790J85129M7053o9707Q1702K90807J69170j93117l66539
$$ 211587 190382 319172 504301 551354 481647 563349 854156 1023326 830209 463670
42900D63670k90808k71931l22198j67248M8507j79752p50250q29863r1666O47192
$$ 463670 172862 -99069 -421267 -588515 -540008 -719760 -1470010 -2299873 -2391539 -1744347
42890a744347N71693K0224j69609P8541K57360K99633N25673P75469N15195j84541
$$ -1744347 -1172654 -1152430 -1322039 -1243498 -986138 -686505 -160832 614637 1129832 945291
42880I45291o13562m79440k37296j99736q9570K35759L67768R7243q1774K11498
$$ 945291 331729 -147711 -385007 -584743 -674313 -438554 -70786 26457 -55317 156181
42870A56181M71985M9527p11713q58392k15126L76667K81662j42204k24067R4771
$$ 156181 628166 677693 -34020 -892412 -1107538 -730871 -449209 -591413 -815480 -720709
42860g20709L90089M48221M06645L72274K79910R9964q7243k25679k91694k01905
$$ -720709 -330620 117601 524246 896520 1176430 1276394 1189151 963472 671778 469873
42850D69873O5938K86437J90027j11820j94700P4969K97873J04329l06438m78440
$$ 469873 535811 822248 1012275 900455 705755 780724 1078597 1182926 876488 398048
42840C98048l45947k11397j98458j27578P5890K29148K05658Q0123q7634k89606
$$ 398048 52101 -159296 -357754 -485332 -409442 -180294 25364 105487 17853 -271753
42830b71753l61141j26677J74392O6144l92997n11979N9659P22394P13017J28372
$$ -271753 -632894 -759571 -585179 -519035 -912032 -1424011 -1364352 -641958 71059 199431
42820A99431l24567l17262j07103M9950J30883O2214k58420o19759o18571j95164
$$ 199431 -125136 -442398 -549501 -499551 -368668 -306454 -564874 -1184633 -1803204 -1998368
42810a998368K94828N57438N78507M01817Q0497j47868l9242K59711L61159K06512
$$ -1998368 -1703540 -1146102 -567595 -165778 -85281 -233149 -272391 -12680 348479 554991
42800E54991R7920J44130J28536K143J3631J82716J33312k84241o40761n32932
$$ 554991 652911 797041 925577 927720 941351 1124067 1257379 973138 332377 -200555
42790b00555j79436l3849q6175K5597L70369O05460M74273J05200k17131l62259
$$ -200555 -379991 -413840 -500015 -474418 -104049 501411 975684 1080884 863753 501494
42780E01494l88142l89773l59960j97713R9615L05867K02237o2434r4298J87924
$$ 501494 113352 -276421 -636381 -834094 -734479 -428612 -226375 -288809 -383107 -195183
42770a95183L76683J11169m24817p31879n73843j57259J47871J19111j77331m18327
$$ -195183 181500 292669 -132148 -864027 -1437870 -1595129 -1447258 -1328147 -1505478 -1923805
42760a923805k82255K09876O68141P06567K90236k66051n37042k97750K16308
$$ -1923805 -2206060 -1996184 -1328043 -621476 -331240 -597291 -1134333 -1432083 -1215775
42751a215775M41450J30247k42525p7010M49934O02222K19017j9341L04869O34703
$$ -1215775 -774325 -644078 -886603 -963613 -513679 88543 307560 288219 593088 1227791
42741A227791L04574m01588o76327l46644M3101J42157J46617K42718K65874O1325
$$ 1227791 1532365 1130777 454450 107806 150907 293064 439681 682399 948273 1009598
42731A009598k14913l24021k25138l0821J32981J85358J54326J52791J69988K2907
$$ 1009598 794685 470664 245526 214705 347686 533044 687370 840161 1010149 1033056
42721A033056l01615m53353j58919L10655M64299K58913N5974L693r0401k76475
$$ 1033056 731441 278088 119169 429824 894123 1153036 1209010 1212703 1122302 845827
42711H45827l15761j19045O9785P4975K5945L3132m2673k83293m48886k82729
$$ 845827 530066 411021 480806 555781 581726 614858 572185 288892 -159994 -442723
42701d42723Q0701K50973O8070j98015j33776L52906Q24499O68410j81471r84229
$$ -442723 -362022 -111049 -42979 -240994 -374770 -21864 802635 1471045 1289574 305345
42691C05345r28457r3724O44517O88691L20918J12593J39500Q9280j25701k63394
$$ 305345 -623112 -716836 -72319 616372 937290 1049883 1189383 1278663 1152962 889568
42681H89568j91660r4977j70907l33105l47029j75674m6855j29652k48964r2871
$$ 889568 697908 602931 432024 98919 -248110 -423784 -470639 -600291 -849255 -942126
42671i42126L04284N36475L97141J86160J97760K05628j14982m88311l59090J61380
$$ -942126 -637842 -101367 295774 481934 679694 885322 770340 282029 -77061 84319
42661H4319L56479J6695k34850k6041R0051m03305r63430p00027K46398Q69625
$$ 84319 440798 457493 222643 196602 286653 -116652 -1080082 -1780109 -1533711 -664086
42651f64086P13046L16495K11199K43729J27813M201Q5010K23374J99964O0985
$$ -664086 48960 365455 576654 820383 948196 952397 1037407 1260781 1460745 1521730
42641A521730j35838n14579r73480r96796l41486M16795N61667K22883R7323L41095
$$ 1521730 1385892 871313 -102167 -1098963 -1440449 -1023654 -461987 -239104 -141781 199314
42631A99314M25566J20659q8796J79574N61945N08325O3404l19301m28702l62062
$$ 199314 624880 745539 656743 836317 1398262 1906587 1969991 1650690 1221988 859926
42621H59926j93757J6433P5931r5836k49690k01320k15847n35505p51999k82275
$$ 859926 666169 682602 758533 662697 413007 211687 -4160 -539665 -1291664 -1573939
42611a573939O11851R94621N51695J0281Q255K22453N4936l93567o06490m90365
$$ -1573939 -962088 32533 584228 594509 602764 825217 880153 486586 -119904 -610269
42601f10269l23981j57399J28298L53297K41185j1283N0261L94311N37838L18241
$$ -610269 -934250 -1091649 -963351 -610054 -368869 -380152 -329891 64420 602258 920499
42591I20499O4043m3338j90592m06739m08461j61789l0936j20022l5777L61316
$$ 920499 984542 941204 750612 343873 -64588 -226377 -257313 -377335 -413112 -51796
42581e1796N34853P2004n59154o02835l8012N28099P19147O00977K68838j85652
$$ -51796 483057 555061 -4093 -606928 -644940 -116841 602306 1203283 1472121 1286469
42571A286469m39151k55389M3293r874k28602l6454M91240N89714k8207o83486
$$ 1286469 847318 591929 635222 625348 396746 360292 851532 1441246 1413039 729553
42561G29553p17706l27869k2512J54472L45609L48996j930k98911o5943M36286
$$ 729553 11847 -316022 -338534 -184062 161547 510543 508613 209702 143759 580045
42551E80045N65343K75617O0883L6210j62772n33109n47115o8071K84832M4222
$$ 580045 1145388 1421005 1481888 1518098 1355326 822217 275102 207031 491863 536085
42541E36085m25905n66475m09536k58719o2374L25293O20789M68853Q7362m8279
$$ 536085 110180 -456295 -865831 -1124550 -1186924 -861631 -240842 228011 315373 267094
42531B67094J2603j44944m79447n17575k06867l9851j83212j70685K46850N78879
$$ 267094 279697 134753 -344694 -862269 -1069136 -1108987 -1292199 -1462884 -1216034 -637155
42521f37155L60271p5689j31115J16242J10198k43645m46731j99995K09183M16595
$$ -637155 -276884 -352573 -483688 -367446 -257248 -500893 -947624 -1147619 -938436 -521841
42511e21841M36415M28145L61991J64191l5134n8956L1409K7933j10252k27529
$$ -521841 -85426 342719 704710 868901 833767 774811 806220 834153 723901 496372
42501D96372k30610j91017j67774j07796o965j4228k21268m42545l92196m8741
$$ 496372 265762 74745 -93029 -200825 -207790 -222018 -443286 -885831 -1278027 -1326768
42491a326768L38131N79408O59370N22768P5357m79326o40996k07558L88100O14849
$$ -1326768 -988637 -409229 250141 772909 848266 368940 -272056 -479614 -91514 523335
42481E23335M59355J83857k07723p43019r66326l70637O48586J011989L66077
$$ 523335 982690 1166547 958824 215805 -750521 -1121158 -472572 539417 905494
42472I05494l74607k76470L73057N94311R7755m62538m61810L287M05511L79879
$$ 905494 530887 254417 627474 1221785 1319540 857002 395192 398479 803990 1183869
42462A183869m2663n35138p34251n39526j82690M1980M0931j07580k72842k85808
$$ 1183869 1141206 606068 -128183 -667709 -850399 -808419 -767488 -875068 -1147910 -1433718
42452a433718k7347L82485O48109O33180M56096K30639j7622j44662L1363L27684
$$ -1433718 -1461065 -1078580 -430471 202709 658805 889444 871822 727160 758523 1086207
42442A086207K78422j88978n57729m41688r8673O3296P9141J59623K10755N6563
$$ 1086207 1364629 1175651 617922 176234 77561 140857 219998 379621 590376 646939
42432F46939j45234j29615O6303K70857M80801O56293N47511J17982k09655j64218
$$ 646939 501705 372090 438393 709250 1190051 1846344 2393855 2511837 2302182 2137964
42422B137964j07744m10831p41153n84068j32914K9331j16805j14276J08543K00460
$$ 2137964 2030220 1619389 878236 294168 161254 190585 73780 -40496 68047 268507
42412B68507J07235R2613Q6443k41860p23810p42656j82945L32418L49674J41983
$$ 268507 375742 468355 554798 312938 -410872 -1153528 -1336473 -1004055 -654381 -512398
42402e12398J23595K17057J12120j79026l07498o824N67714Q92504O05875L2599
$$ -512398 -388803 -171746 -59626 -238652 -546150 -552974 14740 907244 1513119 1545718
42392A545718j50576J26663K41313l0046q5309L58568N53878o0074p43152n75883
$$ 1545718 1395142 1521805 1763118 1733072 1647763 2006331 2560209 2500135 1756983 1181100
42382A181100L8431J86204Q0006M66859R51914N51532l83197n17828K69018P44538
$$ 1181100 1219531 1405735 1485741 1952600 2904514 3456046 3072849 2555021 2824039 3568577
42372C568577M22982J06299J97423J98908R2897M75610J106222J133793R21068
$$ 3568577 3991559 4097858 4295281 4494189 4587086 5062696 6168918 7302711 8223779
42363H223779J619205K808415K953442K407799L098668M862865N732120O730709
$$ 8223779 9842984 12651399 15604841 18012640 21111308 25974173 31706293 38437002
42355C8437002J1535669J8627837J8872062O325219j1607446k1070805j7732355
$$ 38437002 49972671 68600508 87472570 93797789 82190343 61119538 43387183
42348D3387183r926903o103877n718278m416597k080658j453673k505256k764922
$$ 43387183 33460280 27356403 21638125 17221528 15140870 13687197 11181941 8417019
42340H417019j629482o84872n72644m75671k49997n82557j218038j099891k44096
$$ 8417019 6787537 6102665 5530021 5054350 4804353 4221796 3003758 1903867 1659771
42331A659771K34837l9625l22825k14701j64132l92884m78358k17973J7878L467
$$ 1659771 1894608 1854983 1532158 1317457 1153325 760441 282083 64110 81988 85455
42321H5455m216J84415L77971L70781K07684L4090l4212M4553J33251N0537o0859
$$ 85455 81239 265654 643625 1014406 1222090 1256180 1221968 1266521 1399772 1450309 1389450
42310A389450J34929N13773M76695j55852p86666r03605p25370o16121m65348
$$ 1389450 1524379 2038152 2514847 2358995 1572329 668724 -56646 -672767 -1138115
42301a138115j05773K32896L72464N30460P59399O66963J99341J0220M26409P42002
$$ -1138115 -1243888 -1010992 -638528 -108068 651331 1318294 1517635 1527855 1954264 2696266
42291B696266K93675m05226m67427k1599J38144j26407k96460k39655l06906n23205
$$ 2696266 2989941 2584715 2117288 2095689 2233833 2107426 1810966 1571311 1264405 741200
42281G41200n34402l03935j36536p5554P8278K58015K49428J66991K25428K52161
$$ 741200 206798 -97137 -233673 -309227 -230949 27066 276494 443485 668913 921074
42271I21074M1765p7649K57831O39997L80491l52668p13750m18479j344J45646
$$ 921074 962839 885190 1143021 1783018 2163509 1810841 1097091 678612 677268 822914
42261H22914J99625L18102L61558L09879L10995K41841j61906o96338q37939n45974
$$ 822914 1022539 1340641 1702199 2012078 2323073 2564914 2403008 1706670 868731 322757
42251C22757k89546k36962q0221K52286L80000J22809k24018m09980m76365l97713
$$ 322757 33211 -203751 -283972 -31686 348314 471123 247105 -162875 -639240 -1036953
42241a036953o5860K69298J58708l03490m92200j62817K29854K78555J01698q5331
$$ -1036953 -1102813 -833515 -674807 -978297 -1470497 -1633314 -1403460 -1124905 -1023207 -1108538
42231a108538k63765k82560J28149P46856Q70264K64015m22772n16098j10058
$$ -1108538 -1372303 -1654863 -1526714 -779858 90406 354421 -68351 -584449 -694507
42222f94507K86271M04095K21148j96321n36226l82202J82786N61219M87523L65458
$$ -694507 -408236 -4141 217007 20686 -515540 -897742 -714956 -153737 333786 699244
42212F99244M69915M33139k5401m49056l13179J23547K67915J17958P9807J44311
$$ 699244 1169159 1602298 1576897 1127841 814662 938209 1206124 1324082 1403889 1548200
42202A548200n4786m99900p56226o41709l77060j00005K30778M52044K79225j27620
$$ 1548200 1493414 993514 237288 -404421 -781481 -881486 -650708 -198664 80561 -47059
42192d7059j97287K63266P40639P10051L08563M6015J22209L43742N37862O99472
$$ -47059 -244346 18920 759559 1469610 1778173 1824188 1946397 2290139 2828001 3527473
42182C527473P66353N70273J12774l22179m80160m35944m31559n22612n89995
$$ 3527473 4293826 4864099 4976873 4654694 4174534 3738590 3307031 2784419 2194424
42173B194424o30079p42883q13824n62089n9037J67625j51263n17750k92871L83128
$$ 2194424 1564345 821462 7638 -554451 -613488 -445863 -597126 -1114876 -1407747 -1024619
42163a024619P86909O13033K42958K6687j30191l28030l61650j19043J22953J05626
$$ -1024619 -237710 375323 618281 644968 514777 186747 -174903 -293946 -170993 -65367
42153f5367k3840j4634P0832K5860j42409k94835m03858m59283l21848M7048L58483
$$ -65367 -89207 -103841 -33009 -7149 -149558 -444393 -848251 -1307534 -1629382 -1582334 -1223851
42142a223851L03708J8740m5969K69131O03023N52343K20874R0739L23151M15128
$$ -1223851 -920143 -901403 -947372 -678241 -75218 477125 697999 788738 1111889 1527017
42132A527017j65029j076444j306259m71673N48373P10747J38173k52654j42726
$$ 1527017 1361988 285544 -1020715 -1492388 -944015 -233268 -95095 -347749 -490475
42123d90475k4866j27134m0149L92736O58137M19739P4436K9438O5876q8250j62939
$$ -490475 -515341 -642475 -682624 -289888 368249 787988 862424 891862 957738 869488 706549
42112G06549Q4258K40392j29700o31232n65182m0874J90068j08571l86633k16975
$$ 706549 790807 1031199 901499 270267 -294915 -335789 -145721 -254292 -640925 -857900
42102h57900J56013L14104K23990J16900J37273K60587L69276L52060K31760J26169
$$ -857900 -701887 -387783 -163793 -46893 90380 350967 720243 1072303 1304063 1430232
42092A430232J5289k25321m46050k53594L22593O19877K08421m26252n69947k75918
$$ 1430232 1445521 1220200 774150 520556 843149 1463026 1671447 1245195 675248 399330
42082C99330p4580l9716J13389K49551j3737m54248m51312p0161k7991m29778
$$ 399330 324750 285034 398423 647974 634237 179989 -271323 -341484 -369475 -799253
42072g99253n01461P3896N09971J83029l02543j04643M49516M00819k58387n41962
$$ -799253 -1300714 -1226818 -716847 -533818 -836361 -941004 -491488 -90669 -349056 -891018
42062h91018K2438P31578P63465K12867k63892l55457k50129j58887p5230M3018
$$ -891018 -868580 -137002 626463 839330 575438 219981 -30148 -189035 -264265 -221247
42052b21247J13762K0917k13146l97047l49266j21307L6983l515p5350K4114K17821
$$ -221247 -107485 -86568 -299714 -696761 -1046027 -1167334 -1130351 -1133866 -1209216 -1185102 -967281
42041i67281K95321K85072L98881N99370N46731J23500k69493k10367J29056K06877
$$ -967281 -671960 -386888 11993 611363 1158094 1281594 1012101 801734 930790 1137667
42031A137667j05132l43132j56578J70875J70360j02204j87081M5766J95291o8521
$$ 1137667 1032535 689403 532825 703700 874060 771856 584775 630541 825832 757311
42021G57311n40383p73098n85921j22332L71384O40082N01187O5051k65007k21509
$$ 757311 216928 -556170 -1142091 -1264423 -893039 -252957 248230 313281 48274 -173235
42011a73235K1297J50463J48800J81507K17664R8194r5886q9559J58985L72373
$$ -173235 -151938 -1475 147325 328832 546496 644690 548804 459245 618230 990603
42001I90603L36288J12506j66556m56708o84213p02113m67497j05706K46606N07363
$$ 990603 1326891 1439397 1272841 816133 131920 -570193 -1037690 -1143396 -896790 -389427
41991c89427N72412L97952J70422J39019K35826J35015k33668n22586m53657j98034
$$ -389427 182985 580937 751359 890378 1126204 1261219 1027551 504965 51308 -146726
41981a46726r1643k08098m07035n79842o20521l66576J44197N14049M05854M8337
$$ -146726 -238369 -446467 -853502 -1433344 -2053865 -2420441 -2276244 -1762195 -1356341 -1308004
41971a308004n526L71452O87307M86696n7078l88972k65918Q934L1325k01512
$$ -1308004 -1313530 -942078 -254771 231925 174847 -214125 -480043 -471109 -439784 -641296
41961f41296l38777j59236J50995K68226J47968Q265l5145q1403j63951j18693
$$ -641296 -980073 -1139309 -988314 -720088 -572120 -563855 -599000 -680403 -844354 -963047
41951i63047J25034L38338K88547Q7009M741N6919M3677o2579q3982o375o3196
$$ -963047 -838013 -499675 -211128 -124119 -119378 -62459 -18782 -81361 -165343 -171718 -234914
41940b34914l38538n54347m24874k9769L33812N05784N07225M01291L00779L48597
$$ -234914 -573452 -1127799 -1552673 -1582442 -1248630 -742846 -235621 165670 466449 815046
41930H15046M69859L20281k29583p32365o88696l26820l33054p65564q54778j69654
$$ 815046 1284905 1605186 1375603 643238 -45458 -372278 -705332 -1470896 -2325674 -2495328
41920b495328N99227N54086j12108m02044P3680O65993O99222K66683j63821l67989
$$ -2495328 -1896101 -1342015 -1454123 -1856167 -1782487 -1116494 -417272 -150589 -314410 -682399
41910f82399l05195O3766N29216O06168J73324j90957L3151M98177M80280j6011
$$ -682399 -987594 -923828 -394612 211556 384880 193923 227074 725251 1205531 1189520
41900A189520k87739n6313J15227k44088p35814o75933j00224L07712J60648k09551
$$ 1189520 901781 845468 960695 716607 -19207 -695140 -795364 -487652 -327004 -536555
41890e36555l04712p5317J67847K23634J70599J50764J68706J31723j3541k33212
$$ -536555 -841267 -916584 -748737 -525103 -354504 -203740 -35034 96689 83148 -150064
41880a50064m37436n08223l35534R5743O30398R85526R03293L12159n72423j272689
$$ -150064 -587500 -1095723 -1431257 -1335514 -705116 280410 1183703 1495862 923439 -349250
41870c49250j307747o18366K63909O50460L82963k7102k1697L71758O64592N54868
$$ -349250 -1656997 -2275363 -2011454 -1360994 -978031 -1005133 -1026830 -655072 9520 564388
41860E64388K29506M070j05136k66847m14948k43192K82161O69066M45475j64667
$$ 564388 793894 797964 692828 425981 11033 -232159 50002 719068 1164543 999876
41850I99876m81068k87990q2935k48313m49711k39772J32743Q6246l30659m80284
$$ 999876 518808 230818 147883 -100430 -550141 -789913 -657170 -570924 -901583 -1381867
41840a381867j19954K76654L00164J34869Q5917Q8691M786k395K49437N81182
$$ -1381867 -1501821 -1225167 -925003 -790134 -704217 -615526 -610740 -613135 -363698 217484
41830B17484O73810M75700J66294q4563j59773m4084L0081k23968o72806q17750
$$ 217484 891294 1366994 1533288 1448725 1288952 1244868 1274949 1050981 378175 -439575
41820d39575m68935J2264K89997M16180M25576J20350m13630o25110k75699R0519
$$ -439575 -908510 -896246 -606249 -190069 235507 355857 -57773 -682883 -958582 -868063
41810h68063n1551l97705l50814O2571M09361N90365P16441N97844O8251m43962
$$ -868063 -919614 -1317319 -1668133 -1605562 -1196201 -605836 110605 708449 776700 332738
41800C32738l82563Q6883L54523K86250J93898J11509j60088m60355m68168l37280
$$ 332738 -49825 37058 391581 677831 871729 983238 823150 362795 -105373 -442653
41790d42653l87283l66997J27887P04789O31087J30553J19727O14818N93183k99557
$$ -442653 -829936 -1196933 -1069046 -364257 266830 397383 517110 1131928 1725111 1425554
41780A425554j072205q82158j77978K06259J86406O4979j31524l16098r2234N14704
$$ 1425554 353349 -528809 -706787 -500528 -314122 -249143 -380667 -696765 -788999 -274295
41770b74295P69859L05729k09120j50143L7928k86648p15437m06627M57388Q33145
$$ -274295 495564 801293 592173 442030 479958 193310 -522127 -928754 -471366 361779
41760C61779K88342n33878q83661o49180j38617L14529M97561M53543M21871M19112
$$ 361779 650121 116243 -767418 -1416598 -1555215 -1240686 -743125 -289582 132289 551401
41750E51401J48605m12279p65398o21122l91054m47937m08083J80505Q84496R25586
$$ 551401 700006 287727 -477671 -1098793 -1489847 -1937784 -2345867 -2165362 -1280866 -355280
41740c55280L83107L2936J53347K97717J88484N7596N3457j747j59016k14475
$$ -355280 27827 60763 214110 511827 700311 757907 811364 809617 650601 436126
41730D36126j18422l5867J1922J06692Q9704k34342o00034n21097j9671L81042
$$ 436126 317704 281837 293759 400451 490155 255813 -344221 -865318 -884989 -503947
41720e03947L78169J35132j34343l36736l23854n4386J48623P341j81691J627
$$ -503947 -125778 9354 -124989 -461725 -785579 -839965 -691342 -684001 -865692 -864065
41710h64065L03796J61057k73627l07233R5631K11181j79083l55205J36261O83211
$$ -864065 -560269 -399212 -672839 -980072 -884441 -673260 -852343 -1207548 -1071287 -388076
41700c88076N49835m4591l76074k41317M5594K89347M70992M35117N8532l95520
$$ -388076 161759 117168 -258906 -500223 -454629 -165282 305710 740827 799359 403839
41690D03839n12674k52311N0272J19090m5506k79411m01227l32172j67999l0134
$$ 403839 -108835 -361146 -310874 -191784 -237290 -516701 -917928 -1250100 -1418099 -1448233
41680a448233J36515M00959N39548K58284k60385m69876k27151J0435n7722j00348
$$ -1448233 -1311718 -910759 -371211 -112927 -373312 -843188 -1070339 -1059904 -1117626 -1217974
41670a217974K48544P25566P82969L43955j63061l60248k03118J45584M38039
$$ -1217974 -969430 -243864 539105 883060 719999 359751 156633 302217 740256
41661G40256M34691J10307k85869n00355n00285l60224j23027J14582J89629Q6942
$$ 740256 1174947 1285254 999385 499030 -1255 -361479 -484506 -369924 -180295 -93353
41651i3353j9581m8436j17897k65067l16947k00380j27144k63226m20108k97789
$$ -93353 -112934 -161370 -279267 -544334 -861281 -1061661 -1188805 -1452031 -1872139 -2169928
41641b169928J03664M93480O01426L69253k5442k40827l5481M23993O62107L91890
$$ -2169928 -2066264 -1572784 -971358 -602105 -627547 -868374 -903855 -479862 182245 574135
41631E74135k01102o83667p23965k58450M29679Q03616N49139L471j85432J31588
$$ 574135 373033 -310634 -1034599 -1293049 -863370 -59754 489385 492856 307424 439012
41621D39012M55378L47756o3071l73708l54148j5937M04480M49041j49854r30101
$$ 439012 894390 1242146 1179075 805367 451219 435282 839762 1288803 1138949 208848
41611B08848j041862l44674L04243J56775m69391p24809l48674K04770N14069
$$ 208848 -833014 -1177688 -873445 -716670 -1186061 -1910870 -2259544 -2054774 -1540705
41602a540705N77561N25096L51714K8368l15874m27512j76732K04176K85246J4483
$$ -1540705 -963144 -438048 -86334 -57966 -373840 -801352 -978084 -773908 -488662 -474179
41592d74179j05381K33543M99637L5409p71338q63867r1542N29374L74549M3750
$$ -474179 -579560 -346017 153620 189029 -582309 -1446176 -1537718 -1008344 -633795 -590045
41582e90045J56522L01137n7310m70116k80458J27765n0560n71564m37311M68229
$$ -590045 -433523 -132386 -189696 -659812 -940270 -812505 -863065 -1434629 -1871940 -1403711
41572a403711J112462P77546r8525p05619p39228l34734K01963M24520R6631l51843
$$ -1403711 -291249 486297 387772 -317847 -1057075 -1391809 -1189846 -765326 -668695 -1020538
41562a020538k71677K36107M19360K9255l33310k32077l0853j48218l23587j30631
$$ -1020538 -1292215 -1056108 -636748 -607493 -940803 -1172880 -1203733 -1351951 -1675538 -1806169
41552a806169K59651L71375J56813o4804j70445k55992k42860O1949N19075O62819
$$ -1806169 -1546518 -1175143 -1018330 -1083134 -1253579 -1509571 -1752431 -1690482 -1171407 -508588
41542e08588K62460l56720o64208m68085k4309L19491M75388N72007O47922N63542
$$ -508588 -246128 -602848 -1267056 -1735141 -1759450 -1439959 -964571 -392564 255358 818900
41532H18900K68841l7562j74116k30006l31723l16835L9109N44942P06146L54912
$$ 818900 1087741 1050179 876063 646057 314334 -2501 36608 581550 1287696 1642608
41522A642608j46390m11720m49093m44343l97253j95437R2594K32539J39497L6022
$$ 1642608 1496218 1084498 635405 191062 -206191 -401628 -309034 -76495 63002 99024
41512I9024J96111N40194O17605J42312n35341p63407m06704J6529J20310J36443
$$ 99024 295135 835329 1452934 1595246 1059905 296498 -110206 -93677 26633 163076
41502A63076L43967M75798J88149k19129j81820J92547K31681k61030p08107o24831
$$ 163076 507043 982841 1170990 951861 770041 962588 1194269 933239 225132 -399699
41492c99699k18561Q2148J98876K39337J86159O4338R5028L57516N24732K39030
$$ -399699 -618260 -536112 -337236 -97899 88260 152598 247626 605142 1129874 1368904
41482A368904l81071q41612p96927l31125J83354L99178K57761P718j03664j10894
$$ 1368904 987833 146221 -650706 -981831 -798477 -399299 -141538 -133820 -237484 -348378
41472c48378j60491j72487M0689L63212M41716K12716J3928O2551J60904P8786
$$ -348378 -508869 -681356 -640667 -277455 164261 376977 390905 453456 614360 693146
41462F93146q9135j61051j98115l45949n25457n21763k87501J1973J88609J66416
$$ 693146 604011 442960 244845 -101104 -626561 -1148324 -1435825 -1423852 -1235243 -1068827
41452a068827R844j13182p8044O1801J75116K49292L44427M18966M04634L85767
$$ -1068827 -1058983 -1172165 -1250209 -1188408 -1013292 -764000 -419573 -607 404027 789794
41442G89794M48905M22003Q7841l69237n00438k15630R3121J10626r2595l77994
$$ 789794 1238699 1660702 1748543 1379306 878868 663238 756359 866985 774390 396396
41432C96396p31282r90621q32066k75011J87954K46528J93446L72275N63472L44738
$$ 396396 -334886 -1325507 -2157573 -2432584 -2244630 -1998102 -1804656 -1432381 -868909 -524171
41422e24171j84665m97965l47131J9456K89381L84213L33534J65767j0827k9426
$$ -524171 -708836 -1206801 -1553932 -1534476 -1245095 -860882 -527348 -361581 -372408 -401834
41412d01834J58851M21623N49767L77407q5413n36536n54554p1760M41889M79410
$$ -401834 -242983 178640 728407 1105814 1020401 483865 -70689 -142449 299440 778850
41402G78850J05038j66534o9492R2077q5128n02541o34736j97885M36855O47236
$$ 778850 883888 717354 647862 739939 654811 152270 -482466 -680351 -243496 403740
41392D03740L09325q4520j10816N5282Q893k21937k45974N1767L35028L19921
$$ 403740 713065 628545 517729 573011 581904 359967 113993 165760 500788 820709
41382H20709J18209j3713L986R8097J58550O2173k11321m53165m21375j53575
$$ 820709 938918 925205 929191 1027288 1185838 1248011 1036690 583525 162150 8575
41372H575J32002L61677N31138M31689j01939p22625q67994n52013l10238k99691
$$ 8575 140577 502254 1033392 1465081 1363142 640517 -227477 -779490 -1089728 -1389419
41362a389419j10294L49684N22976J55426j09415L24428J003567J057786M65683
$$ -1389419 -1499713 -1150029 -627053 -471627 -581042 -256614 746953 1804739 2270422
41353B270422l2576p6972k8219k12080m62917n19280l93225k16483o4223k2708
$$ 2270422 2237846 2160874 2132655 1920575 1457658 938378 545153 328670 264447 241739
41343B41739j58306l59297m20117k94805r7638R3106K57808L53009L84763M51870
$$ 241739 83433 -275864 -695981 -990786 -1088424 -995318 -737510 -384501 262 452132
41333D52132N50219M97610K42184M2748J03521K29769J14723k16513n17313o76550
$$ 452132 1002351 1499961 1742145 1784893 1888414 2118183 2232906 2016393 1499080 822530
41323H22530o89598m93828j46402N2735m5058j37880O9930L45689K87958J550
$$ 822530 132932 -360896 -507298 -454563 -499621 -637501 -567571 -221882 66076 67626
41313F7626o8726J57389L42650L01206J58170M21j85880k75871j31198Q7972J45799
$$ 67626 -1100 156289 498939 800145 958315 958736 772856 496985 365787 453759 599558
41302E99558J62973L65828N32191K58821k74504m43941j36163P6662j38203m02499
$$ 599558 762531 1128359 1660550 1919371 1644867 1200926 1064763 1141425 1003222 600723
41292F00723l25357r2814k7148n5577M91K5424q8034p8906K89421P06502O30229
$$ 600723 275366 182552 155404 99827 100318 125742 37708 -41198 248223 954725 1584954
41281A584954K4117n86937p60837n46598k52450n3026R6646K76401M18391L44046
$$ 1584954 1609071 1022134 261297 -285301 -537751 -590777 -494131 -217730 200661 544707
41271E44707Q975l58619m73959k97867J31K89179N03962N28154L12492N1375l8368
$$ 544707 553682 195063 -278896 -576763 -576632 -287453 216509 744663 1057155 1108530 1070162
41260A070162o8254k93137o04917n85080j23644L57642M08980J2202n15926q01706
$$ 1070162 1001908 708771 103854 -481226 -604870 -247228 161752 173954 -341972 -1143678
41250a143678n83156N8104N92479N29518N9352j78968j2132O4100k73576o52944
$$ -1143678 -1726834 -1668730 -1076251 -546733 -487381 -666349 -678481 -614381 -887957 -1540901
41240a540901n89545j38697L47417P04803Q60719O48803J33938j98258j4949L38453
$$ -1540901 -2130446 -2269143 -1921726 -1216923 -356204 292599 426537 228279 213330 551783
41230E51783K95482j57278n57506o18069l98034j8118L52520L82950o6600n67409
$$ 551783 847265 689987 132481 -485588 -883622 -901740 -549220 -166270 -232870 -800279
41220h00279n75535k12845r0218l38017l76132J64596P99632Q26496K82947j37216
$$ -800279 -1375814 -1588659 -1678877 -2016894 -2393026 -2228430 -1428798 -602302 -319355 -456571
41210d56571n984L54482L49337j47149o45426n89546J2757N56014M68201j61611
$$ -456571 -462555 -108073 241264 94115 -551311 -1140857 -1128100 -572086 -103885 -265496
41200b65496o74357n65981k8501K93576M6574m16477m27267J97645Q71028Q83477
$$ -265496 -939853 -1505834 -1534335 -1240759 -1194185 -1610662 -2037929 -1840284 -969256 -85779
41190h5779K66176k34933r6037L50926M21876n007m11806m01000j51807j2267
$$ -85779 180397 -54536 -150573 200353 622229 617222 205416 -195584 -347391 -359658
41180c59658L7302K44402N74625O76048L82460k4002k05478k25450l67420n97449
$$ -359658 -322356 -77954 496671 1172719 1555179 1531177 1325699 1100249 732829 135380
41170A35380n41282p2055L89609L83679J4213k29393j37449L1800q97j88022l08236
$$ 135380 -405902 -477957 -88348 295331 309544 80151 -57298 -25498 -26395 -214417 -522653
41159e22653k48552n7281J41114K43105K71906L40382M00742J87269l56580p66695
$$ -522653 -771205 -828486 -687372 -444267 -172361 168021 568763 756032 399452 -367243
41149c67243n59465L6657L11562N2798k15346j00843R3928k7211k86729l05909
$$ -367243 -926708 -890051 -578489 -525691 -741037 -841880 -747952 -775163 -1061892 -1367801
41139a367801j68788j88260k48606L8594N83948P82212L44474k57119l88442k2225
$$ -1367801 -1536589 -1724849 -1973455 -1934861 -1350913 -568701 -224227 -481346 -869788 -892013
41129h92013L21255K55911o7441k34104r6786P7575J645k21976k49951o620K06382
$$ -892013 -570758 -314847 -382288 -616392 -713178 -635603 -633958 -855934 -1105885 -1112505 -906123
41118i06123J65697L1463N2847J93545K40499J11620j21179l44063l76150n3086
$$ -906123 -740426 -708963 -656116 -462571 -222072 -110452 -231631 -575694 -951844 -1004930
41108a004930M59456O80888M13226P7007J11801K88276Q0611m38671o43361k98679
$$ -1004930 -545474 135414 548640 625647 737448 1025724 1106335 667664 24303 -274376
41098b74376J04048J18762m7691K3359L05548M56390L38824P4707k36974n21732
$$ -274376 -170328 -51566 -99257 -75898 229650 686040 1024864 1099571 862597 340865
41088C40865n76161k58609J99707L78331J82263q5225j89748k22107k89148k34566
$$ 340865 -235296 -493905 -294198 84133 266396 181171 -8577 -230684 -519832 -754398
41078g54398J03561N33843O87019M91772K22480P5061m4248k28560l14552j01009
$$ -754398 -650837 -116994 570025 1061797 1284277 1359338 1315090 1086530 771978 670969
41068F70969L15005O10078N86227L17128j49k18648l13924l73054m51106m03230
$$ 670969 985974 1596052 2182279 2499407 2499258 2280610 1966686 1593632 1142526 739296
41058G39296k9662N18070P17066K77343m35482q41672q14303o03806l32349K268
$$ 739296 709634 1227704 1944770 2222113 1786631 944959 130656 -473150 -805499 -803231
41048h03231K00382Q2628l8297K96823Q63120R14540L05279k29375j75581M9932
$$ -803231 -602849 -520221 -558518 -261695 601425 1515965 1821244 1591869 1416288 1466220
41038A466220r6716l93869l21688N8165K94819K63232J07072k09354o89596r39242
$$ 1466220 1369504 975635 653947 712112 1006931 1270163 1377235 1167881 478285 -460957
41028d60957o64819k97618m14868p21554m00901N68699J270953J137515N99750
$$ -460957 -1125776 -1423394 -1838262 -2559816 -2960717 -2392018 -1121065 16450 616200
41019F16200K31785j7623l68963o17562m75543q5179K23095L49075K85219m4947
$$ 616200 847985 830362 461399 -156163 -631706 -716885 -493790 -144715 140504 95557
41009I5557m64657m81936J2683L71043L3712n65905n60274Q6688N59306M13178
$$ 95557 -369100 -851036 -838353 -467310 -433598 -999503 -1559777 -1473089 -913783 -500605
40999e00605J22249K16874M86070M18683K6535k27481j23635J01347J71352O7479
$$ -500605 -378356 -161482 324588 743271 769806 542325 418690 520037 691389 758868
40989G58868j02711k62168l28481k24350r513J35239J22934N0974M1946J19623
$$ 758868 656157 393989 65508 -158842 -168355 -33116 89818 140792 182738 302361
40979C02361K69026M48923M85644J67156m18732q39250q01438n00796k61770m8472
$$ 302361 571387 1020310 1505954 1673110 1254378 415128 -386310 -887106 -1148876 -1197348
40969a197348L12643N95028L63556k83209o76726m55386l4815M7096j34400j37541
$$ -1197348 -884705 -289677 73879 -209330 -886056 -1341442 -1376257 -1329161 -1463561 -1601102
40959a601102J60569M78527N37214K62526k26765n73904l64577L36780Q57816
$$ -1601102 -1440533 -962006 -424792 -162266 -389031 -962935 -1327512 -990732 -132916
40950a32916O70528O3489l00662k66578j70666j36844M5519L69998M86656K38409
$$ -132916 537612 601101 300439 33861 -136805 -273649 -228130 141868 628524 866933
40940H66933r2541j93735n7476J47194K29755Q622m64602p32636l93830K57446
$$ 866933 774392 580657 523181 670375 900130 908752 444150 -288486 -682316 -424870
40930d24870M99318J34216l02709l61779j83801m2703O6912J41512o072l14262
$$ -424870 74448 208664 -94045 -455824 -639625 -682328 -615416 -473904 -479976 -794238
40920g94238l49074K5818L19587J66656n4317J33420M53663L03148k48848n55005
$$ -794238 -1143312 -1117494 -797907 -631251 -685568 -552148 -98485 204663 -44185 -599190
40910e99190l46600L6804L08059M99325N57367K85990j90454m37496l26979j72000
$$ -599190 -945790 -908986 -600927 -101602 455765 741755 551301 113805 -213174 -385174
40900c85174j37056k6338J92163K09555l3098j25820J12979K59114K0456j75573
$$ -385174 -522230 -548568 -356405 -146850 -179948 -305768 -192789 66325 86781 -88792
40890h8792J13869N12600L79595j31448l32661j27652n0112k24559j64657K47226
$$ -88792 25077 537677 917272 785824 453163 325511 275399 50840 -113817 133409
40880A33409M40791J46513q5909J64654M22925J09622m69405o36703m22512l67799
$$ 133409 574200 720713 634804 799458 1222383 1332005 862600 225897 -196615 -564414
40870e64414n25880m47956m9677K52517K78406K97899M44020M98578L55782J86095
$$ -564414 -1090294 -1538250 -1587927 -1335410 -1057004 -759105 -315085 183493 539275 725370
40860G25370O4882r5374k31585k28350k67819n18796n85716l5P82136P69501m7268
$$ 725370 790252 694878 463293 234943 -32876 -551672 -1137388 -1137423 -355287 414214 366946
40849C66946n34983r4570M87092L87416J606Q7314M45307L74249j03636m00063
$$ 366946 -168037 -262607 224485 611901 613507 700821 1146128 1520377 1416741 1016678
40839A016678l81550l67327l70020j57979J04919M5787k11528k13312O6201K64332
$$ 1016678 635128 267801 -102219 -260198 -155279 -109492 -321020 -534332 -468131 -203799
40829b03799K77524K41738N1729m13763p47246m33118K66569N69917K82411n1427
$$ -203799 73725 315463 367192 -46571 -793817 -1226935 -960366 -390449 -108038 -159465
40819a59465p4551J8424N7518J25279J38739j24331m89902n07147j82483J6731
$$ -159465 -234016 -215592 -158074 -32795 105944 -18387 -508289 -1015436 -1197919 -1181188
40809a181188n2672n2081J49917K76496K13301J49068P9428j80147m33904k59428
$$ -1181188 -1233860 -1285941 -1136024 -859528 -646227 -497159 -417731 -597878 -1031782 -1291210
40799a291210K02740L48424R4177k3306J38919Q4442l14919m63249p4515K81840
$$ -1291210 -1088470 -740046 -645869 -669175 -530256 -445814 -760733 -1223982 -1298497 -1016657
40789a016657J50362o4016J31232M77863M97023K84209J77945J12721j25921l88850
$$ -1016657 -866295 -930311 -799079 -321216 175807 460016 637961 750682 624761 235911
40779B35911m11213k47803p2603J03639K08862L8073k94082l26873L829J52891
$$ 235911 -175302 -423105 -495708 -392069 -183207 -145134 -439216 -766089 -762260 -609369
40769f09369j39278l43227M517N21327N98572L05759J13547J32729J66113J59237
$$ -609369 -748647 -1091874 -1087357 -566030 32542 338301 451848 584577 750690 909927
40759I09927J22111o2120l58828m84684m01559m29598n71155l44752L13488O82096
$$ 909927 1032038 969918 611090 126406 -275153 -704751 -1275906 -1620658 -1307170 -625074
40749f25074L18292j93178j73791J24967J27815n7989k0748J09544r888k22692
$$ -625074 -306782 -499960 -673751 -548784 -420969 -478958 -499706 -390162 -400050 -622742
40739f22742k44009k72451m93947n02445j4145L98775J76424j90868J0777M03618
$$ -622742 -866751 -1139202 -1633149 -2135594 -2149739 -1750964 -1574540 -1765408 -1754631 -1351013
40729a351013J79303l82493l47101K10408L34743j13799k68811J42356L48179
$$ -1351013 -1171710 -1554203 -1901304 -1690896 -1356153 -1469952 -1738763 -1596407 -1248228
40720a248228k6790l01711L1323M71959M23788P1432j46093j86054q9616K71233
$$ -1248228 -1275018 -1576729 -1545406 -1073447 -649659 -578227 -724320 -910374 -999990 -728757
40710g28757P09078O52759L924n30367l80977J35728L85110K16856j55760n75456
$$ -728757 -19679 633080 637004 106637 -274340 -138612 246498 463354 307594 -267862
40700b67862q53038o95777j17469L98701M49590J59433j03700j58960k9142J62202
$$ -267862 -1120900 -1816677 -1934146 -1535445 -1085855 -926422 -1030122 -1189082 -1218224 -1056022
40690a056022K29394J62843K85547P66612J094108O27262l49364q13120l60925
$$ -1056022 -826628 -663785 -378238 388374 1482482 2109744 1760380 947260 586335
40681E86335K94120L86239J3890k87454l09930j66730K4310J32424L2820j57124
$$ 586335 880455 1266694 1280584 993130 683200 516470 540780 673204 706024 548900
40671E48900j76101m0929o52n2972M0439K56528L42230L24729M09221M06332m1774
$$ 548900 372799 331870 331218 278246 318685 575213 917443 1242172 1651393 2057725 2015951
40660B015951o60277p62572l51939j35344k83598j55960M18914O28763J5584o19444
$$ 2015951 1355674 593102 241163 105819 -177779 -333739 85175 713938 729522 110078
40650A10078m11784K38372L94254L8208j24501P8748J52022j17917l81323l85146
$$ 110078 -301706 -63334 330920 369128 244627 323375 475397 357480 -23843 -408989
40640d08989k79857k18317j22915Q4465L39921N42581O12224N22628L94327L58835
$$ -408989 -688846 -907163 -1030078 -945613 -605692 -63111 549113 1071741 1466068 1824903
40630A824903K41750k79577j039932j328180p61442J53182O67423O64464N18109
$$ 1824903 2066653 1787076 747144 -581036 -1342478 -1189296 -521873 142591 660700
40621F60700M00144J78409j68983m44036m87850l12438m2507J49246J80075J83164
$$ 660700 1060844 1239253 1070270 626234 138384 -174054 -216561 -67315 112760 295924
40611B95924K91487L15093j7102m84034n09734R102N01151N35077L43815K78660
$$ 295924 587411 902504 885402 401368 -108366 -99264 401887 936964 1280779 1559439
40601A559439K27103o1498m46511n76789l66620j5807K53637L15648J93561O1390
$$ 1559439 1786542 1725044 1278533 701744 335124 319317 572954 888602 1082163 1143553
40591A143553j4387k30722o13215o73196r2854M80453J73312o72131q20916j5831
$$ 1143553 1129166 898444 285229 -387967 -480821 -368 172944 -499187 -1320103 -1335934
40581a335934O04715K97904k31106j56476J72987P6716k27880j69957R7086Q3844
$$ -1335934 -731219 -433315 -664421 -820897 -647910 -571194 -799074 -969031 -871945 -788101
40571g88101j21789j83337k48544n22227n92072l1449P43440J035467Q83268P29558
$$ -788101 -909890 -1093227 -1341771 -1863998 -2456070 -2487519 -1744079 -708612 174656 904214
40561I04214N26101L6948l87712k88807j9906k31590p06598p00481k43713o5821
$$ 904214 1430315 1467263 1079551 790744 770838 539248 -167350 -867831 -1111544 -1177365
40551a177365k94593k71112K55366P10058O72259M41016L63430L02086N9221k27607
$$ -1177365 -1471958 -1743070 -1487704 -777646 -105387 335629 699059 1001145 1060366 832759
40541H32759l70357l87233l23531j82345q1586j19232j17150J16720L71195L14370
$$ 832759 462402 75169 -248362 -430707 -512293 -631525 -748675 -631955 -260760 53610
40531E3610O5616j1637L0415j75712o15812q55996p00377l82264j00785J55701
$$ 53610 119226 107589 138004 -37708 -653520 -1509516 -2209893 -2592157 -2692942 -2537241
40521b537241L29557K95798J45738P0875K6127r1951o5613L57721Q97705R85548
$$ -2537241 -2207684 -1911886 -1766148 -1695273 -1669146 -1761097 -1826710 -1468989 -571284 414264
40511D14264N54307J05441p521Q1387J20484L2172j72070m08504m68120k51478
$$ 414264 968571 1074012 1066491 1147878 1268362 1300534 1128464 719960 251840 362
40501C62J1851N0774p7387j71040k26939k93899k28621O0875L60724M50523L92219
$$ 362 12213 62987 -14400 -185440 -412379 -706278 -934899 -874024 -513300 -62777 329442
40490C29442K63658j5465l15690k52802J42902K90992N009j19408K08331L09169
$$ 329442 593100 577635 261945 9143 152045 443037 448046 328638 536969 846138
40480H46138k80786p83172l58850L81058K58104n81318r51807m93039N6290K74861
$$ 846138 565352 -217820 -576670 -195612 62492 -518826 -1470633 -1963672 -1907382 -1632521
40470a632521M46951N78489L04914j36687n4517M36920M67659j03414m28326j37337
$$ -1632521 -1185570 -607081 -302167 -438854 -493371 -56451 411208 307794 -120532 -257869
40460b57869J18084n3804j26165K20776L92383o1985n91254n33049j22202O5881
$$ -257869 -139785 -193589 -319754 -98978 293405 231420 -359834 -892883 -1015085 -949204
40450i49204O1441K14903M35665L63958K3573k08985j34138R7339K24505J31533
$$ -949204 -887763 -672860 -237195 126763 150336 -58649 -192787 -95448 129057 260590
40440B60590k6860L0452K91714L67758Q4134j70371r8019p7759m92019q88538
$$ 260590 233730 264182 555896 923654 1007788 837417 739398 661639 169620 -718918
40430g18918o00813J34897N57916N80681O45161O54099J58173n25488n60393K7948
$$ -718918 -1319731 -1184834 -626918 -46237 598924 1253023 1411196 885708 325315 353263
40420C53263L60584J62523N1041K36412J42364l95973p01645m05667j3115M2650
$$ 353263 713847 876370 927411 1163823 1306187 910214 208569 -197098 -210213 -167563
40410a67563l0152n6634j95423l05672J0041M96256M08895j85850l92344j8503
$$ -167563 -197715 -254349 -449772 -755444 -745403 -249147 159748 -26102 -418446 -436949
40400d36949J00693l23625m48905J52060O30095K75803l34916m06793j33301l6175
$$ -436949 -336256 -659881 -1108786 -956726 -326631 -50828 -385744 -792537 -925838 -962013
40390i62013j0036J62531J56011k41883n19122k02620L82600O93784O80299M56528
$$ -962013 -972049 -809518 -653507 -895390 -1414512 -1617132 -1234532 -540748 139551 596079
40380E96079j7495n06858n25824j69636q5131l07264j41851M42863N13654k00947
$$ 596079 578584 71726 -454098 -623734 -708865 -1016129 -1157980 -715117 -201463 -402410
40370d02410o40355j08676N58965M10838j36883k04301J24814K77466K70966L73841
$$ -402410 -1042765 -1151441 -592476 -181638 -318521 -522822 -398008 -120542 150424 524265
40360E24265M07396K05457N8369J9639l82063j075894j103042j35253O97579M23764
$$ 524265 931661 1137118 1195487 1215126 833063 -242831 -1345873 -1481126 -783547 -359783
40350c59783l09624l82577J20914M22315L87416L11940J27664k06573k56871P8267
$$ -359783 -669407 -1051984 -931070 -508755 -121339 190601 318265 111692 -145179 -66912
40340f6912J33963l33727n05144P2694N22004J50323k27387K61530Q84271N44208
$$ -66912 67051 -266676 -771820 -699126 -177122 -26799 -254186 7344 891615 1435823
40330A435823k66686l31437K25026L33890r9522k25566J65369M92539N47040N72633
$$ 1435823 1169137 837700 1062726 1396616 1297094 1071528 1236897 1729436 2276476 2849109
40320B849109M66942J2263m14928l72089j89717l42531m97774j56583L23060L31439
$$ 2849109 3316051 3328314 2913386 2541297 2351580 2009049 1511275 1354692 1677752 2009191
40310B009191N0035o4390j77814n02558n70393q9963K68482j2732k76209J09800
$$ 2009191 2059226 1994836 1817022 1314464 744071 654108 922590 909858 633649 743449
40300G43449M87177Q7921m89497l51084P8310l1398k87094Q6454O05730L65309
$$ 743449 1230626 1318547 829050 477966 556276 524878 237784 324238 929968 1295277
40290A295277k01086n5646N51829N58113n5461m25493l63549l21135k91590p3545
$$ 1295277 1094191 1038545 1590374 2148487 2093026 1667533 1303984 982849 691259 617714
40280F17714m8617m43364n46126R4745N99370K05700k69285J14947O54681L29094
$$ 617714 569097 125733 -420393 -325648 273722 479422 210137 325084 979765 1308859
40270A308859k60384m4042N52475O07059M80667P32853N69928n89898j395263
$$ 1308859 1048475 1004433 1556908 2163967 2644634 3377487 3947415 3357517 1962254
40261A962254o46676L29956j50770j075086n98382M64629J40238r32654o20852
$$ 1962254 1315578 1645534 1494764 419678 -178704 285925 426163 -506491 -1127343
40252a127343P19680Q91135j22576l19380M82874M83993n31224q50531r9184L46328
$$ -1127343 -407663 483472 360896 41516 524390 1008383 477159 -373372 -472556 -126228
40242a26228K08783M64493P63784j17335j391294j092710L53424P34859M889J03051
$$ -126228 82555 547048 1310832 1193497 -197797 -1290507 -937083 -202224 -197335 -94284
40232i4284J025354Q49153l40199m43091N94416O52757l98749m30824P14795Q07853
$$ -94284 931070 1780223 1440024 996933 1591349 2244106 1845357 1414533 2129328 2937181
40222B937181m93057j023996k75243p8784o88186l63186P27518N39853n67007
$$ 2937181 2444124 1420128 1144885 1066101 377915 14729 742247 1282100 715093
40213G15093j66726J330907J043082p76116q02707J159306J678041J10262l90519
$$ 715093 548367 1879274 2922356 2146240 1343533 2502839 4180880 4291142 3900623
40204C900623Q27184Q09945p50002o84922J038074P98811j266222p97756K293476
$$ 3900623 4727807 5537752 4787750 4102828 5140902 5939713 4673491 3875735 6169211
40195F169211K936229L77322j49009K557931L450404J669045K769435P312267
$$ 6169211 9105440 9482762 9333753 11891684 15342088 17011133 19780568 27092835
40187B7092835Q752592O574377Q501360J4845961J5884537J1354472J4639397
$$ 27092835 35845427 42419804 50921164 65767125 81651662 93006134 107645531
40180A07645531K8160834L6221523L7327125N7684746J04673052J29028564P5346068
$$ 107645531 135806365 172027888 209355013 267039759 371712811 500741375 576087443
40173E76087443l5630505j17735932j19057399p3549035m1210409l4687076k9568774
$$ 576087443 540456938 422721006 303663607 230114572 188904163 154217087 124648313
40166A24648313j6902758j0121490j3291203j4765980j0061189p111255q533076
$$ 124648313 107745555 97624065 84332862 69566882 59505693 52394438 43861362
40159D3861362p612628k976718j358708m203099n043778j855118j24496j956096
$$ 43861362 36248734 33272016 31913308 27710209 22666431 20811313 20686817 18730721
40151A8730721k809590q75959l9221j629075j973799l9821M95021j376355j948532
$$ 18730721 15921131 15045172 15005951 13376876 11403077 11363256 11858277 10481922 8533390
40142H533390L1841J051544m57541j491686m59164J46423r85730j487292p9396
$$ 8533390 8565231 9616775 9159234 7667548 7208384 7354807 6369077 4881785 4802389
40133D802389J036312M42334j76590L84789Q78163N47485M54180Q72451P20620
$$ 4802389 5838701 6281035 6104445 6489234 7367397 7914882 8369062 9241513 9962133
40124I962133J80129O35183J813773K200101K046454K742577M052036N464933
$$ 9962133 10142262 10777445 12591218 14791319 16837773 19580350 23632386 29097319
40116B9097319Q512957J3062138J3382550M409080q860252j5328486j1719722
$$ 29097319 37610276 50672414 64054964 68464044 59603792 44275306 32555584
40109C2555584n669229l821548m179554k789279q66246r79799j657873n09733
$$ 32555584 26886355 23064807 18885253 16095974 15229728 14249929 12592056 12082323
40101A2082323J212411J309091O23787P03290M81618j255021k816874k310317
$$ 12082323 13294734 14603825 15227612 15930902 16412520 15157499 12340625 10030308
40093A0030308r75544q21287j226745p52328j04438m67131r23139k55759N65688
$$ 10030308 9054764 8233477 7006732 6254404 6149966 5682835 4759696 4503937 5069625
40084E069625K49743l18368R8315N92691r7120j035336p73642P623p7556n53013
$$ 5069625 5319368 5001000 5099315 5692006 5594886 4559550 3785908 3793531 3715975 3162962
40074C162962k51238L42461J51241l83853l54483k52786p71782j062765k16143
$$ 3162962 2911724 3254185 3405426 3021573 2667090 2414304 1642522 579757 363614
40065C63614Q01628O95946P9288J86014O00140K67671m07458m74579l17214o66543
$$ 363614 1165242 1861188 1940476 2126490 2726630 2994301 2586843 2112264 1795050 1128507
40055A128507q58825o9380P84199M01967n97941p34612j23700R0365p7155J94439
$$ 1128507 269682 200302 984501 1386468 788527 53915 -69785 20580 -56575 137864
40045A37864P05753O55982K51838J65553Q9498m85777q50285j78845P46751P06168
$$ 137864 843617 1499599 1751437 1916990 2006488 1520711 670426 491581 1238332 1944500
40035A944500J18886J09697L42925j81841r03803m64573P74550J163948M58595
$$ 1944500 2063386 2173083 2516008 2334167 1430364 965791 1740341 2904289 3362884
40026C362884k5820J61517Q5788n77889r57575o68691l96331m75413l80022O0339
$$ 3362884 3337064 3498581 3584369 3006480 2048905 1380214 983883 508470 128448 188787
40016A88787K77063R2361M3452L25276M66077K46964P990o3000j13344j23000
$$ 188787 465850 558211 601663 926939 1393016 1639980 1647970 1584970 1471626 1348626
40006A348626J3470P1839r7777r9840K80812L92710k91664j056578r12660j57709
$$ 1348626 1362096 1433935 1336158 1236318 1517130 1909840 1618176 561598 -351062 -508771
39996e08771K11217J23354J88394L16258m476m15977j38409N38958O51748K43018
$$ -508771 -297554 -174200 14194 330452 325976 -90001 -228410 310548 962296 1205314
39986A205314J82114M47459J51707o77818q96282q3708P83839Q53502L91562o5709
$$ 1205314 1387428 1834887 1986594 1308776 412494 328786 1112625 1966127 2357689 2291980
39976B291980m47292o85550n13095p3549R4014q3248j32858O4435R2050j95601
$$ 2291980 1844688 1159138 646043 572494 666508 583260 450402 514837 606887 411286
39966D11286m57031n11515m75909k86172J78220N90942N59401L36867L59101L50713
$$ 411286 -45745 -557260 -1033169 -1319341 -1141121 -550179 9222 346089 705190 1055903
39956A055903j58479p11170m42917M16319P35292J89193l45822k13699K34144
$$ 1055903 897424 186254 -256663 159656 894948 1084141 738319 524620 758764
39947G58764M25673K40061k17759p09031p29850p5104N86871N26303R1533R3347
$$ 758764 1184437 1424498 1206739 497708 -232142 -307246 279625 805928 897461 990808
39937I90808L81407J89333l69132m64665q0325L982k68257j60995L06646K36285
$$ 990808 1372215 1561548 1192416 727751 647426 651408 383151 222156 528802 765087
39927G65087m48014o47929R1257P71361N42872r1699l18733j93295j28361j26799
$$ 765087 317073 -330856 -239599 531762 1074634 982935 664202 470907 342546 215747
39917B15747j23124k87541n07282l41446J41496L12745P1251N5953M57446O34496
$$ 215747 92623 -194918 -702200 -1043646 -902150 -589405 -518154 -462201 -4755 629741
39907F29741L11895J05852L49691M27644j10017p08296p34564m11657k12036j05605
$$ 629741 941636 1047488 1397179 1824823 1714806 1006510 271946 -139711 -351747 -457352
39897d57352J7821m3494k30562o1273M29322M51234k45009p34257k89088M68415
$$ -457352 -439531 -483025 -713587 -774860 -345538 105696 -139313 -873570 -1162658 -694243
39887f94243N95962K37295J05726K19181J11926j67114k08676q9146k12034m90803
$$ -694243 -98281 139014 244740 463921 575847 408733 200057 110911 -101123 -591926
39877e91926m35736K5570M19314M02376J39176J1198K02348N14187N09786K3877
$$ -591926 -1027662 -1002092 -582778 -180402 -41226 -30028 172320 686507 1196293 1220170
39867A220170m94571m86307o7341J62381L0321r0638m2530n3154j17083L4221
$$ 1220170 725599 239292 171951 334332 364653 274015 231485 178331 61248 95469
39857I5469K78967K19607J478J27415M12583J78525l91731l21313M44586P28394
$$ 95469 374436 594043 595521 722936 1135519 1314044 922313 601000 1045586 1773980
39847A773980M8178n12155j28111L96517J08936m31347k18594M07589L98196k14160
$$ 1773980 1822158 1310003 1181892 1578409 1687345 1255998 1037404 1444993 1843189 1629029
39837A629029m88276j52794J83677J72483M5575m8481j62406j51378J21364L73129
$$ 1629029 1140753 987959 1171636 1344119 1389694 1341213 1178807 1027429 1148793 1521922
39827A521922L03212J14354Q1406J1612k88429m99739l66357k40560l95276m07965
$$ 1521922 1825134 1939488 2020894 2032506 1744077 1244338 877981 637421 242145 -165820
39817a65820K4457L23522m0592n08533l14621K00406K60893P9105L60508Q23419
$$ -165820 -141363 182159 141567 -366966 -681587 -481181 -220288 -141183 219325 1042744
39807A042744N90365j56760l14968L30765P62670L89747j54510k07769j5279l0605
$$ 1042744 1633109 1476349 1161381 1492146 2254816 2644563 2490053 2282284 2267005 2236400
39797B236400j41817q2784R838j22485m31414o61900n91381j58127L41699L74540
$$ 2236400 2094583 2011799 2021637 1899152 1467738 805838 214457 56330 398029 772569
39787G72569j04798l84914j4766L59475k7335o86175n42741K93646O56225J75315
$$ 772569 667771 282857 268091 627566 600231 -85944 -628685 -335039 321186 496501
39777D96501k69720j35528J8479k29043l28012J86916P58624O70330J32769k00855
$$ 496501 226781 91253 109732 -119311 -447323 -260407 498217 1168547 1301316 1100461
39767A100461k36780k82704l45572k37744o3751l8226n6243R1736K89030K77321
$$ 1100461 863681 580977 235405 -2339 -66090 -104316 -160559 -68823 220207 497528
39757D97528Q5006p0286j35402j86286k03523j40867p5360q0186q5507l4132k9257
$$ 497528 582534 512248 376846 190560 -12963 -153830 -229190 -309376 -394883 -429015 -458272
39746d58272j63069l09548k29334J58392O49981Q80220O44157J61491j21727q2977
$$ -458272 -621341 -930889 -1160223 -1001831 -351850 528370 1172527 1334018 1212291 1129314
39736A129314l9666j78746k23427N0557L46233L02971P2251m2702j63038m67552
$$ 1129314 1089648 910902 687475 738032 1084265 1387236 1459487 1416785 1253747 786195
39726G86195n98347j54917M65855N12585J3528l36557l19185l53751n34102m28743
$$ 786195 187848 32931 498786 1011371 1024899 688342 369157 15406 -518696 -947439
39716i47439K3684K98497J80837N9947J00640m3682l99480m06885J09789N01823
$$ -947439 -923755 -625258 -444421 -384474 -283834 -327516 -726996 -1133881 -1024092 -522269
39706e22269L07800k6241K5399J98989J8004l28915l47686o1005J37237J34294
$$ -522269 -214469 -240710 -215311 -16322 1682 -327233 -674919 -735924 -598687 -464393
39696d64393R0334O3010P1256K27047M24462K70186k69416n62614j39815N41617
$$ -464393 -374059 -311049 -239793 -12746 411716 681902 412486 -150128 -289943 251674
39686B51674O96176K79979q9880p7533N1155m0519l44918n93383m88795K2330
$$ 251674 947850 1227829 1137949 1060416 1111571 1071052 726134 132751 -356044 -333714
39676c33714N27262M65290j10709m55848j21813L95382M20560Q7313j9723J25273
$$ -333714 193548 658838 548129 92281 -29532 365850 786410 873723 854000 979273
39666I79273N5087k53301k55403K47596O96912N26485j05755o01840o43185l72049
$$ 979273 1034360 781059 525656 773252 1470164 1996649 1890894 1289054 645869 273820
39656B73820m9742K02929L66240M08967K89049L2050k48671m41991n16241m76007
$$ 273820 224078 427007 793247 1202214 1491263 1523313 1274642 832651 316410 -159597
39646a59597l21175j20544p639J9001J32763L35435K99520j34104n24340l51962
$$ -159597 -480772 -601316 -608955 -589954 -457191 -121756 177764 43660 -480680 -832642
39636h32642J78604M13689K52415K19025M76668M94331l6562o07508o24386k30547
$$ -832642 -654038 -240349 12066 231091 707759 1202090 1165528 558020 -66366 -296913
39626b96913L0148k1363j75845k58135k12552k2636J91829K57342K68263M50585
$$ -296913 -266765 -288128 -463973 -722108 -934660 -957296 -765467 -508125 -239862 210723
39616B10723O08025K61198m59370p19826j49024N47594O12287K49132N0831K6018
$$ 210723 818748 1079946 620576 -99250 -248274 299320 911607 1160739 1211570 1237588
39606A237588r5395j08271K95030P50956O47056J01612k37817k09385k20192m37843
$$ 1237588 1142193 1033922 1328952 2079908 2726964 2828576 2590759 2381374 2161182 1723339
39596A723339o13324o40111o11052l75211K66498R19608Q50705P914q06649r39707
$$ 1723339 1110015 469904 -141148 -516359 -249861 669747 1520452 1528366 721717 -217990
39586b17990n61730j94172j7172J51993M88397R09227J058555O22674j74876o37035
$$ -217990 -779720 -973892 -991064 -839071 -350674 558553 1617108 2239782 2064906 1427871
39576A427871m31168n7633j14706m61084n96527m88324l93359k08726K57706O46194
$$ 1427871 996703 939070 824364 363280 -233247 -721571 -1114930 -1323656 -1065950 -419756
39566d19756M92448J10483J52458M37997K01416n21662q12049l34100J42188J0457
$$ -419756 72692 183175 335633 773630 975046 453384 -358665 -692765 -550577 -540120
39556e40120l15691k41902J31470M34242O01680N82197J69760m20655n06247M5621
$$ -540120 -855811 -1097713 -966243 -532001 69679 651876 821636 400981 -105266 -59645
39546e9645M38266J22830l33168j96836K48656K48649j77444l62594q6003K16045
$$ -59645 378621 501451 168283 -28553 220103 468752 291308 -71286 -157289 58756
39536E8756K00347l6382k71765l42008j40162J77675J93346j90976m63288k20125
$$ 58756 259103 222721 -49044 -391052 -531214 -353539 -160193 -351169 -814457 -1034582
39526a034582J60250P7333l66289n81042l89358j01206J23106L56115M64698K24732
$$ -1034582 -874332 -796999 -1163288 -1744330 -2133688 -2234894 -2111788 -1755673 -1290975 -1066243
39516a066243j46612j58292K19670N06363M38784K63999K35284K66244J91743
$$ -1066243 -1212855 -1371147 -1151477 -645114 -206330 57669 292953 559197 750940
39507G50940O588k36655m62585m86383j90979K23951M52866M73148M33446L09753
$$ 750940 757528 520873 58288 -428095 -619074 -395123 57743 530891 964337 1274090
39497A274090N4863q2656J19041L33097N2883n41688o89004j19405N26617N43376
$$ 1274090 1328953 1246297 1365338 1698435 1751318 1209630 520626 401221 927838 1471214
39487A471214k2964n92416p13004l43009K02101M60744K54921p1931j33743r4104
$$ 1471214 1448250 855834 142830 -200179 1922 462666 717587 645656 511913 417809
39477D17809l27168o36387m80374K7637J26330l93912p64061l66469L84130P20926
$$ 417809 90641 -545746 -1026120 -998483 -872153 -1266065 -2030126 -2396595 -2012465 -1291539
39467a291539M90015q590n48671q35560m26007N78952J255648R48811K16176j6276
$$ -1291539 -801524 -810114 -1358785 -2194345 -2620352 -2041400 -785752 163059 379235 362959
39457C62959J83697P5446l91935n17061p7678L20261K55130K9974k0638l6822
$$ 362959 546656 622102 230167 -286894 -364572 -44311 210819 240793 220155 183333
39447A83333j55676j61115M4800J45882n9365k68084j49573J56417L22006K77380
$$ 183333 27657 -133458 -88658 57224 -2141 -270225 -419798 -263381 58625 336005
39437C36005J02386j87535m60855m08080J2416L46357K01786j84638k72936M9994
$$ 336005 438391 250856 -209999 -618079 -605663 -259306 -57520 -242158 -515094 -465100
39427d65100L80413L48550P221k92901k71522p223J15949j15366l70212j67281
$$ -465100 -84687 263863 271084 -21817 -293339 -300562 -184613 -299979 -670191 -837472
39417h37472L70816N82875J98707k67411k89522l8133L4698q0818q2053P9666
$$ -837472 -466656 116219 314926 47515 -242007 -280140 -245442 -326260 -408313 -328647
39407c28647K11126K62432K96808K30775k9435l23977m25262l43838j90745M8923
$$ -328647 -117521 144911 441719 672494 643059 319082 -106180 -450018 -640763 -591840
39397e91840L35806M42473L00063J66132J36240q8745n37210n97062N9797O88869
$$ -591840 -256034 186439 486502 652634 788874 700129 162919 -434143 -374346 314523
39387C14523M54630j88601j23690O29100R06392K53531m16828l54224l8373j49776
$$ 314523 769153 580552 456862 1085962 1992354 2245885 1829057 1474833 1436460 1286684
39377A286684m47046m19125k80657m64036o80571l74175K38006M21454M3749l08666
$$ 1286684 839638 420513 139856 -324180 -1004751 -1378926 -1140920 -719466 -675717 -984383
39367i84383k61872m4461O5614J17952K21756L22699L45339K79323J07040j34147
$$ -984383 -1246255 -1290716 -1225102 -1107150 -885394 -562695 -217356 61967 169007 34860
39357C4860k79060k36919j59253j99249k52579j49027P8875L24301N66642O83195
$$ 34860 -244200 -481119 -640372 -839621 -1092200 -1241227 -1162352 -838051 -271409 411786
39347D11786M15090j72400n25773k88446J53696K41108M8355K0638J86498K25975
$$ 411786 826876 654476 128703 -159743 -6047 235061 283416 304054 490552 716527
39337G16527J24026J25751J62826l5156l25155l02255m7044l6177k66470k11243
$$ 716527 840553 966304 1129130 1093974 768819 466564 419520 383343 116873 -94370
39327i4370J88889K71734k55818o83583l00118M99821P54880K73495k28805k36227
$$ -94370 94519 366253 110435 -573148 -873266 -373445 381435 654930 426125 189898
39317A89898o6280k45683o77262p52397j89767N14778O30022R6854l62369j52555
$$ 189898 123618 -122065 -799327 -1551724 -1741491 -1226713 -596691 -499837 -862206 -1014761
39307a014761M39701O81252L81456L2800L6811K55486M00096M25751L72469J90589
$$ -1014761 -575060 106192 487648 520448 557259 812745 1212841 1638592 2011061 2201650
39297B201650n5669j15669Q8565K88768K84377K96066O40428J203172J485407
$$ 2201650 2145981 2030312 2118877 2407645 2692022 2988088 3628516 4831688 6317095
39288F317095J115239J78008q60539j447174j301963o57825p7377P9645m3409
$$ 6317095 7432334 7610342 6749803 5302629 4000666 3342841 3265464 3345109 3301700
39279C301700p2998J39481M26026N80312O08221O67710P73251O48850M5407p90891
$$ 3301700 3228702 3368183 3794209 4374521 4982742 5650452 6423703 7072553 7117960 6327069
39269F327069j242397j056199o67498n54790n99471m58003k50065l29828n70504
$$ 6327069 5084672 4028473 3360975 2806185 2206714 1748711 1498646 1168818 598314
39260E98314n10589j56952m20j87004l09557j49694J599l0108L6040L55454N80820
$$ 598314 87725 -69227 -69647 -256651 -566208 -715902 -714303 -744411 -708371 -352917 227903
39249B27903M09034N0253j69826k46294k35610j6626L51371M71852J73881j75772
$$ 227903 636937 687190 517364 271070 35460 18834 370205 842057 1015938 840166
39239H40166k53554k17338k18056j7903M26979N52323r836o60074n87466L2790
$$ 840166 586612 369274 151218 133315 560294 1112617 1102781 442707 -144759 -111969
39229a11969L56412J50476n0350L4437Q3073p8042j35741P2116J98816l7894l92788
$$ -111969 244443 394919 344569 379006 462079 384037 248296 320412 519228 481334 88546
39218H8546m88229l11803p5831J11265K04421J16213j13594k26590k9709L36830
$$ 88546 -399683 -711486 -787317 -676052 -471631 -355418 -469012 -695602 -725311 -388481
39208c88481N55385M78399K30200J9326p9026j41630k02628j30702J42135L38315
$$ -388481 166904 645303 875503 894829 815803 674173 471545 340843 482978 821293
39198H21293J01699l97491n24718n3400M25465K97795k22118m55376j94466J88639
$$ 821293 922992 525501 783 -52617 372848 670643 448525 -6851 -201317 -12678
39188a2678L60786K79849j1161l68464m49825r5078L03108K57910j06300k77911
$$ -12678 348108 627957 616796 248332 -201493 -296571 6537 264447 158147 -119764
39178a19764j46295l4831o6274q9277j66353m77398p22271l22801O24299J252027
$$ -119764 -266059 -300890 -367164 -456441 -622794 -1100192 -1822463 -2145264 -1520965 -268938
39168b68938J029808L91342k3422k03173m63854p55161p21684k42918M00671P76532
$$ -268938 760870 1152212 1128790 925617 461763 -293398 -1015082 -1258000 -857329 -80797
39158h0797N97810r682m73814l00884L01300O42268M23017O748k21292k98618
$$ -80797 517013 507331 33517 -267367 33933 676201 1099218 1105966 884674 586056
39148E86056l75320m22652m11286l64177j32075M04983Q37687N47301k91785p07629
$$ 586056 210736 -211916 -623202 -987379 -1119454 -714471 123216 670517 378732 -328897
39138c28897k44203L94897M36073R5593j2613Q7033M586j60831j7166L34064M23138
$$ -328897 -573100 -178203 257870 353463 340850 427883 432469 271638 254472 588536 1011674
39127A011674J64736j34233l58618n73310n83722j48819M41260O10408K97778
$$ 1011674 1176410 1042177 683559 110249 -473473 -622292 -181032 429376 727154
39118G27154l3587j40336j79928j84654J7207K95461K49512j04959k39495R5868
$$ 727154 693567 553231 373303 188649 205856 501317 750829 645870 406375 502243
39108E02243M81336M55698R6551k60497m70259m88109k17683K35986M58157J93015
$$ 502243 983579 1439277 1535828 1275331 805072 316963 99280 335266 793423 986438
39098I86438k76299m77798l09775k5354J66772K36788J85882J0393k07165l27529
$$ 986438 710139 232341 -77434 -102788 63984 300772 486654 497047 289882 -37647
39088c7647k82358j15627O7281J66965J56612P9041n5843k76623m68435l62631
$$ -37647 -320005 -435632 -368351 -201386 -44774 34267 -21576 -298199 -766634 -1129265
39078a129265Q3430M73759M53708K51125L21566N54791L86287k46295o65305m19688
$$ -1129265 -1045835 -572076 -118368 132757 454323 1009114 1395401 1149106 483801 64113
39068F4113O1906J70625o563k4323P5232j00560m75377n00736l9597L40613J87215
$$ 64113 126019 296644 290081 265758 340990 240430 -234947 -735683 -775280 -434667 -247452
39057b47452j92349k37063M9318K04070P0503J217K31574M31456J51661m65606
$$ -247452 -439801 -676864 -627546 -423476 -352973 -351756 -120182 311274 462935 -2671
39047b671p69980m33650J05725K33612k3995j06607K15658M88023K45309k82992
$$ -2671 -772651 -1206301 -1100576 -866964 -890959 -997566 -781908 -293885 -48576 -331568
39037c31568m57657o4793M73039O92980N72935L31484L7012l61057p55223q90349
$$ -331568 -789225 -854018 -380979 312001 884936 1216420 1253432 892375 137152 -753197
39027g53197o69453k87544J42J46744K84171M89458O63861O34440L29371j29583
$$ -753197 -1422650 -1710194 -1710052 -1563308 -1279137 -789679 -125818 508622 837993 708410
39017G08410m70333m56780j25710J85996J75040n4307r3662K34395O00844N55294
$$ 708410 238077 -218703 -344413 -158417 16623 -37684 -131346 103049 703893 1259187
39007A259187O8292m63566o65630m74189o0928L19203M27546J97761j79236m69583
$$ 1259187 1327479 863913 198283 -275906 -336834 -17631 409915 607676 428440 -41143
38997d1143o60427q24570q01944l47223L66495P68167N98031K75135K91385N16918
$$ -41143 -701570 -1526140 -2328084 -2675307 -2308812 -1540645 -942614 -667479 -376094 140824
38987A40824M69977Q6110k28531k68772k93096m86237n50750j23136O05073R97451
$$ 140824 610801 696911 468380 199608 -93488 -579725 -1130475 -1253611 -648538 348913
38977C48913O98297M7189l04939j10275K37830K07037k10862m97666l07327N8174
$$ 348913 1047210 1094399 789460 679185 917015 1124052 913190 415524 108197 166371
38967A66371P9801k52540m94178m58890m35293n88674o04398k18684K62368L84914
$$ 166371 246172 -6368 -500546 -959436 -1394729 -1983403 -2587801 -2806485 -2544117 -2159203
38957b159203K39707K57333M52593M13147N1873j83154k4888J85289R2347o8356
$$ -2159203 -1919496 -1662163 -1209570 -796423 -744550 -927704 -952592 -767303 -674956 -743312
38947g43312J08142M56253M33645m1885m42416l71249l8843J46584J24416R9959
$$ -743312 -635170 -178917 254728 212843 -229573 -600822 -639665 -493081 -368665 -268706
38937b68706J57963K10594K01022J29998n1661l62347o14176n23735p0145L96979
$$ -268706 -110743 99851 300873 430871 379210 16863 -597313 -1121048 -1191193 -794214
38927g94214N19580L29269J58911J83162K14841L8534k12012k21105J4890J30400
$$ -794214 -274634 54635 213546 396708 611549 650083 438071 216966 231856 362256
38917C62256q6773l63611l25055k5386J63861R6213j4448M352L3443r3959l11721
$$ 362256 275483 -88128 -413183 -438569 -274708 -178495 -192943 -188591 -155148 -249107 -560828
38906e60828m12923k91142N509L44708N44169M48722J00825k09366j79119J79162
$$ -560828 -973751 -1264893 -1259384 -914676 -370507 78215 179040 -30326 -209445 -30283
38896c0283M72090K64561m16697r50090o93062K28343R34534P77803P5471m11715
$$ -30283 441807 706368 289671 -660419 -1353481 -1125138 -190604 587199 662670 250955
38886B50955m64176m10309l37504M3634O62542Q79037L54796l54984n13039j56140
$$ 250955 -213221 -623530 -961034 -917400 -254858 624179 978975 623991 110952 -45188
38876d5188J12090K5914j41816j60779j39401k12520l05642l00522j95240m5313
$$ -45188 66902 92816 -49000 -209779 -349180 -561700 -867342 -1167864 -1363104 -1408417
38866a408417Q0595Q6830m2924j50659p2802J36166K93111L32191L14112K75823
$$ -1408417 -1327822 -1240992 -1283916 -1434575 -1507377 -1371211 -1078100 -745909 -431797 -155974
38856a55974K23995J79938R0234j58370m69207m87720p4095L76188M03142J02279
$$ -155974 68021 247959 338193 179823 -289384 -777104 -851199 -475011 -71869 30410
38846C0410r5148j10789k33087n05282o00977l78917j05133J8053J36043L69675
$$ 30410 -64738 -175527 -408614 -913896 -1514873 -1893790 -1998923 -1980870 -1844827 -1475152
38836a475152N26292M19965J88832N4211O618l9131o493J63293K73520R6489k57622
$$ -1475152 -948860 -528895 -340063 -285852 -279234 -318365 -324858 -161565 111955 208444 -49178
38825d9178m39281k83652M9711L16600L90018K43766q1651m31476n62259l34482
$$ -49178 -488459 -772111 -722400 -405800 -15782 227984 146333 -285143 -847402 -1181884
38815a181884R1258L25073J33237k48992l55862r5429J22425K1108p5038K41811
$$ -1181884 -1090626 -765553 -632316 -881308 -1237170 -1332599 -1210174 -1189066 -1264104 -1022293
38805a022293P07782O67642N8928m47934m11203j79495k31350m28786l24722J12758
$$ -1022293 -314511 353131 412059 -35875 -447078 -626573 -857923 -1286709 -1611431 -1498673
38795a498673N10704O33098N35072L15306O5846l2787R7568K12340K7766l26313
$$ -1498673 -987969 -354871 180201 495507 561353 528566 626134 838474 866240 539927
38785E39927m53404k64582p1436p4206j01465J2978R8669p6076l86465m73838
$$ 539927 86523 -178059 -249495 -323701 -425166 -412188 -313519 -389595 -776060 -1249898
38775a249898k22228J22340L21057M11250N04899N09694K77196m5472r9093J82238
$$ -1249898 -1472126 -1349786 -1028729 -617479 -112580 397114 674310 628838 529745 711983
38765G11983M13035K71666n2824j70197n5995P515o6952j00521m5554p8893k52789
$$ 711983 1125018 1396684 1343860 1173663 1117668 1125183 1058231 957710 912156 833263 580474
38754E80474l84741l61388k59615j36702j1201l2177k66182l43737J33902P74224
$$ 580474 195733 -165655 -425270 -561972 -573173 -605350 -871532 -1215269 -1081367 -307143
38744c07143O63576k85745r77195n87380K86568N87438L15867K30451M42173L39468
$$ -307143 356433 70688 -906507 -1493887 -1207319 -619881 -304014 -73563 368610 708078
38734G08078j85885m65368j80341J28811O157k27819j50224M9777M0898o08J99351
$$ 708078 522193 56825 -123516 5295 11452 -216367 -366591 -316814 -275916 -276524 -77173
38723g7173L48167j5868o65015q52399l16559M06589P29043O18620L51508P2339
$$ -77173 270994 255126 -409889 -1262288 -1578847 -1172258 -443215 175405 526913 599252
38713E99252j66315k16030J2578L19367L90796J92500j10J3433J11158P2064q6236
$$ 599252 432937 216907 229485 548852 939648 1132148 1132038 1145471 1256629 1328693 1242457
38702A242457j52026m6134Q6516J34625J71250K46328K13185n3789l88224m97587
$$ 1242457 1090431 1044297 1130813 1265438 1436688 1683016 1896201 1842412 1454188 956601
38692I56601l47353j64417p0356O5261L51491O37012O41518K39285m17697r67552
$$ 956601 609248 444831 374475 439736 791227 1428239 2069757 2309042 1891345 923793
38682I23793j045385n85361L3928K87626L6903l21816l12949Q0508M23815L61595
$$ 923793 -121592 -706953 -673025 -385399 -348496 -670312 -983261 -902753 -478938 -117343
38672a17343N0939l2634K75825N69848M18151K2513l8504K86376L69797j32641
$$ -117343 -66404 -99038 176787 746635 1164786 1187299 1148795 1435171 1804968 1672327
38662A672327o81961o42985k30997p1673j51641J8401L47025J70654n60421r82053
$$ 1672327 990366 347381 116384 44711 -106930 -88529 258496 429150 -131271 -1113324
38652a113324n53927J63320M37787L78081M12188L81728m4096m80829k69082L72484
$$ -1113324 -1667251 -1503931 -1066144 -688063 -275875 105853 61757 -419072 -688154 -315670
38642c15670N32369k7189n21774l46521J30929L05476K08327J90725K36112J19282
$$ -315670 216699 189510 -332264 -678785 -547856 -242380 -34053 156672 392784 512066
38632E12066o9776q5554k7865j98994n37823o30952l04221J46767L69883L21823
$$ 512066 442290 356736 328871 129877 -407946 -1038898 -1343119 -1196352 -826469 -504646
38622e04646J64826M2444L3342J31797J98734Q0698j83103m11000n29348n91649
$$ -504646 -339820 -297376 -264034 -132237 66497 147195 -35908 -446908 -976256 -1567905
38612a567905n62765l33483R665K03574J91877K08346L49549L90590K38434K02378
$$ -1567905 -2130670 -2464153 -2454488 -2250914 -2059037 -1850691 -1501142 -1110552 -872118 -669740
38602f69740M51518N41361J7437p19991q13131j81508L39582K42202J3966K16961
$$ -669740 -218222 323139 340576 -379415 -1192546 -1374054 -1034472 -792270 -778304 -561343
38592e61343N64603M77162N4743j70548j14983q1708n7244J84255M00181J11902
$$ -561343 3260 480422 535165 364617 249634 167926 110682 294937 695118 807020
38582H07020m50682m67566J98012O43351K31577m57801n28201m4904K45977R5315
$$ 807020 356338 -111228 86784 730135 961712 503911 -24290 -69194 176783 272098
38572B72098n9455Q0634L01344L31270J89016K2114o0462J0222J57764J22602
$$ 272098 212643 293277 594621 925891 1114907 1137021 1076559 1086781 1244545 1367147
38562A367147j99921m95042l99785j3536K74688L13164J86895j20245o02430r08101
$$ 1367147 1167226 672184 272399 258863 533551 846715 1033610 913365 310935 -597166
38552e97166o67196r2451K66610L29775M69414P02670N97492J19012j62426P42
$$ -597166 -1264362 -1356813 -1090203 -760428 -291014 411656 1009148 1128160 965734 966476
38542I66476J08488j64635l25185N6394M40649J05430n84887o25135Q1947N60813
$$ 966476 1074964 910329 585144 641538 1082187 1187617 602730 -22405 59542 620355
38532F20355K23660l65766m65722j62341L0443K7644J04668K86337K92037k2782
$$ 620355 844015 478249 12527 -149814 -119371 -91727 12941 299278 591315 568533
38522E68533m90481q17118p60619k79291L26565O15829N26887M67278O80595Q10917
$$ 568533 78052 -739066 -1499685 -1778976 -1452411 -836582 -309695 157583 838178 1649095
38512A649095M23933k70947o33481m19854k535J94243J06785j14987k99264k54551
$$ 1649095 2073028 1802081 1168600 748746 746211 940454 1047239 932252 632988 378437
38502C78437P1426L63240K13299k67181m70271j02839L67832L50132p1028l18380
$$ 378437 449863 813103 1026402 759221 288950 186111 553943 904075 833047 514667
38492E14667j37983J49466J80733p622j55934j58729j09079o7993N9588L72266
$$ 514667 376684 526150 706883 699261 543327 384598 275519 207526 267114 639380
38482F39380P31470P76034K91210m64576r50858q83365m45741J5157K77737K18535
$$ 639380 1370850 2146884 2438094 1973518 1022660 139295 -306446 -291289 -13552 204983
38472B04983j67182n68294n15762M662L89233J84967k51517k69236J33410L86255
$$ 204983 37801 -530493 -1046255 -1041593 -652360 -467393 -718910 -988146 -854736 -468481
38462d68481K39600J1926n2810j00019k16191k03544j2400P9395l2134m8075J77049
$$ -468481 -228881 -216955 -269765 -369784 -585975 -789519 -801919 -722524 -754658 -802733 -625684
38451f25684L08656J25169r706K58219N94551M72827O4613l1983J99272J84118
$$ -625684 -317028 -191859 -201565 56654 651205 1124032 1188645 1156662 1355934 1540052
38441A540052k17538m15172n2540L73614K65298j83534l34981m4094K59167K72231
$$ 1540052 1322514 907342 854802 1228416 1493714 1310180 975199 931105 1190272 1462503
38431A462503J15287n7070k92760n74176o58010l83488O6304L92170N15265N14633
$$ 1462503 1577790 1520720 1227960 653784 -4226 -387714 -321410 70760 586025 1100658
38421A100658L83568R9708j40711p5502J79284J47982l55115q50789p63806k02684
$$ 1100658 1484226 1583934 1443223 1367721 1547005 1694987 1339872 489083 -274723 -477407
38411d77407J87900Q2835k19112l69709l97268l87254j73383L16564P13636O04555
$$ -477407 -289507 -206672 -425784 -795493 -1192761 -1580015 -1753398 -1436834 -723198 -118643
38401a18643J13476k58174k54804k7010J97328K81767J42977j22678j84784J11759
$$ -118643 -5167 -263341 -518145 -545155 -347827 -66060 76917 -45761 -230545 -118786
38391a18786M13691L15893M795k2181K32211K97121N4616r5191J0535J3147k71804
$$ -118786 294905 610798 615593 593412 825623 1122744 1177360 1082169 1092704 1105851 834047
38380H34047m74710l12775p6249q8999j59354o660J69252J2113m09321p58016
$$ 834047 359337 46562 -29687 -118686 -278040 -284700 -115448 -103335 -512656 -1270672
38370a270672q64599o44028K9055R12436J276396P56938r991j99891Q4875J74917
$$ -1270672 -2135271 -2779299 -2750244 -1837808 -561412 195526 185535 -14356 70519 245436
38360B45436j2572J649K59271K82033k199j07182J03556J56458j57605l87989
$$ 245436 232864 234513 493784 775817 773618 666436 769992 926450 768845 380856
38350C80856k11728L5896k6924k39558k78281j60276n3378J2994N651j44928k69002
$$ 380856 169128 205024 178100 -61458 -339739 -500015 -553393 -540399 -534748 -679676 -948678
38339i48678r0079K47912K86754j8623k38263j92249r2996N5380M10735O30242
$$ -948678 -1038757 -790845 -504091 -522714 -760977 -953226 -1046222 -990842 -580107 50135
38329E0135K24561l61463j92051M88790M51320l33773l94393P39111J634285J528346
$$ 50135 274696 -86767 -278818 209972 661292 327519 -66874 672237 2306522 3834868
38319C834868J676387K709963L014393J850617J623744M062333O598629O746183
$$ 3834868 5511255 8221218 11235611 13086228 14709972 18772305 25370934 32117117
38311C2117117P930799J4824171K3112326K1230013N330238j3392761k1061081
$$ 32117117 40047916 54872087 77984413 99214426 104544664 91151903 70090822
38304G0090822j6622750r817749p098358o327427m331421k476585k777417l729855
$$ 70090822 53468072 43650323 36551965 30224538 25893117 23416532 20639115 16909260
38296A6909260l095155j604129j138475j485924j330198p68440o54991p21145
$$ 16909260 13814105 12209976 11071501 9585577 8255379 7486939 6831948 6110803
38288F110803k86760J67637j41346p19348o12255m8781J46740N1465J72454J77488
$$ 6110803 5824043 5991680 5850334 5130986 4518731 4469950 4616690 4668155 4840609 5018097
38278E018097m68004j167913r52653j54986Q2289l29438m49993k5274K14677j2717
$$ 5018097 4550093 3382180 2429527 2274541 2356830 2027392 1577399 1552125 1766802 1754085
38268A754085j18423J58167K67227j30516n97968o84586m88271k21238R1426K96869
$$ 1754085 1635662 1793829 2061056 1930540 1332572 647986 159715 -61523 29903 326772
38258C26772J50676j83919k78018j44867j63876k79060l1875N02844O29967J35207
$$ 326772 477448 293529 15511 -129356 -293232 -572292 -604167 -101323 528644 663851
38248F63851k91708r9797L21693L15668j12379m81566n24344k74563J74715O07963
$$ 663851 372143 272346 594039 909707 797328 315762 -208582 -483145 -308430 299533
38238B99533O63891K34275l07048n31170m25455k59596k04036k49896k94587j75842
$$ 299533 963424 1197699 890651 359481 -65974 -325570 -529606 -779502 -1074089 -1249931
38228a249931J63734M75266M36976J34307l6213L119q7587m06599n53410k93594
$$ -1249931 -1086197 -610931 -173955 -39648 -75861 -72742 -160329 -566928 -1120338 -1413932
38218a413932P596O506J284M07328R28215Q86677K69762k08135j70960r4146m55987
$$ -1413932 -1406336 -1399830 -1398546 -991218 -63003 823674 1093436 885301 714341 620195 164208
38207A64208q84125o73223R6738N79600L42998m9911P5001N09921N52120R2203
$$ 164208 -719917 -1393140 -1296402 -716802 -373804 -423715 -348714 161207 713327 805530
38197H05530l07683l40141k88652l33182j95360K21911M49801J61702k29023k06855
$$ 805530 497847 157706 -130946 -464128 -659488 -437577 12224 173926 -55097 -261952
38187b61952K2527n2671l32557k80475J46719M05950J87040k28709m50049l62141
$$ -261952 -239425 -292096 -624653 -905128 -758409 -352459 -165419 -394128 -844177 -1206318
38177a206318l9712L22153M33566K19997j9526r5967k77610o86861p47539L7647
$$ -1206318 -1246030 -923877 -490311 -270314 -289840 -385807 -663417 -1350278 -2097817 -2060170
38167b060170J052178J201842M65978j27716p8173M9805j66916l00908J3483L58007
$$ -2060170 -1007992 193850 659828 532112 453939 503744 336828 35920 49403 407410
38157D07410K63466m7978j79909j96081k37456j06389K42394L57491j1440l82648
$$ 407410 670876 622898 442989 246908 9452 -96937 145457 502948 491508 108860
38147A08860k74223M290j08153m89636n54957j28368M33761P49845O19281L7672
$$ 108860 -165363 -161073 -269226 -758862 -1313819 -1442187 -1008426 -258581 360700 398372
38137C98372n76584n49059J82892P54467M55984k45160l74551J69843N86344L44497
$$ 398372 -178212 -727271 -544379 210088 666072 420912 46361 216204 802548 1147045
38127A147045k53151o26920n07226l174M82013M72591o9316n73108n30308j27350
$$ 1147045 893894 266974 -240252 -243426 238587 711178 641862 68754 -461554 -588904
38117e88904J48148K38608L80591N08520L58621K593k62251m22621o32029p30081
$$ -588904 -440756 -202148 178443 686963 1045584 1048177 785926 363305 -268724 -998805
38107i98805m37256O7082L22627K87910L13642M55609L88438M1393k23031j64581
$$ -998805 -1436061 -1368979 -1046352 -758442 -444800 10809 399247 440640 217609 53028
38097E3028O2056K69729M35885M66274K08858j81159k98262m7881K00796J50287
$$ 53028 115084 384813 820698 1286972 1495830 1314671 1016409 968528 1169324 1319611
38087A319611o0583j56012r5278o509K2206k5339r4182m5766J75158L56039K12151
$$ 1319611 1259028 1103016 1007738 1001229 1023435 998096 903914 858148 1033306 1389345 1601496
38076A601496k05677n00635l88043k5810J71884p228l29301l68841o0601J48506
$$ 1601496 1395819 895184 507141 481331 653215 645987 316686 -52155 -112756 35750
38066C5750q3353m16887l11788N7312K7099l91647m03470K58439P86604N67443
$$ 35750 -47603 -464490 -776278 -718966 -691867 -1083514 -1486984 -1228545 -441941 125502
38056A25502J48801K36591M98930K63682k32458l16903j20170k50846n73823m47488
$$ 125502 274303 510894 1009824 1273506 1041048 724145 603975 353129 -220694 -668182
38046f68182K3984J30833j29068m4532M46060N52145J3194m07640j68587K74797
$$ -668182 -644198 -513365 -642433 -686965 -240905 311240 324434 -83206 -251793 23004
38036B3004L52950J92091J04889K2546j26688j24262O2018J02996p0191p4996
$$ 23004 375954 568045 672934 695480 568792 444530 506548 609544 539353 464357
38026D64357K03778L42264J29480n3570O6344K10598J42616P6424J40099N8650
$$ 464357 668135 1010399 1139879 1086309 1152653 1363251 1505867 1582291 1722390 1781040
38016A781040k52099l88061j42593J07527Q5698O3246K04566J14014m38360r21232
$$ 1781040 1528941 1140880 998287 1105814 1191512 1254758 1459324 1573338 1134978 213746
38006B13746p64502k13510J11982J18464J37986K46495K31895N5735q4642m4641
$$ 213746 -550756 -764266 -652284 -533820 -395834 -149339 82556 138291 53649 9008
37996I008J61244L84589L75612N6736k24196j08756J43412l078m15223m16455
$$ 9008 170252 554841 930453 987189 762993 654237 797649 794571 379348 -37107
37986c7107P1129L48617J14197p4537J39167K82712k7527l75796l30597j80615
$$ -37107 34022 382639 496836 422299 561466 844178 816651 440855 110258 -70357
37976g0357k75186l31275l9413K77263K43304P6232O0921m857k50106k72663J14137
$$ -70357 -345543 -676818 -716231 -438968 -195664 -119432 -58511 -63368 -313474 -586137 -472000
37965d72000L30132p4647n83549n04721m1727J52466j4461j87489j97684J1499
$$ -472000 -141868 -216515 -800064 -1304785 -1346512 -1194046 -1208507 -1395996 -1593680 -1582181
37955a582181N36008J043158Q27206r0207o90446m13776J3551o7342j22849L66735
$$ -1582181 -1046173 -3015 824191 733984 43538 -370238 -356687 -424029 -546878 -180143
37945a80143O58447p494q27823n78910L46800N87197L245l32993m5224J78768
$$ -180143 478304 470810 -357013 -935923 -589123 -1926 1319 -331674 -376898 -198130
37935a98130K6041l3915J79218K69527J04626m0462j21917k57135k50460m029
$$ -198130 -172089 -206004 -26786 242741 347367 306905 184988 -72147 -322607 -326636
37925c26636K3573l74857n05107R6674O55782M28276Q3720M54348Q73119L93558
$$ -326636 -303063 -677920 -1183027 -1086353 -430571 -2295 81425 535773 1408892 1802450
37915A802450k86849O518P39729P13673M05464R79506J829028J658717J187800
$$ 1802450 1515601 1522119 2261848 2975521 3380985 4360491 6189519 7848236 9036036
37906I036036J946032L239668L540075L938624O328134R169260J0163252J2443621
$$ 9036036 10982068 14221736 17761811 21700435 28028569 37197829 47361081 59804702
37898E9804702K0923277L0883560K8443842P851499j7745734k9823006k5071936
$$ 59804702 80727979 111611539 140055381 147906880 130161146 100338140 75266204
37891G5266204j5478592j0797055r536822p148862m296665l543553l885759l011295
$$ 75266204 59787612 48990557 39453735 32304873 28008208 24464655 20578896 17567601
37883A7567601j538973j330717j933516j769451j093651j097674j443280j061651
$$ 17567601 16028628 14697911 12764395 10994944 9901293 8803619 7360339 6298688
37875F298688l37974l64562q35749o22489J46034L28610k60112o54741l54377
$$ 6298688 5960714 5596152 4760403 4137914 4283948 4612558 4352446 3697705 3343328
37866C343328J11440J86041r9105m84368p56627p32175m42340j64877K5514L69290
$$ 3343328 3454768 3640809 3541704 3057336 2300709 1568534 1126194 961317 986831 1356121
37856A356121Q22921Q87478L98212p1011j4721L01249L64468J96100K30599P65037
$$ 1356121 2179042 3066520 3464732 3393721 3379000 3680249 4044717 4240817 4471416 5236453
37846E236453J698696K401081J888237j29786k346117k937245j751967m53838
$$ 5236453 6935149 9336230 11224467 11094681 8748564 5811319 4059352 3605514
37838C605514k29093m90723l27164J867j38709m86684m25657r6490k5813j90865
$$ 3605514 3376421 2885698 2558534 2560401 2421692 1935008 1509351 1412861 1387048 1196183
37828A196183k62622k55625k19726J24385P27424Q53642J66314n23068m64852
$$ 1196183 933561 677936 458210 582595 1310019 2163661 2329975 1806907 1342055
37819A342055k00262n39485j010914o14464L55091O41776j544n27246k96319J82543
$$ 1342055 1141793 602308 -408606 -1023070 -667979 -26203 -27747 -554993 -851312 -668769
37809f68769L73418M17935M44066K04108k40343l63996o6802Q8731j35254k29375
$$ -668769 -295351 122584 566650 770758 530415 166419 99617 188348 53094 -176281
37799a76281J10994L94515J84830j48849r6159J45829Q8088k09276k96628n9062
$$ -176281 -65287 329228 514058 365209 269050 414879 502967 293691 -2937 -61999
37789f1999K14537K94390J65524q6536k51535q8266L02983M86088L04292J14982
$$ -61999 152538 446928 612452 525916 274381 186115 489098 975186 1279478 1394460
37779A394460J23829k9301n49954q44255l06109N67271P04844K6796m28727j07276
$$ 1394460 1518289 1488988 939034 94779 -211330 355941 1060785 1087581 658854 551578
37769E51578K50921j28453p73170p05798L6608N19917L55815J16920K31602L29767
$$ 551578 802499 674046 -99124 -804922 -768314 -248397 107418 224338 455940 785707
37759G85707L9222k84042j61419J88144K52937R8044J52975L35732J29912m54631
$$ 785707 824929 540887 379468 567612 820549 918593 1071568 1407300 1537212 1082581
37749A082581p07101k13458N35334Q23905N58133J23175k13399l88195l30366
$$ 1082581 375480 162022 697356 1521261 2079394 2202569 1989170 1600975 1270609
37740A270609p3974Q6547p1416l02093j72065K86803N32805K10717l46280m87653
$$ 1270609 1196635 1283182 1211766 909673 737608 1024411 1557216 1767933 1421653 934000
37730I34000l3676M90008M71182o5631n43170n87230l87639k22870l7720K08862
$$ 934000 900324 1390332 1861514 1795883 1252713 665483 277844 54974 17254 226116
37720B26116J91475k61584o02537k02447N97609Q45237L70026l5615L1473j452
$$ 226116 417591 156007 -446530 -648977 -51368 793869 1163895 1128280 1159753 1158301
37710A158301n15415q61024l71594M91899Q11612N25372K52225J85375J4462k67770
$$ 1158301 642886 -218138 -589732 -97833 713779 1239151 1491376 1676751 1691213 1423443
37700A423443l20964j53713j28000k80470l03297j93614k64555m80731m37865
$$ 1423443 1102479 948766 820766 540296 236999 43385 -221170 -701901 -1139766
37691a139766r3107J15419K0123p101K61140N08849M22122J59863n683j25783
$$ -1139766 -1232873 -1117454 -1097331 -1104432 -843292 -334443 87679 247542 241859 116076
37681A16076l58075o02549o08497k63476L31799Q72947R46170M37868j51073j90963
$$ 116076 -241999 -844548 -1453045 -1716521 -1384722 -511775 434395 872263 721190 530227
37671E30227K55368N29177L15298l8890k27079l92124o03072n44530j08324K41739
$$ 530227 785595 1314772 1630070 1591180 1364101 971977 368905 -175625 -283949 -42210
37661d2210J48270p0074k9138k92l80147p92328n04673L68823Q71970N30750j6224
$$ -42210 106060 35986 6848 6556 -373591 -1165919 -1670592 -1301769 -429799 100951 84727
37650H4727K316M43517O18606L33759L3642K5767O5874j58534m85605m93009j09450
$$ 84727 87043 530560 1149166 1482925 1516567 1542334 1608208 1449674 964069 471060 361610
37639C61610K76840L41753K17893K35101M33483N25371K76186k40113p26273q73932
$$ 361610 638450 980203 1198096 1433197 1866680 2392051 2668237 2428124 1701851 827919
37629H27919n73284p8363J31481j28364m58209l74226j680J13294j35839k26526
$$ 827919 254635 176272 307753 179389 -278820 -653046 -654726 -541432 -677271 -903797
37619i03797J71673O59530P04217L97549K13415K70434K95082J82232J18861J52456
$$ -903797 -732124 -72594 631623 1029172 1242587 1513021 1808103 1990335 2109196 2261652
37609B261652O6794k09761m23686l81838k38378k07054k16221r3338N9095l2863
$$ 2261652 2328446 2118685 1694999 1313161 1074783 867729 651508 558170 617265 584402
37599E84402l54212n17996k47840K41800N07766M15881K33294K23367L51810M35537
$$ 584402 230190 -287806 -535646 -293846 213920 629801 863095 1086462 1438272 1873809
37589A873809L94098K48676K1445k26540l65424l42656k72841k60885k41382j30361
$$ 1873809 2267907 2516583 2538028 2311488 1946064 1603408 1330567 1069682 828300 697939
37579F97939j2830p599o7451j07772j95848l68681m07446j20781K39636K28058
$$ 697939 685109 677510 610059 502287 306439 -62242 -469688 -590469 -350833 -122775
37569a22775j44211l91838k29818J17318L53603M54101M33659J88462j99160l56364
$$ -122775 -266986 -658824 -888642 -771324 -417721 36380 470039 658501 459341 102977
37559A02977j05030K33097K93698J66089J35077J78995Q1613j28195k12791j16334
$$ 102977 -2053 231044 524742 690831 825908 1004903 1086516 958321 745530 629196
37549F29196j2307j8456j15205k71339m14325l74086j10072J03742m333k82255
$$ 629196 616889 598433 483228 211889 -202436 -576522 -686594 -582852 -587185 -869440
37539h69440l35869p0241K44942M00275M14632L00038K2785k42188j82712J71635
$$ -869440 -1205309 -1275550 -1030608 -630333 -215701 84337 107122 -135066 -317778 -146143
37529a46143L52151M8531m35666n76978l11379l4931n593m7418R4871L45709M01132
$$ -146143 206008 254539 -181127 -758105 -1069484 -1104415 -1110008 -1157426 -1062555 -716846 -315714
37518c15714J42587j98633k93556o8236J98412J21449l80174q86400q16541j02837
$$ -315714 -173127 -371760 -665316 -733552 -535140 -413691 -793865 -1680265 -2496806 -2599643
37508b599643N98017O12505J02605j43343J92899N36926L31222j18164j83107
$$ -2599643 -2001626 -1389121 -1286516 -1429859 -1236960 -700034 -368812 -486976 -670083
37499f70083P0165O9543k35915k92318P6933L58601K42079J19576L15367M44051
$$ -670083 -599918 -530375 -766290 -1058608 -981675 -623074 -380995 -261419 53948 497999
37489D97999O8859m80912n59059j53874K06486K91250L20250L81747K63665r7417
$$ 497999 566858 85946 -473113 -626987 -420501 -129251 190999 572746 836411 738994
37479G38994m38209n15656l32682j3346K85571L85860K63569J33385J30020P3721
$$ 738994 300785 -214871 -547553 -560899 -275328 110532 374101 507486 637506 711227
37469G11227j61571k73553O1033N69038O47141J77727l74889o50888p25315p36257
$$ 711227 549656 276103 337136 906174 1553315 1731042 1356153 705265 -20050 -756307
37459g56307o16830k89757J76395O27562Q07708M35891l48051q25223m84293K02016
$$ -756307 -1373137 -1662894 -1486499 -858937 -51229 384662 36611 -788612 -1272905 -1070889
37449a070889L73702J6360j13584K53565N47693L96676J75466K15383K49254O2162
$$ -1070889 -697187 -680827 -794411 -540846 6847 403523 578989 794372 1043626 1105788
37439A105788k5959J68520K04812k11793n73680l59600M3382l1692l98860l60423
$$ 1105788 1079829 1248349 1453161 1241368 667688 308088 351470 319778 -79082 -439505
37429d39505Q3756K56922m0391k52016l8880K29351J79131p31L591J14700J04188
$$ -439505 -355749 -98827 -139218 -391234 -430114 -200763 -21632 -22363 -18772 95928 200116
37418B00116k329m4734j455P0435J54291J76337O171k99230m56925l05898j3065
$$ 200116 197787 153053 151598 222033 376324 552661 558832 259602 -197323 -503221 -516286
37407e16286J92484L07519M32439N19550M26517J62504n6815k0928K36025M22896
$$ -516286 -323802 -16283 416156 935706 1362223 1524727 1467912 1446984 1683009 2105905
37397B105905K74706j29580m37540m63074l88435m09451l93348j27657K56750
$$ 2105905 2380611 2251031 1813491 1350417 961982 552531 159183 31526 288276
37388B88276M16028K58816j1181k41367m03545l81188n2317L89544N38706K71638
$$ 288276 704304 963120 951939 710572 307027 -74161 -126478 263066 801772 1073410
37378A073410j44259m57858o22649n53782j15662M96932P57914M37277p2942l07111
$$ 1073410 929151 471293 -151356 -705138 -820800 -323868 434046 871323 798381 491270
37368D91270l10186l75051m59071k70520J68706M50424L25908L9386k337K70304
$$ 491270 181084 -193967 -653038 -923558 -754852 -304428 21480 60866 58529 328833
37358C28833N42867N08981K13460l2853n9532n3515k65057n84216o31114k86176
$$ 328833 871700 1380681 1594141 1561288 1501756 1448241 1183184 598968 -32146 -318322
37348c18322J12426K14538R6835Q8031L03822N46889N88352L78781K3488l10866
$$ -318322 -205896 8642 105477 193508 497330 1044219 1632571 2011352 2034840 1723974
37338A723974m85639m90963m43175m23134l67741j86647P2114K49287K33539M8896
$$ 1723974 1238335 747372 304197 -118937 -486678 -673325 -601211 -351924 -118385 -69489
37328f9489j76764l07558l11762k77068k60292j79230K6599K03890J64032K2966
$$ -69489 -246253 -553811 -865573 -1142641 -1402933 -1582163 -1555564 -1351674 -1187642 -1164676
37318a164676R7324M20640O35082M59379J4644m08091o27127n15832k6700N26149
$$ -1164676 -1067352 -646712 -11630 447749 462393 54302 -572825 -1088657 -1115357 -589208
37308e89208N79558L5916m56002l19688J45180K55138j2063q1863K12397L93282
$$ -589208 -9650 26266 -429736 -749424 -604244 -349106 -361169 -443032 -230635 162647
37298A62647K15706Q5796K83349L71744r6472p11691o95791p2017L30874Q6685
$$ 162647 378353 464149 747498 1119242 1022770 311079 -384712 -456729 -125855 -39170
37288c9170k62448j22786K18969J01184l95983n16957r933M45444K89906k0358
$$ -39170 -301618 -424404 -205435 -104251 -500234 -1017191 -1027124 -581680 -291774 -312132
37278c12132K54082Q79618R04050J22986n17668k59991M10772N34585o465n36805
$$ -312132 -58050 821568 1725618 1848604 1330936 1070945 1481717 2016302 2009837 1473032
37268A473032o27418m50444k50375o8833L1967n175J6494K93265N42260L04547
$$ 1473032 845614 395170 144795 75962 107929 102754 119248 412513 954773 1259320
$$ [...]
##END NTUPLES=NMR SPECTRUM
##END=
