##TITLE=31Pdec_LR-724-0-DRY
 PhCh3, 24 sc
 2.10.2020
##JCAMPDX= 6.0         $$ Bruker NMR JCAMP-DX V2.0
##DATA TYPE= NMR SPECTRUM
##DATA CLASS= NTUPLES
##ORIGIN= UXNMR, Bruker Analytische Messtechnik GmbH
##OWNER= root
$$ XWIN-NMR		Version 3.5
$$ Fri Oct  2 10:19:56 2020 Russian Standard Time (UT+4h)  she@DPX200
##.OBSERVE FREQUENCY= 81.013821
##.OBSERVE NUCLEUS= ^31P
##.ACQUISITION MODE= SIMULTANEOUS
##.ACQUISITION SCHEME= undefined
##.AVERAGES= 24
##.DIGITISER RES= 17
##SPECTROMETER/DATA SYSTEM= spect
##.PULSE SEQUENCE= zgpg30
##.SOLVENT NAME= CDCl3
##.SHIFT REFERENCE= (INTERNAL, CDCl3, 0, 182.463)
##AUDIT TRAIL= $$ (NUMBER, WHEN, WHO, WHERE, WHAT)
$$ ##TITLE= Audit trail, XWIN-NMR		Version 3.5
$$ ##JCAMPDX= 5.01
$$ ##ORIGIN= Bruker BioSpin GmbH
$$ ##OWNER= she
$$ F:/spectra/data/she/nmr/P31/1/pdata/1/auditp.txt
$$ ##AUDIT TRAIL=  $$ (NUMBER, WHEN, WHO, WHERE, WHAT)
(   1,<2020-10-02 10:18:59.64 +0400>,<she>,<DPX200>,
      <created by zg, POWCHK disabled, PULCHK disabled
       configuration hash MD5:
       00 E9 B6 7A A2 85 ED C7 34 08 36 98 17 FE 4E 26
       data hash MD5: 32K
       FD DB BF DB F6 17 7C 1F 7F 7B 12 EC E5 08 B9 7B>)
(   2,<2020-10-02 10:19:02.09 +0400>,<she>,<DPX200>,
      <Start of raw data processing
       efp BC_mod = 2 LB = 1 FT_mod = 6 PKNL = 1 PHC0 = -2740.03 PHC1 = 68.00137 SI = 64K 
       data hash MD5: 64K
       76 28 67 0B 18 47 5D 5A E7 B3 A4 0A A1 73 DC 49>)
(   3,<2020-10-02 10:19:19.60 +0400>,<she>,<DPX200>,
      <pk PHC0 = 8.651098 PHC1 = 0 
       data hash MD5: 64K
       64 F6 45 D3 9A B3 9E 03 B4 BE 78 C3 83 05 DA 56>)
$$ ##END=
$$ 
$$ hash MD5
$$ 32 7D 56 04 89 1F 8A B6 30 54 C4 E1 33 69 68 D3
##$RELAX= 
##$RELAX= 
##$RELAX= 
##$RELAX= 
##$RELAX= 
##$RELAX= 
##$RELAX= 
##$RELAX= 
$$ Bruker specific parameters
$$ --------------------------
##$DU= <F:/spectra>
##$EXPNO= 1
##$NAME= <P31>
##$PROCNO= 1
##$TYPE= <nmr>
##$USER= <she>
##$AMP= (0..31)
100 100 100 100 100 100 100 100 100 100 100 100 100 100 100 100 100 100 
100 100 100 100 100 100 100 100 100 100 100 100 100 100 
##$AQSEQ= 0
##$AQ_mod= 1
##$AUNM= <au_zg>
##$AUTOPOS= <>
##$BF1= 81.014009
##$BF2= 200.13
##$BF3= 200.13
##$BF4= 200.13
##$BF5= 200.13
##$BF6= 200.13
##$BF7= 200.13
##$BF8= 200.13
##$BYTORDA= 1
##$CFDGTYP= 0
##$CFRGTYP= 5
##$CHEMSTR= <none>
##$CNST= (0..31)
1 1 145 1 1 1 1 1 1 1 1 1 1 1 1 1 1 1 1 1 1 1 1 1 1 1 1 1 1 1 1 1 
##$CPDPRG= <waltz16>
##$CPDPRG1= <>
##$CPDPRG2= <waltz16>
##$CPDPRG3= <>
##$CPDPRG4= <mlev>
##$CPDPRG5= <mlev>
##$CPDPRG6= <mlev>
##$CPDPRG7= <mlev>
##$CPDPRG8= <mlev>
##$CPDPRGB= <>
##$CPDPRGT= <>
##$D= (0..31)
0 1 0 0 0 0 0 0 0 0 0 0.03 2e-05 3e-06 0 0 0 0 0 0 0 0 0 0 0 0 0 0 0 0 
0 0 
##$DATE= 1601619539
##$DBL= (0..7)
120 120 120 11 120 120 24 19 
##$DBP= (0..7)
150 150 150 150 150 150 150 150 
##$DBP07= 0
##$DBPNAM0= <>
##$DBPNAM1= <>
##$DBPNAM2= <>
##$DBPNAM3= <>
##$DBPNAM4= <>
##$DBPNAM5= <>
##$DBPNAM6= <>
##$DBPNAM7= <>
##$DBPOAL= (0..7)
0.5 0.5 0.5 0.5 0.5 0.5 0.5 0.5 
##$DBPOFFS= (0..7)
0 0 0 0 0 0 0 0 
$$ [...]
##$SUBNAM2= <"">
##$SUBNAM3= <"">
##$SUBNAM4= <"">
##$SUBNAM5= <"">
##$SUBNAM6= <"">
##$SUBNAM7= <"">
##$SUBNAM8= <"">
##$SUBNAM9= <"">
##$SW= 369.568048894756
##$SWIBOX= (0..15)
0 1 3 0 0 0 0 0 0 0 0 0 0 0 0 0 
##$SW_h= 29940.119760479
##$TD= 32768
##$TD0= 1
##$TE= 0
##$TE2= 300
##$TE3= 300
##$TEG= 300
##$TL= (0..7)
0 120 53 12 22 120 120 120 
##$TP= (0..7)
150 150 150 150 150 150 150 150 
##$TP07= 0
##$TPNAME0= <>
##$TPNAME1= <>
##$TPNAME2= <>
##$TPNAME3= <>
##$TPNAME4= <>
##$TPNAME5= <>
##$TPNAME6= <>
##$TPNAME7= <>
##$TPOAL= (0..7)
0.5 0.5 0.5 0.5 0.5 0.5 0.5 0.5 
##$TPOFFS= (0..7)
0 0 0 0 0 0 0 0 
##$TUNHIN= 0
##$TUNHOUT= 0
##$TUNXOUT= 0
##$USERA1= <user>
##$USERA2= <user>
##$USERA3= <user>
##$USERA4= <user>
##$USERA5= <user>
##$V9= 5
##$VALIST= <valist>
##$VCLIST= <CCCCCCCCCCCCCCC>
##$VD= 0
##$VDLIST= <DDDDDDDDDDDDDDD>
##$VPLIST= <PPPPPPPPPPPPPPP>
##$VTLIST= <TTTTTTTTTTTTTTT>
##$WBST= 1024
##$WBSW= 4
##$XGAIN= (0..3)
0 0 0 0 
##$XL= 0
##$YL= 0
##$YMAX_a= 24762
##$YMIN_a= -21522
##$ZGOPTNS= <>
##$ZL1= 120
##$ZL2= 120
##$ZL3= 120
##$ZL4= 120
##$ABSF1= 0
##$ABSF2= 0
##$ABSG= 0
##$ABSL= 0
##$ALPHA= 0
##$AQORDER= 0
##$ASSFAC= 0
##$ASSFACI= 0
##$ASSFACX= 0
##$ASSWID= 0
##$AUNMP= <proc_1d>
##$AZFE= 0.1
##$AZFW= 0.5
##$BCFW= 0
##$BC_mod= 2
##$BYTORDP= 0
##$COROFFS= 0
##$CY= -3
##$DATMOD= 1
##$DC= 0
##$DFILT= <>
##$DTYPP= 0
##$F1P= 0
##$F2P= 0
##$FCOR= 1
##$FTSIZE= 65536
##$FT_mod= 6
##$GAMMA= 0
##$GB= 0
##$INTBC= 1
##$INTSCL= 5.30512e-09
##$ISEN= 30
##$LB= 1
##$LEV0= 0
##$LPBIN= 0
##$MAXI= 10000
##$MC2= 0
##$MEAN= 0
##$ME_mod= 0
##$MI= 50
##$NCOEF= 0
##$NC_proc= -4
##$NLEV= 6
##$NOISF1= 182.463
##$NOISF2= 159.3651
##$NSP= 0
##$NTH_PI= 0
##$NZP= 0
##$OFFSET= 182.463
##$PC= 4
##$PHC0= -2731.379
##$PHC1= 68.00137
##$PH_mod= 1
##$PKNL= yes
##$PPARMOD= 0
##$PSCAL= 0
##$PSIGN= 0
##$REVERSE= no
##$SF= 81.0140089999434
##$SI= 65536
##$SIGF1= 159.3651
##$SIGF2= -187.1042
##$SINO= 113.3802
##$SIOLD= 16384
##$SREGLST= <1H.CDCl3>
##$SSB= 0
##$STSI= 65536
##$STSR= 0
##$SW_p= 29940.119760479
##$SYMM= 0
##$S_DEV= 0
##$TDeff= 32768
##$TDoff= 0
##$TI= <>
##$TILT= no
##$TM1= 0
##$TM2= 0
##$TOPLEV= 0
##$USERP1= <user>
##$USERP2= <user>
##$USERP3= <user>
##$USERP4= <user>
##$USERP5= <user>
##$WDW= 1
##$XDIM= 65536
##$YMAX_p= 434892080
##$YMIN_p= -2128072
$$ End of Bruker specific parameters
$$ ---------------------------------
##NTUPLES= NMR SPECTRUM
##VAR_NAME=  FREQUENCY,     SPECTRUM/REAL,   SPECTRUM/IMAG
##SYMBOL=    X,             R,               I
##VAR_TYPE=  INDEPENDENT,   DEPENDENT,       DEPENDENT
##VAR_FORM=  AFFN,          ASDF,            ASDF
##VAR_DIM=   65536,         65536,           65536
##UNITS=     HZ,            ARBITRARY UNITS, ARBITRARY UNITS
##FACTOR=    0.456856943014862, 1,           1
##FIRST=     14782.0589164792, 0,            0
##LAST=      -15158.0608439998, 0,           0
##MIN=       -15158.0608439998, -2128072,    0
##MAX=       14782.0589164792, 434892080,    0
$$ Real data points
##PAGE= N=1
##DATA TABLE= (X++(R..R)), XYDATA
$$ [...]
45687 -30058 371380 372335 -23421 -400357 -501355 -379168 -117419 267930 623294 638639
45677 638639 219406 -269222 -384038 -204811 -248419 -675672 -939778 -542973 149965 356584
45667 356584 -9317 -280236 -121320 -1744 -333690 -770992 -805001 -564635 -494949 -606674
45657 -606674 -609820 -530909 -617321 -790847 -757694 -568252 -533895 -641626 -572832 -285631 -66491
45646 -66491 5319 128378 283029 211078 -17099 13263 323266 353664 -174738 -719061
45636 -719061 -653530 -164469 79230 -96679 -240455 -47486 211470 149851 -165942 -322037
45626 -322037 -124040 133090 35511 -389492 -663436 -473411 -94564 3093 -211344 -396722
45616 -396722 -405645 -370820 -271575 90387 581481 699275 279768 -192756 -288656 -248965 -502226
45605 -502226 -894923 -905673 -455199 4399 175259 233309 403124 610550 707557 740153
45595 740153 793873 773293 555700 275068 243530 555445 902451 894987 530912 191886
45585 191886 117281 74809 -237553 -616027 -541597 53960 618100 716449 554731 506484
45575 506484 475146 122145 -493437 -944418 -1017673 -874089 -668972 -402144 -163455 -143125
45565 -143125 -298962 -341080 -175064 -62343 -181540 -313674 -188772 77113 163809 31039
45555 31039 -59182 50553 252042 430831 625144 815902 769925 302941 -380487 -813547
45545 -813547 -742699 -329704 112471 384338 362699 -23765 -588202 -883041 -698045 -409987
45535 -409987 -494652 -810302 -809274 -428438 -217505 -436305 -596203 -244144 287285 397208
45525 397208 113547 -92298 -132448 -309350 -606342 -636513 -364000 -267409 -589159 -927383
45515 -927383 -831341 -393341 21585 281070 428645 418517 223348 6585 -77021 -88371
45505 -88371 -115211 -90233 -12065 -109779 -512109 -945521 -1042447 -783656 -373879 108177 597850
45494 597850 785095 414556 -230534 -587828 -561368 -576370 -832409 -958842 -604209 14651
45484 14651 420534 451814 253421 -76566 -503259 -837552 -819726 -425118 101882 492985
45474 492985 594978 365638 -52078 -313855 -181787 149264 263019 77623 -62984 75744
45464 75744 264149 161302 -193743 -483582 -568671 -568111 -534275 -333211 85093 514365 706580
45453 706580 633449 456417 352528 424658 630128 708592 358249 -353096 -900597 -843976
45443 -843976 -359929 11160 75090 113781 286361 297160 -115357 -662653 -830209 -571320
45433 -571320 -310690 -295285 -321765 -189219 -55459 -122829 -245487 -154993 84113 179204
45423 179204 103717 128681 313774 320160 -81799 -581305 -672642 -296921 121644 218258 19046
45412 19046 -257435 -477398 -593603 -566864 -425227 -315076 -384948 -632747 -894139 -966400
45402 -966400 -787433 -556627 -598885 -974490 -1300263 -1160746 -655716 -286060 -293471 -418337
45392 -418337 -385659 -285079 -285888 -308743 -270235 -374775 -784476 -1180489 -1072703 -475472 115920
45381 115920 396757 513185 637498 693442 613738 507957 417598 218760 -63697 -151115
45371 -151115 72027 314087 292173 147144 166264 300641 286054 116153 56769 222725
45361 222725 431832 498296 436993 339921 239274 136592 23056 -156724 -437712 -716813
45351 -716813 -816641 -685621 -450042 -264529 -175706 -118702 -7783 122802 61434 -357715
45341 -357715 -919584 -1116727 -719667 -73524 359485 546637 708428 799201 560382 19910
45331 19910 -468269 -707369 -814914 -853869 -692162 -337422 -35812 127089 369874 756720
45321 756720 946854 679110 202465 -96196 -228233 -408814 -566822 -487975 -295284 -300178
45311 -300178 -414639 -211100 345537 693413 415944 -175830 -484710 -394768 -280843 -388335
45301 -388335 -524842 -390688 -5930 289273 209723 -144605 -374675 -249454 -22204 -124255
45291 -124255 -560292 -841391 -615095 -142338 41450 -207038 -536147 -593898 -399454 -207145
45281 -207145 -180097 -270492 -332015 -289562 -216660 -241294 -366138 -443188 -365145 -192962 -16718
45270 -16718 207652 543582 855621 879156 538019 82728 -137339 -4524 263574 325811
45260 325811 76412 -205289 -167358 146249 338029 247537 218758 532048 822995 485323
45250 485323 -434679 -1189022 -1218810 -707813 -173220 88206 3306 -395423 -815023 -779177
45240 -779177 -194127 421524 586716 476430 537850 755546 762318 507083 293792 221096
45230 221096 108883 -312 188822 621352 778052 411518 -46073 -120645 45266 54612
45220 54612 -42124 105200 446653 482663 -36095 -730014 -1036497 -798355 -299427 106505
45210 106505 279966 307836 335891 385743 341189 136319 -104024 -186733 -75459 69689
45200 69689 37280 -280050 -775999 -1126866 -1052214 -697643 -593042 -1032487 -1623378 -1706659
45190 -1706659 -1161053 -508459 -217598 -201845 -111160 138521 325909 266553 -11462 -380600
45180 -380600 -726521 -928323 -851661 -449216 139543 640414 852016 819617 760353 790385
45170 790385 786725 571832 169044 -209570 -385251 -343816 -197719 -104223 -159714 -272688
45160 -272688 -213293 82664 338559 238156 -156487 -491492 -588090 -580168 -582469 -512225 -340720
45149 -340720 -242849 -297819 -249992 169694 779184 1055430 718280 32916 -497681 -614752
45139 -614752 -441600 -248660 -178513 -204365 -283135 -429338 -584494 -544933 -201781 197930
45129 197930 262906 -37922 -319457 -310294 -178617 -167735 -173066 27234 298582 284850 -6129
45118 -6129 -118064 227855 690098 702582 195547 -284546 -193298 392695 864510 778938
45108 778938 355953 161260 365042 561827 384110 -5317 -255075 -392880 -672525 -989869
45098 -989869 -917528 -368400 205882 438119 490025 641606 783346 666576 417651 382465
45088 382465 559701 605825 413311 284721 410187 520778 293489 -139958 -374820 -302713
45078 -302713 -210251 -321060 -498462 -487357 -259620 21027 259477 482745 667199 680704
45068 680704 452141 100834 -164039 -211490 -23306 333506 672026 710149 295748 -380449
45058 -380449 -919248 -1091379 -990036 -804917 -594403 -352409 -160434 -129233 -242809 -374932
45048 -374932 -428636 -368204 -161940 181342 527348 687256 604009 395924 209829 112074
45038 112074 128528 280781 517923 676918 591589 245549 -206092 -565840 -742743 -779949
45028 -779949 -738013 -589388 -304585 -28826 -11685 -263361 -437489 -252841 71739 71650 -298797
45017 -298797 -576346 -459376 -253136 -415721 -885762 -1165548 -970861 -509251 -145748 -62357
45007 -62357 -261448 -635482 -936817 -884779 -438541 140867 559857 704658 571023 197224
44997 197224 -222100 -360678 -103613 239742 254999 -108183 -547421 -807505 -862527 -748013
44987 -748013 -477612 -187809 -124836 -338141 -555251 -544049 -478524 -707456 -1186640 -1398789
44977 -1398789 -947521 -62919 636908 796096 581129 351908 260348 203186 26409 -290821
44967 -290821 -574729 -561939 -172731 319575 553194 534080 606309 887448 1022222 715835
44957 715835 245538 98280 281687 410797 381847 477497 776142 951543 807865 563042
44947 563042 393822 145571 -217909 -317354 75297 528260 497626 132869 16666 267835
44937 267835 451898 324570 129061 116904 243876 408534 566072 550639 230599 -84645
44927 -84645 117474 751056 1054417 571980 -203369 -478853 -119693 351840 438457 45396
44917 45396 -595069 -1086389 -1122130 -797261 -510147 -441245 -393402 -254141 -220534 -356048
44907 -356048 -366531 -141425 -85947 -493685 -980693 -1035067 -780312 -645075 -596346 -335307
44897 -335307 1795 53278 -14649 279208 817361 960424 586784 270142 275052 186135
44887 186135 -175795 -271382 249716 838738 834835 439309 277878 396353 363070 113864
44877 113864 18203 188500 316068 227026 128847 215548 377463 400496 225819 -32150
44867 -32150 -178914 -98967 46429 -88457 -580329 -1054569 -1159634 -1004485 -853718 -630957
44857 -630957 -118631 508582 806591 692733 546495 635515 785516 703034 351650 -78835
44847 -78835 -373170 -410702 -249685 -100335 -88672 -125753 -154650 -343743 -756856 -994323
44837 -994323 -561390 422591 1232463 1295140 683468 -115142 -627966 -624839 -251845 26255
44827 26255 -114493 -458384 -562561 -384756 -256164 -297229 -280547 -86599 118708 214294
44817 214294 247482 189955 -32057 -235998 -146455 103264 105381 -147775 -264791 -193563 -308532
44806 -308532 -594635 -483211 145439 522023 84998 -603320 -680143 -215871 88483 45802
44796 45802 49991 231565 312275 232648 269653 535877 885682 1249751 1562332 1499435 868513
44785 868513 134099 -78216 86623 -43528 -549719 -815968 -600345 -399900 -530617 -617430
44775 -617430 -346178 -32784 -18106 -95410 -415 69045 -78218 -130440 192628 513824
44765 513824 314323 -213237 -428357 -169314 150755 252177 253105 272157 248791 168083 74272
44754 74272 -122795 -496104 -801381 -699034 -245655 187405 429033 560231 526380 181826
44744 181826 -248791 -260744 223060 671398 667749 399935 175758 -129769 -733240 -1338471
44734 -1338471 -1384932 -834990 -258756 -62774 -24170 218999 534378 495554 81583 -226226
44724 -226226 -134196 23241 -209357 -699083 -912315 -738697 -679359 -1094612 -1670204 -1891201
44714 -1891201 -1723630 -1475330 -1213397 -750320 -120100 357247 524958 561029 626613 641407
44704 641407 521219 392347 426803 622604 840969 928294 762297 346646 -93149 -287235
44694 -287235 -255148 -288390 -538596 -810155 -854083 -693521 -535961 -495415 -524129 -530688 -467574
44683 -467574 -352780 -245849 -156005 -5798 217000 346654 256620 118745 189980 373176
44673 373176 313862 -28043 -270237 -197170 -72173 -129291 -129642 203095 587501 501659 -24893
44662 -24893 -418120 -371851 -202712 -264615 -415656 -340292 -128607 -176761 -588846 -995530
44652 -995530 -1030795 -766458 -542297 -505830 -503035 -382078 -206570 -106004 -72369 -23602 43863
44641 43863 106564 223727 421209 529386 338534 -99014 -500874 -660477 -531964 -85131
44631 -85131 619324 1211928 1241368 743311 259772 137795 142304 -26654 -197652 -52208
44621 -52208 296022 460205 352274 195779 83397 -70366 -201315 -147022 -36863 -221317
44611 -221317 -730428 -1160123 -1200977 -949737 -589022 -124212 360281 515917 112714 -572901
44601 -572901 -1025768 -1038314 -777568 -442260 -128051 22438 -157836 -588539 -887364 -744366
44591 -744366 -284995 64935 59887 -146183 -297607 -392262 -559502 -681382 -450553 119092
44581 119092 564936 575269 428623 507918 628067 327632 -281721 -524773 -107771 468502
44571 468502 645683 485350 310914 104970 -301863 -735935 -858449 -688229 -502922 -316314
44561 -316314 81834 575081 690862 263613 -251508 -331349 26117 463434 763179 930473
44551 930473 949947 761244 444843 199237 102690 53013 -35496 -126344 -198538 -334644 -547033
44540 -547033 -615256 -289185 321536 735795 607071 142132 -158601 -142525 -168064 -559604
44530 -559604 -1114415 -1344376 -1092528 -675447 -428294 -337108 -199249 34412 227686 280381
44520 280381 229678 146197 50351 -41344 -73699 -11324 97685 160966 135516 65842 47938
44509 47938 163243 401891 614587 593738 285889 -92347 -242012 -94245 153996 321624
44499 321624 426796 533061 566448 428768 197965 48481 14887 -7663 -50229 -19409
44489 -19409 131725 328841 498376 639677 749600 781042 688115 427930 -28265 -542458
44479 -542458 -751935 -421233 149756 365505 68738 -256873 -173731 108280 80881 -323641
44469 -323641 -681608 -688164 -486408 -341308 -252384 -43753 281122 439354 168096 -418709
44459 -418709 -869633 -871717 -608629 -476842 -498181 -298530 261814 762621 752384 359693
44449 359693 89123 167594 395489 537868 539856 396545 129582 -83581 -41796 158241
44439 158241 176425 -118967 -467285 -571596 -458454 -388370 -547562 -901774 -1232732 -1263620
44429 -1263620 -865634 -192592 468718 963658 1265477 1272905 856574 151809 -429728 -606902
44419 -606902 -492573 -342938 -199208 65069 433439 664195 548376 170302 -144726 -155288
44409 -155288 54060 216628 235731 231590 209079 -60619 -637859 -1126784 -1096474 -650285
44399 -650285 -250034 -88235 -10279 30653 -88765 -260012 -182850 79725 95184 -187398
44389 -187398 -203148 368422 977771 918615 335639 -7117 236297 706990 978138 958530
44379 958530 672587 137855 -426547 -664263 -508801 -264409 -159308 -99401 26444 93602
44369 93602 -19207 -161171 -99937 136821 294090 217381 27935 -18917 196283 517178
44359 517178 660625 545340 398030 433737 530797 404066 30434 -335032 -548789 -716526
44349 -716526 -895153 -936100 -763499 -585354 -639403 -864711 -992222 -868157 -555978 -211522
44339 -211522 11918 15793 -153583 -317290 -356638 -318747 -252828 -82150 196149 305239
44329 305239 -51033 -707429 -1063620 -720139 55620 641069 745647 624140 638274 805186
44319 805186 874953 723288 497741 391960 421103 460205 396526 194211 -92108 -308277
44309 -308277 -312773 -184263 -208467 -533766 -929945 -1042472 -821442 -524693 -339492 -210147
44299 -210147 -51525 87563 162221 259842 464815 699815 812779 753953 585069 381657
44289 381657 208635 134971 181653 272480 294959 206371 56213 -88201 -234629 -474823
44279 -474823 -837966 -1117312 -987357 -430347 83263 75546 -336166 -596334 -469592 -306583
44269 -306583 -446913 -707049 -713167 -480859 -331844 -372027 -386927 -225049 -2796 103711
44259 103711 70173 -89 25503 207040 397400 298885 -157563 -596353 -621198 -370919
44249 -370919 -318033 -541642 -611687 -290365 78193 111747 -44977 -35249 108167 85375 -110492
44238 -110492 -192593 -92022 -42934 -104658 -3682 383564 719273 617802 163712 -211835
44228 -211835 -229871 63257 490816 880624 1068157 985314 750751 526935 313754 31946
44218 31946 -228211 -237832 59781 428249 584512 454732 153534 -168557 -403556 -512156
44208 -512156 -530476 -494967 -363514 -108157 129130 130988 -103992 -315473 -295173 -108014
44198 -108014 73865 201655 295191 292801 110775 -220688 -593974 -911550 -1046720 -866621
44188 -866621 -458946 -194820 -326382 -593042 -486737 96240 711930 910862 692485 347642
44178 347642 75715 -95142 -164302 -118515 4547 114359 109658 -101277 -538569 -1055404
44168 -1055404 -1385253 -1364732 -1088947 -822463 -780885 -971724 -1179898 -1147595 -869192 -650049
44158 -650049 -710115 -782951 -370870 554106 1390544 1608628 1366465 1183426 1183641 1007165
44148 1007165 449731 -143065 -267585 134519 641114 857212 805133 776453 902385 995559
44138 995559 831727 468059 175799 117953 218830 315618 295615 111069 -161617 -276876
44128 -276876 -44648 358013 518552 296489 -40689 -268165 -472255 -684274 -600996 -39700
44118 -39700 567060 597499 86830 -303499 -196191 48047 -74274 -524917 -864120 -825805
44108 -825805 -505844 -125839 162574 297897 296145 209371 50287 -164331 -276337 -61915
44098 -61915 451525 897237 955407 730544 584303 660978 758151 659096 417853 236767
44088 236767 161336 20014 -310466 -654898 -661381 -212224 373719 652053 524345 279115
44078 279115 182163 180756 63671 -215599 -479345 -546205 -443260 -384422 -517406 -694796
44068 -694796 -608152 -229365 36749 -158772 -585597 -692586 -349193 19573 87114 26791
44058 26791 87035 136436 -54852 -339145 -366917 -113262 98767 34624 -267869 -677047
44048 -677047 -1043439 -1152808 -910124 -569664 -502183 -718438 -887844 -836902 -734119 -736499
44038 -736499 -761123 -708543 -630883 -552880 -393997 -214627 -269229 -614959 -900639 -776581
44028 -776581 -335014 72786 280125 339953 307943 273459 444491 860067 1117404 769357
44018 769357 -11100 -541690 -479942 -202056 -182532 -337936 -270934 52215 224651 -18580
44008 -18580 -411524 -458960 -19880 515365 651437 352324 72590 153457 335486 114978
43998 114978 -476410 -814898 -530742 -57148 -51946 -533055 -965564 -1055638 -1019663 -1079264
43988 -1079264 -1130750 -1041801 -902202 -774636 -506865 -59835 222415 11011 -460374 -591236
43978 -591236 -162487 385084 482720 38257 -572621 -957228 -1030745 -968073 -938814 -920392
43968 -920392 -787308 -558270 -424319 -452271 -409735 -73925 374207 504121 174782 -307054
43958 -307054 -587353 -590473 -400542 -89583 200419 241650 -12942 -306608 -405354 -399449 -491014
43947 -491014 -641048 -671623 -593614 -548042 -500573 -314352 -109283 -197578 -577918 -817109
43937 -817109 -598429 -124525 218009 353252 423414 405280 164393 -178036 -285290 -74737
43927 -74737 138459 102246 10363 221440 715991 1060194 913122 402914 -55822 -200542
43917 -200542 -92295 66833 150641 133161 13995 -195911 -452620 -707948 -936293 -1085483
43907 -1085483 -1055957 -823907 -547283 -415597 -393099 -264214 23652 231543 144049 -139237
43897 -139237 -370629 -476157 -522347 -482438 -300941 -143033 -261576 -547364 -522795 24025
43887 24025 625544 610420 -122768 -1040623 -1600540 -1688166 -1468426 -1106878 -748616 -547324
43877 -547324 -524162 -486464 -235657 168758 438186 330815 -133120 -675903 -956261 -849283
43867 -849283 -577473 -457394 -475025 -297375 165505 445871 83379 -615674 -821268 -258216
43857 -258216 393623 427538 54740 -6958 359049 545324 197752 -263486 -319063 -70453
43847 -70453 76617 93335 225932 419314 367108 101901 24508 238229 320152 -15511
43837 -15511 -422538 -425636 -124883 16053 -76327 -1502 438199 893832 954125 669182 376716
43826 376716 210575 38219 -200868 -353937 -298832 -155729 -142080 -286777 -407490 -379383
43816 -379383 -316813 -396298 -551449 -493473 -88547 403084 581812 360752 63003 73235
43806 73235 452909 885312 960009 552731 -31673 -350152 -290670 -145302 -155571 -166485
43796 -166485 82858 478189 632995 429877 150224 22081 -55552 -214876 -329833 -241052
43786 -241052 -75350 -88253 -282359 -411135 -332698 -168190 -90223 -94882 -38066 160593 390837
43775 390837 451055 308661 211397 411151 785188 912255 584677 69385 -232271 -212628
43765 -212628 -36081 122518 159844 32359 -153873 -186239 -56098 -51911 -316155 -500546
43755 -500546 -194371 419974 728802 498128 140305 82812 222762 201426 -31485 -172482
43745 -172482 20316 443166 759385 738648 511745 443624 646668 716041 194664 -721002
43735 -721002 -1261667 -983752 -301017 75258 -10062 -135714 2473 211320 165985 -77901
43725 -77901 -115781 293096 881037 1143566 917141 517124 248217 14504 -370772 -704725
43715 -704725 -608037 -147336 185372 164717 69640 90159 -47574 -570617 -1150614 -1305862
43705 -1305862 -1080410 -930027 -1075948 -1331389 -1462418 -1375814 -1032485 -518941 -146035 -130539
43695 -130539 -218281 14234 500863 735007 531164 303011 406158 598102 445900 -13634
43685 -13634 -369965 -430450 -359335 -280050 -87212 267148 574641 632181 543410 549303 616030
43674 616030 425910 -147283 -746526 -894437 -551264 -104837 146702 248865 314087 297160
43664 297160 181210 108053 108598 -53469 -490962 -850886 -710891 -192334 194331 249095
43654 249095 227252 284241 211334 -139639 -535730 -673334 -539737 -278311 46852 328978
43644 328978 297441 -177661 -760315 -896215 -395331 369121 824256 680643 123197 -381862
43634 -381862 -507470 -335355 -166289 -124498 -121857 -156800 -331574 -503642 -286010 382164
43624 382164 973399 988902 603096 339536 292528 108163 -326906 -644785 -541598 -194412
43614 -194412 29774 9534 -149944 -340354 -467885 -421233 -214949 -51608 -75600 -157704
43604 -157704 -81301 136996 280701 238245 99590 -43194 -212846 -411388 -522943 -470266
43594 -470266 -376700 -421430 -555223 -523673 -229262 79784 114104 -72547 -198761 -201619 -304634
43583 -304634 -587501 -775404 -646938 -417947 -425038 -569959 -450445 -37539 167246 -193345
43573 -193345 -802742 -1059568 -803063 -382064 -121326 -33686 -62786 -285081 -683129 -902700
43563 -902700 -520288 399215 1196949 1239570 614367 46171 71561 465447 642377 470720
43553 470720 375060 635801 959079 926261 569821 219075 5420 -123113 -68425 287734
43543 287734 683096 699677 437288 434296 754244 732167 -4764 -796429 -790094 -141629 283621
43532 283621 168559 -40361 -88433 -268104 -678799 -897340 -706831 -507606 -612680 -719529
43522 -719529 -536652 -374066 -543578 -673188 -312717 162341 43767 -536472 -750410 -324216
43512 -324216 165513 301883 334972 478388 442421 17144 -477186 -704739 -792671 -940337
43502 -940337 -1007179 -861759 -716942 -721627 -608557 -170689 265768 300029 93878 87793 322759
43491 322759 501419 518128 472711 334300 55180 -118011 88579 483086 613507 405837
43481 405837 205492 252131 488401 796509 1031527 927001 401746 -125026 -172615 132198
43471 132198 298500 272250 405249 661386 548179 -10360 -390173 -146558 366913 588267
43461 588267 482685 329902 190559 -20389 -247599 -448013 -754635 -1163239 -1344387 -1112043
43451 -1112043 -801800 -809380 -1003323 -997958 -796104 -723432 -865754 -1005719 -1044061 -1077994 -1089712
43440 -1089712 -935034 -662829 -522348 -606333 -737966 -732124 -554593 -244994 94147 260517
43430 260517 123482 -199780 -522492 -834946 -1143778 -1227482 -905386 -449647 -311802 -451408
43420 -451408 -367072 140908 662532 766577 510955 194598 -32925 -105242 55459 291235
43410 291235 190118 -350839 -810130 -659999 -85556 316414 372719 379673 411395 179124
43400 179124 -295458 -439699 81021 730476 721434 66365 -466376 -394583 -50966 33472
43390 33472 -146577 -229398 -88464 64806 56195 -100100 -397842 -876819 -1401652 -1662921
43380 -1662921 -1517804 -1133934 -692331 -178216 360134 584153 215937 -475050 -867800
43371 -867800 -709137 -374307 -335117 -608900 -866525 -884418 -696677 -421624 -153506 -5378
43361 -5378 -86809 -388047 -757467 -1015411 -1064370 -919650 -680410 -442402 -204225 94184
43351 94184 418719 624484 647353 582909 474384 194029 -259151 -506299 -178781 481808
43341 481808 815792 610782 339899 345384 280793 -206052 -660737 -370837 451989 812016
43331 812016 341373 -175295 -336 500448 519869 26323 -332546 -259293 -71783 -36974
43321 -36974 -51735 -22095 -48754 -146892 -194145 -219219 -363141 -534603 -512498 -393500 -464432
43310 -464432 -604943 -375916 187168 482299 271291 82379 332058 642372 514016 148446
43300 148446 9839 2947 -242594 -588981 -610351 -400306 -431545 -691510 -674460 -255312
43290 -255312 114630 185661 230276 413137 467654 272566 194234 504204 905183 1006964
43280 1006964 909975 939688 1084066 1062804 768347 342739 -34248 -223615 -173963 -55870
43270 -55870 -120503 -273919 -102276 466720 879797 656053 63797 -280638 -238590 -146037
43260 -146037 -175003 -179121 -109103 -120735 -221884 -182520 113844 503179 787762 913989 865743
43249 865743 621777 294468 121477 230605 508563 714056 650298 303730 -77224 -163869
43239 -163869 38003 110500 -227441 -671764 -738040 -471131 -366900 -641656 -985307 -1071860
43229 -1071860 -929956 -717187 -481612 -286487 -273499 -447858 -626245 -691397 -672403 -546037
43219 -546037 -270199 -57215 -222226 -642213 -787942 -482356 -178317 -205237 -218634 164312
43209 164312 602348 500948 -5388 -198300 162638 546981 491369 165616 -74185 -209647
43199 -209647 -369023 -480081 -413944 -240182 -98245 -2538 45887 -30291 -172741 -115603
43189 -115603 236761 561071 517493 235253 81195 56795 -197004 -779308 -1284507 -1338250
43179 -1338250 -1100085 -966283 -913647 -484495 479224 1353212 1290508 259774 -766015
43170 -766015 -831556 -16469 808616 1079395 1011489 1000827 1019221 835301 498527 267514
43160 267514 226286 265426 331554 425726 435611 228218 -128781 -439365 -607742 -619167 -425168
43149 -425168 -82194 137743 66101 -56262 92035 422738 662740 904678 1394629 1847610
43139 1847610 1654191 888558 406227 631932 914823 548637 -177043 -560755 -606429 -776055
43129 -776055 -971188 -663689 54975 457173 323543 262407 615073 835713 434242 -120093
43119 -120093 -72527 475311 777468 564875 294934 343539 548169 638403 624784 586792
43109 586792 454448 212453 50015 105105 259191 360095 469482 704177 978364 1105044
43099 1105044 1057348 935733 747912 432746 80281 -86807 9709 222322 419487 616074
43089 616074 775876 705285 342561 -5940 15522 325968 512054 393681 183013 50841
43079 50841 -107227 -323581 -331250 38008 496607 672049 621364 597928 490920 -1008
43069 -1008 -673377 -841298 -234738 557766 791900 408592 -66776 -201556 22908 349248
43059 349248 442372 125803 -332316 -342070 324809 1123025 1314873 862708 404747 378147
43049 378147 534107 417428 20785 -238527 -42780 496912 982483 1103259 891877 646968
43039 646968 592563 649191 598231 402927 225842 146312 36597 -212233 -477012 -541375
43029 -541375 -399775 -305503 -487234 -871620 -1127528 -973321 -416548 283233 813592 958753
43019 958753 676246 154404 -254144 -300806 -55401 232874 436658 571769 588996 391295
43009 391295 78914 -82169 -25272 21626 -80411 -147698 12809 287227 458717 531697
42999 531697 629338 743157 822584 953156 1188937 1346732 1227901 913169 579131 194327
42989 194327 -273798 -523744 -237369 332490 567350 314556 47573 77776 82046 -315908
42979 -315908 -870333 -992764 -522064 101991 351247 62032 -557391 -1151358 -1436173 -1338891
42969 -1338891 -994684 -632720 -479008 -666436 -1086892 -1391228 -1332584 -1069803 -905188 -789744
42959 -789744 -435909 73424 242195 -85897 -352481 -4193 702916 1011564 611984 -91547
42949 -91547 -570456 -659737 -465182 -127660 210489 408676 406158 227149 -65597 -321440
42939 -321440 -297701 102917 627381 897053 825915 634615 469083 234158 -143615 -508198
42929 -508198 -666017 -661004 -718578 -958965 -1257528 -1372773 -1157859 -665378 -110297 242810
42919 242810 210553 -175656 -605681 -663069 -220464 357983 575779 372388 144694 180503
42909 180503 328417 339660 255650 231492 209855 74818 -31794 104041 351045 365913
42899 365913 132332 -6689 76498 56078 -337208 -870187 -1116129 -1009050 -835793 -797793
42889 -797793 -829224 -802247 -690944 -513091 -273565 -19861 138143 109776 -108638 -442657
42879 -442657 -778307 -1015571 -1138674 -1224088 -1332811 -1403144 -1299151 -982430 -620307 -505249
42869 -505249 -827878 -1472987 -2034589 -2100364 -1583073 -776890 -85233 287804 394668 372060
42859 372060 271421 54360 -276413 -575185 -633329 -397204 -64495 106667 66961 -20020
42849 -20020 -21437 31402 71408 127100 249891 412554 580471 799608 1085288 1285932 1224493
42838 1224493 965955 766108 715981 624260 349840 60714 -20177 24857 -39217 -170675
42828 -170675 -94812 207046 406266 358565 376360 707755 1045803 943914 523456 303748
42818 303748 404861 432516 219736 158637 560237 1123280 1374884 1300671 1155883 926849
42808 926849 443628 -117773 -327671 -98070 209511 311313 283675 258523 190058 56449
42798 56449 -4936 69015 134485 101575 114961 301830 524516 568629 427933 225791 -514
42787 -514 -232046 -303898 -59347 350822 532852 263951 -268857 -662860 -656945 -309982 96354
42776 96354 338786 477587 746414 1174803 1447677 1281075 841019 583101 693130 888012
42766 888012 799980 368013 -201708 -647463 -708508 -199479 729061 1528172 1725517 1435194
42756 1435194 1144608 1024037 793286 356166 146969 522986 1111004 1223214 803492
42747 803492 457892 523373 642430 463570 252329 398906 686473 582419 85650 -267386
42737 -267386 -232534 -171605 -405405 -704952 -675507 -322124 40253 204641 141161 -142292
42727 -142292 -517513 -669821 -428027 -65599 44845 11939 282358 882779 1223882 879753
42717 879753 234688 8168 314198 582203 378073 -82178 -333883 -241577 16948 270407
42707 270407 389842 206926 -273147 -683622 -667483 -402122 -400466 -772933 -1069876 -951402
42697 -951402 -617884 -398203 -310822 -309239 -570756 -1120107 -1452023 -1038913 -97397 609293
42687 609293 677749 365795 67449 -48828 95842 484384 801500 721599 486111 678285
42677 678285 1280182 1528581 989868 218235 -72271 10842 -69591 -305479 -234799 180073
42667 180073 438136 267117 -57800 -239466 -319907 -395316 -388096 -260007 -119492 11106
42657 11106 225525 433464 379202 98632 -6042 242163 468624 289879 -106271 -259690
42647 -259690 -104285 35601 -7960 -84342 -89546 -149405 -367946 -642169 -801494 -744485 -412858
42636 -412858 144031 625505 654136 230839 -184415 -203908 51628 226582 257519 354849
42626 354849 561461 661505 557122 429477 403529 316938 27420 -246051 -167273 206885
42616 206885 439601 273845 -49204 -140545 29329 139875 -16229 -243747 -181606 250706
42606 250706 750999 984899 922694 743367 524930 238170 12213 118316 578395 1042371
42596 1042371 1241727 1347693 1644628 2056977 2319139 2464204 2781234 3401914 4356261
42587 4356261 5951460 8486875 11404055 13265867 13008152 10967809 8385178 6168231
42579 6168231 4477635 3226394 2430269 2044489 1869506 1772111 1790862 1930390 2010714 1820612
42569 1820612 1355449 851132 580625 589355 649662 558340 426336 487676 657775 592125
42559 592125 255434 65856 268035 515328 398770 101595 114990 487531 802362 830781
42549 830781 794641 962504 1315805 1646875 1735370 1452548 936903 594685 651117 799249
42539 799249 611303 179689 -44734 41799 118444 36611 -14672 15815 -66586 -209856 -58255
42528 -58255 387138 569919 166069 -376895 -474093 -206713 -70940 -219856 -406443 -484902
42518 -484902 -527416 -538110 -424722 -218888 -63632 -54543 -276216 -800036 -1401911 -1539197
42508 -1539197 -973983 -217364 56139 -133696 -257971 -169947 -231343 -550461 -711697 -458905
42498 -458905 -128015 -101604 -245828 -240711 -145353 -225172 -416636 -388052 -75263 208469 230735
42487 230735 123546 132671 302245 514272 685433 800151 835104 767708 634049 499177
42477 499177 373733 216289 25625 -116128 -116824 38782 298526 600870 887456 1130992
42467 1130992 1466521 2235203 3647272 5285450 6179661 5676152 4186647 2799995 2130174
42458 2130174 1835316 1361588 797018 652685 999448 1290787 1111993 710959 546703
42449 546703 586351 410554 -85675 -503084 -547308 -491166 -774195 -1329663 -1626812 -1360049
42439 -1360049 -823457 -523278 -618130 -860872 -946020 -757334 -354733 96983 362584 244033
42429 244033 -235521 -781646 -1049363 -947847 -685579 -489175 -351032 -137931 133681 319359
42419 319359 437625 691222 1091337 1310404 1122312 780934 672501 754366 700581 502831
42409 502831 483162 692524 764114 506737 210415 140948 142121 43572 69372 409444 690071
42398 690071 413183 -216539 -460673 -58272 435930 442353 40856 -332991 -485093 -461449
42388 -461449 -237975 214052 664996 765800 468765 84727 -106561 -106004 -7660 219592
42378 219592 597187 923550 951440 785835 847574 1300013 1718205 1571443 912907 291788
42368 291788 31382 -47936 -143996 -126442 109649 289495 86964 -403812 -838292 -1093899
42358 -1093899 -1257369 -1297563 -1121781 -879912 -842328 -981748 -995358 -743430 -376549 -49358
42348 -49358 192592 284320 239332 322621 712116 1012154 623268 -301643 -820690 -375700
42338 -375700 482661 876307 677191 397196 367921 517531 717848 855704 706578 199856
42328 199856 -299630 -421635 -393635 -717045 -1305429 -1528035 -1187644 -852338 -961756 -1142039
42318 -1142039 -832156 -210561 29020 -326328 -728628 -617759 -82402 351884 355693 55542
42308 55542 -230810 -371708 -504096 -769629 -1046412 -1061942 -772255 -447034 -283404 -130141
42298 -130141 205050 532364 473854 55313 -217746 15798 518880 790816 679378 465570
42288 465570 442198 603150 720362 581356 164696 -303856 -488465 -242861 242935 671697
42278 671697 939181 1076007 994413 557875 -67900 -409591 -205839 228681 358045 66828
42268 66828 -248417 -219712 49296 169770 -14063 -247102 -230512 -39898 -23779 -304361
42258 -304361 -596922 -648427 -641610 -889290 -1256709 -1276957 -864352 -498060 -525397 -664476
42248 -664476 -494706 -131500 -15214 -216794 -385529 -318913 -172780 -92135 -12875 96735
42238 96735 137041 127838 249959 496852 566970 284569 -107363 -279821 -263062 -346084 -646498
42227 -646498 -970183 -1044937 -779899 -353644 -95259 -160999 -298649 -126682 290877 419342
42217 419342 -29774 -632240 -782348 -471621 -168024 -53853 153638 586893 901067 795955
42207 795955 524809 542334 832851 965050 764941 546345 569695 620881 383396 -12705
42197 -12705 -175491 -90199 -167988 -591239 -992927 -984926 -685390 -437498 -269597 -12890
42187 -12890 221403 147960 -127775 -106497 412156 988826 1084189 682561 195313 -51818
42177 -51818 -52057 13391 -23379 -170488 -265270 -200021 -135906 -308995 -651835 -867065 -874499
42166 -874499 -866290 -885087 -734269 -421166 -272457 -397968 -435507 -106347 338886 543795
42156 543795 563806 596870 537601 239257 -65917 -94493 -32145 -217559 -501596 -486127 -274344
42145 -274344 -365176 -809697 -1079049 -866294 -469686 -229611 -88235 97898 257104 326646
42135 326646 381149 350193 19163 -480334 -621894 -220579 185548 57913 -371910 -475829
42125 -475829 -135721 177311 125773 -110225 -195752 -83434 -6221 -179375 -552590 -807512
42115 -807512 -655123 -179198 219076 258668 22249 -260238 -460258 -519555 -419960 -309178
42105 -309178 -424569 -749261 -964752 -876971 -642572 -439597 -223200 -5601 -37032 -405273
42095 -405273 -742884 -676827 -327024 -10287 284493 684065 919838 592043 -104950 -464778
42085 -464778 -171234 324112 475904 328412 315530 628508 1010590 1092627 803131 434405
42075 434405 274847 200637 -160979 -791450 -1141377 -882756 -448080 -401834 -581390 -423868
42065 -423868 67081 355752 294239 276752 419333 345018 -10096 -127543 209680 461194
42055 461194 214372 -122808 -87658 -28558 -467683 -1037338 -910178 -95588 525408 448767
42045 448767 85289 -45883 20614 53754 69282 117084 54509 -164205 -279347 -65669
42035 -65669 351089 712128 946120 1109644 1207923 1220407 1140602 911128 512254 157011
42025 157011 140714 422930 630654 563744 405492 331740 249672 91859 28770 149588
42015 149588 227891 72620 -147703 -203411 -169298 -194013 -165849 26994 129286 -155172
42005 -155172 -615654 -770384 -582236 -471969 -610830 -678699 -442561 -135489 -43146 -64496
41995 -64496 48466 272675 418837 477715 582524 723284 745652 589047 324075 -4996
41985 -4996 -365762 -582229 -438791 -22319 251506 122477 -150400 -144094 87293 56092
41975 56092 -397149 -750985 -500188 72868 271097 -6799 -177418 65583 299360 125419
41965 125419 -184306 -206662 -59281 -45881 -2660 353877 705372 508233 -30449 -152069
41955 -152069 244963 416280 -8354 -425128 -261762 149575 252740 215615 521085 1031948
41945 1031948 1188323 905697 593324 393986 56411 -438177 -718214 -594141 -310947
41936 -310947 -109514 55146 234464 301013 203493 107331 123384 128063 -22919 -292389 -551450
41925 -551450 -697579 -655362 -449955 -281970 -322549 -456306 -455527 -343659 -283458 -179849 181781
41914 181781 587366 484637 -203803 -816371 -783757 -340565 -64645 -37406 96857 431946
41904 431946 636795 476497 123081 -116930 -124722 41492 274577 467071 569165 638631
41894 638631 736872 789573 674296 437974 290147 350132 501181 531525 358996 99183
41884 99183 -46219 32363 255357 441011 484567 400566 206365 -105999 -433967 -546877
41874 -546877 -332277 18982 190141 48357 -297875 -644191 -774039 -525044 18886 461300
41864 461300 458564 164712 76606 372829 657346 514624 89595 -150479 -87098 -31389
41854 -31389 -141271 -144887 181938 583589 675067 521488 498288 664658 685802 414629 150769
41843 150769 174131 367806 509091 620208 764880 769821 470322 31983 -290093 -529333
41833 -529333 -812237 -977936 -804833 -485562 -418217 -576516 -554227 -243474 11896 21292
41823 21292 33691 256268 505854 547997 426372 248623 -20798 -338302 -467028 -314443
41813 -314443 -108749 -41055 -17182 59892 103104 141362 406883 835078 901472 371511 -160969
41802 -160969 -3248 643824 999600 831298 625531 657719 560559 33642 -547260 -598223
41792 -598223 -116262 344613 363077 44653 -244337 -314891 -241077 -127837 25228 175427
41782 175427 129370 -208583 -575138 -619915 -409627 -315884 -376250 -205366 312329 719786
41772 719786 659104 390404 258987 89034 -376902 -811596 -716332 -263310 -50406 -144376
41762 -144376 -73622 239803 272241 -220313 -759560 -853875 -636066 -503933 -549821 -639644
41752 -639644 -707620 -698436 -516086 -271472 -294844 -664249 -983911 -866825 -409480 22055
41742 22055 251151 326777 316268 283023 306629 346499 242870 -4523 -144557 -17034 187404
41731 187404 169072 -119181 -471749 -648112 -504592 -81590 345910 468170 270525 20203
41721 20203 -86345 -67016 29576 169304 185151 -94216 -523385 -771597 -805754 -869277 -953326
41710 -953326 -764908 -329205 -92539 -214899 -303766 -154090 -191530 -732804 -1299618 -1227439
41700 -1227439 -592491 28636 399840 615486 531748 -54600 -741874 -766485 -30376 690546
41690 690546 738520 302090 -40185 -88454 -70111 -198048 -449091 -671680 -756329 -725596
41680 -725596 -665687 -540096 -199245 305404 609359 472365 160398 96915 272713 338257
41670 338257 168993 -41399 -182611 -314161 -361092 -139346 250879 429372 234798 -86156
41660 -86156 -259069 -253714 -126184 89725 262824 250352 177245 319415 649122 837279
41650 837279 773394 692522 678594 487750 78782 -120262 188849 653121 736636 475707
41640 475707 375269 693149 1184540 1479584 1402738 966552 342843 -147337 -241360 23294
41630 23294 384025 619500 627478 356086 -130400 -555920 -604072 -227476 298227 616396
41620 616396 548609 214111 -31843 96320 467937 635016 393993 68593 62011 331197
41610 331197 564291 693608 868951 1020510 879101 467934 160743 116343 36698 -297778
41600 -297778 -606461 -538440 -237122 -64453 46898 453898 1038382 1139647 470410 -342860
41590 -342860 -498534 -10769 452298 541051 546605 757252 981520 907056 587598 313157
41580 313157 213669 227391 288391 307788 113120 -331112 -722021 -680458 -184277 437829
41570 437829 870714 980338 734512 245889 -142782 -120766 202326 425298 406488 406482 604098
41559 604098 768431 584748 80137 -467930 -871310 -1085047 -1071363 -833700 -516117 -288217
41549 -288217 -172605 -108606 -98574 -142476 -124115 43024 218890 204129 80071 132018 384099
41538 384099 468062 112193 -430529 -659698 -422035 5461 358134 610036 722390 508225
41528 508225 -38076 -531620 -630779 -530169 -662371 -981706 -973569 -438507 173634 416396
41518 416396 442712 630851 921016 932660 573536 124239 -211582 -463937 -619971 -552266
41508 -552266 -290702 -91870 -159117 -474901 -903556 -1259451 -1327071 -1075359 -813542 -840836
41498 -840836 -968496 -729777 -82354 468029 530981 266817 34993 -51004 -48161 20199
41488 20199 81035 -13719 -218860 -240842 35090 286612 159065 -250884 -540710 -480966
41478 -480966 -149960 258123 555017 614524 493170 392510 376569 285190 54859 -96533
41468 -96533 -9291 98512 -85663 -498837 -767456 -655182 -240553 249390 578259 583759
41458 583759 347928 200463 334733 497376 290676 -259892 -670515 -550984 -30715 397330
41448 397330 370901 -4702 -282593 -175826 107690 174701 19671 -15591 136751 122820
41438 122820 -179142 -314090 77417 621412 733640 517633 568368 986405 1183176 753351
41428 753351 47172 -323447 -207885 54933 99388 -150364 -484822 -606818 -392269 8345
41418 8345 353014 513181 453299 198251 -52101 -24414 200010 144461 -364914 -768999
41408 -768999 -495053 154311 402649 122291 -103525 11961 121497 28546 71660 419859
41398 419859 624805 308741 -192823 -336770 -139380 15585 24691 62279 158801 213881
41388 213881 266151 371170 365357 115913 -135407 -41202 348780 688765 827753 862865
41378 862865 818881 649638 492567 541440 675650 571953 210628 -61864 -35223 98107
41368 98107 72857 -90448 -159964 28043 405126 669610 510360 4345 -318173 -63782
41358 -63782 472687 684190 504013 442592 737046 960233 694683 182074 -21507 240242
41348 240242 662864 914045 834636 415124 -104434 -278568 54285 450604 381905 -32646
41338 -32646 -213390 28565 301759 333812 340803 501258 550787 258423 -71925 -33233 197176
41327 197176 108703 -315711 -549710 -332545 -32791 -45055 -247534 -308138 -188054 -29946
41317 -29946 197502 577281 900785 808770 269828 -344322 -669897 -628035 -308544 181465
41307 181465 699718 1087016 1280070 1302305 1147760 825776 517185 479095 710606 871050
41297 871050 647346 113977 -360807 -497468 -318603 -41896 147645 220624 256722 323339
41287 323339 426939 553415 669131 672674 469193 147446 -61534 -101712 -204214 -520437
41277 -520437 -806641 -717743 -307015 45107 138247 87193 -22310 -261669 -572564 -685865
41267 -685865 -485763 -198031 -48239 39876 216459 380067 320912 76627 -83965 -7285
41257 -7285 174736 235338 134547 84384 306642 694599 823057 442613 -147043 -467630
41247 -467630 -523461 -734193 -1203956 -1500703 -1324961 -979660 -899039 -1060456 -1190841 -1241729
41237 -1241729 -1262225 -1063991 -498673 69879 72511 -492810 -1025203 -1090506 -832099 -561161
41227 -561161 -353800 -205567 -216009 -380159 -453112 -263453 15429 119663 71739 79844
41217 79844 159615 100086 -186519 -471400 -454168 -124141 209651 254351 43572 -140083
41207 -140083 -114281 48056 221394 402862 571607 556580 267119 -60758 -122275 5066
41197 5066 -19487 -213983 -168211 319769 826907 822394 414693 236684 619935 1193218 1377335
41186 1377335 1031841 457554 -59964 -457498 -683202 -563423 -55036 505977 652287
41177 652287 305055 -139526 -305534 -232962 -157394 -87996 152324 554389 868735 948793
41167 948793 912389 888766 819003 633974 452274 423751 491070 504131 511992 717248 1107246
41156 1107246 1335880 1105357 550709 87255 -71954 -71655 -87263 -58890 122047 329415
41146 329415 329094 134727 13989 123915 338621 485217 557195 615069 656057 683957 744104
41135 744104 785740 663280 391422 205954 217437 205063 -44933 -386049 -538599 -500582
41125 -500582 -456752 -429851 -343111 -314712 -528197 -861653 -1003972 -915679 -809681 -695394
41115 -695394 -374453 57570 179271 -114569 -375622 -261005 -45330 -158190 -536206 -807401
41105 -807401 -874044 -910177 -938407 -814578 -570426 -416099 -409869 -408322 -326030 -189419 25495
41094 25495 335630 563712 499654 247767 124519 194652 212891 77739 19522 208806
41084 208806 462654 520092 391814 258014 202367 221640 333076 493889 565982 540960
41074 540960 640690 974001 1236453 1032339 429695 -90660 -236162 -179012 -187733 -258422
41064 -258422 -248549 -164433 -121100 -126182 -77881 72125 285695 526017 753495 859969 738349
41053 738349 438254 155868 30669 8324 -70426 -287656 -566896 -731185 -640130 -331533
41043 -331533 -50405 -68085 -403913 -756114 -788026 -489693 -179291 -112947 -182055 -94593
41033 -94593 204592 459100 468452 351312 329848 399313 393383 288668 224549 240132 209181
41022 209181 64620 -108149 -234203 -297779 -193963 202795 718192 910765 620491 242952
41012 242952 219394 468937 605232 522924 431606 441372 475229 511826 551108 396924 -125790
41001 -125790 -739318 -918687 -603882 -314448 -438656 -782088 -965890 -900445 -676051 -347542
40991 -347542 -70426 -119127 -479803 -703567 -473974 -88050 -50950 -375959 -612514 -445037
40981 -445037 32065 546023 889286 986614 913138 790840 576784 126589 -434556 -689025
40971 -689025 -472868 -151109 -89416 -153597 -58006 95868 48722 -97857 -64748 78011
40961 78011 48688 -115825 -163331 -163361 -415771 -852119 -1051123 -884547 -655134 -531770 -333504
40950 -333504 23124 324923 442752 489082 473206 229941 -160781 -314677 -96338 155643
40940 155643 150128 19022 -29320 -72090 -258706 -539193 -803885 -1020767 -1103467 -959401
40930 -959401 -771452 -848979 -1087576 -1029732 -611942 -321020 -368817 -299151 197058 644320
40920 644320 501791 63480 12585 395085 682674 657169 597293 677274 764917 804688 895692
40909 895692 983344 922712 834193 945238 1088529 845697 256434 -87403 187640 749712
40899 749712 1020215 825008 432145 183381 233443 477933 636564 527492 272955 109899
40889 109899 66290 3156 -130645 -319783 -623574 -991708 -1081313 -662068 -117904 -70565
40879 -70565 -503013 -765185 -539293 -263877 -382152 -670768 -660447 -334091 -9809 190333
40869 190333 350823 434168 336199 166101 125149 163337 57540 -209016 -422138 -461194
40859 -461194 -382700 -207824 76455 279361 89218 -469430 -913842 -839289 -417301 -143188
40849 -143188 -180818 -203858 96029 564348 774000 547723 144364 -52275 83396 356957
40839 356957 483737 347690 94407 -1877 190343 505133 643161 487929 187723 -61827
40829 -61827 -187134 -162525 62750 440510 744048 774874 604020 468658 451316 400706
40819 400706 195005 -25061 38819 510265 1136577 1467990 1295931 875886 611625 558965
40809 558965 428893 93386 -176863 -125338 68588 24156 -313786 -637596 -712776 -614695
40799 -614695 -524466 -480889 -385529 -155945 134380 230288 -89624 -674554 -1014990 -763496
40789 -763496 -135919 382770 606697 701119 803908 914171 1097982 1437013 1723026 1556000
40779 1556000 892004 208558 -61989 -37136 -117861 -406808 -643068 -617457 -407075 -211068
40769 -211068 -144973 -215842 -346438 -383310 -204797 116988 347119 342392 209210 146141 201654
40758 201654 290214 395908 599115 872355 1007145 842276 461594 77428 -168891 -198421
40748 -198421 46643 462653 751002 741152 611270 550479 396913 -19285 -353468 -115446
40738 -115446 461381 545616 -127445 -814565 -798268 -316541 -29651 -32487 41891 253939
40728 253939 302479 105165 -89445 -125867 -65582 56154 233414 331633 276642 293563 592770
40717 592770 941599 955680 713478 638460 825111 933860 755499 450074 190218 -33503
40707 -33503 -196166 -190279 -59103 23502 22311 7869 -81728 -301300 -407368 -132683 296464
40696 296464 388149 123225 -44325 29609 -38987 -430012 -717124 -504961 -45423 134328
40686 134328 -71075 -336152 -374730 -135769 311272 824201 1186450 1233420 975861 564152
40676 564152 188956 -2292 12295 155901 408193 790491 1122790 1070170 626885 242858
40666 242858 193470 191472 1702 -5003 509038 1066644 1002055 584209 629172 1135561 1271781
40655 1271781 743294 186334 29979 -60501 -299571 -276480 221422 699509 759592 683259
40645 683259 735449 619969 174188 -93789 210587 646764 635676 348531 279307 419577
40635 419577 475552 456677 455204 285074 -78217 -163723 284085 731947 624807 237666
40625 237666 86007 12688 -327972 -554135 -79863 754724 1053922 705906 418616 499365
40615 499365 524291 257366 25292 39327 103746 153014 389063 732412 791045 535845
40605 535845 385515 468699 442741 240289 328822 902616 1402459 1267559 737429 464375
40595 464375 610094 741603 492597 1562 -301078 -172720 206935 470071 520085 617464
40585 617464 911857 1112110 875308 353017 30730 117399 388039 547442 473146 198872
40575 198872 -63226 1274 427409 798712 744579 441441 296828 331763 274036 101458
40565 101458 42391 116376 95546 -107504 -360236 -561649 -676173 -640636 -537346 -668208
40555 -668208 -1108294 -1415374 -1195283 -714824 -477759 -440255 -219838 115184 128865 -183099
40545 -183099 -333973 -118298 148012 232818 287807 432209 517217 436995 288987 149858
40535 149858 38593 102868 462225 871333 924844 604079 279952 210467 355614 586885
40525 586885 741074 621144 304072 225590 547650 741279 330709 -262231 -289605 158632
40515 158632 338682 59288 -123960 93247 393432 569811 862871 1361227 1716793 1690594
40505 1690594 1470790 1294111 1207326 1260215 1459218 1529295 1224933 830888 810062 1046114
40495 1046114 1057723 866580 937346 1296929 1475174 1348654 1278354 1333178 1141281 648223
40485 648223 303248 332413 473141 533027 574233 507971 199413 -7039 384889 1148879
40475 1148879 1573627 1592033 1825394 2459382 2992312 3211279 3468565 3800733 3719801 3143583
40465 3143583 2656632 2596344 2716415 2920327 3394634 3833905 3559463 2684647 2144142 2265387
40455 2265387 2359204 2052561 1888257 2147166 2228026 1808753 1562631 2021228 2666511 2886059
40445 2886059 3036802 3877331 5581991 7761527 9724621 10417695 9101924 6554727 4608863
40436 4608863 4006558 3716352 2816686 1826555 1487260 1454375 1127664 770468 861757 1179910
40426 1179910 1369576 1610085 1966306 1920561 1288516 754607 808832 1035420 1085966 1352625
40416 1352625 2005522 2448806 2463595 2751433 3563883 4020337 3690382 3603892 4644272 6102296
40406 6102296 6880881 6983384 6761895 5936222 4534344 3577489 3565958 3455759 2401107
40397 2401107 1291083 1212569 1633604 1566301 1304804 1460964 1486862 825031 388021 1138619
40387 1138619 2231384 2329985 1785486 1723260 1941046 1577124 980171 1031130 1391255 1233603
40377 1233603 930961 1256341 1736284 1545862 1156265 1363547 1673186 1405701 1261786
40368 1261786 1917464 2342352 1568614 774929 1355387 2323423 2123266 1594015 2356813
40359 2356813 3605965 3550831 2858138 3413272 4683966 4764790 4260537 5550376 8602226
40350 8602226 10925871 11385191 10854669 9582855 7248251 5158724 4989448 5775112 5441861
40341 5441861 4555387 5023841 6114218 5759651 4805074 5581457 7241350 7220348 6355427
40332 6355427 7453979 9756947 10368293 10196476 12399550 15947105 17497298 18672614
40324 18672614 23849753 31614204 36993376 41303559 49813251 60435784 66882836 73015424
40316 73015424 89463254 115232538 141893292 180075747 255279680 360200937 434892080
40309 434892080 423944166 343197206 261015091 217989732 194928459 161029104 119778339
40302 119778339 92124300 80025694 69405087 55790147 46189374 41862829 36467614
40295 36467614 28818133 23967098 22641064 20385286 16496100 14608891 14871877 13618756
40287 13618756 10608845 9414882 10611438 10951688 9423961 8415910 8696628 8410522
40279 8410522 7287550 7221563 8428000 9093723 8898230 9292620 10651959 12566868 16025071
40270 16025071 21421155 25313125 23506912 17076329 11272961 8678938 7421020 5924971
40262 5924971 5050882 5023525 4334305 2729521 1940316 2522329 2940414 2507360 2369380
40253 2369380 2925046 3046831 2498041 2430584 2884294 2458210 1085175 484130 1161028
40244 1161028 1551473 904926 473174 957126 1233006 626674 168522 518752 752995
40235 752995 280672 6504 522737 967361 696257 387631 552322 603880 282317 346100
40225 346100 980271 1162122 501441 97250 646595 1277626 1210460 1037202 1350256 1581470
40215 1581470 1278092 1168934 1857175 2656313 2762726 2481915 2358008 2181492 1746051
40206 1746051 1496068 1565356 1271096 399777 -132643 238426 730730 599789 366415 679854
40196 679854 1074355 937445 690128 864872 935231 253984 -629057 -771596 -313736 -34890
40186 -34890 -19072 147097 341261 141135 -267915 -371656 -210019 -165846 -211956 -135619
40176 -135619 -141129 -452940 -677846 -359645 129312 48074 -562842 -935779 -679601 -196535
40166 -196535 -36079 -316451 -743122 -858902 -390221 402233 919172 964100 974199 1296550
40156 1296550 1636530 1547966 1129045 886522 1138950 1783100 2430008 2656308 2381967 2018049
40146 2018049 1930254 1880748 1474782 963947 905155 1152323 1047916 593538 460587 745007
40136 745007 773347 389501 319925 833248 1128316 655515 57742 92386 483478 588879
40126 588879 439254 350693 185422 -231653 -537358 -389313 -89703 -23240 -1993 232156
40116 232156 401449 190080 -176623 -398481 -590217 -801440 -697509 -271615 -175041 -712675
40106 -712675 -1212339 -1061418 -647032 -540218 -505432 -167025 68300 -282191 -776429 -751742
40096 -751742 -474431 -565445 -801118 -586597 -185293 -293691 -682468 -473753 339603 815756
40086 815756 546641 157039 162263 268954 86992 -213806 -270557 -38940 265911 387758
40076 387758 162207 -257646 -432142 -213661 -40667 -274271 -597384 -564730 -368673 -466621
40066 -466621 -791043 -955403 -927093 -873617 -678394 -248005 67653 22641 12163 334814
40056 334814 421881 -291473 -1175627 -1140727 -257726 436086 532956 532304 646736 503847 86740
40045 86740 -124383 -74531 -188991 -399135 -140324 521427 797362 442839 111946 171416
40035 171416 168026 -159792 -326105 -31343 231400 39880 -250963 -199253 4292 25882
40025 25882 -5793 121198 245661 192199 104820 77667 -38943 -178716 11414 486436
40015 486436 687428 455722 393148 888447 1437725 1422272 962505 496776 101288 -228892
40005 -228892 -201333 248230 546576 243191 -236899 -230908 155175 333248 201283 140979
39995 140979 270047 359277 375224 513254 741621 801587 619918 337997 39386 -202986
39985 -202986 -197896 59702 181327 -76846 -310733 -36714 438909 359909 -335224 -877344
39975 -877344 -766028 -379028 -260531 -358796 -343663 -270137 -441012 -787679 -859215 -472290
39965 -472290 -29933 -24493 -416808 -727020 -669215 -448754 -381944 -475843 -569600 -680349 -894058
39954 -894058 -1012040 -690966 10528 570524 630790 400097 252941 187968 -45688 -434922
39944 -434922 -621861 -366986 88223 234167 -138523 -657826 -774521 -451961 -237279 -511650
39934 -511650 -932264 -924820 -521451 -269395 -397623 -578594 -560016 -521502 -631174 -705771
39924 -705771 -572548 -390238 -305811 -109012 409811 965936 1024068 481750 -175818 -429358
39914 -429358 -267018 -125757 -349100 -754050 -832061 -422728 17648 30755 -173074 -41803
39904 -41803 440121 697179 426747 21470 -40039 205666 442348 540687 524170 368693
39894 368693 112806 -49683 -15861 69380 64727 30392 29590 -24379 -148473 -150368 91337
39883 91337 386894 449496 213784 -161558 -456703 -501324 -305729 -108534 -94694 -100053 134414
39872 134414 478129 546656 288163 13223 -143690 -299048 -342846 16825 597465 752068
39862 752068 296365 -141292 -14590 419560 619173 492524 232862 -103408 -429212 -466928
39852 -466928 -191871 -53962 -346780 -735112 -806343 -679559 -638818 -589961 -365553 -163478
39842 -163478 -167162 -111277 250333 632060 719886 769879 1075600 1252651 808861 109589
39832 109589 -54863 318205 486666 127972 -347449 -631743 -859648 -1018231 -781479 -145093
39822 -145093 410236 612036 708533 909219 1052084 1026038 1005194 1031544 843978 379531
39812 379531 13700 25615 194194 198086 88099 76975 129016 62389 -93646 -90564 239731
39801 239731 784441 1204513 1199331 817451 445890 367563 456809 481812 494271 623930 702658
39790 702658 513967 280947 425427 868974 1030012 561180 -280051 -1001377 -1269723 -998306
39780 -998306 -445251 -165977 -433647 -775926 -558282 77766 440148 372022 395857 716929
39770 716929 867453 582652 281991 298859 304381 -24268 -351671 -258521 20528 51536
39760 51536 18020 411857 1123187 1501439 1285778 921438 893241 1175209 1432727 1443292
39750 1443292 1218667 941984 855426 1046377 1313975 1369646 1156488 863393 671480 603328
39740 603328 578747 514079 391042 272657 195426 53897 -269249 -652368 -811930 -685104
39730 -685104 -524388 -520220 -541744 -379003 -50425 275941 508590 645297 696845 707857
39720 707857 727113 689789 482238 168320 -39660 -73894 -47267 31948 281023 601225
39710 601225 662494 388044 120860 107961 156627 56410 -956 227631 541487 552242
39700 552242 257239 -19281 -114018 -83524 89004 429471 687346 554217 184376 74095
39690 74095 332424 479167 152868 -335098 -433994 -95605 244777 303549 222331 201399
39680 201399 178882 25195 -158951 -175042 -79366 -161781 -534873 -937802 -1050200 -869215
39670 -869215 -663265 -645780 -791840 -890126 -698106 -159783 451652 760321 751049 798782
39660 798782 1089162 1275973 979576 376841 -69400 -270985 -465196 -643074 -553488 -271294
39650 -271294 -221700 -511208 -713714 -525531 -220952 -203767 -439719 -606338 -556883 -385566
39640 -385566 -218265 -144848 -216187 -361809 -431770 -385416 -291064 -142625 106979 356514
39630 356514 476046 575945 816893 999708 782860 310038 105547 261049 285442 -58130
39620 -58130 -343581 -200861 90238 101822 -91932 -159188 -30879 184448 450200 634266
39610 634266 469073 11836 -255288 -120626 17482 -114152 -122286 332038 777073 564701
39600 564701 -117136 -573109 -652615 -740241 -900828 -807761 -467453 -299596 -446093 -594772
39590 -594772 -535235 -357533 -88024 330108 664110 540242 43984 -309359 -278788 -132505
39580 -132505 -135236 -247291 -387541 -562556 -673001 -591459 -463677 -536336 -692281 -591312
39570 -591312 -267602 -116045 -252738 -353827 -181846 164077 542344 860488 883683 463280
39560 463280 -33477 -71093 247751 317451 24339 -71596 291969 632944 538222 262509
39550 262509 135871 -17823 -401754 -705905 -584529 -292420 -313398 -616347 -761003 -571214
39540 -571214 -304899 -269785 -544783 -939565 -1048349 -576772 208010 634841 404390 -120779
39530 -120779 -533862 -812373 -897653 -444140 533629 1261082 1063489 294833 -189936 -199538
39520 -199538 -183773 -266381 -78424 423178 688659 347701 -270022 -633675 -641228 -515230
39510 -515230 -387843 -260913 -195492 -301714 -587073 -921391 -1124252 -1076095 -805523 -463846
39500 -463846 -184240 -31800 -95759 -432527 -815247 -785590 -183448 557338 899405 834348
39490 834348 746689 794304 777326 568781 319288 186573 133758 60392 -68246 -260935
39480 -260935 -504800 -723114 -862808 -969770 -1029882 -854363 -353408 179497 343236 137739
39470 137739 -89069 -157090 -188181 -228591 -112086 193630 428747 393202 206260 61260
39460 61260 -44166 -164893 -221007 -164228 -148579 -298770 -444819 -344224 -83662 16245
39450 16245 -123867 -248266 -204715 -189132 -383006 -585134 -483775 -164626 -9922 -109529
39440 -109529 -144443 37435 116521 -165961 -501255 -431836 -51658 179638 190945 327759
39430 327759 634055 692125 334118 -32042 -72465 -17572 -173100 -389288 -421901 -423428 -599301
39419 -599301 -711470 -466687 -150427 -288279 -813071 -1135493 -970542 -550095 -72954 460239
39409 460239 840068 704730 170797 -140485 63281 360859 310800 74267 38807 216598
39399 216598 369071 416084 368384 116405 -351085 -719072 -685405 -378452 -130009 10261
39389 10261 207936 433174 486026 369223 283432 264484 163732 19522 106429 494733
39379 494733 843482 810753 469059 118673 -161323 -532252 -1010499 -1312835 -1185898 -737066
39369 -737066 -280933 66024 425633 776777 809846 376566 -106280 -60167 466710 793032
39359 793032 511117 39338 938 342612 482389 211362 -13453 245468 808332 1166014
39349 1166014 1104017 789139 399489 -32275 -425946 -575474 -391464 -94859 -22902 -253362
39339 -253362 -518437 -529826 -327439 -219530 -383410 -647362 -749039 -691275 -654845 -614333
39329 -614333 -329742 181879 462975 169076 -388488 -601094 -368014 -141259 -168877 -166342
39319 -166342 97710 359257 330919 225369 363126 555107 414130 93486 96527 395764
39309 395764 399281 -90781 -528149 -485163 -269112 -288870 -326652 37064 639956 945022
39299 945022 815580 561289 360432 145332 -25253 18397 179880 179051 21521 -17361
39289 -17361 128242 264641 357732 540602 670275 392670 -206282 -510136 -176499 383524
39279 383524 604265 470980 312609 220943 66537 -108596 -92996 171937 525884 772787
39269 772787 760522 420206 -88450 -423790 -438637 -343223 -323756 -248508 -17339 63134 -335211
39258 -335211 -945667 -1127135 -687779 -82489 250982 353858 436576 499859 490381 538133
39248 538133 758647 1000579 1047783 939960 842916 714073 394677 -3147 -127787 111713
39238 111713 356996 275323 3938 -99293 13732 80944 -15701 -109548 -90303 -82183 -167478
39227 -167478 -202122 -84285 23667 -34189 -107307 25811 271701 365390 284405 192007 53375
39216 53375 -294228 -684934 -674325 -183443 294816 354921 218096 334705 718166 1017904
39206 1017904 1073541 1011064 859128 472624 -80921 -392049 -173687 321274 563966 370289
39196 370289 66408 20933 198844 304394 235786 172232 226723 278060 245772 264372 379183
39185 379183 313364 -149542 -729175 -977167 -934207 -1021494 -1314036 -1423685 -1181837 -910672
39175 -910672 -811674 -598439 -71508 394634 382941 105623 44423 164740 33128 -401982
39165 -401982 -696692 -594873 -344978 -238851 -240820 -221910 -226164 -311704 -359531 -223438 62533
39154 62533 330149 421636 259736 -74850 -311016 -206463 149660 399837 314337 -20592
39144 -20592 -405894 -711770 -808761 -548354 28100 577130 702842 316167 -286860 -675702
39134 -675702 -632203 -318856 -90949 -96213 -137332 -10175 167047 155578 9249 -2381 138232
39123 138232 123115 -201000 -559697 -622416 -439576 -312299 -360555 -426947 -356371 -190624
39113 -190624 -63233 -9672 64488 246991 475714 566841 416743 137747 -66982 -127100
39103 -127100 -123376 -118321 -82127 4853 69349 -4324 -273414 -657839 -921164 -807681 -301290
39092 -301290 294088 624419 600337 388030 184283 93420 112944 116327 -40484 -284524
39082 -284524 -366528 -279156 -379736 -821636 -1125367 -751454 57110 521750 378841 138634
39072 138634 232224 472429 562028 591449 701248 707537 464832 240046 303361 443282 320296
39061 320296 43673 -62549 -42414 -150440 -284109 -139154 145207 94970 -301260 -488152
39051 -488152 -187417 200943 277285 205396 254295 238795 -105176 -502142 -436575 59560
39041 59560 411728 274861 -120344 -409027 -478541 -349958 -72479 120052 -88765 -621044
39031 -621044 -929816 -658501 -129298 107497 -9489 -123982 -75935 -27051 -27826 105850
39021 105850 403595 599391 532291 394481 407490 494798 457261 273005 54302 -115401
39011 -115401 -161405 -30371 151114 167683 96399 283575 739615 934981 540838 7854
39001 7854 -70433 137513 44666 -308861 -301444 169501 412598 18132 -470154 -373772 148484
38990 148484 431079 236844 -127669 -377904 -456195 -327979 -17870 218802 134227 -133225
38980 -133225 -222489 -47425 152014 203944 157077 62667 -110235 -319877 -445868 -457441
38970 -457441 -391954 -184286 252211 756985 961715 682355 140745 -252293 -255169 34945
38960 34945 262049 104402 -389529 -801446 -789778 -464735 -203323 -203711 -382755 -589351
38950 -589351 -695875 -564646 -176988 226324 346927 156982 -141463 -406419 -591492 -586465
38940 -586465 -310657 64395 269258 307255 392601 534144 515127 331472 292868 553733
38930 553733 857045 926586 851085 869358 982621 1002252 841420 569827 288735 105653
38920 105653 127423 337456 563344 662832 644795 554300 404254 297769 404165 673809
38910 673809 792631 614597 433748 562634 802653 673309 117003 -379091 -441509 -292213
38900 -292213 -391155 -788971 -1079033 -953245 -583090 -353564 -354270 -319362 -66414 214313
38890 214313 244665 85640 53564 252545 433570 367861 154368 60984 207000 478650
38880 478650 629078 424998 -128538 -652566 -687096 -211801 322606 559517 567441 476972
38870 476972 134725 -563275 -1242349 -1371475 -934953 -415952 -132698 58207 359710 674883
38860 674883 785581 657485 422395 202492 56044 -10856 -49932 -113734 -183074 -235967
38850 -235967 -347759 -586350 -844793 -938075 -838208 -652357 -418951 -121736 149744 289631
38840 289631 374111 497179 472292 69293 -459681 -562667 -227483 -144987 -744838 -1507262
38830 -1507262 -1651702 -1175338 -719439 -639478 -752853 -887915 -1090989 -1244126 -1036339 -514386
38820 -514386 -220122 -504086 -1011890 -1128348 -714757 -157169 152148 146307 -187 -96579
38810 -96579 -116167 -216403 -482244 -669247 -452406 31891 245929 10435 -182427 94511
38800 94511 528789 564183 272669 173220 345811 359716 86872 -54868 160460 360615
38790 360615 190207 -145005 -280558 -230086 -160360 -10207 247972 302954 -49880 -414920
38780 -414920 -279960 177721 317030 -34335 -429012 -536271 -445193 -211470 267576 781197
38770 781197 828700 372920 3236 31583 -640 -481964 -954266 -788250 -222794 -14639
38760 -14639 -285144 -461577 -294552 -181870 -365118 -482991 -195078 280761 575431 698350
38750 698350 827834 905838 794617 601564 514279 472564 296391 16303 -191850 -314498
38740 -314498 -499066 -784882 -1017603 -1003477 -640765 10951 671853 965295 755450 297320
38730 297320 -49477 -161776 -132507 -65586 -19928 -28509 -54828 -45220 -73250 -227914 -311958
38719 -311958 15309 635942 898271 443945 -234652 -442366 -163892 160599 421998 782423
38709 782423 1028370 723164 20964 -370476 -178747 118347 149402 169375 434276 686823
38699 686823 676238 636578 761563 691761 92076 -649192 -907298 -717835 -579628 -604957
38689 -604957 -522060 -361526 -428237 -613783 -440644 95395 362726 -20354 -672791 -1046564
38679 -1046564 -1044155 -800368 -345030 174723 359660 66726 -242234 -75832 370036 478363
38669 478363 68606 -406365 -493771 -231520 46894 137633 81423 -5042 -83558 -179203 -262864
38658 -262864 -238972 -121559 -130332 -443550 -897970 -1132210 -1007168 -672932 -271278 122575
38648 122575 279181 -58536 -718301 -1159479 -1163644 -1082851 -1194298 -1243853 -967018 -653692
38638 -653692 -720234 -1005199 -1008028 -651422 -288243 -51280 271027 701603 907717 672502
38628 672502 162881 -356541 -751605 -912244 -761681 -450824 -238358 -127322 58380 211530
38618 211530 -29077 -656886 -1114357 -972056 -481180 -194892 -284147 -478717 -486682 -227084
38608 -227084 201287 563138 620175 396732 184603 143668 84876 -163283 -386568 -278180
38598 -278180 27460 60446 -333000 -741342 -701511 -261893 119894 133839 -95071 -260794
38588 -260794 -249240 -153928 -27934 174274 393777 433173 246178 61847 45702 36753 -135025
38577 -135025 -267193 -62793 350334 580029 563744 548132 517605 193236 -319365 -480996
38567 -480996 -153800 88283 -150025 -411153 -103318 530086 770336 489281 220292 283095
38557 283095 452192 497343 479702 401790 68305 -503728 -926786 -924231 -693470 -593328
38547 -593328 -690758 -791314 -739812 -536254 -293155 -200470 -410427 -844870 -1198238 -1209512
38537 -1209512 -894837 -518643 -390102 -611755 -916812 -863176 -364387 89923 -8785 -500483
38527 -500483 -731928 -382036 222167 620696 679666 458746 21006 -418946 -488032 -82462
38517 -82462 402380 524766 326116 187761 311655 580870 809053 863997 616182 46327
38507 46327 -569428 -802296 -486721 111620 575989 693466 519761 217376 -77264 -265858
38497 -265858 -274177 -105312 97404 133535 -34030 -199823 -155667 34800 125558 21111
38487 21111 -136317 -216739 -265473 -355229 -421130 -343074 -117689 119322 207899 103528 -42660
38476 -42660 4643 276572 505527 465477 290184 211525 93654 -393142 -1127326 -1500732
38466 -1500732 -1191442 -591772 -227338 -95592 93364 303240 224664 -174618 -537353 -558732
38456 -558732 -282565 38064 183105 107736 -244 109713 386762 458005 171369 -66614
38446 -66614 187267 743809 1040050 952461 893649 1117930 1404511 1509232 1481586 1385698
38436 1385698 1128887 779949 677946 962900 1330945 1548312 1896194 2732606 3837024
38427 3837024 4605251 4794682 4700829 4626038 4513049 4145303 3451852 2560654 1732665 1251247
38417 1251247 1202940 1372908 1504466 1595625 1751069 1848865 1652593 1218865 856880 645314
38407 645314 343948 -92622 -271531 115719 775363 1106637 878548 366845 -66016 -268272
38397 -268272 -250096 -113789 -52940 -213597 -505446 -679501 -605898 -372605 -148728 -82431
38387 -82431 -272925 -647187 -876332 -631087 16203 603594 761091 562593 361155 405056
38377 405056 666469 930460 991718 836476 642545 536260 421956 190652 -11966 21108
38367 21108 168121 124715 -56408 15297 399140 627402 431093 226710 483422 956920
38357 956920 1050272 696084 329833 128296 -126419 -445876 -520642 -332832 -310352 -633264
38347 -633264 -884878 -695769 -296591 -74232 30799 258942 485833 432232 204231 116943
38337 116943 114415 -103436 -431404 -419659 -72927 -4128 -520177 -1059687 -973751 -505214
38327 -505214 -429241 -860628 -1022524 -330887 775155 1387521 1212207 740933 495491 490099
38317 490099 461449 295171 75878 -76762 -67157 136605 387129 412553 128001 -224728
38307 -224728 -387422 -400961 -436788 -456560 -293740 -655 165738 116991 60937 223823
38297 223823 629882 1154383 1588774 1662917 1257877 643195 265691 238095 254236 58770
38287 58770 -245612 -429812 -421551 -261778 -27620 96644 -71004 -406921 -544134 -365455
38277 -365455 -159662 -145049 -154296 1787 180174 194297 171219 293312 421364 339458 202622
38266 202622 362277 833506 1268412 1421566 1386185 1410830 1673115 2170747 2749428 3432821
38256 3432821 4742657 7176154 10064353 11555663 10434609 7643144 5264742 4205807
38248 4205807 3694556 2953547 2311795 2329910 2718832 2768064 2333718 1798175 1366251 952562
38238 952562 598557 514079 712542 912951 823387 380335 -221539 -638338 -642003 -362769
38228 -362769 -126057 -23330 124084 347162 408232 218911 40850 79163 180948 152173
38218 152173 81916 108393 130891 15047 -153639 -273004 -440088 -697296 -797853 -523467
38208 -523467 -51646 266431 322824 216141 17492 -173582 -177911 -18917 -2962 -223904
38198 -223904 -294873 45160 382289 198477 -263104 -319768 93893 355620 153647 -108466
38188 -108466 -63435 70654 -21641 -218101 -279869 -333355 -624026 -1017034 -1123493 -818760
38178 -818760 -342231 52062 302787 438706 479540 457641 413129 352001 269944 197240 173881
38167 173881 206359 269058 308073 248198 71035 -104717 -104511 101490 317498 263765 -184567
38156 -184567 -833362 -1232804 -1033459 -362849 262498 482288 413265 342848 324213 269848
38146 269848 239905 353917 543655 666285 740357 786934 589302 -19011 -725638 -1009957
38136 -1009957 -809839 -515364 -320476 -34582 420228 804389 980466 1093385 1172613 993725
38126 993725 544050 205601 221270 358650 358323 330641 426954 511052 478147 501829 605093
38115 605093 424051 -134217 -435748 55545 832217 953507 406191 61301 314922 612439
38105 612439 485886 254351 326761 497408 442712 380106 630245 889407 586151 -202800
38095 -202800 -781988 -741147 -324493 103057 454020 682512 625504 315183 106676 226721
38085 226721 434142 380963 114160 -48758 4077 110562 154223 168282 149224 34453
38075 34453 -112417 -122071 47673 305727 642737 1077147 1368897 1154616 522373 94098
38065 94098 263996 654039 674351 373568 283005 559799 806032 758477 652518 731329
38055 731329 811769 607897 204532 -67303 -52839 153000 416425 645110 750265 698258
38045 698258 559674 429057 360084 387420 474100 443451 172292 -133523 -116277 233628
38035 233628 548145 622607 641951 750953 801581 731519 761924 911153 750142 81975
38025 81975 -516979 -387445 253565 638898 540657 384604 384891 287334 33670 -26080 205955
38014 205955 328555 147957 74596 444933 922671 1007053 765407 611898 648012 677040
38004 677040 656361 683774 682040 524964 369977 449846 613831 507108 176827 52705
37994 52705 279449 509603 484894 398772 458646 461863 134150 -367396 -651755 -642715 -570970
37983 -570970 -506573 -296752 8706 85062 -136633 -211874 241579 928549 1190258 836499
37973 836499 316380 88763 194174 500265 948597 1337788 1224182 411468 -637785
37964 -637785 -1228577 -1184258 -873108 -580333 -222556 288067 741627 843516 541112 35892
37954 35892 -398525 -568151 -469081 -285585 -175628 -79528 140993 448124 688065 831996
37944 831996 947532 996785 895400 712711 573453 439255 253316 196470 477784 972677
37934 972677 1420452 1846110 2373793 2817187 3016498 3390165 4433467 5870375 7303788
37925 7303788 9582033 13981184 19477306 22424345 20308113 14874669 10092398 7693905
37917 7693905 6336572 4693517 3302392 2963770 3113626 2792502 2097478 1673915 1538976
37908 1538976 1320115 1081523 1059486 1008287 600877 149293 179181 529307 575574 183828
37898 183828 -205782 -314594 -231878 10440 452548 833362 792682 465351 325676 407066
37888 407066 245368 -294596 -707396 -591671 -229032 -125738 -345054 -597279 -700314 -641264
37878 -641264 -403636 -52572 136491 -77941 -567414 -930460 -889673 -471849 105648 553800
37868 553800 595381 161240 -455780 -814788 -790744 -715990 -932125 -1266984 -1161895 -390749
37858 -390749 542126 931299 698685 423346 557241 927697 1116333 1013456 790903 589275
37848 589275 493979 614491 910711 1116731 1106895 1130785 1361091 1442752 946880 119467
37838 119467 -355875 -298542 -176518 -267229 -271674 39707 360094 359476 215139 241385 344570
37827 344570 263890 84248 72181 171416 75757 -277763 -628140 -741183 -569267 -166746
37817 -166746 265933 367577 -19633 -522330 -585983 -138334 363063 509094 294400 -57051
37807 -57051 -316761 -313787 -76429 70821 -162298 -590644 -739725 -488192 -187176 -84093
37797 -84093 -9106 210895 388208 278654 -14523 -212399 -246681 -226991 -193553 -162904 -273097
37786 -273097 -586768 -831664 -642342 -58404 481790 676595 649934 642581 656829 561709
37776 561709 388746 324182 458461 704923 960965 1202560 1380000 1365167 1126691 878326
37766 878326 883400 1105021 1213325 998234 614191 306943 63590 -269827 -631595 -755695
37756 -755695 -528668 -121110 250460 499936 606492 592346 590091 697126 723474 359399
37746 359399 -316454 -795234 -762588 -476895 -317518 -257029 -85724 102562 53551 -168447
37736 -168447 -260898 -174189 -118264 -106596 77690 413412 569077 427261 281776 328541
37726 328541 345108 134370 -69951 6564 158781 -9452 -435705 -669307 -537532 -327939
37716 -327939 -271448 -230249 -24564 262425 506026 813060 1315583 1826636 1959854 1582063
37706 1582063 976622 533190 378274 335322 183981 -73237 -197720 20180 496385 909296
37696 909296 1013726 811665 418283 -75624 -524710 -691829 -492806 -194638 -141174 -296022
37686 -296022 -296762 -5089 263262 201416 -41565 -129822 -82103 -192056 -452208 -460983 -41772
37675 -41772 390399 358271 2349 -98400 305534 868627 1148144 1063235 789840 477273
37665 477273 215356 75548 10355 -154064 -477927 -773579 -837006 -693007 -483134 -249280
37655 -249280 8819 190000 196865 85380 -64908 -293821 -553821 -528324 -635 678324
37645 678324 889522 528360 90390 -85302 -201350 -449054 -548317 -214101 267499 390287
37635 390287 152898 -16597 72403 243937 418765 697309 937021 760301 168650 -291038
37625 -291038 -247610 -41423 -209417 -696264 -953652 -686425 -142938 292943 486844 506902
37615 506902 443371 356648 269413 172424 111405 206009 448709 562068 265739 -315329 -704102
37604 -704102 -578923 -84247 393624 607439 554775 357551 151775 37826 56916 202923
37594 202923 424903 585576 517870 258405 140665 430685 877465 896763 307620 -356853
37584 -356853 -466549 -47738 320814 258928 -58219 -301266 -443582 -646695 -874468 -878391
37574 -878391 -558402 -136501 100280 85557 -90142 -371949 -678949 -755501 -378850 245826
37564 245826 585492 414206 98407 57273 196036 174316 19896 52007 281572 355701
37554 355701 149014 -36341 -9113 -14410 -281174 -593076 -618161 -407151 -238479 -156186
37544 -156186 9361 278481 478687 496735 344625 65705 -215103 -272686 -42954 224500
37534 224500 298548 284293 355952 388746 200876 -46154 -116893 -189126 -550475 -933580 -785561
37523 -785561 -209437 44615 -308085 -649041 -427591 54693 248771 190564 198932 198255 -35537
37512 -35537 -266951 -91431 337697 485700 245692 -9592 -128046 -324406 -594912 -595061
37502 -595061 -257877 4097 -58477 -151148 34523 318636 386013 324468 448419 770858
37492 770858 972132 814984 377462 -62785 -246045 -122930 85870 130453 52828 88510
37482 88510 252693 305407 172118 55729 21541 -141505 -451332 -533810 -204061 116029
37472 116029 -42629 -502505 -732291 -603864 -395580 -215261 69788 395114 484761 300752
37462 300752 105231 64659 166312 486674 1085634 1618057 1553558 908126 305675 156911
37452 156911 212775 117451 -45625 -29150 151689 377243 671528 974411 972773 510205
37442 510205 -74857 -349003 -306122 -191072 -53256 170805 356568 367571 358097 507523
37432 507523 612074 366321 -63377 -191887 107459 492984 687757 710907 598763 333620
37422 333620 85512 104605 306545 361481 256806 345483 731615 1044992 990212 714478
37412 714478 452635 222039 85773 281835 775192 1059930 781436 265084 61173 217564
37402 217564 367194 296757 38263 -386534 -879182 -1088788 -789232 -343049 -326109 -716232
37392 -716232 -912841 -602874 -160778 -64242 -303830 -555822 -624376 -501276 -229155 73741
37382 73741 206383 81016 -168126 -365640 -461869 -455064 -320173 -125550 -61621 -209035
37372 -209035 -390021 -389934 -246153 -181692 -294170 -429440 -368438 -74694 258863 397448 299711
37361 299711 144936 110191 181054 237891 245340 240912 198632 63772 -80607 -29046 321808
37350 321808 845683 1296933 1494623 1431820 1271143 1182938 1132531 929214 553015 251033
37340 251033 160605 57631 -257954 -532212 -396330 -15618 61798 -291291 -601796 -531892
37330 -531892 -335421 -358899 -490560 -426803 -199991 -92990 -193733 -332193 -356776 -243645
37320 -243645 -32180 154373 136509 -89075 -258868 -161435 68801 152648 50466 -28032
37310 -28032 96728 431702 842665 1100583 1026801 718022 481599 440553 402360 238556
37300 238556 116382 146315 96661 -230596 -589090 -621120 -409562 -303943 -348158 -307745
37290 -307745 -160548 -95013 -55474 221582 655035 770934 368562 -148297 -300713 -86971
37280 -86971 182880 332151 393262 450270 588665 834519 1009684 829184 276126 -293609
37270 -293609 -543654 -481282 -281520 2590 386694 781352 1061115 1207687 1244192 1123929
37260 1123929 808920 375445 -53671 -393589 -549985 -417961 -29313 402715 679975
37251 679975 785457 809228 815328 820127 781827 584720 176173 -264356 -471537 -436711 -401166
37240 -401166 -475828 -522184 -489580 -578141 -894121 -1192557 -1181222 -896685 -575738 -323632
37230 -323632 -119383 -1075 -28713 -163334 -338753 -522735 -585933 -332788 141103 364658
37220 364658 46705 -481232 -694370 -572729 -500509 -599027 -598046 -356200 -82657 37700
37210 37700 67247 45896 -155129 -530061 -779479 -686028 -450122 -417108 -591393 -638811 -328088
37199 -328088 191174 551270 519783 191874 -131452 -258564 -278828 -385350 -597211 -760658
37189 -760658 -760840 -588677 -257958 154867 427715 380062 148707 43313 116582 157307 150741
37178 150741 383820 919077 1307446 1115221 483906 -147336 -637690 -1067054 -1260101 -930514
37168 -930514 -303458 -47323 -395109 -788386 -683199 -321959 -303796 -665146 -881078 -677536
37158 -677536 -352907 -250450 -341067 -459588 -587392 -718248 -756215 -743663 -881661 -1090272
37148 -1090272 -894369 -113328 633457 613497 11924 -291945 44079 427618 318409 13793
37138 13793 83210 477234 698801 607639 546892 752105 1071118 1286036 1360096 1308154 1112984
37127 1112984 855822 704250 682033 622349 420614 192184 115777 221180 362562 326671
37117 326671 -5013 -495187 -789832 -644501 -182929 270977 534957 603430 468898 154980
37107 154980 -123927 -98556 242921 680635 1069319 1373956 1443519 1097117 506174 149965
37097 149965 232308 427921 388070 211862 162078 165488 -46716 -421277 -584470 -393126
37087 -393126 -176468 -293313 -644229 -804297 -563597 -157209 75954 117717 203960 384449
37077 384449 390405 66443 -277640 -219688 165128 375096 180584 -83125 -40467 220353
37067 220353 383146 389629 394966 389680 198379 -158630 -386196 -283266 -11465 119677 44286
37056 44286 -6727 149138 351161 277388 -72658 -280377 -64156 244242 102112 -436639
37046 -436639 -731871 -445840 20245 181514 117743 109791 23859 -402881 -883005 -806596
37036 -806596 -149179 411483 425221 229141 335341 658295 701587 287655 -240647 -466074
37026 -466074 -295900 54966 306544 347270 317220 423308 642397 735022 619049 546444
37016 546444 746808 1044059 1057884 719205 340117 158615 51323 -190426 -470522 -463352
37006 -463352 -47293 492896 757176 644372 392967 248842 220322 203994 211632 315099
36996 315099 431890 382927 203640 182095 453198 731317 659661 318872 118479 193459
36986 193459 206784 -132813 -622270 -863058 -828609 -824051 -945217 -934124 -661379 -428623
36976 -428623 -566798 -948673 -1171012 -1089570 -887557 -700675 -513826 -429174 -655813 -1090342
36966 -1090342 -1239310 -814865 -191695 4796 -366270 -890813 -1153012 -1080898 -803688 -470815
36956 -470815 -243112 -202282 -193400 34751 459470 751727 701739 485183 387285 441827 509463
36945 509463 573941 743177 994378 1107884 900451 433724 -36691 -275690 -245749 -122313
36935 -122313 -118618 -253228 -322559 -157924 129350 248823 80303 -162503 -165335 132881
36925 132881 475759 569446 373157 92895 -59280 -38657 67832 150572 124353 -39694
36915 -39694 -259816 -380430 -333077 -213123 -133417 -65392 85722 301036 444927 407577
36905 407577 172376 -187487 -476406 -447907 -89825 242317 211816 -18125 29474 459932
36895 459932 831316 775265 465384 255945 155329 -21600 -197554 -130222 119915 211902
36885 211902 27864 -193441 -278236 -330487 -420101 -403899 -242596 -179759 -341652 -428294 -147048
36874 -147048 235139 180914 -346592 -815214 -849728 -614060 -355746 -3689 492453 766777
36864 766777 422370 -315657 -755559 -572843 -151904 -13116 -195792 -367697 -322297 -151442
36854 -151442 -27900 -2064 5002 112068 369723 689215 901892 899886 671944 242925
36844 242925 -289440 -682816 -724217 -523584 -409258 -436390 -264236 277656 751420 570460
36834 570460 -213956 -918066 -1002662 -562868 -41414 249630 253580 92342 6263 179999
36824 179999 491726 575768 249218 -242660 -503083 -396514 -106351 98040 57579 -200299
36814 -200299 -465207 -492053 -243968 46103 104621 -129590 -483869 -705921 -644795 -381385
36804 -381385 -172968 -154369 -134466 131518 504130 564696 208723 -160282 -171203 53995
36794 53995 189815 220249 381415 736276 1086904 1239634 1129621 757597 234132 -171626
36784 -171626 -257948 -134844 -51414 -49981 -16068 12420 -111133 -302815 -276214 18721 274843
36773 274843 265423 143582 137114 162316 -27159 -416343 -676631 -541494 -113132 231605
36763 231605 210591 -80018 -270359 -155468 28914 -103279 -565895 -965283 -1010305 -841754
36753 -841754 -755275 -786522 -737052 -504900 -219131 -59234 -33573 45422 357003 813940
36743 813940 1080012 950910 624317 415166 324585 188515 149945 516989 1105995 1274800
36733 1274800 847731 478941 712267 1177864 1257936 1104176 1265088 1591921 1393510 641553
36723 641553 129951 249096 429038 151618 -233181 -197329 88509 157809 31902 -16809
36713 -16809 -66424 -248576 -205505 413647 1153088 1233325 722355 436325 685402 921593
36703 921593 732177 374837 103752 -244612 -647309 -633266 -107009 239103 -78055 -505848
36693 -505848 -303799 272982 431463 147721 141888 659398 1131361 1145201 999905 1043671
36683 1043671 1062851 681222 -28804 -649774 -884356 -712817 -307169 62606 231646 333862
36673 333862 593010 910331 945740 645468 359780 341902 445935 447003 364505 314354 284542
36662 284542 190785 -38050 -460355 -946469 -1028445 -335178 755096 1362281 1171152 781552
36652 781552 760256 859297 579002 62895 -118891 172629 541177 694279 722051 778412
36642 778412 864076 916303 839364 524037 89488 -60624 242966 528716 219377 -518169
36632 -518169 -910346 -561421 129180 590855 717272 749078 858556 1028808 1136741 1045707
36622 1045707 774875 589719 720071 1007545 1090309 920368 783525 783929 669319 283855
36612 283855 -132918 -272317 -119117 182006 574454 995439 1228719 1090131 680943 308446
36602 308446 217261 458991 887431 1194739 1107771 679557 281573 204779 363594 466607
36592 466607 358127 106133 -122027 -168619 14388 254848 241708 -144972 -624796 -769929
36582 -769929 -490291 -165016 -193815 -452342 -382340 245928 866408 770762 159050 6006
36572 6006 706140 1433639 1288089 556414 157999 203575 -17589 -724624 -1258785 -1167383
36562 -1167383 -810332 -568168 -250720 235186 360089 -246556 -1045773 -1313945 -1196724
36553 -1196724 -1319685 -1674613 -1688783 -1256436 -911466 -927392 -921798 -513658 149041 675780
36543 675780 826128 514888 -155319 -755452 -830247 -475407 -256632 -440999 -683573 -607164
36533 -607164 -297872 -35561 96482 98822 -110237 -475147 -700677 -653069 -614304 -836303
36523 -836303 -1076068 -942318 -550535 -420063 -738923 -1106224 -1096677 -793527 -606055 -737668
36513 -737668 -998594 -1062733 -783205 -285238 159025 341330 262545 105951 65853 184006
36503 184006 333051 352890 207971 4937 -148788 -269569 -435563 -616187 -636354 -353296
36493 -353296 157175 632445 848565 794062 602334 341149 -37790 -482707 -686245 -347081
36483 -347081 385835 934006 892035 477156 210917 257153 311715 140994 -37351 131201
36473 131201 587734 852040 598348 78255 -165896 51002 375367 419982 247476 179218
36463 179218 274534 278051 50052 -244260 -422634 -483763 -426072 -155793 262585 520781
36453 520781 436194 194502 27877 -112682 -323199 -437492 -291280 -112068 -255902 -647654
36443 -647654 -869576 -777895 -653342 -702569 -761579 -601497 -258031 60700 198162 102054
36433 102054 -178648 -492474 -707035 -825809 -865325 -713945 -317704 92859 226372 112449
36423 112449 -14276 -126541 -365455 -645024 -683734 -451400 -220007 -134764 -96138 -94727
36413 -94727 -253503 -464979 -413864 -85117 161818 162433 168941 348501 507750 514411 532259
36402 532259 602332 478844 173303 142262 546034 834344 556370 99720 41427 210192
36392 210192 100432 -138252 43040 534413 639900 206649 -156362 -115372 -60181 -254628
36382 -254628 -300645 118059 574835 512044 79268 -167292 -100980 -60680 -245118 -517436
36372 -517436 -700561 -706047 -476660 -122298 9932 -264982 -609403 -558663 -207130 -110789
36362 -110789 -485795 -876165 -744539 -121217 481608 613816 227000 -365881 -739371 -661943
36352 -661943 -251408 208470 571025 813678 790189 302092 -471468 -908410 -575783 221302
36342 221302 785626 824749 622969 489882 408027 302107 290578 440659 533281 361092
36332 361092 98601 72885 260842 330375 154273 -29402 -464 191120 416252 623015
36322 623015 713449 563235 302959 280255 548632 689465 401899 -11219 -90672 77150
36312 77150 38443 -273179 -443027 -255712 -13522 -31980 -189506 -193890 -23648 133406
36302 133406 198476 233162 260575 237808 145211 -15473 -235754 -416613 -373646 -58174 291540
36291 291540 352920 64808 -305467 -436403 -257846 10871 133350 173912 447788 1048328
36281 1048328 1541391 1379006 616359 -48401 -34579 550319 1192368 1545920 1537460 1174025
36271 1174025 596352 202099 342020 854719 1186424 1053466 748178 674965 808661 815909
36261 815909 572335 292325 147648 12430 -278319 -592383 -653098 -473652 -372369 -488516
36251 -488516 -547125 -289715 86726 208741 90464 56004 172474 197255 128213 308789
36241 308789 777042 988890 567435 -48192 -177655 148320 351543 247736 204739 384170
36231 384170 470406 299455 159726 204184 108838 -317822 -675074 -592288 -404972 -638752
36221 -638752 -1110907 -1192364 -809103 -496810 -479699 -410384 -160792 -144145 -506030 -640619
36211 -640619 -49237 783136 992111 527921 100685 77538 107040 -121991 -387533 -417552
36201 -417552 -353998 -420066 -500455 -404417 -284928 -428998 -773531 -960002 -808439 -467992
36191 -467992 -142859 68933 73266 -211425 -657715 -939653 -867116 -599455 -417498 -366668
36181 -366668 -260453 -14592 176355 83031 -225161 -437021 -391943 -261882 -272740 -393523
36171 -393523 -438053 -357477 -254530 -190230 -171818 -264387 -490272 -667533 -603931 -423057 -405755
36160 -405755 -506972 -372480 92566 522324 589992 380376 112926 -156888 -359736 -303290
36150 -303290 -21241 99714 -141921 -413154 -382619 -269298 -415833 -629283 -506531 -196662
36140 -196662 -195302 -459706 -402891 145250 593453 426413 -114365 -463644 -460264 -349744
36130 -349744 -330976 -368973 -316006 -77071 229847 280752 -80949 -527845 -599908 -316993
36120 -316993 -71362 30791 231365 510509 495811 137181 -102342 10922 92720 -175085
36110 -175085 -499833 -539739 -528336 -818085 -1181252 -1135794 -709538 -330798 -142238 56310
36100 56310 316341 482066 523302 484918 226412 -326776 -788030 -670544 -95884 337647
36090 337647 361969 231454 130817 -75315 -430454 -730900 -916178 -1160964 -1428758 -1377092
36080 -1377092 -902648 -372804 -84578 137268 543670 996107 1201501 1162129 1089352 1043423
36070 1043423 929586 731125 518199 307229 78467 -143842 -336973 -498519 -547321 -367586
36060 -367586 -40081 164091 144551 130443 323963 576865 621964 473725 368519 392340
36050 392340 388544 219725 -38843 -176696 -33543 365895 794493 983772 863213 600527
36040 600527 383021 240847 116310 -12 -72888 -95671 -107808 -168809 -298326 -395020
36030 -395020 -298582 -43685 68499 -147346 -422316 -367232 -70388 9477 -248896 -451421
36020 -451421 -323024 -87915 -18013 -22380 20451 -91486 -509366 -902414 -854226 -509366
36010 -509366 -383337 -632716 -929798 -1005898 -923483 -819228 -731120 -683969 -637190 -389719
36000 -389719 127874 542620 445138 69147 53722 467739 642679 178967 -461865 -728852
35990 -728852 -797994 -1070834 -1283292 -845267 95472 685178 540420 226627 331907 653595
35980 653595 691636 481510 416374 522476 481188 282381 308991 691095 1033974 976998
35970 976998 674730 493046 498796 515846 493584 532283 642128 732180 787877 837755 778416
35959 778416 454668 -72929 -523870 -690043 -590779 -333717 11980 357527 550102 474508
35949 474508 156079 -256400 -582513 -726674 -754041 -785472 -773488 -523335 -41659 321059
35939 321059 281311 19078 -95583 -32420 -32857 -121160 -92657 30314 -17158 -217805 -188084
35928 -188084 188601 467270 276455 -88623 -63205 422886 924134 1066443 827367 336940
35918 336940 -266633 -781053 -988469 -828429 -447978 -115409 -96306 -437758 -797456 -712472
35908 -712472 -176805 282151 271016 12333 -62230 80468 186391 196905 246141 329672
35898 329672 345627 365733 522583 709247 710037 541307 359493 165141 -54396 -50904 367281
35887 367281 844277 805084 263802 -192038 -257055 -227377 -357759 -436637 -242537 27011
35877 27011 95091 48049 142159 404726 672012 837528 889172 879892 958837 1202714 1366085
35866 1366085 1119317 598204 306630 346755 234669 -270393 -670153 -474842 -14215 29352
35856 29352 -387018 -691427 -549769 -171820 150999 324501 285983 6052 -302528 -346305
35846 -346305 -161691 -50001 -107415 -160188 -172715 -342793 -709951 -1003595 -995570 -730455
35836 -730455 -321998 189913 672337 883155 786737 648625 645368 595759 286320 -105887
35826 -105887 -176714 153608 462549 275510 -385974 -997914 -1099032 -777638 -467146 -321570
35816 -321570 -83136 345479 575640 297017 -132172 -135874 197783 242957 -164573 -448478
35806 -448478 -175793 329427 552020 489933 392622 186778 -313137 -830171 -810735 -186004
35796 -186004 480256 685054 504874 318640 276199 205553 -82129 -528810 -853016 -819828
35786 -819828 -502389 -215085 -143467 -147786 -14372 246284 501035 740602 993893 1099472
35776 1099472 859402 430377 283681 664661 1265576 1544127 1262190 647167 125933
35767 125933 -32280 117481 324164 445514 583868 858484 1137688 1165172 920276 660125
35757 660125 580978 622010 661477 724188 875823 1034066 1021550 770124 403965 144983
35747 144983 138561 300889 350014 107205 -227851 -258977 102036 479802 481773 152667 -149109
35736 -149109 -205834 -101310 1405 52949 72932 52273 -34821 -172542 -294279 -326536 -251944
35725 -251944 -131905 -36550 41970 148123 241813 216485 66133 -69376 -82206 -28322 -12027
35714 -12027 -16021 72601 303587 572356 665651 441279 60788 -34111 402147 987885 1066961
35703 1066961 566802 145109 287560 643567 617723 290821 225703 524571 682277 409022
35693 409022 35181 -73039 -10845 8766 70966 282535 392176 86152 -499709 -906750
35683 -906750 -902280 -628439 -287712 55787 394754 701111 909298 873776 471073 -128063
35673 -128063 -487849 -413449 -220317 -240728 -299382 -57790 314517 317570 -82436 -365977
35663 -365977 -252230 -71747 -157517 -324427 -245076 29506 256711 400641 482789 308744
35653 308744 -214178 -657698 -460256 286934 879344 882626 578808 411917 381690 243575
35643 243575 25606 -1351 231570 475588 507800 381435 281681 281605 320134 331346 302835
35632 302835 228884 78017 -160778 -414725 -545403 -457583 -185409 148366 443136 657242
35622 657242 759951 722608 570469 368335 129318 -170895 -443623 -488305 -287730 -193769
35612 -193769 -570327 -1244328 -1591057 -1299612 -802253 -697824 -942502 -976778 -592309 -237960
35602 -237960 -333807 -665085 -741864 -503446 -312059 -367198 -478118 -412368 -177881 84885
35592 84885 256525 241631 36411 -163560 -145533 -22647 -150577 -606281 -1001079 -970895
35582 -970895 -634109 -366677 -309249 -331849 -350649 -416919 -545300 -674096 -770645 -806774 -693634
35571 -693634 -433542 -261458 -386491 -620941 -543906 -74663 382643 459483 244442 46970
35561 46970 -35678 -102522 -141715 8450 389961 774485 837307 462151 -97704 -375474
35551 -375474 -125007 378972 630184 521532 464897 772980 1201228 1343241 1215138 1080742
35541 1080742 908004 500091 80092 149869 674234 1005407 854869 749046 1151250 1728082
35531 1728082 2033450 2353688 3124439 4029663 4735890 6172670 9584955 14017164 16241932
35522 16241932 14186789 9484692 5548917 3846468 3294539 2738398 2333797 2353741 2220496
35513 2220496 1490976 767149 755213 1091333 952254 385267 176784 598020 1053277 986446
35503 986446 537987 190884 182612 379817 454333 130278 -525721 -1057833 -1046072 -541840
35493 -541840 49935 379789 280975 -269174 -1005372 -1383045 -1110631 -567461 -331322 -400875
35483 -400875 -298450 134347 530787 619286 564546 553297 478424 252281 69208 94490
35473 94490 174271 116384 25464 90560 229925 224948 65522 -117439 -357582 -779995 -1243697
35462 -1243697 -1371968 -1044446 -628187 -546327 -754088 -850001 -654319 -427626 -437075 -547075
35452 -547075 -469394 -264705 -254644 -451441 -461929 -100111 252285 146871 -335467 -769935
35442 -769935 -944057 -924951 -783506 -611012 -644415 -980831 -1280006 -1146321 -711747 -429163
35432 -429163 -387906 -314242 -190592 -315191 -694413 -931855 -855398 -730777 -694481 -527515
35422 -527515 -222723 -204726 -636851 -1026795 -946808 -689150 -720385 -884321 -713655 -252510
35412 -252510 19560 -69409 -250813 -336285 -387716 -416607 -353741 -295474 -388616 -497654 -354305
35401 -354305 -1612 267843 361654 403935 368325 112529 -250532 -455909 -565989 -875656
35391 -875656 -1271001 -1185925 -403454 515703 872115 593429 127692 -147425 -144784 72848
35381 72848 342439 404053 104153 -403965 -782195 -814599 -552595 -221693 -18872 50469
35371 50469 115511 167608 -25409 -555674 -1057592 -1047080 -535083 2054 249810 316456
35361 316456 350232 290209 121393 13952 26338 -15420 -159186 -175199 6774 36141 -368055
35350 -368055 -924767 -1141319 -969060 -747554 -623214 -405308 22321 470162 663695 482732
35340 482732 -4915 -550258 -814807 -681754 -434108 -398554 -485065 -370485 -81910 -514
35330 -514 -207801 -239462 270866 1014580 1386557 1222582 806152 293060 -420770 -1241661
35320 -1241661 -1747554 -1718711 -1448923 -1252372 -967821 -343448 320005 448877 67687 -192260
35310 -192260 -67941 -33474 -385503 -575154 -41157 736597 805474 186865 -95816 465208
35300 465208 1121197 986335 236061 -318516 -371139 -237933 -121414 110303 458567 634406
35290 634406 464252 115134 -171557 -317348 -322737 -181920 34791 183183 202956 159759
35280 159759 101108 -15818 -220329 -438392 -539049 -441657 -198786 10654 40923 -39777
35270 -39777 -25611 137070 268202 212827 25191 -168820 -298409 -242509 158129 792292
35260 792292 1189488 992376 398630 -77949 -167862 25051 301027 526344 628612 663246
35250 663246 789703 985415 938054 472612 -71227 -193625 143280 544314 716417 652856
35240 652856 399493 17367 -276151 -303749 -242412 -393170 -692072 -841284 -861412 -1027761
35230 -1027761 -1252611 -1085420 -463796 71605 147582 59467 202455 445451 456404 297873
35220 297873 259751 327345 241235 -31986 -246678 -239582 -81634 69469 68984 -162147 -496438
35209 -496438 -623816 -389203 12067 309912 454547 491706 378189 141466 10847 134647
35199 134647 332424 354511 209981 24959 -196328 -412461 -394368 -51387 311951 399882
35189 399882 362018 456114 518365 241371 -195804 -302449 -2647 318225 447137 510036
35179 510036 518702 294158 -94884 -333193 -389598 -542600 -781491 -728628 -310974 58792
35169 58792 184496 373376 719646 729292 134082 -464974 -373058 175124 412344 181761
35159 181761 6272 160612 356506 368852 366890 488598 573049 492829 382093 381091 459784
35148 459784 600770 839108 997402 708667 -87372 -895663 -1125615 -687122 -10423 411513
35138 411513 408196 171730 14696 61323 172448 182600 87375 -88599 -408579 -803270
35128 -803270 -936996 -607524 -128720 46379 -47598 -59934 6622 -148209 -423985 -328589
35118 -328589 175905 497452 360781 270907 598674 836948 412975 -240352 -217398 510671
35108 510671 1095080 1096246 968803 1130002 1285581 1025954 538660 287611 324979 340618
35098 340618 204785 96575 160194 300770 327872 164283 -80944 -195156 -67638 175856
35088 175856 321812 315250 225892 43202 -260374 -493691 -381406 -1303 201038 -45106
35078 -45106 -524872 -882021 -1010096 -958337 -728776 -385448 -146061 -135971 -216549 -237688
35068 -237688 -256449 -306384 -193999 189441 553712 541259 240258 32687 33140 38387 -17822
35057 -17822 48162 281287 439590 355019 161499 18588 -159265 -513250 -925810 -1084101
35047 -1084101 -832814 -373290 -97909 -207636 -469830 -434752 34711 564395 722497 526649
35037 526649 302374 192681 114583 110796 355854 772329 1003783 891596 679964 619184
35027 619184 656156 669787 714641 815430 780602 484212 142048 46958 177756 313004
35017 313004 387086 467757 498222 353856 101073 -69017 -141837 -269435 -471439 -586326
35007 -586326 -532856 -389296 -180406 181436 659319 988240 925864 499802 -51262 -466008
34997 -466008 -558158 -294024 122564 356582 248266 -37610 -224001 -202208 -37882 200852
34987 200852 492906 770192 894013 772658 468357 162060 15317 59943 197131 279772
34977 279772 202889 -27834 -260754 -277448 -19975 263999 249650 -44504 -238662 -113821
34967 -113821 32729 -211629 -730341 -950152 -584045 -1295 277178 204685 114330 168413
34957 168413 189625 16561 -235389 -358521 -318757 -202894 -20762 254243 479947 395932
34947 395932 -25056 -431859 -465618 -187568 59055 161092 337061 671260 849035 575197
34937 575197 53377 -236322 -142403 55469 111940 94670 152711 256678 271126 114425
$$ [...]
##END NTUPLES=NMR SPECTRUM
##END=
