##TITLE=31Pdec_LR-724-B2
 CDCl3, 24 sc
 1.10.2020
##JCAMPDX= 6.0         $$ Bruker NMR JCAMP-DX V2.0
##DATA TYPE= NMR SPECTRUM
##DATA CLASS= NTUPLES
##ORIGIN= UXNMR, Bruker Analytische Messtechnik GmbH
##OWNER= root
$$ XWIN-NMR		Version 3.5
$$ Thu Oct  1 10:16:07 2020 Russian Standard Time (UT+4h)  she@DPX200
##.OBSERVE FREQUENCY= 81.013821
##.OBSERVE NUCLEUS= ^31P
##.ACQUISITION MODE= SIMULTANEOUS
##.ACQUISITION SCHEME= undefined
##.AVERAGES= 24
##.DIGITISER RES= 17
##SPECTROMETER/DATA SYSTEM= spect
##.PULSE SEQUENCE= zgpg30
##.SOLVENT NAME= CDCl3
##.SHIFT REFERENCE= (INTERNAL, CDCl3, 0, 182.463)
##AUDIT TRAIL= $$ (NUMBER, WHEN, WHO, WHERE, WHAT)
$$ ##TITLE= Audit trail, XWIN-NMR		Version 3.5
$$ ##JCAMPDX= 5.01
$$ ##ORIGIN= Bruker BioSpin GmbH
$$ ##OWNER= she
$$ F:/spectra/data/she/nmr/P31/1/pdata/1/auditp.txt
$$ ##AUDIT TRAIL=  $$ (NUMBER, WHEN, WHO, WHERE, WHAT)
(   1,<2020-10-01 10:15:06.06 +0400>,<she>,<DPX200>,
      <created by zg, POWCHK disabled, PULCHK disabled
       configuration hash MD5:
       00 E9 B6 7A A2 85 ED C7 34 08 36 98 17 FE 4E 26
       data hash MD5: 32K
       90 F4 9C 9D 6D C9 FF AE 1E 63 F2 77 CA BD C0 F2>)
(   2,<2020-10-01 10:15:12.43 +0400>,<she>,<DPX200>,
      <Start of raw data processing
       efp BC_mod = 2 LB = 1 FT_mod = 6 PKNL = 1 PHC0 = -2961.604 PHC1 = 487.8014 SI = 64K 
       data hash MD5: 64K
       8B BE 81 29 F4 A1 B7 87 06 4D 96 D8 AD 40 A6 37>)
(   3,<2020-10-01 10:15:35.48 +0400>,<she>,<DPX200>,
      <pk PHC0 = 219.1258 PHC1 = -413.8 
       data hash MD5: 64K
       D9 C5 2D 58 3B E6 CE 2A DA 93 CB 6D E7 D4 68 D3>)
(   4,<2020-10-01 10:15:39.10 +0400>,<she>,<DPX200>,
      <abs ABSG = 5 
       data hash MD5: 64K
       43 49 AB FC A8 D9 A6 A8 D1 CA 9C 21 48 01 B1 DB>)
$$ ##END=
$$ 
$$ hash MD5
$$ 4D F6 85 87 51 84 E0 A4 31 F7 A3 EC FB 27 C5 E0
##$RELAX= 
##$RELAX= 
##$RELAX= 
##$RELAX= 
##$RELAX= 
##$RELAX= 
##$RELAX= 
##$RELAX= 
$$ Bruker specific parameters
$$ --------------------------
##$DU= <F:/spectra>
##$EXPNO= 1
##$NAME= <P31>
##$PROCNO= 1
##$TYPE= <nmr>
##$USER= <she>
##$AMP= (0..31)
100 100 100 100 100 100 100 100 100 100 100 100 100 100 100 100 100 100 
100 100 100 100 100 100 100 100 100 100 100 100 100 100 
##$AQSEQ= 0
##$AQ_mod= 1
##$AUNM= <au_zg>
##$AUTOPOS= <>
##$BF1= 81.014009
##$BF2= 200.13
##$BF3= 200.13
##$BF4= 200.13
##$BF5= 200.13
##$BF6= 200.13
##$BF7= 200.13
##$BF8= 200.13
##$BYTORDA= 1
##$CFDGTYP= 0
##$CFRGTYP= 5
##$CHEMSTR= <none>
##$CNST= (0..31)
1 1 145 1 1 1 1 1 1 1 1 1 1 1 1 1 1 1 1 1 1 1 1 1 1 1 1 1 1 1 1 1 
##$CPDPRG= <waltz16>
##$CPDPRG1= <>
##$CPDPRG2= <waltz16>
##$CPDPRG3= <>
##$CPDPRG4= <mlev>
##$CPDPRG5= <mlev>
##$CPDPRG6= <mlev>
##$CPDPRG7= <mlev>
##$CPDPRG8= <mlev>
##$CPDPRGB= <>
##$CPDPRGT= <>
##$D= (0..31)
0 1 0 0 0 0 0 0 0 0 0 0.03 2e-05 3e-06 0 0 0 0 0 0 0 0 0 0 0 0 0 0 0 0 
0 0 
##$DATE= 1601532905
##$DBL= (0..7)
120 120 120 11 120 120 24 19 
##$DBP= (0..7)
150 150 150 150 150 150 150 150 
##$DBP07= 0
##$DBPNAM0= <>
##$DBPNAM1= <>
##$DBPNAM2= <>
$$ [...]
##$SUBNAM3= <"">
##$SUBNAM4= <"">
##$SUBNAM5= <"">
##$SUBNAM6= <"">
##$SUBNAM7= <"">
##$SUBNAM8= <"">
##$SUBNAM9= <"">
##$SW= 369.568048894756
##$SWIBOX= (0..15)
0 1 3 0 0 0 0 0 0 0 0 0 0 0 0 0 
##$SW_h= 29940.119760479
##$TD= 32768
##$TD0= 1
##$TE= 0
##$TE2= 300
##$TE3= 300
##$TEG= 300
##$TL= (0..7)
0 120 53 12 22 120 120 120 
##$TP= (0..7)
150 150 150 150 150 150 150 150 
##$TP07= 0
##$TPNAME0= <>
##$TPNAME1= <>
##$TPNAME2= <>
##$TPNAME3= <>
##$TPNAME4= <>
##$TPNAME5= <>
##$TPNAME6= <>
##$TPNAME7= <>
##$TPOAL= (0..7)
0.5 0.5 0.5 0.5 0.5 0.5 0.5 0.5 
##$TPOFFS= (0..7)
0 0 0 0 0 0 0 0 
##$TUNHIN= 0
##$TUNHOUT= 0
##$TUNXOUT= 0
##$USERA1= <user>
##$USERA2= <user>
##$USERA3= <user>
##$USERA4= <user>
##$USERA5= <user>
##$V9= 5
##$VALIST= <valist>
##$VCLIST= <CCCCCCCCCCCCCCC>
##$VD= 0
##$VDLIST= <DDDDDDDDDDDDDDD>
##$VPLIST= <PPPPPPPPPPPPPPP>
##$VTLIST= <TTTTTTTTTTTTTTT>
##$WBST= 1024
##$WBSW= 4
##$XGAIN= (0..3)
0 0 0 0 
##$XL= 0
##$YL= 0
##$YMAX_a= 44342
##$YMIN_a= -32643
##$ZGOPTNS= <>
##$ZL1= 120
##$ZL2= 120
##$ZL3= 120
##$ZL4= 120
##$ABSF1= 182.463
##$ABSF2= -187.1042
##$ABSG= 5
##$ABSL= 3
##$ALPHA= 0
##$AQORDER= 0
##$ASSFAC= 0
##$ASSFACI= 0
##$ASSFACX= 0
##$ASSWID= 0
##$AUNMP= <proc_1d>
##$AZFE= 0.1
##$AZFW= 0.5
##$BCFW= 0
##$BC_mod= 2
##$BYTORDP= 0
##$COROFFS= 0
##$CY= -3
##$DATMOD= 1
##$DC= 0
##$DFILT= <>
##$DTYPP= 0
##$F1P= 0
##$F2P= 0
##$FCOR= 1
##$FTSIZE= 65536
##$FT_mod= 6
##$GAMMA= 0
##$GB= 0
##$INTBC= 1
##$INTSCL= 5.30512e-09
##$ISEN= 30
##$LB= 1
##$LEV0= 0
##$LPBIN= 0
##$MAXI= 10000
##$MC2= 0
##$MEAN= 0
##$ME_mod= 0
##$MI= 50
##$NCOEF= 0
##$NC_proc= -3
##$NLEV= 6
##$NOISF1= 182.463
##$NOISF2= 159.3651
##$NSP= 0
##$NTH_PI= 0
##$NZP= 0
##$OFFSET= 182.463
##$PC= 4
##$PHC0= -2742.478
##$PHC1= 74.0014
##$PH_mod= 1
##$PKNL= yes
##$PPARMOD= 0
##$PSCAL= 0
##$PSIGN= 0
##$REVERSE= no
##$SF= 81.0140089999434
##$SI= 65536
##$SIGF1= 159.3651
##$SIGF2= -187.1042
##$SINO= 113.3802
##$SIOLD= 16384
##$SREGLST= <1H.CDCl3>
##$SSB= 0
##$STSI= 65536
##$STSR= 0
##$SW_p= 29940.119760479
##$SYMM= 0
##$S_DEV= 0
##$TDeff= 32768
##$TDoff= 0
##$TI= <>
##$TILT= no
##$TM1= 0
##$TM2= 0
##$TOPLEV= 0
##$USERP1= <user>
##$USERP2= <user>
##$USERP3= <user>
##$USERP4= <user>
##$USERP5= <user>
##$WDW= 1
##$XDIM= 65536
##$YMAX_p= 309540013
##$YMIN_p= -2862401
$$ End of Bruker specific parameters
$$ ---------------------------------
##NTUPLES= NMR SPECTRUM
##VAR_NAME=  FREQUENCY,     SPECTRUM/REAL,   SPECTRUM/IMAG
##SYMBOL=    X,             R,               I
##VAR_TYPE=  INDEPENDENT,   DEPENDENT,       DEPENDENT
##VAR_FORM=  AFFN,          ASDF,            ASDF
##VAR_DIM=   65536,         65536,           65536
##UNITS=     HZ,            ARBITRARY UNITS, ARBITRARY UNITS
##FACTOR=    0.456856943014862, 1,           1
##FIRST=     14782.0589164792, 0,            0
##LAST=      -15158.0608439998, 0,           0
##MIN=       -15158.0608439998, -2862401,    0
##MAX=       14782.0589164792, 309540013,    0
$$ Real data points
##PAGE= N=1
##DATA TABLE= (X++(R..R)), XYDATA
$$ [...]
##PAGE= N=2
##DATA TABLE= (X++(I..I)), XYDATA
45994 667561 829055 761779 410355 -1481 -188161 -145272 -96311 -128586 -106736 35385
45984 35385 159387 158872 117688 122897 111867 40439 35234 217664 498393 694716 748572 699279
45972 699279 563261 398282 375041 594301 893443 1005997 872481 647719 458674 320570
45962 320570 250242 285023 392056 498969 600309 708865 746452 636305 464709 384213
45952 384213 393523 396345 432358 608499 802299 719050 339680 57757 204281 615640 852940
45941 852940 728471 443829 286171 346225 503589 573616 477312 319457 264019 319408
45931 319408 337870 244696 130837 72862 31161 17565 175820 535479 843267 843964 624934
45920 624934 477483 501582 567630 603281 663821 729005 688061 572160 565753 702503 761737
45909 761737 586578 328687 236404 338437 483214 575379 611663 567046 423789 284829
45899 284829 300104 468902 630582 662068 588918 499161 448759 466486 551588 632305 610408
45888 610408 486296 368484 323871 296579 221793 134935 92136 57279 -24334 -84997 4075
45877 4075 228674 408619 414755 313108 248974 279043 379158 531428 713635 858508 914417
45866 914417 910268 882690 786362 572180 313630 142176 82197 72829 133584 347957 652806
45855 652806 810848 688894 448512 351131 449364 572588 558644 395626 172900 -698
45845 -698 -33968 100842 328711 516051 574199 518051 437299 415327 458211 507175 533627
45834 533627 573556 615773 535032 267072 802 10836 289763 541555 581797 532342 541526
45823 541526 549815 478352 423109 460613 459362 321362 232575 392454 640655 675316 544115
45812 544115 566141 806335 990128 954839 830242 719782 562207 403291 441167 653495
45802 653495 729220 562573 473618 692745 953551 914966 705739 667216 763018 671418 358118
45791 358118 134202 157578 250306 245039 188504 153822 146397 240281 507672 754153 643466
45780 643466 194687 -151860 -110800 102258 184032 202535 371603 608522 658652 530986
45770 530986 470083 539396 544013 383868 210277 174448 250378 375129 547458 691531 627138
45759 627138 319046 3492 -86812 -6327 48169 55602 144274 301239 334551 167291 -14124
45748 -14124 -676 174247 318345 341320 307918 275417 215759 120204 74241 162506 346568
45737 346568 495567 522271 447441 340596 247242 191527 206568 305856 424583 449269 348735
45726 348735 239777 259938 386175 450707 347621 152968 16026 7866 116467 301298
45716 301298 474797 507889 365383 194971 175542 309398 468979 599575 727598 798791
45706 798791 704859 505106 424121 539388 647140 563366 398049 364757 451205 489276 469803
45695 469803 546190 733408 840045 763064 651248 664773 725602 654048 460252 335593
45685 335593 373938 447321 403172 287206 285612 476002 720079 828071 767010 646698 541363
45674 541363 423403 279067 180992 189349 261917 328804 384002 430881 420409 347045 329708
45663 329708 459193 614460 592452 408698 299253 397472 572514 646461 616389 569548
45653 569548 516202 435366 390136 454645 577264 647399 668902 736800 845928 858452 708233
45642 708233 530965 504400 610139 648841 497159 273030 196227 323516 493925 538084
45632 538084 462151 379842 332292 262067 136629 7503 -52349 578 178713 425336 586764
45621 586764 535205 344308 235521 309264 432824 443799 348855 242795 147225 50230 18474
45610 18474 120858 280195 344264 297520 274088 350887 448422 467018 416310 365846 354883
45599 354883 400889 522343 692806 822269 836016 739588 580538 400532 261211 251627
45589 251627 400442 612704 752217 765023 682363 551578 433882 423251 557888 717957
45579 717957 724491 568454 435095 449449 507275 451311 319326 273659 330376 327168 180293
45568 180293 19091 -2062 97588 201917 270712 328660 361201 346102 340336 408185 488996
45557 488996 465369 354847 297904 336390 342356 224545 83927 70252 167703 236468 233120
45546 233120 275260 456308 665222 666144 379767 40428 -10877 284859 609232 629864 376500
45535 376500 143094 97509 169526 291069 509054 796567 974279 953030 881519 900839
45525 900839 910367 764615 563255 506971 553244 486924 307820 258356 415143 538872 466269
45514 466269 401806 600233 926995 1002093 722748 389769 289946 367199 390617 281279
45504 281279 145103 84977 121679 257363 482894 714230 828505 804024 758591 810470
45494 810470 946713 1054824 1033725 845232 520465 171388 -57134 -120493 -124442 -165180
45484 -165180 -155666 75878 507772 863437 891792 641489 391177 344496 449778 504667
45474 504667 394215 214340 160142 293598 460657 478102 356148 255579 260392 312740
45464 312740 368762 470486 612165 674758 590239 469387 458950 546631 612098 604373 552392
45453 552392 449352 258966 32158 -91903 -27728 167138 344388 371894 224255 21539
45443 21539 -56015 51745 220870 300108 274970 225568 201959 224459 330166 508977 649421
45432 649421 659590 592193 538800 464338 291761 102928 76181 219029 329696 266211 119324
45421 119324 66072 156886 296274 354929 272453 117209 45444 126764 237439 229900 166287
45410 166287 231941 436838 590789 599749 586672 642501 646341 461838 173893 -8669 8110
45399 8110 177774 431671 693399 848182 837176 753403 735440 787745 799251 719989 625617
45388 625617 601325 631848 630446 549485 445249 419304 483628 526262 467506 399273 459518
45377 459518 598748 623681 484805 350121 336783 342244 245810 125495 132929 261744 383527
45366 383527 431671 414145 319859 160441 54787 123998 317148 455810 437475 306600
45356 306600 161718 89022 148534 321334 494325 578083 594931 574509 450765 194623
45346 194623 -23708 18766 300257 558091 602339 492130 382808 329835 291044 228418
45336 228418 157780 142713 240201 406762 498303 438726 335927 325431 354801 266196 60501
45325 60501 -85524 -68510 32905 116030 163738 166567 98610 26153 84033 267986 393336
45314 393336 347328 245906 235209 265218 192997 17065 -127907 -150379 -62136 80374 185266
45303 185266 142947 -37351 -162894 -69061 144700 246473 217641 280370 543954 810420
45293 810420 838304 660997 505534 490495 561978 672700 836603 988764 971122 749307
45283 749307 519535 481684 583818 615345 502492 374209 350865 408601 475113 530815 565845
45272 565845 547738 496755 500056 579629 628183 553634 415161 332668 321969 305522 239518
45261 239518 152597 101090 150081 339843 597843 750678 713255 607626 601898 692279 747176
45250 747176 707153 624039 549109 502356 515191 588934 647439 636246 613665 630365 600953
45239 600953 450168 307204 355196 534089 610556 524129 432749 406812 328054 149549 16082
45228 16082 25911 78067 66968 45081 76993 100953 55501 -6050 -32736 -53205 -37915 141149
45216 141149 494775 834147 1027328 1150651 1249857 1177525 873682 596892 608643 784656
45206 784656 820989 692342 592322 523017 313519 26746 -35588 184541 352364 220843
45196 220843 -18342 -50253 120037 260944 301568 386521 592670 787005 795189 609185
45186 609185 395457 325731 395667 420949 262067 27147 -55218 38150 78453 -78957 -265079
45175 -265079 -222084 53810 337590 472471 485330 435527 319129 166332 99767 199633
45165 199633 372510 447401 386938 322211 360958 437290 417978 316166 294372 431697 589409
45154 589409 591457 477398 461382 646044 885658 969660 861152 698602 618151 645715 741205
45143 741205 866090 972366 978157 836693 644035 594265 749489 908891 828280 553937
45133 553937 382223 455730 588652 600736 623135 850217 1123733 1073306 665465 308280
45123 308280 306464 462866 393078 55878 -237577 -243993 -17117 241633 383615 363651 237459
45112 237459 135663 137098 156064 55179 -125889 -179539 -7202 235724 349183 337929
45102 337929 340387 387705 387816 327494 317503 387888 397427 257956 124417 200159 424780 545051
45090 545051 479516 409040 465192 537364 499162 443858 522678 670278 685297 524766 340489
45079 340489 253239 254888 315235 417134 478607 399463 214700 69264 23274 17647 40337
45068 40337 156975 333575 406162 315897 223140 276503 395745 414035 338199 321287 422682
45057 422682 523085 473278 254072 3982 -70947 133176 481997 690675 612306 393453
45047 393453 287794 371368 505876 527361 395639 198193 77474 126922 306919 490824
45037 490824 614719 715872 801228 791310 668103 569370 627258 797454 956805 1074428
45027 1074428 1147601 1069556 766316 420146 321354 466847 530011 321110 74593 117549
45017 117549 397995 559721 440634 278450 363453 651556 852371 823088 714586 705471
45007 705471 736194 629659 411706 337602 546456 827753 860390 616827 379863 367213
44997 367213 497309 582649 609921 694468 830282 851769 665671 393951 221215 185452
44987 185452 197576 200563 205267 205308 178959 178094 290538 478080 572723 499039 387031 375407
44975 375407 414412 388017 333018 369814 471450 484365 370183 260015 256649 331957 429585
44964 429585 519526 547589 496037 494082 669119 874531 809237 469059 210198 242649 338160
44953 338160 233451 57684 85161 274016 380932 396957 510244 694193 698232 476065
44943 476065 291487 310969 376542 307211 184151 183459 310788 455295 563943 620375 571724
44932 571724 419769 295280 305882 368180 308796 97870 -112932 -168045 -55379 117432
44922 117432 253305 363000 518911 702581 766610 623394 403397 302956 329033 353378
44912 353378 377088 528706 788676 948870 916233 834863 802519 693648 430293 229201
44902 229201 350503 715756 990496 976282 741093 442373 219123 192954 354907 479012
44892 479012 365989 163444 210858 542704 803908 756970 624510 736716 1017293 1076836
44882 1076836 756803 333235 144284 216231 358018 475798 628455 821180 913507 784521
44872 784521 491585 195688 -9564 -119090 -117105 27327 251667 391102 347248 217959
44862 217959 194817 352018 589203 767903 840532 829671 740610 558308 326362 165232
44852 165232 165352 287235 418984 517580 623646 736092 769126 680255 555542 496098 489865
44841 489865 476200 467226 501938 536302 496982 407868 349292 328350 309538 330023 440579
44830 440579 568681 607847 622041 770608 1023427 1153425 1050033 841037 651924 457021
44820 457021 251792 155764 218556 310647 337492 383285 509516 604513 595087 612245 747639
44809 747639 828995 675325 420598 319583 355162 323991 223259 242336 400190 492498
44799 492498 420751 310425 268638 267082 299678 412187 525536 474130 293517 236020 407057
44788 407057 606733 640381 572440 542397 532967 484796 470016 564473 666100 618448 439907
44777 439907 288944 268711 376689 557866 689180 612489 332195 102311 156213 400459
44767 400459 539857 477001 408573 501886 646829 626071 429609 269989 295124 395372
44757 395372 361296 179043 57865 144126 325862 409786 397041 443650 599802 750086
44747 750086 802320 779239 714675 611406 514020 464446 376912 145372 -105020 -104234 159271
44736 159271 370636 342479 282603 429765 663862 725960 633906 591700 623028 602592 564072
44725 564072 653135 804570 791870 626816 597795 824652 1055003 1033375 836906 690741
44715 690741 651529 653896 710662 859399 1000720 984988 828909 695419 671553 687160 646830
44704 646830 536622 395898 273187 225474 290992 437912 579892 653102 650149 587666 487192
44693 487192 394970 374306 446462 557962 638354 687937 773578 919203 1036048 1013812 870795
44682 870795 746718 728515 749099 696755 564173 436213 381525 414139 513309 619387 663624
44671 663624 673017 779639 1025554 1223703 1159516 906717 775777 918977 1142897 1184520
44661 1184520 1038341 896629 856469 825828 698836 504680 351048 289421 282985 282619 292109
44650 292109 345855 440518 515472 508181 415680 300943 253053 323064 455253 495355 338352
44639 338352 74769 -89877 -73165 26479 126622 268622 458878 562300 488678 358513
44629 358513 326528 349404 303786 232916 268126 381312 441406 463290 560040 683866 677049
44618 677049 570986 555218 633040 611712 491286 536028 833969 1094895 1064581 871208
44608 871208 767740 783609 841086 963263 1116948 1085820 792080 545803 659401 979216
44598 979216 1132194 1093511 1133836 1289964 1291448 1019703 680121 468973 379447 384266 507863
44587 507863 655622 660219 564494 575813 680451 621155 356421 206086 375411 643968
44577 643968 733697 702534 726980 748260 631059 485510 517657 676497 740761 676334 632476
44566 632476 639624 587001 485913 494096 647875 789700 809927 780690 803061 874969 951559
44555 951559 1002399 980193 860034 729598 713413 792160 826122 767364 704914 683818 645226
44544 645226 593788 653815 864398 1057576 1059528 918146 816587 829998 877241 866559 784165
44533 784165 658581 523972 417044 350903 295392 227242 190319 263519 467920 729381
44523 729381 927827 971206 841849 599963 347579 184338 183607 364543 646787 869496
44513 869496 930830 908257 972184 1170988 1367110 1398135 1232811 955706 683274 526287
44503 526287 540394 649166 691205 615664 559882 644870 763622 703023 452290 249326 290884
44492 290884 514319 724737 837441 898613 927538 864301 688317 495249 399258 397371 382971
44481 382971 284878 152894 97649 171524 323679 459539 528759 554595 584706 624262 635409
44470 635409 608922 603474 668981 744197 703203 535611 412413 496724 721546 848775 756192
44459 756192 575007 501719 553940 589616 517893 391437 300408 280483 353431 550004 808826
44448 808826 933120 783498 500520 394385 569072 782480 768477 589505 527584 681442
44438 681442 841993 785578 546085 335840 297444 395177 475537 388269 126487 -110037
44428 -110037 -83504 193221 434324 421103 262411 215732 345887 500689 567324 598613
44418 598613 685230 819219 906154 854255 664172 465214 400141 433480 392187 273597 334972
44407 334972 699473 1046007 975688 588885 360328 460534 572789 455520 302835 360935
44397 360935 522565 573480 582163 724031 893358 832337 565150 388403 449142 603126
44387 603126 693091 716747 697165 624493 574528 669585 855918 913609 763194 585390 553277
44376 553277 615839 649870 670055 757448 896556 1014706 1094037 1121826 1012062 718378 379537
44365 379537 211846 263124 391352 493141 626483 847738 1029600 970156 681012 449324
44355 449324 531509 841038 1049366 984023 792135 671268 599123 462328 331800 400329
44345 400329 664293 867980 825830 657153 615307 777146 990047 1079670 1037041 999004
44335 999004 1065186 1154726 1097110 879410 698703 689501 719209 604178 422760 396370 522075
44324 522075 590614 568155 660214 916351 1068725 925199 670941 575843 613815 603791 549616
44313 549616 577414 668519 728425 821221 1044584 1235721 1120728 762263 548566 668954
44303 668954 877699 885908 735832 635534 633937 649266 672451 748033 841608 896994 966073
44292 966073 1129042 1325287 1405634 1334935 1217244 1126363 1031727 908547 814677 814302 894571
44281 894571 999415 1096990 1173979 1199423 1144774 1038265 962525 971121 1009918 951284 737361
44270 737361 481213 379752 498289 667933 644282 380776 108832 99141 342568 533215
44260 533215 422858 138534 39512 271272 607017 776197 779889 753611 679427 463649
44250 463649 218524 183292 341280 396051 240154 187661 531177 1053270 1250663 968959
44240 968959 550878 355396 378427 420335 410757 414276 440113 420939 354769 338979 439336
44229 439336 594697 679244 628650 493841 394648 433676 635748 933210 1185162 1242399
44219 1242399 1074841 864467 882540 1181545 1468108 1415712 1085578 872931 997861 1230793
44209 1230793 1238772 1041392 923860 990395 1052105 963669 830377 794386 817976 815704 837633
44198 837633 943300 1013784 902265 709421 678490 814698 838369 585301 254158 136925
44188 136925 257516 422022 512440 564092 616520 658896 714518 834729 984193 1039519 934957
44177 934957 734791 542300 407241 341916 359642 461225 618091 782753 894204 897352
44167 897352 810863 752792 822147 957857 992461 854110 643359 503004 491040 591174
44157 591174 749547 865315 846082 736932 704528 807733 866580 683741 350407 176476
44147 176476 294118 476370 436314 200736 51996 142413 323887 392028 354842 360909 463231
44136 463231 591245 700610 793697 809996 676285 499976 525522 802120 1055559 1022975
44126 1022975 779866 581790 511860 485804 505363 653355 865757 964863 947617 1000991
44116 1000991 1168027 1237134 1079049 881514 886899 1057162 1172134 1136110 1009860 837128
44106 837128 629684 469191 444291 508692 552145 585859 701302 861373 907600 801304
44096 801304 693650 693520 708898 616706 481140 471975 613391 746913 757639 727364 796590
44085 796590 940712 988007 859189 681366 607240 614440 592257 561758 648619 838710 937746
44074 937746 844026 709734 714001 789113 723254 481725 276474 307251 530823 711360 661100
44063 661100 440969 336931 577259 1041314 1339926 1249752 966518 832193 923679 1060295
44053 1060295 1123885 1161208 1191999 1138645 1004204 936911 1013377 1086634 971574 706635 513903
44042 513903 526515 650644 704133 627054 525153 529858 650103 777613 819088 783264 736599
44031 736599 725385 761223 827430 868080 828608 744678 724635 798440 863523 844047 815077
44020 815077 876548 986056 1033346 1018831 1032655 1097842 1149759 1130536 997051 700297 291454
44009 291454 -17609 -64433 41666 81573 56491 135624 301062 321404 144007 50542 276582
43998 276582 672016 908902 889855 783984 754212 812364 897348 961510 986404 988498 996401
43987 996401 995960 952035 903312 945729 1082428 1185811 1161684 1061927 981823 933755 873705
43976 873705 768190 597786 389988 271404 359020 563899 652253 556607 464845 529504
43966 529504 669227 758927 823665 902828 913332 831843 836700 1040475 1223725 1097989 742548
43955 742548 504106 503504 520102 383146 222353 255507 513707 847079 1064709 1038745 812984
43944 812984 625087 669855 834609 843880 671146 579953 694475 777583 593617 299169
43934 299169 255127 546827 902494 1062918 1047958 1026095 1064212 1088425 1027211 915843 859088
43923 859088 916929 1029071 1050459 881688 588609 382063 429401 660765 814573 731480
43913 731480 546655 489375 544388 487189 266827 139328 315019 658738 895972 959225
43903 959225 937773 821251 542856 210545 41352 71901 151130 217569 362262 595626
43893 595626 770615 791780 720230 634491 568330 607494 831797 1110046 1173885 973489 750570
43882 750570 681839 681769 659713 712906 897473 1047108 1035484 1017047 1158956 1298871 1155919
43871 1155919 786714 543276 600356 772556 812772 682246 493566 363165 370026 530951
43861 530951 767986 971383 1096346 1147997 1129198 1078527 1074761 1104512 1030817 819663 669790
43850 669790 739881 871866 816536 634979 598271 743194 838243 794275 785545 898664 979723
43839 979723 951185 977485 1136493 1197668 961394 607309 448922 503817 575750 637634 829837
43828 829837 1124369 1287546 1213582 1057665 971068 899690 735480 517548 382220 410657
43818 410657 600803 903116 1208259 1368076 1311953 1119768 936561 837399 797286 756585
43808 756585 683788 593259 522445 487373 466660 440944 425061 437105 467552 514646 610322
43797 610322 756913 874967 882239 799462 711098 650806 603650 592583 666148 808494 950835
43786 950835 1065180 1161370 1212716 1192130 1164618 1214846 1286488 1239912 1083819 987555 1025871
43775 1025871 1087433 1103241 1175693 1365992 1532394 1535398 1451507 1407263 1340927 1139374 899866
43764 899866 815365 866899 874572 813968 825308 919605 951123 917140 1003051 1236031 1358104
43753 1358104 1189984 900081 744043 728175 718842 719384 816447 957829 1000857 928875 846142
43742 846142 809159 817729 907675 1081540 1200135 1123253 929271 825270 865016 931422 978858
43731 978858 1092719 1284578 1419117 1408427 1325075 1251653 1151193 967523 748051 585816
43721 585816 516092 530552 619677 743325 825363 837054 840410 903750 1008848 1075012 1055937
43710 1055937 1001725 1028231 1188872 1357812 1319877 1041820 763451 713878 831781 914437
43700 914437 946083 1059444 1221903 1229426 1048679 908971 960559 1067802 1065787 1014690 1038773
43689 1038773 1089632 1061669 1013629 1072465 1196466 1226407 1132140 1038719 1023462 1036541 1031080
43678 1031080 1051159 1159539 1342112 1495771 1490225 1284820 1014151 885915 945636 1026566
43668 1026566 991621 920007 960964 1102229 1206492 1205339 1131975 1019399 895776 844206 944413
43657 944413 1166988 1407739 1591138 1670389 1602090 1424273 1279362 1231241 1140197 883519
43647 883519 634868 710075 1129916 1544220 1656038 1549391 1495156 1567789 1598312 1451004
43637 1451004 1211401 1080310 1154697 1347583 1489239 1469849 1300487 1095455 1015291 1152335
43627 1152335 1401854 1511831 1368996 1177957 1204531 1387859 1426870 1259974 1185655 1398229
43617 1398229 1667722 1677123 1468332 1313047 1294181 1277073 1201472 1145589 1143028 1152928 1178082
43606 1178082 1228485 1223798 1114467 1021829 1060094 1117170 1045526 963204 1072531 1260124 1226292
43595 1226292 997995 943003 1210679 1508189 1552239 1431535 1366887 1382116 1385056 1351339 1269008
43584 1269008 1102804 949628 1013671 1284327 1468119 1409178 1344562 1533383 1849735 1997809
43574 1997809 1957174 1929575 1954621 1868972 1611929 1321970 1120183 990332 891336 836814
43564 836814 841850 895529 984260 1067633 1073758 1000641 961573 1035723 1137460 1133882 1028982 930787
43552 930787 899948 929972 1006409 1080441 1060216 947806 912627 1091061 1361275 1456614 1283999
43541 1283999 1012444 856535 876350 991668 1102240 1164333 1186126 1173268 1109650 1025927
43531 1025927 1029793 1163020 1270736 1169277 932662 826916 945274 1117087 1211684 1285530
43521 1285530 1354646 1301131 1144538 1126127 1325928 1457688 1287390 1016930 968894 1101688
43511 1101688 1160486 1135719 1210822 1367309 1411624 1344709 1359145 1483310 1545374 1490506 1438174
43500 1438174 1423856 1370694 1315142 1371867 1479316 1477847 1426348 1507795 1625891 1488113 1143577
43489 1143577 1011236 1231217 1407654 1224320 932835 921887 1119546 1196236 1140280 1226222
43479 1226222 1508945 1722641 1685828 1516804 1407706 1403649 1447662 1472792 1414450 1271859
43469 1271859 1181657 1302080 1592276 1812459 1780172 1552990 1334847 1262426 1305191 1337863
43459 1337863 1295998 1259102 1345520 1520913 1591893 1444017 1211247 1119499 1209289 1320550
43449 1320550 1340508 1350726 1481624 1701683 1839238 1799359 1674888 1604517 1585436 1507900
43439 1507900 1346666 1210917 1188905 1247993 1326683 1419486 1516105 1568729 1590408 1664756 1772593
43428 1772593 1754098 1567856 1429827 1513867 1656525 1590681 1362644 1245790 1304701 1346589
43418 1346589 1301027 1334336 1513298 1636532 1535200 1329162 1234871 1267434 1272019 1161618
43408 1161618 1023830 1031386 1263205 1564634 1644650 1421472 1184042 1241982 1509815 1664141
43398 1664141 1627093 1607868 1714388 1848565 1979397 2172984 2321948 2211486 1923569 1798219
43388 1798219 1893237 1884795 1650748 1517548 1693481 1882391 1787314 1624564 1741519 2020579
43378 2020579 2096360 1951803 1859200 1869203 1789400 1603139 1514723 1592791 1708477 1824775
43368 1824775 2032546 2279170 2348657 2168720 1922645 1817004 1903176 2122708 2367144 2511509
43358 2511509 2529870 2533063 2577282 2549350 2388391 2257176 2277778 2267156 2025044 1749082 1811248
43347 1811248 2178346 2420507 2318645 2121875 2116925 2246669 2304798 2281416 2332002 2518295
43337 2518295 2724128 2795534 2700891 2559225 2503620 2514307 2460124 2323761 2251082 2314942 2398513
43326 2398513 2418929 2477851 2637872 2745120 2674514 2571743 2623182 2748689 2766788 2708245
43316 2708245 2702722 2703879 2613550 2547342 2675961 2909525 3030759 3033020 3035401 2990887 2805779
43305 2805779 2635627 2712767 2959800 3103675 3081490 3005822 2857037 2588064 2408736 2543145
43295 2543145 2805376 2854821 2762504 2830757 2956033 2762529 2350503 2270208 2653364 2994631
43285 2994631 2978681 2927757 3165276 3479767 3551213 3453200 3389090 3317056 3169447 3104956 3223763
43274 3223763 3325831 3235473 3090284 3063004 3089670 3112659 3280874 3642597 3935938 3965136
43264 3965136 3919439 4046219 4255526 4315243 4214327 4086061 3978061 3912451 3966136 4106638
43254 4106638 4164911 4121775 4174750 4391470 4587615 4680087 4828611 5074371 5200333 5136858
43244 5136858 5139072 5352412 5564647 5605070 5624346 5758146 5884706 5938842 6088223 6378932
43234 6378932 6595245 6676538 6854752 7182281 7388111 7404751 7523788 7810927 7938029 7847439
43224 7847439 7960049 8425803 8828223 8969801 9246842 9869253 10467131 10894256 11593747
43215 11593747 12672932 13509772 13858202 14396893 15525239 16637102 17323911 18161028 19462883
43206 19462883 20568920 21368712 22991773 25728641 28169165 30097900 33603049 37981174
43198 37981174 35867038 19938850 -6167737 -28698936 -37521786 -35279295 -30959928 -28675255
43190 -28675255 -26527411 -23280150 -20746988 -19995654 -19525017 -18091080 -16464685 -15510563
43182 -15510563 -14756345 -13735374 -12958715 -12719389 -12367167 -11498259 -10654561 -10228974 -9778868
43173 -9778868 -8995406 -8342688 -8169837 -8080858 -7711152 -7325778 -7168129 -6967821 -6556002 -6272443
43163 -6272443 -6318163 -6340136 -6065806 -5748985 -5612803 -5441185 -5088868 -4820370 -4774226 -4643706
43153 -4643706 -4257354 -3945732 -3965249 -4070164 -4021271 -4011353 -4195986 -4283287 -4007177 -3591505
43143 -3591505 -3356135 -3257448 -3179062 -3261363 -3552060 -3725889 -3560421 -3325671 -3295536 -3239883
43133 -3239883 -2853042 -2359369 -2199359 -2355810 -2471053 -2452108 -2496937 -2635211 -2668727 -2524714
43123 -2524714 -2336515 -2209458 -2154383 -2178648 -2238804 -2219373 -2132387 -2160478 -2325726 -2362195 -2147173
43112 -2147173 -1976463 -2102515 -2276069 -2140126 -1851038 -1839435 -2083825 -2121697 -1777477 -1414825
43102 -1414825 -1366977 -1501665 -1513324 -1357050 -1205041 -1163779 -1209825 -1299647 -1406732 -1492146
43092 -1492146 -1518014 -1486596 -1451779 -1487543 -1603529 -1685454 -1602637 -1401826 -1284341 -1343904 -1458505
43081 -1458505 -1509200 -1547686 -1634579 -1669094 -1539910 -1327067 -1185256 -1116624 -1024918 -922471
43071 -922471 -914993 -1020791 -1149305 -1234059 -1275079 -1284746 -1288440 -1331726 -1395049 -1358891 -1153443
43060 -1153443 -894380 -772710 -840895 -980737 -1049724 -1001526 -890084 -788542 -689900 -522017
43050 -522017 -315672 -264186 -466777 -701383 -685383 -513255 -541052 -829212 -1040090 -969659
43040 -969659 -823416 -808242 -804913 -677902 -583254 -668039 -735130 -545073 -237049 -97449 -86911
43029 -86911 21419 157603 22991 -381872 -677687 -608871 -321956 -73691 72621 161627
43019 161627 177348 102599 35757 133468 442248 789107 844533 392063 -403533 -1096307
43009 -1096307 -1394052 -1382206 -1276396 -1154051 -1039893 -1029265 -1134288 -1183378 -1062502 -891590
42999 -891590 -793680 -696063 -551888 -512333 -632769 -670146 -478517 -341247 -533778 -803396
42989 -803396 -736693 -444681 -365193 -516495 -517974 -313381 -276198 -520869 -680220 -538296
42979 -538296 -376005 -463771 -659435 -763318 -866191 -1053564 -1114566 -867000 -504258 -314633
42969 -314633 -271706 -185925 -79360 -129779 -361558 -621880 -783026 -817919 -778130 -798926 -980652
42958 -980652 -1183093 -1132175 -821732 -574085 -582138 -654230 -575112 -442690 -424355 -435801 -335702
42947 -335702 -232527 -302040 -452413 -461735 -338059 -269900 -304058 -329767 -316966 -326725 -331373
42936 -331373 -250564 -139136 -142126 -283552 -459775 -598682 -676741 -648679 -524882 -446517 -512341
42925 -512341 -604355 -562143 -445336 -414884 -424276 -272983 48471 304689 340331 255232 192912
42914 192912 124520 -57971 -330446 -511737 -437956 -143995 136359 198556 96884 52375
42904 52375 124752 142641 24762 -43723 81700 214744 96323 -183320 -289880 -115641
42894 -115641 109976 164160 52430 -115471 -251587 -271271 -152247 -43703 -130942 -362696
42884 -362696 -496170 -438188 -338827 -298839 -208280 11573 198804 151112 -74447 -218706
42874 -218706 -127849 111466 310718 354057 243245 51132 -132727 -228360 -177278 15097
42864 15097 225640 266379 63928 -242630 -446123 -480496 -421500 -329093 -191627 -12790
42854 -12790 139095 180736 68937 -167176 -407214 -512647 -478969 -438678 -443397 -359030 -99301
42843 -99301 163320 211851 121195 146992 316689 390243 254848 101788 117277 219307 239660
42832 239660 192754 199774 264711 292608 266578 263607 320821 389464 401123 304967 75250 -236420
42820 -236420 -479857 -516658 -352891 -117114 75021 186124 215683 172914 105793 90523
42810 90523 142711 171541 84433 -66902 -120703 -20138 86302 43964 -72107 -52968 133900
42799 133900 287188 252890 110229 18702 25436 102592 233794 365764 403608 348452 303496
42788 303496 261406 74492 -240540 -393852 -217874 38285 58854 -88294 -145740 -124720
42778 -124720 -200730 -288860 -154949 103206 135391 -82662 -196612 -63503 65291 70252
42768 70252 185255 475306 570231 252832 -93464 -30046 269366 346870 205346 224773
42758 224773 473141 610723 465488 247893 138567 65800 -7457 57935 276021 395655
42748 395655 250953 24168 -25758 86058 176339 204196 274950 411052 500790 463380 344276
42737 344276 241107 205670 217567 214044 155572 74364 25666 -7531 -94863 -228187 -293372
42726 -293372 -220150 -89389 -21853 -11054 43939 153738 188273 64735 -74500 23262 400093
42715 400093 770408 821683 593132 421463 493577 612153 503836 218839 42100 75186
42705 75186 130239 67896 22714 163844 385592 430796 267804 140906 206175 292073 144046
42694 144046 -196934 -420277 -326145 -29986 235539 377402 428975 408286 315792 207478
42684 207478 150605 141226 156185 228879 362363 433393 334197 170337 148678 281623 379062
42673 379062 340415 267975 261758 297888 365248 519323 712094 769532 660751 599728 723498
42662 723498 840587 693532 344852 94226 89237 212733 310784 352031 371051 395725 436767
42651 436767 465146 426954 338798 296776 329757 350903 328257 360536 482601 569096 572818
42640 572818 658378 891338 996600 717923 269512 95399 271091 493045 597400 689972
42630 689972 760009 606463 267548 116946 328577 587805 577297 447080 506290 692509
42620 692509 697975 486062 340115 440035 670720 844990 883493 768349 527170 289352
42610 289352 190528 202437 198552 174957 238827 380853 450202 394709 346837 405147 494386
42599 494386 527603 550302 608402 614076 493466 358196 351436 396656 307319 124724 113950
42588 113950 364946 615594 603095 417077 325223 380120 422336 398843 420518 499305 484327
42577 484327 334886 231650 296697 397104 376809 315548 375770 522816 597831 581532 586836
42566 586836 642931 671316 641260 583689 490518 365682 331410 501097 772293 921692 881682
42555 881682 755396 609347 454565 382111 471071 585459 529642 396297 452715 659229
42545 659229 664448 384594 205525 403178 718557 799974 756689 893276 1121552 1088625
42535 1088625 795641 634615 779793 950829 900886 788314 861793 1041867 1071573 928417
42525 928417 825968 860548 890029 791179 647518 581313 520940 293267 -67958 -264772
42515 -264772 -75532 342114 620389 609034 475915 384619 277494 78115 -72994 20227
42505 20227 292502 460549 382985 219785 201869 369738 597221 777164 897258 967745
42495 967745 955420 822741 613442 453984 435102 512936 576001 593689 632113 733963 869311
42484 869311 1005511 1121912 1143942 991021 732771 567105 577126 634435 616539 581607
42474 581607 627816 720509 790749 876168 1006613 1061203 917441 659877 463427 344860
42464 344860 218867 130396 207150 405042 524072 496118 463984 547100 703214 846280
42454 846280 931037 902004 738676 573194 569647 660216 623819 474840 504613 811516 1063721
42443 1063721 954430 679827 670282 964533 1170658 1037216 765052 668743 765137 845502
42433 845502 804368 724398 694993 696555 671827 613760 553074 515995 522018 580443 654356 662300
42421 662300 571129 478619 535880 758993 976292 1017558 911088 817295 798397 762980 651041
42410 651041 554161 580801 689423 755234 750302 742285 736576 657129 516642 468716 592476
42399 592476 724985 653921 433677 338183 478111 643000 619848 516854 605425 923538
42389 923538 1222998 1295073 1178832 1027660 925866 887367 903621 926552 903214 875530 946230
42378 946230 1109107 1231485 1253065 1271456 1360806 1435634 1385308 1228468 1040409 837613
42368 837613 630259 480859 414371 377531 369186 470243 645436 690281 526820 383308
42358 383308 488924 740475 884935 885200 853358 757148 503516 236410 216558 412477 524208
42347 524208 434850 330071 320680 265118 74798 -93092 -95798 -17225 32974 116118 292801
42336 292801 439877 420625 304623 260872 336845 464746 578066 616660 530795 378257
42326 378257 303057 336774 352085 287468 258137 350111 474419 539885 595984 667578 624102
42315 624102 387488 127915 72238 226696 442013 629147 751769 741358 608506 522300
42305 522300 585002 636505 488698 253465 208036 404454 645901 801257 899192 929218
42295 929218 807008 582218 459716 530127 642203 625677 514103 464628 546471 684517
42285 684517 768365 771056 766505 823474 887892 837845 673531 545112 540203 575287 581817 640643
42273 640643 789531 854315 677151 403609 318724 466302 648529 746014 808095 858843
42263 858843 848358 795060 764331 710607 550385 379786 390239 566110 704939 751038 853108
42252 853108 1053187 1183814 1142880 1014451 841559 555886 240470 165575 390244 600033
42242 600033 557830 470191 640980 965998 1089767 944999 812525 879141 1022307 1054337
42232 1054337 943258 745644 516725 348756 340279 456057 532728 483874 409772 452519
42222 452519 613355 762851 790742 712604 643811 670903 743175 722105 553639 343184 233926
42211 233926 267260 389649 522647 590249 565973 538964 630528 792342 820535 652160 488560
42200 488560 491059 522522 394636 229078 299836 589985 807089 835104 859064 975100 991349
42189 991349 778983 559580 608436 841692 950441 856337 790455 934254 1187751 1332978
42179 1332978 1282988 1114903 945441 820787 695805 523815 382989 441822 726802 1003397
42169 1003397 1012832 783981 577790 554779 652291 776188 918914 1036862 1001503 788804
42159 788804 575561 512564 511929 406020 225313 142059 189084 229585 211814 264916 479184
42148 479184 745063 906653 961241 993552 991455 861710 612072 402240 378006 513009
42138 513009 651864 687572 666844 713426 860954 994905 982242 825293 637411 491343
42128 491343 368599 257293 207003 250248 345511 444801 550018 649721 670887 572727 444046
42117 444046 425819 556507 754845 927462 1026010 1025079 930028 812318 768557 826017 930183
42106 930183 1025135 1094954 1122072 1068137 933793 804145 789742 917289 1096713 1203944
42096 1203944 1185807 1072935 912628 742723 637816 694098 896539 1068214 1060227 948756
42086 948756 909888 927014 803274 494302 234340 233904 412880 557593 601545 604058 578830
42075 578830 528213 559439 761911 1003357 1042161 850813 664572 681087 843907 956282
42065 956282 904159 738225 614144 659772 836459 952967 887045 745204 708407 778554
42055 778554 806115 725386 616354 552598 531275 550657 626472 731275 830243 956497 1135086
42044 1135086 1275945 1284001 1227891 1233653 1257903 1163096 985829 905756 949645 960543 883371
42033 883371 839976 875381 876858 814038 808262 872922 847386 712733 699748 904911 1061750
42022 1061750 935141 722100 766238 1023245 1129437 940107 697062 642613 717713 718064
42012 718064 579584 423437 408518 587801 858149 1040812 1046344 941488 836379 774765
42002 774765 772709 864763 1028257 1141237 1107442 969825 840085 788472 852362 1045271 1279030
41991 1279030 1383421 1295126 1135979 1031599 967625 902588 879831 919012 940870 927076 1004677
41980 1004677 1214897 1343830 1181001 843412 641498 688360 817944 832938 678183 433782
41970 433782 279047 379527 668974 853588 787247 699724 851227 1113402 1163683 982480
41960 982480 841389 846341 821805 674597 571836 671079 900268 1087035 1133027 1021915
41950 1021915 828248 735374 860730 1055151 1068536 911174 830452 923788 1022875 1000838
41940 1000838 943057 942687 962564 984525 1071767 1190607 1187402 1043647 945513 995758 1063816
41929 1063816 1031908 977463 983631 979759 919666 917653 1036680 1123976 1043383 909781 895629
41918 895629 945103 891137 748885 679806 732206 810128 854617 886712 905654 895897 908601
41907 908601 1004140 1135848 1200748 1178007 1125766 1083544 1063072 1080303 1113173 1096927 1046007
41896 1046007 1086502 1252837 1350123 1179469 845264 666901 789888 1032911 1143754 1081889
41886 1081889 996252 1010190 1102305 1176381 1187527 1161897 1110181 1000878 863325 824923 938273
41875 938273 1052376 1012920 920288 971119 1087833 1000031 728335 647168 919765 1195074
41865 1195074 1109703 820432 727346 870322 957218 873773 794458 814449 815779 739722 701273
41854 701273 762730 833661 862874 910744 965901 908507 740264 644259 711116 795243 767184
41843 767184 735800 865022 1101771 1253832 1256023 1204207 1177574 1176353 1218178 1353745 1547660
41832 1547660 1636304 1475353 1116364 797862 736485 922041 1138877 1201547 1133830 1083147
41822 1083147 1109614 1139965 1112129 1069286 1081309 1138967 1171658 1144410 1106269 1137796 1246276
41811 1246276 1327975 1285061 1183757 1206734 1401103 1579720 1574666 1491299 1549014 1721431 1738144
41800 1738144 1476204 1167837 1126558 1392227 1744847 1963497 1950368 1678672 1187682 650691
41790 650691 320917 323060 529554 695193 697962 599848 488008 353308 186941 114074 286719
41779 286719 636099 877711 840553 683282 679121 869757 1061676 1111726 1063415 1004169 940628
41768 940628 869985 860120 966764 1120297 1178795 1098738 1008223 1080916 1338401 1606612 1696454
41757 1696454 1599942 1452476 1335174 1225931 1144165 1181461 1310393 1315999 1061549 720108
41747 720108 579737 682460 818256 832632 770709 733797 757237 834096 914436 885416 706120
41736 706120 557399 678108 1028071 1298788 1312082 1226019 1264522 1418211 1528360 1519674
41726 1519674 1419425 1267076 1138067 1149914 1302947 1406509 1313513 1151874 1158918 1338739
41716 1338739 1461627 1388880 1222591 1107914 1045188 961435 850972 771512 775631 896219
41706 896219 1128230 1379874 1515017 1497540 1433313 1422915 1438982 1400894 1295930 1154671
41696 1154671 981086 808115 763976 950415 1267825 1487929 1513152 1448643 1402493 1354829
41686 1354829 1281487 1262455 1346162 1399660 1241206 898377 617630 604091 814414 1008531
41676 1008531 976972 745556 570130 667254 948646 1143683 1198141 1338789 1637178 1770069
41666 1770069 1468560 1007715 899413 1191912 1448123 1399504 1230218 1158005 1132641 1093896
41656 1093896 1160643 1352585 1440322 1316477 1239410 1436350 1702762 1692029 1411975 1136882
41646 1136882 990837 922786 952732 1114050 1240816 1133644 896028 823047 985999 1183571
41636 1183571 1269206 1277309 1260116 1243821 1312683 1502139 1653033 1603975 1461483 1429521 1461435
41625 1461435 1381749 1272602 1380538 1663344 1801478 1686800 1542022 1508666 1481884 1430387
41615 1430387 1504390 1697654 1758224 1600539 1481627 1585120 1733560 1713740 1605128 1566749
41605 1566749 1550286 1449125 1312958 1210357 1096884 1010954 1152474 1539798 1834538 1771818
41595 1771818 1539985 1447282 1434472 1266460 1032433 1045696 1308879 1472423 1358546 1195546
41585 1195546 1243934 1451432 1595038 1577826 1467615 1361132 1307740 1308188 1333813 1365716 1407590
41574 1407590 1441879 1426292 1365920 1308572 1229842 1044101 804331 747105 1005684 1392639
41564 1392639 1620136 1648265 1657299 1744228 1816632 1763739 1595459 1414838 1337107 1408279 1547245
41553 1547245 1629429 1664015 1766369 1898114 1820937 1452135 1091396 1080167 1350595 1543282
41543 1543282 1500541 1397399 1397954 1424911 1341676 1198700 1192888 1430133 1770225 1915506 1705716
41532 1705716 1335418 1170593 1306798 1456586 1360164 1129530 1029956 1086258 1127633 1113685
41522 1113685 1167765 1325972 1477075 1552712 1595329 1633401 1647244 1659792 1718900 1791189 1799297
41511 1799297 1751595 1717951 1703298 1662081 1601978 1554538 1486150 1359396 1234640 1192465 1218706
41500 1218706 1286715 1457485 1737125 1935396 1879879 1708145 1708467 1887190 1942041 1705482
41490 1705482 1385242 1266803 1353007 1429627 1383691 1318948 1370618 1500382 1537545 1423892
41480 1423892 1333903 1450233 1675259 1747417 1644353 1631146 1831333 2016824 1987147 1898667
41470 1898667 1974629 2107090 2047520 1837567 1732223 1795342 1878051 1919848 1961791 1921087 1678008
41459 1678008 1370975 1296797 1506274 1774132 1965016 2138622 2283757 2255828 2036990 1795456
41449 1795456 1632365 1503624 1412241 1423113 1466758 1395062 1257809 1254195 1392806 1492871
41439 1492871 1540372 1706912 1962123 2030618 1843075 1674911 1692291 1714126 1610860 1583399
41429 1583399 1784880 1974182 1864044 1587712 1491463 1618782 1723787 1710349 1749318 1954254
41419 1954254 2173099 2164953 1876289 1512704 1361745 1503046 1697549 1664608 1450707 1354214
41409 1354214 1488836 1659735 1721018 1774329 1885807 1891378 1695848 1528524 1635816 1885070
41399 1885070 1951844 1799722 1702215 1823629 2015780 2050260 1882814 1655705 1542116 1598970
41389 1598970 1715327 1732484 1646965 1617330 1728001 1858159 1858044 1743482 1628304 1573099 1596212
41378 1596212 1722546 1902171 1967595 1799311 1494085 1285540 1330698 1609513 1966159 2215725
41368 2215725 2283386 2255238 2221018 2113826 1854916 1607347 1644414 1939604 2148029 2085858
41358 2085858 1975027 2069281 2270446 2313718 2160196 1992238 1929261 1941195 1979471 2034643
41348 2034643 2089743 2114511 2088908 2009788 1932303 1979693 2190585 2390681 2389111 2269368 2263412
41337 2263412 2362965 2337277 2144443 1995314 1951010 1819465 1572365 1490728 1706792 1953892
41327 1953892 2002082 2005719 2150144 2278636 2194750 2055796 2110205 2267799 2287321 2203258 2212049
41316 2212049 2294051 2304461 2312500 2498593 2800099 2975898 2951180 2824133 2633087 2397234
41306 2397234 2275067 2385495 2570182 2615810 2592764 2675157 2763947 2639220 2379430 2256551
41296 2256551 2287949 2272962 2225018 2362680 2663379 2821172 2713768 2565221 2564699 2636380 2671593
41285 2671593 2699657 2741980 2765708 2859232 3174683 3588601 3683172 3220324 2453055 1842029
41275 1842029 1605575 1630832 1682637 1613580 1469943 1436658 1608028 1851302 2006124 2126641
41265 2126641 2338146 2540517 2515030 2300941 2186479 2287074 2392288 2314076 2159814 2139960
41255 2139960 2272824 2403530 2406546 2272253 2069516 1903428 1875631 2029601 2306693 2536952
41245 2536952 2528490 2278219 2056043 2095651 2222388 2064146 1663512 1505724 1788128 2078863
41235 2078863 1988985 1781164 1895197 2210747 2300064 2168140 2162367 2283716 2191699 1870276
41225 1870276 1706186 1840896 1983077 1983887 2087937 2420196 2668637 2525731 2113406 1752495
41215 1752495 1587399 1619767 1850575 2197825 2469203 2559730 2527987 2432740 2292794 2223555
41205 2223555 2365752 2643351 2830517 2871869 2888827 2891572 2784324 2638432 2619186 2639983
41195 2639983 2464622 2184427 2183355 2534118 2830859 2771771 2547170 2478968 2600243 2773354
41185 2773354 2938867 3066756 3093173 3042558 3007029 2939335 2707152 2386917 2222910 2268253
41175 2268253 2369845 2504800 2760468 2975429 2848255 2478098 2334711 2567219 2808554
41166 2808554 2822211 2848711 3077782 3260190 3165090 3017775 3129311 3403895 3537245 3448841
41156 3448841 3252813 3045780 2937623 3027114 3167555 3062263 2758490 2681722 2980731 3239545
41146 3239545 3096736 2757458 2596460 2630903 2707533 2849219 3067319 3162974 3065799 3053555
41136 3053555 3290456 3476552 3328443 3082625 3107525 3307573 3350854 3240521 3214999 3282149
41126 3282149 3283282 3252587 3308823 3345669 3218572 3091409 3214023 3484229 3596502 3507487
41116 3507487 3409547 3365601 3312759 3314410 3470753 3668079 3717399 3646752 3588027 3503081 3297874
41105 3297874 3072768 2982911 2984869 2983447 3071174 3341463 3614642 3637160 3435132 3230442 3142483
41094 3142483 3178242 3336977 3522406 3561585 3496350 3587527 3843556 3904069 3646945 3495226
41084 3495226 3758805 4083267 4010453 3714264 3646580 3762961 3690084 3438462 3340546 3416246
41074 3416246 3389533 3267116 3340531 3618340 3762153 3627663 3446488 3432890 3560534 3729942
41064 3729942 3852244 3818541 3668578 3670003 3930999 4116462 3911638 3571162 3575659 3905610
41054 3905610 4126258 4080257 4015698 4086278 4183660 4246311 4321561 4334888 4172119 3968356 3974364
41043 3974364 4177559 4363421 4466256 4550360 4563784 4437034 4303936 4316141 4387213 4404131
41033 4404131 4471652 4639265 4674535 4480434 4416848 4761227 5171065 5188173 4963926 4923496
41023 4923496 5015454 4928940 4795030 4976883 5339513 5424947 5239802 5200088 5381848 5476753
41013 5476753 5416584 5405884 5407001 5221727 5010044 5101084 5369371 5424750 5317243 5398157 5596700
41002 5596700 5539324 5299672 5302320 5542796 5635221 5574317 5690554 5900205 5803040 5511326
40992 5511326 5554201 5930597 6094716 5939734 5936505 6192403 6248075 5977412 5832653 5980504
40982 5980504 6024777 5834616 5841357 6226836 6576743 6635431 6682873 6866463 6849164 6424295
40972 6424295 5860214 5400655 5030827 4889224 5234116 5852621 6202977 6263223 6491196 6860030
40962 6860030 6807400 6305251 6052764 6342699 6639312 6585481 6528052 6695484 6745771 6530713
40952 6530713 6465746 6738268 6956489 6948976 7082154 7434171 7533804 7293859 7286125 7680745
40942 7680745 7870397 7612548 7546780 8005237 8283844 7773571 6944874 6519376 6464166 6472539
40932 6472539 6656782 7080339 7335292 7248991 7320359 7845472 8316756 8286961 8117924 8281179
40922 8281179 8614027 8827195 9045305 9323823 9355424 9129483 9118325 9399021 9450598 9193109
40912 9193109 9214042 9552229 9423298 8684019 8308343 8733519 9045629 8641138 8368574 8994667
40902 8994667 9786982 9795507 9442572 9616343 10147251 10387672 10438528 10657916 10776200 10569879
40892 10569879 10578813 11143212 11617556 11517333 11462510 11980961 12451247 12314913 12216131 12769982
40882 12769982 13331258 13213657 12985699 13281340 13509505 13100086 12824324 13428168 14145276
40873 14145276 14074939 13843799 14334177 14972669 14930239 14825123 15524679 16434022 16702335 16913966
40863 16913966 17810140 18605162 18425227 18109643 18672567 19369079 19293640 19388723 20670612
40854 20670612 22006021 22018283 21645908 22311786 23187421 22983285 22774924 24085557 25806279
40845 25806279 26183092 26223247 27754298 29751675 30229174 30161314 31657892 33840760 34641745
40836 34641745 35075444 37331132 40273939 41560617 42499862 45691634 49678194 51605947
40828 51605947 53262154 58091342 64161060 67250598 68944423 73546020 79132643 81341155
40820 81341155 83905601 93641406 106737045 114838696 123588524 143816608 158723880 125386027
40812 125386027 28169062 -86505564 -152693013 -153996672 -128563437 -112601778 -106027663
40805 -106027663 -95362146 -82394567 -76304941 -75210308 -71375516 -65342056 -62377442 -61352496
40797 -61352496 -57623416 -52234989 -49336412 -48131625 -45096184 -41078041 -39290674 -38887780
40789 -38887780 -36803147 -33719020 -32463367 -32443460 -30996302 -28558429 -27533721 -27526583 -26350800
40780 -26350800 -24451756 -23935063 -24346922 -23557541 -21837057 -21152906 -21313033 -20518237 -18960170
40771 -18960170 -18337647 -18474368 -17759697 -16353415 -15794042 -15966925 -15442698 -14301530 -13796600
40762 -13796600 -13753688 -13010322 -11872730 -11530069 -11627041 -10932194 -9745773 -9190633 -8892378
40753 -8892378 -7795422 -6337094 -5352654 -4132469 -2484548 -3274546 -9138737 -17404422
40745 -17404422 -22242161 -21823307 -19647633 -18681683 -18134727 -16788683 -15629388 -15535038 -15399243
40736 -15399243 -14320505 -13278468 -13095199 -12870259 -11924095 -11369655 -12256132 -13760097 -14574007
40727 -14574007 -14687288 -14616757 -14217761 -13391479 -12769905 -12675937 -12485951 -11858306 -11459831 -11678675
40717 -11678675 -11775885 -11155679 -10409367 -10281556 -10572761 -10797604 -10985170 -11154914 -10935383
40708 -10935383 -10344505 -10047775 -10269309 -10357608 -9946914 -9573066 -9599414 -9545381 -9090432 -8763856
40698 -8763856 -8976155 -9269150 -9183419 -9018129 -9091076 -9070542 -8690011 -8353005 -8390366 -8434602
40688 -8434602 -8135583 -7812609 -7819351 -7913202 -7796949 -7661468 -7693723 -7663259 -7454025 -7384374
40678 -7384374 -7573608 -7625391 -7342397 -7104740 -7156211 -7194315 -7049250 -7055195 -7337150 -7448238
40668 -7448238 -7149606 -6841945 -6786273 -6621082 -6121051 -5708310 -5692497 -5693342 -5363363 -5041237
40658 -5041237 -5131762 -5420121 -5529995 -5518797 -5544861 -5501311 -5426603 -5686758 -6288575 -6615036
40648 -6615036 -6327432 -5935093 -5974498 -6222149 -6247305 -6155437 -6209257 -6244968 -6048339 -5844033
40638 -5844033 -5867541 -5893100 -5691736 -5510537 -5603744 -5733555 -5621114 -5452187 -5463187 -5470333
40628 -5470333 -5278188 -5109906 -5167506 -5211255 -5031173 -4877240 -4966884 -5046902 -4916426 -4878980
40618 -4878980 -5155025 -5348294 -5077717 -4687087 -4713671 -5037227 -5164506 -5029151 -4924910 -4928682
40608 -4928682 -4931696 -4984482 -5122893 -5119165 -4853437 -4634257 -4716739 -4837930 -4681368 -4444692
40598 -4444692 -4452937 -4551213 -4409261 -4133182 -4047551 -4120823 -4107392 -4035967 -4089498 -4206444 -4220683
40587 -4220683 -4184031 -4180988 -4083880 -3850988 -3761769 -3973005 -4160724 -4004519 -3710282 -3649692
40577 -3649692 -3806133 -3980141 -4192557 -4449610 -4459367 -4051697 -3572307 -3415639 -3474003 -3467524
40567 -3467524 -3468367 -3644909 -3835085 -3843454 -3826214 -3927419 -3901287 -3577506 -3319904 -3498965 -3866267
40556 -3866267 -3978647 -3881705 -3836862 -3756091 -3493174 -3322778 -3504932 -3718699 -3569118 -3317420
40546 -3317420 -3430016 -3725668 -3704786 -3459904 -3491825 -3806333 -3950361 -3830279 -3777885 -3873849
40536 -3873849 -3865620 -3701689 -3551574 -3385565 -3103548 -2939052 -3142845 -3427039 -3341904 -3032520
40526 -3032520 -2972921 -3134352 -3127705 -3014467 -3207799 -3650519 -3859578 -3756957 -3706704 -3739279
40516 -3739279 -3503584 -3026120 -2764937 -2830009 -2868414 -2802470 -2950777 -3303722 -3413252 -3169017
40506 -3169017 -2986084 -3038341 -2989744 -2697495 -2511805 -2623209 -2734439 -2644269 -2572197 -2645157
40496 -2645157 -2633261 -2462911 -2437679 -2670370 -2830963 -2745685 -2719379 -2946650 -3104254 -2884921
40486 -2884921 -2505077 -2331641 -2373096 -2455198 -2560868 -2700158 -2743059 -2640094 -2549598 -2562834
40476 -2562834 -2571408 -2527096 -2523613 -2535485 -2430165 -2299896 -2365683 -2494249 -2308592 -1889444 -1810884
40465 -1810884 -2268099 -2715770 -2670090 -2376087 -2323439 -2518147 -2620813 -2496035 -2276041 -2106066
40455 -2106066 -2079813 -2214517 -2327321 -2187229 -1891512 -1774473 -1866480 -1845060 -1630193 -1567585
40445 -1567585 -1845599 -2190584 -2357443 -2474519 -2663697 -2760874 -2674593 -2598349 -2609902 -2493112
40435 -2493112 -2221142 -2155635 -2457726 -2756335 -2742235 -2641557 -2721861 -2774391 -2530749 -2202136
40425 -2202136 -2125001 -2189032 -2088740 -1875651 -1804353 -1855948 -1846542 -1814085 -1894238 -1986490 -1917000
40414 -1917000 -1774627 -1754212 -1833060 -1897769 -1991439 -2144597 -2188689 -2040312 -1931224 -2045171
40404 -2045171 -2181337 -2107118 -1974223 -2018149 -2109345 -2008638 -1832811 -1837480 -1937892 -1883409
40394 -1883409 -1739551 -1753359 -1875736 -1863670 -1759606 -1826078 -2051614 -2139441 -1986950 -1812360
40384 -1812360 -1787021 -1849036 -1892648 -1880294 -1774588 -1586081 -1455421 -1492255 -1605573 -1671256
40374 -1671256 -1735844 -1852496 -1882669 -1705099 -1457983 -1316624 -1206396 -1018138 -921491 -1128786
40364 -1128786 -1491135 -1672406 -1618470 -1531860 -1486315 -1395444 -1280132 -1246388 -1256217 -1202179 -1137992
40353 -1137992 -1178978 -1279289 -1365610 -1549394 -1913094 -2231486 -2227802 -1977515 -1739443 -1541534
40343 -1541534 -1296885 -1173981 -1412488 -1843831 -2025630 -1838864 -1570765 -1428285 -1352681 -1304779
40333 -1304779 -1343920 -1405398 -1369677 -1374466 -1686374 -2224404 -2582009 -2584253 -2461489 -2393695 -2257407
40322 -2257407 -1962428 -1699681 -1659147 -1747861 -1764514 -1666765 -1526289 -1381812 -1261390 -1230098
40312 -1230098 -1325880 -1524855 -1784650 -2035579 -2169799 -2157875 -2111729 -2100104 -2007941 -1753815
40302 -1753815 -1518810 -1524491 -1688028 -1757320 -1703093 -1703314 -1807617 -1898413 -1932905 -1952386 -1912397
40291 -1912397 -1781336 -1729847 -1910174 -2114586 -1995391 -1589714 -1283855 -1279479 -1439761 -1635104
40281 -1635104 -1853144 -1957221 -1752211 -1373431 -1232032 -1464049 -1772785 -1914641 -1986022 -2096455
40271 -2096455 -2107897 -1893208 -1579973 -1352660 -1229318 -1170895 -1194190 -1252135 -1212035 -1069447
40261 -1069447 -996725 -1095941 -1288282 -1491620 -1693234 -1816059 -1756299 -1590361 -1496554 -1457590
40251 -1457590 -1323129 -1164212 -1208361 -1382867 -1332181 -1006845 -816639 -1001841 -1247876 -1193300
40241 -1193300 -978534 -968813 -1192397 -1385077 -1412708 -1348649 -1259573 -1172526 -1155951 -1227084 -1281203
40230 -1281203 -1277772 -1353575 -1570112 -1707624 -1539597 -1202961 -1062202 -1254420 -1558056 -1684725
40220 -1684725 -1551634 -1288736 -1101687 -1120689 -1298382 -1451666 -1430683 -1234229 -988652 -872080
40210 -872080 -999674 -1273995 -1413494 -1267103 -1017027 -899911 -855299 -711766 -594903 -771542
40200 -771542 -1126147 -1222384 -952405 -705984 -761660 -916573 -914971 -857601 -922120 -1005681 -947404
40189 -947404 -849939 -882160 -967716 -950316 -894710 -956291 -1092846 -1147109 -1098119 -1031106 -983836
40178 -983836 -996959 -1166625 -1465201 -1657633 -1578714 -1363760 -1253017 -1309650 -1455412 -1602881
40168 -1602881 -1621414 -1383996 -1000655 -786969 -845107 -916913 -818736 -739452 -883327 -1096877
40158 -1096877 -1126070 -1004056 -904361 -838327 -781040 -859339 -1103713 -1245136 -1093566 -890732
40148 -890732 -920672 -997797 -773853 -373175 -240406 -452296 -662351 -701883 -767822 -971109
40138 -971109 -1126714 -1095074 -985033 -916088 -870536 -857792 -952360 -1099170 -1129675 -1024531 -931271
40127 -931271 -899279 -835679 -732188 -682308 -665881 -579722 -489518 -571958 -784072 -871914 -743672
40116 -743672 -563556 -454389 -399785 -462140 -758477 -1144060 -1256979 -999597 -674361 -523404
40106 -523404 -446806 -320476 -262733 -373145 -493823 -476088 -449787 -580027 -762450 -818876
40096 -818876 -820947 -945904 -1137565 -1180874 -1038355 -874943 -800796 -798773 -861615 -1001077 -1142578
40085 -1142578 -1178366 -1106776 -992366 -852381 -725539 -755150 -994896 -1196416 -1042018 -593602
40075 -593602 -265105 -294853 -477926 -519818 -428651 -385273 -401960 -346519 -226405 -209650 -354729
40064 -354729 -518908 -587991 -629995 -734306 -834819 -810969 -675501 -543990 -476626 -455269
40054 -455269 -461346 -467249 -406794 -279018 -228011 -368430 -568680 -585649 -408914 -276467 -319074
40043 -319074 -395454 -358186 -283960 -308847 -393718 -410787 -355809 -324204 -349926 -398396 -460466
40032 -460466 -537700 -582240 -550705 -478877 -430064 -417993 -436407 -499117 -597222 -684662 -740462
40021 -740462 -762498 -693534 -486579 -257739 -199576 -305469 -381879 -385271 -492474 -729781 -817949
40010 -817949 -579423 -244925 -116380 -148861 -132479 -81235 -133552 -233956 -241023 -222640 -313849
39999 -313849 -394852 -264749 -53406 -83039 -352222 -534926 -500964 -461229 -542781 -587701 -481683
39988 -481683 -353372 -310322 -262635 -149535 -77907 -88035 -32300 143911 228431 45491 -249301
39977 -249301 -381287 -329150 -282610 -312353 -278092 -60735 241497 383821 213718 -159431
39967 -159431 -451210 -490522 -369036 -245266 -109089 111184 305320 274971 52114 -106894
39957 -106894 -73849 18746 48046 91327 247809 436952 494248 375180 189825 99813 199254
39946 199254 417605 546946 454217 237727 82925 35035 34826 69975 113013 26428 -232302
39935 -232302 -409413 -242452 118159 288915 210571 169525 264642 261522 76348 5879 274083
39924 274083 662594 819747 700166 490009 304549 169942 138516 221716 319128 352945
39914 352945 362864 378796 347348 271048 255468 327951 380138 376075 428169 563360 605552 422943
39902 422943 141489 -2910 97161 394074 754010 1006751 1079069 1098098 1198029 1259184
39892 1259184 1078742 767465 665377 849989 1063123 1160986 1265557 1399480 1378312 1197425
39882 1197425 1123695 1235486 1270193 1117785 1050102 1226051 1387172 1329263 1274780 1451946
39872 1451946 1683249 1751121 1821477 2115938 2471636 2618174 2620818 2682539 2778460 2841046 3018946
39861 3018946 3392035 3729357 3885410 4103708 4567466 5041638 5354964 5775954 6456463
39852 6456463 7047413 7400933 7923949 8391194 7200488 3201641 -2063828 -5465826 -5736136
39843 -5736136 -4482884 -3595749 -3150438 -2449343 -1642337 -1209549 -843860 -21813 979489
39834 979489 1683873 2382484 3290299 3227866 626316 -4083836 -8352460 -10146927 -9785224
39825 -9785224 -8821156 -8083923 -7456155 -6839504 -6422686 -6192984 -5870561 -5361773 -4873443
39816 -4873443 -4569342 -4418494 -4374104 -4422247 -4430929 -4202455 -3754521 -3370429 -3277186 -3389614
39806 -3389614 -3450844 -3332375 -3110783 -2918929 -2826638 -2842702 -2926931 -2976233 -2884500 -2672996
39796 -2672996 -2506979 -2513063 -2607038 -2576914 -2338438 -2046948 -1935016 -2072534 -2302522 -2400022
39786 -2400022 -2293900 -2130480 -2093959 -2177873 -2207245 -2092930 -1942748 -1857817 -1758494 -1549789
39776 -1549789 -1346053 -1332573 -1454077 -1458944 -1266863 -1086073 -1102273 -1232828 -1293530 -1265822
39766 -1265822 -1261502 -1301943 -1271342 -1086955 -834389 -703654 -798054 -1012797 -1132354 -1069050
39756 -1069050 -957082 -967103 -1094325 -1206944 -1236341 -1210073 -1147761 -1049779 -960842 -928191 -924667
39745 -924667 -920648 -978616 -1142472 -1292814 -1280635 -1161511 -1109199 -1128963 -1075819 -956739 -969279
39734 -969279 -1179797 -1392289 -1442509 -1429792 -1527755 -1716165 -1835879 -1802448 -1651699 -1462942
39724 -1462942 -1332324 -1337377 -1435951 -1468577 -1337847 -1125134 -968466 -890306 -816713 -725937 -710507
39713 -710507 -880851 -1210939 -1495693 -1527074 -1336966 -1169916 -1162633 -1182224 -1076675 -920162
39703 -920162 -847104 -809231 -722524 -703791 -877761 -1069210 -1018874 -830726 -842888 -1085267 -1249405
39692 -1249405 -1209344 -1171216 -1247637 -1295245 -1277482 -1367914 -1541319 -1488837 -1152243 -927428 -1064813
39681 -1064813 -1257779 -1153576 -915945 -895869 -1042778 -1065457 -949924 -887773 -859966 -718983
39671 -718983 -564778 -621242 -814098 -870356 -788510 -816502 -981805 -1041339 -930906 -881913 -1004680
39660 -1004680 -1102250 -1029366 -939553 -1013190 -1176209 -1260194 -1261051 -1267772 -1260837 -1146266 -930992
39649 -930992 -740298 -672669 -702633 -728553 -691429 -630143 -600842 -574214 -496446 -433188 -507271
39638 -507271 -670901 -722769 -617845 -553252 -639883 -721850 -681536 -669749 -797961 -848960 -611468
39627 -611468 -302053 -273813 -437993 -393623 -78203 142935 64376 -100939 -155492 -223877
39617 -223877 -441597 -647362 -617732 -404402 -227383 -171238 -166180 -176124 -251494 -429222 -661385
39606 -661385 -825946 -809764 -637417 -480401 -449963 -446925 -343613 -223369 -248236 -361715
39596 -361715 -360869 -233260 -171827 -250856 -332925 -322216 -274891 -227677 -146570 -72442 -85345 -109349
39584 -109349 -5780 133458 83715 -96635 -95491 126445 208204 -56909 -389976 -458080
39574 -458080 -318573 -191109 -81888 83023 205112 202112 239910 461230 658696 545147
39564 545147 215557 14666 45124 126547 165176 232759 309571 271873 152834 130622 221773
39553 221773 247774 154333 113396 230151 370082 379419 299959 255760 256730 212914 59347
39542 59347 -195406 -482780 -713906 -861565 -983430 -1101748 -1131995 -1044253 -1008883 -1210400
39532 -1210400 -1574066 -1864555 -2003434 -2072259 -2050918 -1836472 -1539328 -1456607 -1656304 -1862811
39522 -1862811 -1881212 -1861812 -1970710 -2071956 -1994525 -1896597 -2042814 -2344313 -2455374 -2290321
39512 -2290321 -2127935 -2168080 -2265402 -2196574 -1970194 -1751332 -1639509 -1634771 -1699361 -1750499 -1691256
39501 -1691256 -1535680 -1421440 -1440342 -1552342 -1709778 -1925683 -2136638 -2153006 -1891599 -1548856
39491 -1548856 -1382805 -1398942 -1412985 -1360841 -1357469 -1461764 -1565296 -1553109 -1445335 -1342733
39481 -1342733 -1324777 -1406323 -1504006 -1473958 -1301940 -1207281 -1380858 -1646039 -1611439 -1200625
39471 -1200625 -789180 -713472 -870999 -964369 -938289 -957882 -1090415 -1243424 -1352133 -1419612
39461 -1419612 -1404205 -1251582 -1026148 -856232 -764650 -693633 -666276 -764055 -957575 -1119243
39451 -1119243 -1208360 -1294834 -1390682 -1408999 -1317460 -1195577 -1103170 -1010188 -887915 -760327 -642933
39440 -642933 -539759 -510244 -608740 -736850 -703424 -485160 -292320 -303779 -458366 -592119
39430 -592119 -665695 -741939 -824176 -853448 -836526 -855122 -933977 -988342 -940890 -835624 -779726
39419 -779726 -790567 -769165 -655099 -542304 -558836 -668694 -712089 -642272 -579673 -593201 -590616
39408 -590616 -515057 -487460 -612477 -780994 -836554 -823098 -875408 -960257 -944587 -855699 -842744
39397 -842744 -910558 -919953 -845769 -814212 -874407 -941909 -979694 -1025289 -1029541 -897980 -721663
39386 -721663 -728361 -943268 -1118138 -1063328 -841495 -582049 -341928 -218448 -333654 -586081
39376 -586081 -668820 -483742 -306032 -374166 -548811 -579958 -498535 -494590 -565486 -552455 -440302
39365 -440302 -379780 -446948 -568246 -662066 -711067 -722999 -730330 -784905 -873008 -914304 -914592 -996096
39353 -996096 -1182040 -1296281 -1202033 -993360 -806996 -609115 -361238 -240825 -433049 -779466
39343 -779466 -903194 -686630 -402632 -336778 -467993 -594064 -634912 -703254 -908614 -1164102
39333 -1164102 -1247362 -1087600 -916767 -998738 -1245766 -1311914 -1087897 -844704 -786293 -741076
39323 -741076 -501134 -228144 -242962 -559807 -900783 -1071327 -1070122 -920559 -662393 -462580
39313 -462580 -486358 -676888 -858188 -996872 -1151058 -1239751 -1125054 -888634 -766649 -814879
39303 -814879 -875805 -865842 -844160 -796287 -621094 -377233 -285762 -410828 -560920 -586880 -567374
39292 -567374 -608333 -657630 -632711 -572323 -552647 -578409 -635011 -720951 -764711 -653276 -424325
39281 -424325 -294346 -398109 -608656 -709165 -651946 -554992 -513210 -508697 -482564 -431019 -416542
39270 -416542 -480669 -553869 -519182 -399847 -381710 -558419 -756236 -745643 -544270 -360399
39260 -360399 -313835 -379544 -527684 -718649 -819954 -748674 -654952 -731774 -877971 -817365 -550027
39249 -550027 -388675 -488604 -630949 -585261 -429582 -364144 -425113 -543450 -704420 -881877
39239 -881877 -961887 -890528 -778097 -721288 -647182 -479544 -344005 -433717 -727378 -987399
39229 -987399 -1018731 -834514 -594509 -459247 -481136 -576151 -608782 -523863 -378690 -267931
39219 -267931 -266528 -402949 -600115 -686406 -581242 -430795 -426350 -533460 -565892 -484500 -412816
39208 -412816 -369348 -229768 -1551 101699 -44711 -301928 -482904 -565054 -595873 -563567
39198 -563567 -473264 -404284 -388072 -353158 -263172 -179557 -139801 -122223 -157648 -287767 -390796
39187 -390796 -293651 -114077 -202428 -619079 -959787 -884358 -551827 -309710 -207271 -96499
39177 -96499 -3053 -65658 -233364 -340642 -407164 -564461 -733394 -677689 -387107 -134634
39167 -134634 -103079 -184755 -217806 -215660 -262874 -341789 -382789 -392778 -424655 -462101 -424391 -291212
39155 -291212 -166720 -172813 -283201 -329223 -218186 -77388 -86174 -226503 -338437 -372561 -400436
39144 -400436 -398300 -257746 -48322 -18879 -240166 -472571 -506646 -414645 -332119 -229238 -85391
39133 -85391 -69195 -305112 -619412 -750152 -681606 -556169 -391287 -129700 128367 196024
39123 196024 60800 -121380 -243177 -289968 -246719 -139648 -95810 -191583 -323697 -383708
39113 -383708 -435802 -539028 -545322 -321264 -48585 -21601 -217927 -347330 -278394 -142941
39103 -142941 -50530 18754 41059 -56478 -202444 -230028 -147409 -126731 -201823 -218887 -124486
39092 -124486 -55222 -74840 -55390 86923 238917 274360 223485 168282 117917 73335 83712
39081 83712 155644 205913 159591 14112 -202554 -436091 -580229 -570115 -485787 -435011 -373183
39070 -373183 -200815 4855 59970 -39129 -112545 -80703 -27729 28053 171659 347586 341319
39059 341319 108690 -112684 -148414 -122990 -197652 -281315 -206077 -39708 -436 -137915 -291595
39048 -291595 -326635 -249780 -114038 43247 160140 169448 92277 35940 66244 132283 150241
39037 150241 125157 134579 187235 166521 -13201 -230553 -256718 -49002 184994 273046 290520
39026 290520 390019 553751 656566 668691 635986 540997 350072 138410 11702 -41062
39016 -41062 -74602 -48230 78475 201167 211967 202023 311551 452490 419720 230980 107357
39005 107357 138108 211074 266183 367500 513008 612205 666620 741427 761346 595591 356269
38994 356269 324475 527413 670084 567420 377375 307224 343208 388459 438009 493691 509667
38983 509667 530848 687510 954927 1118541 1071688 947899 875432 821311 774003 847444 1075797
38972 1075797 1308829 1429288 1481205 1491800 1393232 1228125 1185476 1287997 1276302 966328
38962 966328 511883 155744 -70471 -241208 -352797 -425075 -578560 -812774 -895461 -678236
38952 -678236 -361019 -245758 -370246 -559435 -683655 -687163 -519471 -237203 -48457 -76897
38942 -76897 -190960 -205779 -118495 -14390 95198 199811 231618 227313 354292 610968 709266
38931 709266 454455 49266 -186926 -210161 -148687 -18829 188181 313375 224896 91818
38921 91818 185961 493249 763618 857946 814560 672503 476552 374626 461118 580242
38911 580242 508436 274132 87920 25178 -6511 -47877 -52501 -22887 15911 129698 375554
38900 375554 639682 752359 716171 662677 646983 635998 619998 585878 475130 320518 308930
38889 308930 535391 808723 885979 791736 717431 714345 691367 629487 596026 603128 615855
38878 615855 641150 682942 694172 676176 710028 805177 872416 916666 1043034 1196331 1177912
38867 1177912 1036687 1102179 1443528 1661547 1479282 1182222 1154424 1314679 1371471 1320496
38857 1320496 1298458 1238974 1085852 1066094 1321199 1545292 1441822 1256473 1362516 1596508
38847 1596508 1558466 1326956 1280107 1405212 1408226 1353178 1545403 1876510 1931227 1699869
38837 1699869 1567131 1626950 1622633 1546266 1672861 1984532 2164608 2186012 2316693 2533543
38827 2533543 2540316 2386309 2447014 2756694 2977143 3053903 3263328 3575339 3631666 3412759
38817 3412759 3275104 3291357 3222934 3149517 3393187 3812494 3959613 3943679 4275848 4839616
38807 4839616 4979785 4694945 4700507 5153106 5418776 5341082 5566168 6268727 6761299 6802198
38797 6802198 7064443 7807392 8365125 8536550 9130903 10434487 11537891 11979447 12569096
38788 12569096 13689771 14439476 14546372 15297444 17237491 19064099 20485280 23375974
38780 23375974 27026710 24919027 11308889 -9471916 -25331353 -29152152 -25160004 -21316823
38772 -21316823 -19868343 -18288854 -15755745 -14123995 -13942164 -13603504 -12405964 -11439049
38764 -11439049 -11185245 -10697758 -9592691 -8803411 -8785287 -8675292 -7876386 -7063113 -6934270
38755 -6934270 -7117890 -6985769 -6626467 -6381040 -6165924 -5834073 -5608958 -5658223 -5715214 -5526100
38745 -5526100 -5257643 -5144162 -5118509 -5053115 -4994330 -4939984 -4748832 -4457303 -4323591 -4392494
38735 -4392494 -4385455 -4181250 -4027188 -4096927 -4205606 -4154026 -4008561 -3846406 -3567773 -3185980
38725 -3185980 -2987715 -3144593 -3412694 -3465960 -3329574 -3255600 -3329052 -3405608 -3333458 -3089225
38715 -3089225 -2783448 -2608789 -2663185 -2787181 -2743618 -2583957 -2608549 -2896721 -3128832 -3005293
38705 -3005293 -2624103 -2292388 -2156060 -2180070 -2322943 -2532419 -2667997 -2601405 -2356883 -2066922
38695 -2066922 -1857374 -1824500 -1999901 -2253212 -2350237 -2212241 -2022490 -1981511 -2050402 -2042499
38685 -2042499 -1899846 -1768665 -1817157 -2035805 -2213966 -2120379 -1747826 -1350325 -1171721 -1190134
38675 -1190134 -1230710 -1249270 -1328840 -1448740 -1485407 -1446328 -1468218 -1547050 -1518459 -1378588 -1358259
38664 -1358259 -1544111 -1678403 -1527585 -1237696 -1096645 -1116745 -1113557 -1077897 -1179196 -1429118
38654 -1429118 -1598371 -1505932 -1218977 -943309 -848339 -987690 -1249171 -1396577 -1305690 -1141629
38644 -1141629 -1152376 -1317612 -1391862 -1288121 -1193230 -1252058 -1362087 -1388955 -1386103 -1447612 -1501704
38633 -1501704 -1431791 -1294785 -1236953 -1265075 -1273969 -1242715 -1225448 -1194163 -1090131 -1014885 -1153699
38622 -1153699 -1478165 -1729714 -1755746 -1662466 -1563126 -1404787 -1181036 -1088558 -1251189 -1453660
38612 -1453660 -1409033 -1190271 -1127108 -1323440 -1547675 -1599520 -1525454 -1441311 -1394628 -1457378 -1697836
38601 -1697836 -1967154 -1964321 -1647674 -1354665 -1355590 -1505203 -1525368 -1423941 -1389756 -1436623 -1432571
38590 -1432571 -1384153 -1410660 -1482555 -1450948 -1321629 -1244516 -1222120 -1088690 -833515 -696052
38580 -696052 -827934 -1060447 -1147495 -1092281 -1082803 -1197136 -1320771 -1326955 -1231472 -1155970 -1182759
38569 -1182759 -1262740 -1279800 -1211150 -1165454 -1212782 -1257131 -1183097 -1060624 -1056037 -1175727 -1261875
38558 -1261875 -1232639 -1159003 -1102130 -1057532 -1078833 -1250913 -1482889 -1536214 -1352523 -1155125
38548 -1155125 -1108032 -1080513 -918813 -760941 -845348 -1124202 -1317302 -1303010 -1225454 -1214334
38538 -1214334 -1202437 -1065710 -803095 -542129 -461605 -688485 -1144700 -1518315 -1538712 -1280098
38528 -1280098 -1045023 -961433 -887446 -732381 -634382 -710860 -837706 -841301 -757653 -715934 -683593
38517 -683593 -542014 -346927 -282027 -360951 -397558 -313255 -265737 -384191 -558898 -622881 -598356
38506 -598356 -608702 -654654 -653872 -634054 -694577 -796121 -782162 -641286 -572991 -719506 -972034
38495 -972034 -1131702 -1146602 -1090491 -1007841 -898591 -788435 -701809 -618405 -557641 -635992 -904163
38484 -904163 -1178450 -1203790 -985777 -796890 -815714 -914502 -878145 -697764 -533490 -475369
38474 -475369 -466615 -425636 -338773 -241463 -181660 -194354 -259394 -306499 -313742 -363357 -526608 -727002
38462 -727002 -818293 -793296 -802581 -930012 -1052809 -1000465 -784224 -577297 -502977 -535818 -597453
38451 -597453 -644559 -643005 -564397 -472826 -523656 -770847 -1029668 -1060796 -880524 -748040 -811202
38440 -811202 -911149 -832031 -618899 -491618 -508151 -498551 -342778 -139943 -33277 -10554 11982
38429 11982 12609 -88805 -259979 -375334 -395656 -398411 -419362 -400885 -342466 -362091 -507161
38418 -507161 -614831 -505695 -259905 -142564 -263261 -463824 -566190 -570805 -543483 -465698
38408 -465698 -324999 -236245 -311474 -471084 -537610 -477455 -399316 -348795 -281519 -232623 -314116
38397 -314116 -501855 -615929 -587409 -560774 -628367 -651025 -499360 -309327 -288760 -380433 -353559
38386 -353559 -179803 -74662 -151833 -265507 -271333 -257576 -397121 -686402 -947892 -1028884
38376 -1028884 -914888 -700146 -523360 -497393 -629714 -809699 -899667 -834097 -640433 -407809
38366 -407809 -241363 -196969 -239804 -297021 -351549 -442160 -571035 -660819 -617549 -412094 -112118
38355 -112118 138732 213705 132705 60943 109252 185789 141836 7128 -64980 -56100 -103699
38344 -103699 -244661 -334825 -300299 -279822 -382220 -456768 -287265 75433 362325 430880
38334 430880 389409 378244 381633 296232 78360 -214446 -451359 -486005 -277833 19109 173105
38323 173105 115260 -3049 -12299 97014 228280 316593 346940 308037 215040 141682 150797
38312 150797 208883 234638 221451 252140 395331 634809 891246 1065621 1080960 950211
38302 950211 801720 772391 870223 996029 1082130 1126920 1114813 1033141 984789 1128734 1437846
38291 1437846 1661403 1638441 1526605 1594384 1894642 2274376 2590887 2768068 2769399 2703687
38281 2703687 2827169 3222547 3620775 3798248 3958546 4362602 4818731 5096625 5622207
38272 5622207 6832152 7700124 6041110 1099049 -4867136 -8577238 -9010557 -7842678
38264 -7842678 -6941927 -6589684 -6243525 -5808512 -5482989 -5119049 -4499836 -3860153 -3535078
38255 -3535078 -3387433 -3106130 -2807516 -2807197 -2988583 -2942150 -2641224 -2470814 -2595836 -2757073
38245 -2757073 -2738747 -2634835 -2565354 -2476379 -2337271 -2255550 -2283697 -2337178 -2378090 -2456798 -2514274
38234 -2514274 -2393570 -2137965 -2027385 -2180466 -2338017 -2213743 -1888688 -1665146 -1647267 -1668909
38224 -1668909 -1585374 -1448405 -1374127 -1374776 -1382967 -1374078 -1394528 -1474718 -1566945 -1608297 -1619778 -1676690
38212 -1676690 -1778696 -1835000 -1809813 -1786448 -1827289 -1870080 -1851336 -1835320 -1901670 -1983688 -1954777
38201 -1954777 -1822085 -1701739 -1647607 -1635656 -1668515 -1747324 -1775416 -1649186 -1438314 -1336128
38191 -1336128 -1428965 -1622922 -1769266 -1751304 -1512326 -1148910 -913947 -950505 -1079136 -1039828
38181 -1039828 -870915 -804482 -852727 -818850 -718626 -824433 -1187502 -1464445 -1399695 -1179976
38171 -1179976 -1088761 -1077836 -951491 -758229 -694273 -764258 -834842 -918711 -1110831 -1314922
38161 -1314922 -1327778 -1162721 -1014647 -930355 -802839 -685703 -783476 -1061299 -1188384 -1011629
38151 -1011629 -797288 -808898 -905101 -819132 -636205 -661905 -909161 -1063834 -979843 -887270
38141 -887270 -991102 -1128986 -1028281 -730339 -522104 -523196 -576710 -551981 -535160 -636276
38131 -636276 -776562 -805996 -738996 -727837 -835733 -965857 -1017220 -996706 -947136 -863463 -740124
38120 -740124 -635335 -618209 -684081 -777931 -871956 -955255 -967106 -830523 -578569 -369955 -320219
38109 -320219 -373499 -418310 -475293 -636905 -829363 -817836 -541221 -280586 -324659 -579141
38099 -579141 -727817 -718271 -807928 -1095549 -1301516 -1159347 -792625 -509440 -404674 -386423
38089 -386423 -449200 -657081 -927724 -1085307 -1106140 -1097273 -1059097 -896486 -657564 -521691
38079 -521691 -521893 -510355 -449811 -503996 -744209 -977824 -999863 -855378 -728472 -703630 -746228
38068 -746228 -794111 -763002 -580045 -318844 -197542 -345945 -661887 -956123 -1119752 -1100252
38058 -1100252 -884635 -604480 -489594 -594978 -729364 -768935 -843873 -1045311 -1159471 -952195
38048 -952195 -569472 -358985 -373018 -350363 -170881 -28635 -102897 -307121 -447145 -437819
38038 -437819 -298968 -113688 -42977 -196113 -423876 -430338 -169147 64402 35150 -140864
38028 -140864 -245034 -289704 -393183 -483407 -401014 -231542 -252584 -523855 -774496 -782731 -666070
38017 -666070 -669996 -830368 -1009879 -1158379 -1334198 -1495803 -1476775 -1232618 -967550 -905410
38007 -905410 -1006402 -1020483 -802671 -487150 -333284 -453738 -722228 -924891 -969751 -930699
37997 -930699 -900800 -865887 -773999 -669389 -640981 -653395 -579831 -438425 -427356 -631497 -860269
37986 -860269 -924214 -918177 -1025686 -1170986 -1134149 -946963 -870212 -963373 -978806 -765253 -499755
37975 -499755 -389559 -387586 -362658 -339284 -390657 -476282 -564060 -734725 -969980 -1020987 -737062
37964 -737062 -382772 -345700 -612928 -823294 -798466 -723378 -770009 -824048 -700943 -439621
37954 -439621 -245461 -244678 -394841 -584060 -757003 -952952 -1208688 -1414784 -1360700 -1001718
37944 -1001718 -580743 -359313 -318550 -280209 -229148 -299459 -479400 -566975 -458108 -295329
37934 -295329 -274088 -431877 -654416 -772388 -659985 -373413 -171088 -242047 -444939 -498830
37924 -498830 -396099 -388067 -557185 -676528 -571056 -367854 -268920 -292181 -369088 -493528
37914 -493528 -613717 -556308 -249181 99915 216855 65557 -188754 -410670 -552031 -589902
37904 -589902 -565670 -603457 -741285 -819752 -686586 -441126 -316201 -365899 -429955 -383655 -273329
37893 -273329 -206024 -234839 -362748 -546819 -679206 -658937 -515063 -397017 -416736 -534323
37883 -534323 -609721 -549566 -405870 -328023 -395269 -519521 -570228 -560467 -601192 -688600 -692603
37872 -692603 -587148 -520290 -574680 -622927 -543361 -437327 -478248 -647960 -780313 -793912 -737676
37861 -737676 -668748 -621677 -638776 -699330 -681921 -531693 -396546 -448599 -634407 -764171 -790631
37850 -790631 -817555 -872168 -871969 -815525 -807374 -861396 -858155 -748682 -643484 -637378 -679780 -679268
37838 -679268 -618711 -513216 -369215 -242347 -229897 -347651 -505095 -641498 -781031 -912864
37828 -912864 -943854 -846624 -746949 -772457 -893583 -994946 -1030068 -1025844 -1006332 -1000045 -1060593
37817 -1060593 -1186981 -1272915 -1229999 -1121719 -1074666 -1083680 -1018623 -829349 -631696 -545720 -536753
37806 -536753 -489485 -384864 -312112 -317897 -340241 -327555 -341361 -461141 -632195 -711083 -661115
37795 -661115 -601760 -635766 -721021 -762707 -746206 -712632 -677596 -648140 -650625 -663237 -596113 -434161
37783 -434161 -322572 -387487 -534081 -565098 -455916 -355983 -346446 -376846 -446629 -647717 -955201
37772 -955201 -1146912 -1050475 -766819 -540630 -476251 -472262 -396209 -254645 -197599 -357505 -650665
37761 -650665 -786621 -580868 -222684 -75910 -221043 -393727 -413840 -433346 -630220 -882682
37751 -882682 -959946 -877073 -813444 -778023 -624536 -371079 -239524 -330942 -480184 -511874 -461666
37740 -461666 -446546 -465618 -450450 -410257 -405539 -436296 -456210 -461366 -486567 -540289 -603674 -667585
37728 -667585 -719129 -718166 -636814 -505200 -384579 -318171 -329168 -418389 -521459 -519893 -366090
37717 -366090 -175413 -125105 -262903 -467703 -595118 -607808 -562884 -533239 -560794 -634065 -680672
37706 -680672 -622678 -475437 -361971 -391187 -538761 -677170 -702122 -599883 -423250 -255922
37696 -255922 -182457 -225347 -305601 -324196 -287553 -282442 -316764 -286013 -150740 -43045 -92154
37685 -92154 -221535 -260402 -217257 -273647 -491581 -702106 -756879 -730914 -750541 -749299 -575912
37674 -575912 -288432 -147321 -290919 -563841 -716132 -658552 -469154 -261801 -137994 -186944
37664 -186944 -412901 -673181 -775105 -658988 -455652 -361320 -468403 -696295 -865622 -864904
37654 -864904 -765312 -740086 -853230 -982967 -993165 -910797 -852829 -834217 -772237 -669453 -647666
37643 -647666 -744488 -796184 -631633 -324393 -135741 -209337 -412019 -501945 -389986 -193873
37633 -193873 -76722 -97291 -225287 -434882 -700993 -907753 -875712 -573972 -240008 -151056
37623 -151056 -286743 -367928 -254182 -125414 -182523 -352095 -455635 -520062 -677814 -839330
37613 -839330 -756542 -438653 -227993 -346367 -585323 -608265 -398122 -220234 -244260 -390326
37603 -390326 -503554 -515896 -439548 -323240 -225942 -162827 -97006 -37688 -80263 -261631 -445577
37592 -445577 -469514 -356992 -263731 -255504 -274361 -295578 -363293 -458409 -470242 -341704 -148166
37581 -148166 -6845 15612 -89665 -263285 -377856 -348756 -241928 -177668 -156948 -109452
37571 -109452 -79558 -188909 -408699 -557900 -566922 -553404 -576629 -524245 -350342 -225039 -289828
37560 -289828 -429304 -463111 -420893 -426545 -434607 -321884 -165009 -165014 -307973 -354001 -205869 -58658
37548 -58658 -97144 -241695 -315064 -306093 -326116 -410315 -505335 -589365 -673367 -716895 -657166 -510811
37536 -510811 -355714 -219479 -71975 67316 100306 -33542 -259170 -422272 -429977 -322263
37526 -322263 -217715 -199816 -254779 -319743 -376137 -457211 -555562 -583556 -482079 -332341 -280440
37515 -280440 -355212 -442241 -455268 -445225 -489329 -552001 -540065 -444973 -333967 -230780 -113039
37504 -113039 -17730 -26618 -125343 -200493 -225598 -326451 -577694 -841451 -918032 -780375 -555889
37493 -555889 -359183 -263047 -341380 -568988 -736389 -657197 -437360 -339607 -388709 -343578 -100851
37482 -100851 123401 119850 -33136 -158459 -241561 -322518 -319640 -190532 -116154 -257203 -429736
37471 -429736 -315767 45145 269861 149345 -128972 -324433 -426669 -495341 -483901 -383999
37461 -383999 -328229 -367203 -330577 -110834 83558 1691 -247326 -340970 -229809 -186520 -359079
37450 -359079 -556820 -565449 -436156 -331953 -276371 -207564 -137532 -98491 -42788 46520 45913
37439 45913 -133116 -340919 -362652 -244610 -223560 -338540 -365504 -203183 -71089 -170445
37429 -170445 -353216 -346103 -173285 -108957 -259631 -438660 -478347 -449026 -488006 -581582 -631734
37418 -631734 -626849 -627845 -647999 -645872 -602823 -533380 -444912 -345251 -268945 -250041 -282945 -332095
37406 -332095 -355114 -313969 -220110 -178159 -298667 -524993 -637775 -510175 -285003 -193356
37396 -193356 -245555 -232987 -39833 177564 187610 -24608 -257596 -355606 -364868 -397993 -440840
37385 -440840 -399262 -297462 -283438 -398925 -485370 -416399 -300575 -307116 -390285 -382842 -303173
37374 -303173 -330527 -473414 -520399 -390425 -283309 -354791 -466184 -426987 -291613 -212702
37364 -212702 -164985 -47634 67622 46718 -33432 13034 146901 137075 -69263 -259819 -276246
37353 -276246 -190207 -105648 -6994 106300 129683 16679 -112838 -136041 -83618 -45699 -32547
37342 -32547 -13435 3707 5338 -2673 -51997 -189488 -355237 -409852 -340138 -300323 -375543 -449997
37330 -449997 -408740 -326317 -325201 -371029 -359419 -311277 -323359 -388192 -412811 -375195 -332909 -317686
37318 -317686 -340014 -441217 -601847 -651100 -438535 -86548 93772 -36625 -305494 -473295
37308 -473295 -474140 -371614 -223492 -82828 -25840 -66751 -102608 -37367 80575 134483 121062
37297 121062 151251 265004 350766 303956 191303 168753 263035 333679 269195 122654 -10420
37286 -10420 -162712 -425741 -744274 -920852 -857735 -680840 -567345 -551078 -576870 -650153
37276 -650153 -801319 -943140 -912322 -688588 -468615 -452955 -609726 -718060 -632444 -442827
37266 -442827 -351721 -436028 -583222 -654896 -645288 -641336 -681513 -723057 -723123 -680280 -604938 -515190
37254 -515190 -451491 -424071 -360479 -193859 5642 92564 41574 -35661 -77736 -135440 -216870
37243 -216870 -241871 -226118 -327385 -574744 -724302 -583274 -350095 -384985 -699359 -936364
37233 -936364 -874535 -694942 -656917 -727422 -694282 -510675 -341891 -314949 -377282 -419367 -427516
37222 -427516 -458894 -515271 -515809 -420979 -336446 -407913 -595627 -656579 -436033 -96505 70655
37211 70655 9618 -86030 -106835 -170242 -365357 -553677 -576902 -530458 -636714 -900918 -1086575
37200 -1086575 -1043640 -889523 -800137 -758844 -627166 -392171 -210829 -200434 -282216 -287956 -175286
37189 -175286 -67042 -77655 -172254 -247036 -298831 -418533 -610450 -727215 -657940 -506042
37179 -506042 -466232 -550256 -562580 -375235 -109670 22017 -36584 -187981 -347507 -481816
37169 -481816 -528555 -436397 -297807 -288616 -417076 -468913 -293531 -27807 85555 8513 -107926
37158 -107926 -177684 -240902 -298809 -282965 -223416 -267591 -450259 -591566 -531907 -355208 -257542
37147 -257542 -276483 -281747 -188788 -57594 6753 -49517 -226728 -474025 -682501 -751094 -687911
37136 -687911 -607966 -614654 -700140 -757943 -684215 -488155 -307562 -274881 -363435 -429207 -413286
37125 -413286 -405663 -470648 -528913 -498359 -437301 -420862 -374267 -199731 -8480 -22609 -242199
37114 -242199 -405683 -333768 -141005 -24131 3552 46399 116432 140341 115392 114915 154494
37103 154494 170996 138078 99798 70417 -4752 -142698 -248520 -218562 -91030 -26459 -124923
37092 -124923 -304208 -390323 -312502 -170894 -104669 -135175 -179501 -191777 -216179 -280861 -319717
37081 -319717 -276149 -238246 -352876 -587336 -696262 -509443 -170821 24551 -15192 -124329
37071 -124329 -162013 -177202 -241548 -287376 -232514 -145607 -142249 -194470 -186216 -100564 -13406 43784
37059 43784 70441 7711 -167297 -311781 -278571 -167501 -191178 -316094 -309582 -160833 -136967
37048 -136967 -320542 -414970 -201043 93979 133392 -48555 -188746 -247456 -403084 -685232
37038 -685232 -914047 -980646 -937768 -822804 -615546 -373954 -214371 -147096 -88292 -13700
37028 -13700 49461 131409 253715 320346 258332 187615 239786 298792 183051 9518 59386
37017 59386 302285 396433 208854 4169 18788 153895 222255 218019 184306 70705 -94415
37006 -94415 -113715 98502 326217 330865 165656 37969 7576 -2368 -29301 -83655 -220864
36995 -220864 -431542 -558686 -475934 -255524 -33652 170674 366371 457332 370437 207771
36985 207771 103422 29357 -89924 -176775 -107955 54671 135096 95670 42718 21713 -24121
36974 -24121 -119661 -234979 -367771 -508085 -559004 -440838 -246185 -147020 -168620 -191580 -154195
36963 -154195 -109285 -87960 -46242 35648 107731 121862 79041 14692 -8509 63355 182749
36952 182749 206912 73012 -106757 -209693 -270362 -374122 -478071 -481610 -411366 -394963 -491710
36941 -491710 -656788 -807302 -821880 -582877 -163949 132353 102392 -84004 -126128 -13704
36931 -13704 25403 -73449 -139199 -91442 -69016 -172272 -300103 -325342 -256110 -153312 -45700
36920 -45700 13375 -42282 -160942 -191702 -89248 26061 50551 6875 -57813 -131945 -153954
36909 -153954 -25210 217534 373640 300237 64268 -173679 -323021 -375606 -368870 -377286 -441980
36898 -441980 -493396 -448420 -365067 -352785 -355388 -229789 -48241 -70476 -335741 -528955 -394498
36887 -394498 -77902 109190 87876 -7643 -97947 -193046 -246599 -174608 11357 222558 394245
36876 394245 462354 333674 23756 -255650 -306892 -188655 -100717 -94267 -72629 -28445 -66218
36865 -66218 -178313 -203966 -77925 46779 21607 -74932 -50908 134711 326857 362390 224280
36854 224280 26206 -90683 -56112 68826 123355 1827 -198166 -246812 -60916 142358
36844 142358 80950 -209788 -373834 -180239 166636 301173 175331 59470 104176 151852
36834 151852 52626 -67168 -19247 124753 142157 16832 -36335 87977 224995 198538
36824 198538 79870 55239 135468 169455 123908 160936 363168 540396 469675 240593 154489
36813 154489 285564 366061 186975 -97134 -216982 -170143 -140127 -147496 -39314 198621
36803 198621 368201 347475 256158 254286 319541 302606 106291 -231649 -543094 -610520 -362265
36792 -362265 2794 206704 203457 157692 136784 31525 -186335 -352473 -348898 -264929 -212672
36781 -212672 -156642 -49880 21159 -28594 -129155 -170055 -158532 -145148 -106571 -25341 23196
36770 23196 -11677 -51648 -16019 52666 97827 162023 271194 336106 305122 280286 327544
36759 327544 315686 136258 -49698 -20126 145911 171656 2728 -138729 -122850 -76027
36749 -76027 -112650 -126956 30382 316525 551430 617081 519334 327017 129037 11180
36739 11180 14733 118794 265169 383457 415375 356784 265513 206473 218997 341355 583090
36728 583090 834789 909849 757141 544045 439124 405406 317876 187936 121825 122608 100630
36717 100630 55718 87968 213260 299989 228622 31915 -153226 -229582 -231417 -288221 -461729
36706 -461729 -620720 -572106 -334803 -145047 -136687 -188042 -185902 -241590 -461685 -672023 -610380
36695 -610380 -295055 28614 230574 351253 381706 249738 15596 -150261 -192438 -176983
36685 -176983 -96885 102241 310783 317356 118814 -54971 -72656 -50039 -119490 -255699 -390888
36674 -390888 -511750 -578400 -524627 -393849 -303906 -244278 -106045 53748 17525 -243924
36664 -243924 -470822 -487316 -448650 -550369 -688315 -621875 -352214 -120932 -76883 -120767
36654 -120767 -93412 -4387 -16116 -206448 -385634 -259212 158015 436752 228875 -245404
36644 -245404 -474833 -355917 -269459 -436947 -593142 -456387 -174150 -50123 -94506 -128413
36634 -128413 -138114 -227238 -342350 -334132 -233010 -217013 -323798 -392227 -293663 -84918 62600
36623 62600 8890 -221016 -391369 -260681 90275 290415 146937 -100094 -146661 -55289
36613 -55289 -94508 -301545 -466441 -465592 -368306 -266125 -207166 -238423 -311059 -225462 103282
36602 103282 409240 369077 74892 -77832 42005 160789 77413 -30617 82748 353275
36592 353275 513247 432684 205837 -10945 -133311 -172527 -186568 -174320 -36455 267468
36582 267468 556970 576788 314858 26611 -80844 -41262 21984 77363 147987 221776 270628
36571 270628 272245 187336 17690 -111344 -64141 99978 191949 177045 203708 309693 325495
36560 325495 176613 66836 191097 425786 491657 314752 51977 -148359 -235369 -183224
36550 -183224 -19112 114711 97538 6081 -1270 53137 -4164 -206918 -372792 -360778 -241378
36539 -241378 -144585 -89489 -61032 -124072 -322121 -534907 -574986 -403493 -144134 93245
36529 93245 284472 389214 320101 85931 -130672 -145154 14494 157494 180873 171909 237513
36518 237513 325603 291676 100303 -123699 -249434 -281181 -313788 -383652 -413886 -315936 -112871
36507 -112871 74953 168973 221444 338862 540486 735033 831447 827277 779097 729438 687732
36496 687732 654399 632531 620300 606117 577210 542532 543154 604179 665271 618997 460281 327870
36484 327870 323358 365198 337195 304945 405575 559971 529653 302399 175374 328458 532085
36473 532085 470140 186722 -18944 -31088 5000 -4313 23397 123831 167429 60172 -90477
36462 -90477 -111301 29781 224788 357692 377957 303503 198290 112011 33190 -55265 -97322
36451 -97322 -22228 127571 218676 183358 75203 -23655 -61080 2541 153678 268713 226861
36440 226861 96286 72129 199253 304589 259653 153300 111137 92950 4544 -106288
36430 -106288 -123967 -57696 -2947 30433 86210 101610 -29957 -240559 -336428 -305375 -359641
36419 -359641 -568138 -660890 -397845 22463 187354 38752 -74088 60320 216742 121950
36409 121950 -108381 -159075 9664 146167 111536 47070 122793 328352 556683 720183
36399 720183 736413 561805 302554 156644 192034 297519 366091 376673 290541 68896
36389 68896 -168255 -223825 -131773 -143809 -314134 -371640 -164090 51390 -6387 -218150 -308524
36378 -308524 -296754 -368912 -469092 -393834 -194138 -99747 -91367 61436 336112 433556 287306
36367 287306 205545 362021 495201 320409 -37524 -252952 -230245 -102584 35491 169439
36357 169439 243013 196756 84739 21419 50727 140135 230579 235272 89999 -133715 -271535
36346 -271535 -273984 -250915 -267108 -249637 -163498 -103952 -109979 -50377 172023 435334 544916
36335 544916 449791 211837 -95747 -336036 -315097 -17813 278430 304306 125354 2633
36325 2633 19261 42213 2485 2158 122123 279618 327579 217464 48906 1375 182059
36314 182059 490008 687671 663963 548891 502798 503553 452123 375577 361979 364930 257451
36303 257451 63673 -31728 73741 280022 431371 470277 418238 310440 196619 130346
36293 130346 112818 99914 91947 157787 329780 522062 613350 599793 604962 708891 814710
36282 814710 760397 557515 416049 478098 620494 616201 415934 151683 -69446 -217821
36272 -217821 -231582 -45363 255957 483096 579123 662325 802842 911197 890491 752990
36262 752990 549786 334305 221766 314489 531217 680242 720718 752924 748780 569005
36252 569005 298180 234332 411542 465252 181824 -131881 -104415 151708 282288 258668
36242 258668 315918 465941 482315 333146 256942 374988 535319 596119 603671 623425 613897
36231 613897 542187 461270 424773 448267 547033 680262 702454 532121 316852 250713 291412
36220 291412 271969 228209 344819 588084 684276 526027 346064 387679 606120 793530
36210 793530 822307 675223 405887 171876 156619 345861 497351 432946 266096 248925
36200 248925 466260 756572 887673 767835 527158 405727 516034 728981 849934 858671
36190 858671 874729 929926 917547 771972 575858 462861 494243 630531 754726 753128 650603
36179 650603 613201 724430 834392 759265 559113 458375 535721 657421 695728 659171
36169 659171 617206 628679 725010 847730 850344 685715 522846 539820 687543 815171 917064
36158 917064 1048733 1103123 927648 609032 392157 353953 393144 480506 645628 770566
36148 770566 712618 613270 748122 1052205 1150635 930203 723169 795660 985572 1022235
36138 1022235 914437 817131 752654 677169 638158 671575 692610 651162 652920 779528 928138
36127 928138 971747 950096 963088 985357 918377 750135 567647 467069 489850 580527 618700
36116 618700 582352 608967 748850 781868 535696 272810 390867 775588 893674 596539
36106 596539 361214 547254 866637 894617 730772 766042 1046724 1267607 1259456 1136894
36096 1136894 1032841 968412 948331 969276 966930 906408 860890 884720 914193 903164 920455
36085 920455 999665 1050464 1037619 1068222 1169133 1176963 1009257 848754 881084 1036392 1170906
36074 1170906 1311804 1522715 1705284 1738205 1656211 1521163 1304222 1064234 1008850 1165846
36064 1165846 1237309 1034244 814611 890166 1120785 1147266 952590 825078 886787 1019389
36054 1019389 1167512 1355198 1456899 1310749 1053659 1017393 1264242 1504336 1503402 1328567
36044 1328567 1171045 1154204 1332666 1659511 1924382 1917642 1690909 1505871 1520386 1658169
36034 1658169 1765983 1763594 1662600 1551653 1526309 1557974 1525570 1447508 1519959 1808279 2087875
36023 2087875 2148650 2063395 1974366 1833965 1593807 1440066 1550534 1779195 1872556 1856734
36013 1856734 1917194 2029104 2018183 1886426 1777533 1704117 1590062 1497504 1542068 1671037
36003 1671037 1775336 1906045 2129056 2312107 2328350 2303267 2364092 2345479 2099931 1893319
35993 1893319 2053107 2378816 2390456 2079422 1910073 2090700 2341064 2436284 2506167 2668081
35983 2668081 2772341 2685730 2522413 2446915 2483895 2609405 2805795 2966699 2959481 2828447
35973 2828447 2762854 2859741 3062933 3272662 3364790 3226390 2951288 2838275 3000466 3182980
35963 3182980 3174635 3116555 3140310 3059072 2792383 2723273 3144967 3683559 3818988 3679359
35953 3679359 3722600 3920839 3936883 3868500 4074773 4422419 4462131 4257692 4290156 4600817
35943 4600817 4777208 4750066 4851403 5100768 5189135 5165141 5380895 5761812 5891151 5797911
35933 5797911 5881324 6110707 6139978 6136145 6556162 7151333 7210056 6789551 6647765 6941285
35923 6941285 7128078 7192577 7711307 8587037 9044362 9073372 9504301 10434764 11069679 11386472
35913 11386472 12308312 13828236 14747437 14841655 15410953 16962954 18327607 18932308 19842033
35904 19842033 21523876 22888475 23755608 25665966 28796176 31212266 33115824 37554183
35896 37554183 42930561 39052724 17658039 -14238176 -38540132 -44812616 -39207157 -33409468
35888 -33409468 -31130647 -29120190 -25925226 -23531244 -22570410 -21363562 -19449846 -18188840
35880 -18188840 -17823804 -17040434 -15575393 -14620046 -14418525 -13809471 -12472646 -11532155 -11494268
35871 -11494268 -11437135 -10759592 -10105541 -9981522 -9875318 -9358593 -8859529 -8731891 -8572180
35862 -8572180 -8039501 -7505760 -7368394 -7421397 -7347164 -7223191 -7177843 -7078549 -6850799 -6637408
35852 -6637408 -6451527 -6126035 -5717545 -5493277 -5455996 -5359447 -5205755 -5215408 -5319410 -5234645
35842 -5234645 -5023766 -4991447 -5043867 -4794160 -4323994 -4156990 -4382959 -4489154 -4219967 -3948818
35832 -3948818 -3979855 -4092008 -4039554 -3958529 -3993421 -3995253 -3856771 -3728215 -3680793 -3567038 -3401594
35821 -3401594 -3445793 -3719215 -3870765 -3746670 -3637792 -3723814 -3729442 -3439077 -3137480 -3172606
35811 -3172606 -3403536 -3453999 -3279996 -3143912 -3184146 -3296972 -3342840 -3263320 -3075384 -2872900
35801 -2872900 -2741856 -2634151 -2470446 -2354561 -2458998 -2705482 -2835275 -2799374 -2765024 -2730887
35791 -2730887 -2517524 -2197258 -2115612 -2353764 -2569888 -2541694 -2475136 -2579244 -2730449 -2800826
35781 -2800826 -2929539 -3165971 -3203442 -2836134 -2392955 -2316573 -2514000 -2523774 -2204431 -1883486
35771 -1883486 -1870523 -2133701 -2452587 -2651021 -2673991 -2602868 -2575482 -2581778 -2431329 -2050793
35761 -2050793 -1681590 -1597898 -1728071 -1759068 -1566844 -1357566 -1384463 -1656770 -1945119 -2013186
35751 -2013186 -1851256 -1688326 -1723220 -1879371 -1945295 -1908561 -1941515 -2058537 -2051407 -1838460
35741 -1838460 -1617051 -1546568 -1522409 -1411843 -1280646 -1214520 -1141309 -1028496 -1042319 -1277836
35731 -1277836 -1515257 -1501034 -1329383 -1284982 -1411950 -1495884 -1411193 -1256025 -1178092 -1252927
35721 -1252927 -1487479 -1775762 -1912104 -1813681 -1660600 -1653717 -1724439 -1672189 -1498557 -1380278
35711 -1380278 -1365043 -1329363 -1227800 -1164866 -1198378 -1260444 -1305169 -1368813 -1447954 -1468771 -1422056
35700 -1422056 -1400142 -1452215 -1507915 -1487870 -1407329 -1338998 -1338873 -1418209 -1520446 -1526456 -1361947
35689 -1361947 -1112562 -964743 -1012958 -1170838 -1280786 -1271724 -1200210 -1162500 -1181795 -1195195 -1158705
35678 -1158705 -1116879 -1113842 -1097443 -1026149 -1022573 -1244755 -1597266 -1764334 -1590578 -1252975 -988000
35667 -988000 -842805 -790062 -868093 -1046434 -1144826 -1078624 -1022676 -1132165 -1265787 -1225319 -1121891
35656 -1121891 -1212958 -1465269 -1588030 -1470532 -1289925 -1175607 -1058195 -906132 -839866 -911467
35646 -911467 -996408 -1010375 -1034723 -1122199 -1173900 -1132606 -1111910 -1182446 -1196908 -1012230 -760859
35635 -760859 -700079 -867275 -1078419 -1217692 -1319914 -1371973 -1258217 -985932 -789171 -870476
$$ [...]
##END NTUPLES=NMR SPECTRUM
##END=
