##TITLE=31Pdec_LR-724-B2-OC
 CDCl3, 24 sc
 2.10.2020
##JCAMPDX= 6.0         $$ Bruker NMR JCAMP-DX V2.0
##DATA TYPE= NMR SPECTRUM
##DATA CLASS= NTUPLES
##ORIGIN= UXNMR, Bruker Analytische Messtechnik GmbH
##OWNER= root
$$ XWIN-NMR		Version 3.5
$$ Fri Oct  2 10:14:29 2020 Russian Standard Time (UT+4h)  she@DPX200
##.OBSERVE FREQUENCY= 81.013821
##.OBSERVE NUCLEUS= ^31P
##.ACQUISITION MODE= SIMULTANEOUS
##.ACQUISITION SCHEME= undefined
##.AVERAGES= 24
##.DIGITISER RES= 17
##SPECTROMETER/DATA SYSTEM= spect
##.PULSE SEQUENCE= zgpg30
##.SOLVENT NAME= CDCl3
##.SHIFT REFERENCE= (INTERNAL, CDCl3, 0, 182.463)
##AUDIT TRAIL= $$ (NUMBER, WHEN, WHO, WHERE, WHAT)
$$ ##TITLE= Audit trail, XWIN-NMR		Version 3.5
$$ ##JCAMPDX= 5.01
$$ ##ORIGIN= Bruker BioSpin GmbH
$$ ##OWNER= she
$$ F:/spectra/data/she/nmr/P31/1/pdata/1/auditp.txt
$$ ##AUDIT TRAIL=  $$ (NUMBER, WHEN, WHO, WHERE, WHAT)
(   1,<2020-10-02 10:13:42.65 +0400>,<she>,<DPX200>,
      <created by zg, POWCHK disabled, PULCHK disabled
       configuration hash MD5:
       00 E9 B6 7A A2 85 ED C7 34 08 36 98 17 FE 4E 26
       data hash MD5: 32K
       67 C6 60 CA FB E3 3C 2F 50 B7 9A 70 8D 37 AD 1F>)
(   2,<2020-10-02 10:13:44.65 +0400>,<she>,<DPX200>,
      <Start of raw data processing
       efp BC_mod = 2 LB = 1 FT_mod = 6 PKNL = 1 PHC0 = -2740.847 PHC1 = 68.00137 SI = 64K 
       data hash MD5: 64K
       2C 31 38 C0 D3 E3 08 81 CC 06 BC 3E 9C 09 A6 E4>)
(   3,<2020-10-02 10:13:59.51 +0400>,<she>,<DPX200>,
      <pk PHC0 = 0.8174804 PHC1 = 0 
       data hash MD5: 64K
       44 2E 47 93 CA 8C 9F 5A 9B 1E CF 10 1C 16 81 6D>)
$$ ##END=
$$ 
$$ hash MD5
$$ B4 F7 72 EF A9 FC 8F 9D BD 48 96 F2 94 FE DA 60
##$RELAX= 
##$RELAX= 
##$RELAX= 
##$RELAX= 
##$RELAX= 
##$RELAX= 
##$RELAX= 
##$RELAX= 
$$ Bruker specific parameters
$$ --------------------------
##$DU= <F:/spectra>
##$EXPNO= 1
##$NAME= <P31>
##$PROCNO= 1
##$TYPE= <nmr>
##$USER= <she>
##$AMP= (0..31)
100 100 100 100 100 100 100 100 100 100 100 100 100 100 100 100 100 100 
100 100 100 100 100 100 100 100 100 100 100 100 100 100 
##$AQSEQ= 0
##$AQ_mod= 1
##$AUNM= <au_zg>
##$AUTOPOS= <>
##$BF1= 81.014009
##$BF2= 200.13
##$BF3= 200.13
##$BF4= 200.13
##$BF5= 200.13
##$BF6= 200.13
##$BF7= 200.13
##$BF8= 200.13
##$BYTORDA= 1
##$CFDGTYP= 0
##$CFRGTYP= 5
##$CHEMSTR= <none>
##$CNST= (0..31)
1 1 145 1 1 1 1 1 1 1 1 1 1 1 1 1 1 1 1 1 1 1 1 1 1 1 1 1 1 1 1 1 
##$CPDPRG= <waltz16>
##$CPDPRG1= <>
##$CPDPRG2= <waltz16>
##$CPDPRG3= <>
##$CPDPRG4= <mlev>
##$CPDPRG5= <mlev>
##$CPDPRG6= <mlev>
##$CPDPRG7= <mlev>
##$CPDPRG8= <mlev>
##$CPDPRGB= <>
##$CPDPRGT= <>
##$D= (0..31)
0 1 0 0 0 0 0 0 0 0 0 0.03 2e-05 3e-06 0 0 0 0 0 0 0 0 0 0 0 0 0 0 0 0 
0 0 
##$DATE= 1601619222
##$DBL= (0..7)
120 120 120 11 120 120 24 19 
##$DBP= (0..7)
150 150 150 150 150 150 150 150 
##$DBP07= 0
##$DBPNAM0= <>
##$DBPNAM1= <>
##$DBPNAM2= <>
##$DBPNAM3= <>
##$DBPNAM4= <>
##$DBPNAM5= <>
##$DBPNAM6= <>
##$DBPNAM7= <>
##$DBPOAL= (0..7)
0.5 0.5 0.5 0.5 0.5 0.5 0.5 0.5 
##$DBPOFFS= (0..7)
$$ [...]
##$SUBNAM2= <"">
##$SUBNAM3= <"">
##$SUBNAM4= <"">
##$SUBNAM5= <"">
##$SUBNAM6= <"">
##$SUBNAM7= <"">
##$SUBNAM8= <"">
##$SUBNAM9= <"">
##$SW= 369.568048894756
##$SWIBOX= (0..15)
0 1 3 0 0 0 0 0 0 0 0 0 0 0 0 0 
##$SW_h= 29940.119760479
##$TD= 32768
##$TD0= 1
##$TE= 0
##$TE2= 300
##$TE3= 300
##$TEG= 300
##$TL= (0..7)
0 120 53 12 22 120 120 120 
##$TP= (0..7)
150 150 150 150 150 150 150 150 
##$TP07= 0
##$TPNAME0= <>
##$TPNAME1= <>
##$TPNAME2= <>
##$TPNAME3= <>
##$TPNAME4= <>
##$TPNAME5= <>
##$TPNAME6= <>
##$TPNAME7= <>
##$TPOAL= (0..7)
0.5 0.5 0.5 0.5 0.5 0.5 0.5 0.5 
##$TPOFFS= (0..7)
0 0 0 0 0 0 0 0 
##$TUNHIN= 0
##$TUNHOUT= 0
##$TUNXOUT= 0
##$USERA1= <user>
##$USERA2= <user>
##$USERA3= <user>
##$USERA4= <user>
##$USERA5= <user>
##$V9= 5
##$VALIST= <valist>
##$VCLIST= <CCCCCCCCCCCCCCC>
##$VD= 0
##$VDLIST= <DDDDDDDDDDDDDDD>
##$VPLIST= <PPPPPPPPPPPPPPP>
##$VTLIST= <TTTTTTTTTTTTTTT>
##$WBST= 1024
##$WBSW= 4
##$XGAIN= (0..3)
0 0 0 0 
##$XL= 0
##$YL= 0
##$YMAX_a= 31600
##$YMIN_a= -27356
##$ZGOPTNS= <>
##$ZL1= 120
##$ZL2= 120
##$ZL3= 120
##$ZL4= 120
##$ABSF1= 0
##$ABSF2= 0
##$ABSG= 0
##$ABSL= 0
##$ALPHA= 0
##$AQORDER= 0
##$ASSFAC= 0
##$ASSFACI= 0
##$ASSFACX= 0
##$ASSWID= 0
##$AUNMP= <proc_1d>
##$AZFE= 0.1
##$AZFW= 0.5
##$BCFW= 0
##$BC_mod= 2
##$BYTORDP= 0
##$COROFFS= 0
##$CY= -3
##$DATMOD= 1
##$DC= 0
##$DFILT= <>
##$DTYPP= 0
##$F1P= 0
##$F2P= 0
##$FCOR= 1
##$FTSIZE= 65536
##$FT_mod= 6
##$GAMMA= 0
##$GB= 0
##$INTBC= 1
##$INTSCL= 5.30512e-09
##$ISEN= 30
##$LB= 1
##$LEV0= 0
##$LPBIN= 0
##$MAXI= 10000
##$MC2= 0
##$MEAN= 0
##$ME_mod= 0
##$MI= 50
##$NCOEF= 0
##$NC_proc= -4
##$NLEV= 6
##$NOISF1= 182.463
##$NOISF2= 159.3651
##$NSP= 0
##$NTH_PI= 0
##$NZP= 0
##$OFFSET= 182.463
##$PC= 4
##$PHC0= -2740.03
##$PHC1= 68.00137
##$PH_mod= 1
##$PKNL= yes
##$PPARMOD= 0
##$PSCAL= 0
##$PSIGN= 0
##$REVERSE= no
##$SF= 81.0140089999434
##$SI= 65536
##$SIGF1= 159.3651
##$SIGF2= -187.1042
##$SINO= 113.3802
##$SIOLD= 16384
##$SREGLST= <1H.CDCl3>
##$SSB= 0
##$STSI= 65536
##$STSR= 0
##$SW_p= 29940.119760479
##$SYMM= 0
##$S_DEV= 0
##$TDeff= 32768
##$TDoff= 0
##$TI= <>
##$TILT= no
##$TM1= 0
##$TM2= 0
##$TOPLEV= 0
##$USERP1= <user>
##$USERP2= <user>
##$USERP3= <user>
##$USERP4= <user>
##$USERP5= <user>
##$WDW= 1
##$XDIM= 65536
##$YMAX_p= 404496549
##$YMIN_p= -2316557
$$ End of Bruker specific parameters
$$ ---------------------------------
##NTUPLES= NMR SPECTRUM
##VAR_NAME=  FREQUENCY,     SPECTRUM/REAL,   SPECTRUM/IMAG
##SYMBOL=    X,             R,               I
##VAR_TYPE=  INDEPENDENT,   DEPENDENT,       DEPENDENT
##VAR_FORM=  AFFN,          ASDF,            ASDF
##VAR_DIM=   65536,         65536,           65536
##UNITS=     HZ,            ARBITRARY UNITS, ARBITRARY UNITS
##FACTOR=    0.456856943014862, 1,           1
##FIRST=     14782.0589164792, 0,            0
##LAST=      -15158.0608439998, 0,           0
##MIN=       -15158.0608439998, -2316557,    0
##MAX=       14782.0589164792, 404496549,    0
$$ Real data points
##PAGE= N=1
##DATA TABLE= (X++(R..R)), XYDATA
$$ [...]
$$ plain form
43798 258475 517103 578225 416147 421835 833546 1228222 1016848 316220 -144048 27163
43788 27163 458558 609686 400202 107056 -63072 -121505 -201129 -427145 -751827 -897117
43778 -897117 -645233 -192556 16474 -162260 -442100 -566313 -593007 -599590 -430621 7688
43768 7688 441135 530759 358120 304022 495884 670107 604495 420886 367588 503157 707856
43757 707856 851530 830693 575525 165827 -161456 -281161 -379042 -688609 -1066375 -1077807
43747 -1077807 -583682 -17432 100901 -209545 -467043 -368953 -111970 -24042 -95845 -42147
43737 -42147 264696 595347 618671 265991 -200948 -451178 -380968 -160600 -30884 -100054
43727 -100054 -327261 -606773 -793105 -717737 -331672 145148 349402 145724 -188582 -253974
$$ packed form
43798B58475K58628O1122j62078N688M11711L94676k11374p00628m60268J71211
43788B7163M31395J51128k09484k93146j70128n8433p9624k26016l24682j45290
43778h97117K51884M52677K09030j78734k79840j24213k6694o583J68969M38309
43768G688M33447Q9624j72639n4098J91862J74223o5612j83609n3298J35569K04699
43757G07856J43674k0837k55168m09698l27283j19705r7881l09567l77766j1432
43747a077807M94125N66250J18333l10446k57498R8090K56983Q7928p1803N3698
43737d2147L06843L30651K3324l52680m66939k50230P0210K20368J29716o9170
43727a00054k27207k79512j86332P5368L86065M76820K04254k03678l34306o5392
$$ plain form
43717 -253974 8329 250038 156841 -145218 -262525 -87000 37702 -170042 -447095 -305032
43707 -305032 241646 640772 578722 404303 537499 796374 703075 247496 -111334 -124544
43697 -124544 29088 214439 540106 934998 971179 412170 -346122 -694384 -506419 -164336
43687 -164336 -19967 -74902 -125959 -29366 158466 204942 -61345 -479605 -674302 -531272
43677 -531272 -364933 -477365 -763710 -950160 -1010901 -1070124 -1044663 -726148 -185952 204805
43667 204805 198834 -107027 -498260 -865292 -1138315 -1199864 -990804 -626300 -338986 -327732
43657 -327732 -620605 -998694 -1103242 -756574 -181961 201373 202432 -11614 -181172 -220397
43647 -220397 -201552 -192116 -182488 -151896 -163706 -342653 -692836 -970531 -876145 -409810 94957
$$ packed form
43717b53974K62303K41709r3197l02059j17307J75525J24702k07744k77053J42063
43707c05032N46678L99126o2050j74419J33196K58875r3299m55579l58830j3210
43697a24544J53632J85351L25667L94892L6181n59009p58292l48262J87965L42083
43687a64336J44369n4935n1057R6593J87832M6476k66287m18260j94697J43030
43677e31272J66339j12432k86345j86450o0741n9223K5461L18515N40196L90757
43667B04805n971l05861l91233l67032k73023o1549K09060L64504K87314J1254
43657c27732k92873l78089j04548L46668N74613L83334J059k14046j69558l9225
43647b20397J8845R436R628L0592j1810j78947l50183k77695R4386M66335N04767
$$ plain form
43636 94957 336039 290926 63898 -278732 -587347 -587019 -196444 271367 467850 432185 411918
43625 411918 413031 249843 -41694 -189979 -87044 107204 280155 482793 681675 698125
43615 698125 501432 305128 245216 182664 -35389 -296786 -348767 -84784 381448 820695
43605 820695 1019938 930317 711682 520683 302054 -30737 -294320 -223490 52939 97846
43595 97846 -190119 -410249 -308052 -185454 -366035 -601524 -429732 90674 452114 419419
43585 419419 261528 255898 329358 271160 19462 -349247 -685587 -762771 -443680 67804
43575 67804 365655 324807 230313 320052 433907 288948 -98939 -488718 -758963 -930103
43565 -930103 -941267 -689694 -285073 -1 87340 165755 315748 298062 -100960 -678859
$$ packed form
43636I4957K41082m5113k27028l42630l08615L28L90575M67811J96483l5665k0267
43625D11918J113j63188k91537j48285J02935J94248J72951K02638J98882J6450
43615F98125j96693j96304n9912o2552k18053k61397n1981K63983M66232M39247
43605H20695J99243q9621k18635j90999k18629l32791k63583P0830K76429M4907
43595I7846k87965k20130J02197J22598j80581k35489J71792N20406L61440l2695
43585D19419j57891n630P3460n8198k51698l68709l36340p7184L19091N11484
43575F7804K97851m0848r4494Q9739J13855j44959l87887l89779k70245j71140
43565i30103j1164K51573M04621K85072Q7341P8415J49993j7686l99022n77899
$$ plain form
43555 -678859 -1004993 -932075 -701219 -547276 -419296 -170259 142884 297219 195686 3242
43545 3242 -46282 61877 99597 -93527 -343045 -333009 -70455 57365 -200488 -604872
43535 -604872 -785680 -739552 -678621 -578895 -295854 -24864 -135602 -506777 -546871 -39609
43525 -39609 521569 672285 557202 454130 221473 -303373 -761259 -709135 -343931 -206431
43515 -206431 -332964 -291544 29465 268011 231435 140214 159454 181458 167173 252025 416137
43504 416137 469549 436503 522432 642033 458762 -19012 -387252 -503107 -640657 -829701
43494 -829701 -667100 -97232 232988 -131986 -700952 -713837 -201852 197584 222916 198170
43484 198170 370345 558513 486832 113892 -383231 -723435 -695158 -422593 -327741 -620534
$$ packed form
43555f78859l26134P2918K30856J53943J27980K49037L13143J54335j01533j92444
43545C242m9524J08159L7720j93124k49518J0036K62554J27820k57853m04384
43535f04872j80808M6128O0931R9726K83041K70990j10738l71175m0094N07262
43525c9609N61178J50716j15083j03072k32657n24846m57886N2124L65204J37500
43515b06431j26533M1420L21009K38546l6576r1221J9240K2004j4285Q4852J64112
43504D16137N3412l3046Q5929J19601j83271m77774l68240j15855j37550j89044
43494h29701J62601N69868L30220l64974n68966j2885N11985L99436K5332k4746
43484A98170J72175J88168p1681l72940m97123l40204K8277K72565R4852k92793
$$ plain form
43474 -620534 -997036 -1056478 -802293 -483721 -183444 137207 406254 567821 729605 893899
43464 893899 814785 462488 300030 631839 976132 670575 -94591 -495046 -245594 105207
43454 105207 91434 -108702 -195712 -249461 -422342 -578659 -556412 -471977 -479265 -465520 -248173
43443 -248173 87463 268419 173385 -40214 -110424 60649 279231 268170 60447 11500
43433 11500 286361 587693 639574 648620 899430 1163743 1031531 648476 536979 779460
43423 779460 1002346 1134486 1491878 2032472 2235146 1920640 1534344 1357533 1083092 498566
43413 498566 -39221 -216308 -269674 -436989 -455737 -128993 126185 -103274 -490340 -484439
43403 -484439 -200945 -125280 -229283 -107188 198905 248957 6449 -106218 50212 190090
$$ packed form
43474f20534l76502n9442K54185L18572L00277L20651K69047J61567J61784J64294
43464H93899p9114l52297j62458L31809L44293l05557p65166m00455K49452L50801
43454A05207j3773k00136q7010n3749j72881j56317K2247Q4435p288J3745K17347
43443b48173L35636J80956r5034k13599p0210J71073K18582j1061k07723m8947
43433A1500K74861L01332N1881R046K50810K64313j32212l83055j11497K42481
43423G79460K22886J32140L57392N40594K02674l14506l86296j76811k74441n84526
43413D98566n37787j77087n3366j67315j8748L26744K55178k29459l87066N901
43403d84439K83494P5665j04003J22095L06093N0052k42508j12667J56430J39878
$$ plain form
43393 190090 236965 448050 807058 928074 733029 621740 743832 688282 205016 -303287
43383 -303287 -394317 -227564 -163684 -132357 91570 289525 50579 -526507 -922730 -940705
43373 -940705 -848464 -766129 -447030 149334 542347 337546 -143187 -229250 230246 729903
43363 729903 820430 619063 512942 624233 757848 725988 525606 261597 66096 68017
43353 68017 288700 557563 648417 508395 255695 -21346 -308561 -498672 -376679 98759
43343 98759 611597 753605 473944 147596 141718 384098 474512 234389 -16935 106111
43333 106111 466834 550431 206590 -122787 -75602 116796 89916 -44135 5103 96122
43323 96122 -76699 -291190 -53219 496741 661509 279309 5768 270245 678150 814117
$$ packed form
43393A90090M6875K11085L59008J21016j95045j11289J22092n5550m83266n08303
43383c03287r1030J66753O3880L1327K23927J97955k38946n77086l96223j7975
43373i40705R2241Q2335L19099N96364L93013k04801m80733q6063M59496M99657
43363G29903R0527k01367j06121J11291J33615l1860k00382k64009j95501J921
43353F8017K20683K68863R0854j40022k52700k77041k87215j90111J21993M75438
43343I8759N12838J42008k79661l26348n878K42380R0414k40123k51324J23046
43333A06111L60723Q3597l43841l29377M7185J92398k6880j34051M9238R1019
43323I6122j72821k14491K37971N49960J64768l82200k73541K64477M07905J35967
$$ plain form
43313 814117 918114 1236521 1356037 871152 211988 53210 265734 228910 -96698 -231630
43303 -231630 -141705 -277257 -660617 -763705 -414614 -75159 -35012 -35224 76621 17463 -272464
43292 -272464 -291930 253364 871192 957471 631121 400397 345560 176522 -116890 -218007
43282 -218007 -23399 213821 295296 295552 330011 359947 289427 105054 -109789 -224699 -162840
43271 -162840 -6701 71468 21043 -51823 -66572 -18548 156409 529324 942355 1094998
43261 1094998 954214 799662 757030 607714 217651 -189647 -405915 -534643 -639094 -458590
43251 -458590 135721 712904 794376 591176 704126 1179154 1407393 1025690 438822 274828
43241 274828 662000 1218477 1503899 1332991 844737 389264 206180 168700 243 -285267
$$ packed form
43313H14117J03997L18407J19516m84885o59164j58778K12524l6824l25608j34932
43303b31630Q9925j35552l83360j03088L49091L39455M0147k12J11845n9158k89927
43292b72464j9466N45294O17828Q6279l26350k30724n4837j69038k93412j01117
43282b18007J94608K37220Q1475K56L4459K9936p0520j84373k14843j14910O1859
43271a62840J56139P8169n0425p2866j4749M8024J74957L72915M13031J52643
43261A094998j40784j54552m2632j49316l90063m07298k16268j28728j04451J80504
43251d58590N94311N77183Q1472k03200J12950M75028K28239l81703n86868j63994
43241B74828L87172N56477K85422j70908m88254m55473j83084l7480j68457k85510
$$ plain form
43231 -285267 -419154 -356917 -375672 -573884 -626966 -295389 102133 80528 -282651 -391414
43221 -391414 78092 755644 1068921 918001 664504 584896 573695 400929 77757 -150781
43211 -150781 -119390 52561 96609 -87896 -283527 -169579 283426 702833 708152 389693
43201 389693 234599 536486 1042808 1277475 1059715 592005 199681 131056 440763 880255
43191 880255 1073634 1004080 1097897 1552756 1893735 1675716 1363876 1806096 2869143 3398450
43181 3398450 2760317 1698772 1279135 1626534 2198008 2699142 3079163 3085988 2584809 2044190
43171 2044190 1981628 2130100 1893097 1461392 1622865 2457422 3122799 3172018 3253100 4078084
43161 4078084 5400269 6585649 7675845 9221775 11363204 13732360 16184894 19066409
$$ packed form
43231b85267j33887O2237j8755j98212n3082L31577L97522k1605l63179j08763
43221c91414M69506O77552L13277j50920k53497p9608j1201j72766l23172k28538
43211a50781L1391J71951M4048j84505j95631J13948M53005M19407N319l18459
43201C89693j55094L01887N06322K34667k17760m67710l92324o8625L09707M39492
43191H80255J93379o9554R3817M54859L40979k18019l11840M42220J063047N29307
43181C398450o38133j061545m19637L47399N71474N01134L80021O825n01179n40619
43171B044190o2562J48472k37003m31705J61473Q34557O65377M9219Q1082Q24984
43161D078084J322185J185380J090196J545930K141429K369156K452534K881515
$$ plain form
43153 19066409 22707745 27132247 32475633 39386650 48569897 59616118 70171373 76564971
43145 76564971 75965387 68488799 57222564 45980617 36949881 30275768 25255405 21349333
43137 21349333 18229518 15560824 13126857 11005683 9406486 8370072 7705057 7157516
43129 7157516 6570305 5896586 5119655 4226107 3305948 2619469 2411495 2614208 2866135
43120 2866135 2899263 2781621 2687591 2577628 2274166 1773629 1301152 1059032 1042861 1107666
43110 1107666 1123520 1062011 991003 983688 1013609 981244 850876 675702 480768 266061 165773
43099 165773 391163 867060 1130327 849043 319059 129186 368317 523572 253394 -106597
43089 -106597 -67790 256029 319349 -14982 -256005 -36129 308623 230035 -202302 -390870
$$ packed form
43153A9066409L641336M424502N343386O911017R183247J1046221J0555255O393598
43145G6564971n99584p476588j1266235j1241947r030736o674113n020363l906072
43137B1349333l119815k668694k433967k121174j599197j036414o65015n47541
43129G157516n87211o73719p76931q93548r20159o86479k07974K02713K51927
43120B866135L3128j17642r4030j09963l03462n00537m72477k42120j6171O4805
43110A107666J5854o1509p1008p315K9921l2365j30368j75174j94934k14707j00288
43099A65773K25390M75897K63267k81284n29984j89873K39131J55255k70178l59991
43089a06597L8807L23819O3320l34331k41023K19876L44752p8588m32337j88568
$$ plain form
43079 -390870 -73168 352130 465442 370111 347586 331453 114670 -147838 -95434 269179
43069 269179 600466 774576 982454 1207160 1094662 550979 55662 80878 493964 832385
43059 832385 914443 856635 712920 486041 374002 609524 1063609 1332403 1244908 1014570
43049 1014570 863175 769014 657952 586592 598334 582573 436970 257838 215069 295364
43039 295364 325139 257376 278258 506709 686008 421919 -204055 -537171 -123449 621640
43029 621640 912511 662498 538878 886560 1193904 944060 467889 431787 834071 1111762
43019 1111762 1050076 958553 986938 874635 482095 56167 -198055 -377852 -539939 -496839
43009 -496839 -178367 130451 141820 -92311 -350365 -487137 -371595 100551 731690 1058090
$$ packed form
43079c90870L17702M25298J13312r5331k2525j6133k16783k62508N2404L64613
43069B69179L31287J74110K07878K24706j12498n43683m95317K5216M13086L38421
43059H32385Q2058n7808j43715k26879j12039K35522M54085K68794q7495k30338
43049A014570j51395r4161j11062p1360J1742j5761j45603j79132m2769Q0295
43039B95364K9775o7763K0882K28451J79299k64089o25974l33116M13722P45089
43029F21640K90871k50013j23620L47682L07344k49844m76171l6102M02284K77691
43019A111762o1686r1523K8385j12303l92540m25928k54222j79797j62087M3100
43009d96839L18472L08818J1369k34131k58054j36772J15542M72146O31139L26400
$$ plain form
42999 1058090 889358 549041 372375 270793 49840 -168188 -184692 -108010 -106555 -24513
42989 -24513 308776 587040 376985 -127263 -266332 120740 441725 228231 -227524 -390479
42979 -390479 -223394 -33616 130008 475260 954238 1158773 811453 132294 -376322 -403183
42969 -403183 -62324 258899 282808 132806 204684 685011 1284683 1579368 1547251 1583046
42959 1583046 1963765 2471822 2631767 2220044 1460667 785255 474783 488238 559691 465707
42949 465707 239315 118163 272598 624919 959524 1145184 1181987 1091759 891127 675217
42939 675217 583141 598575 493030 102069 -394876 -634507 -520996 -341190 -343445 -380687
42929 -380687 -176959 156879 186694 -199368 -519643 -316732 163665 280344 -67466 -239879
$$ packed form
42999A058090j68732l40317j76666j01582k20953k18028j6504P6682J455Q2042
42989b4513L33289K78264k10055n04248j39069L87072L20985k13494m55755j62955
42979c90479J67085J89778J63624L45252M78978K04535l47320o79159n08616k6861
42969d03183L40859L21223K3909j50002P1878M80327N99672K94685l2117L5795
42959A583046L80719N08057J59945m11723p59377o75412l10472J3455P1453r3984
42949D65707k26392j21152J54435L52321L34605J85660L6803r0228k00632k15910
42939F75217r2076J5434j05545l90961m96945k39631J13511J79806k255l7242
42929c80687K03728L33838K9815l86062l20275K02911M80397J16679l47810j72413
$$ plain form
42919 -239879 249352 1005065 1242494 787158 192615 -57829 -53946 -104257 -253910 -338044
42909 -338044 -255342 5289 409801 770720 795725 462889 175707 293577 637059 726614
42899 726614 421713 41655 -100318 6175 239550 531786 809852 955270 892437 596775
42889 596775 59710 -570412 -908179 -701381 -253511 -112215 -298874 -267935 228194 692968
42879 692968 608459 212985 118278 404655 599226 454897 251111 275079 441034 568463
42869 568463 683739 836548 877269 657420 295173 28426 -90642 -158753 -160545 29797
42859 29797 374811 596797 473216 113245 -153013 -111971 184581 556803 855384 971368
42849 971368 830488 476824 82745 -218542 -429746 -519984 -299981 311001 980301 1234119
$$ packed form
42919b39879M89231P55713K37429m55336n94543k50444L883n0311j49653q4134
42909c38044Q2702K60631M04512L60919K5005l32836k87182J17870L43482Q9555
42899G26614l04901l80058j41973J06493K33375K92236K78066J45418o2833k95662
42889E96775n37065o30122l37767K06798M47870J41296j86659L0939M96129M64774
42879F92968q4509l95474r4707K86377J94571j44329k03786K3968J65955J27429
42869E68463J15276J52809M0721k19849l62247k66747j19068o8111j792J90342
42859B9797L45014K21986j23581l59971k66258M1042K96552L72222K98581J15984
42849I71368j40880l53664l94079l01287k11204r0238K20003O10982O69300K53818
$$ plain form
42839 1234119 1057909 901678 984568 943315 403909 -397399 -899574 -928759 -761785 -598241
42829 -598241 -368550 -61449 134890 114229 -12657 -166693 -428403 -789695 -1001163 -836914
42819 -836914 -377363 100427 408156 531599 547591 555392 606758 635956 539343 360662 292463
42808 292463 455096 775734 1094500 1251513 1074696 505291 -182948 -511141 -298910 117559
42798 117559 324096 324445 398493 603939 702964 569369 390166 353802 337851 94836 -339694
42787 -339694 -645746 -660865 -610694 -731377 -828738 -536013 12995 195540 -216416 -596010
42777 -596010 -297906 347873 457210 -124074 -635693 -575768 -344388 -414007 -529000 -272255
42767 -272255 85053 9101 -300966 -104906 721973 1411197 1320987 682226 127075 -55251
$$ packed form
42839A234119j76210j56231Q2890m1253n39406q01308n02175k9185J66974J63544
42829e98241K29691L07101J96339k0661j26886j54036k61710l61292k11468J64249
42819h36914M59551M77790L07729J23443J5992P801N1366K9198r6613j78681o8199
42808B92463J62633L20638L18766J57013j76817n69405o88239l28193K12231M16469
42798A17559K06537L49P4048K05446R9025j33595j79203l6364j5951k43015m34530
42787c39694l06052j5119N0171j20683r7361K92725N49008J82545m11956l79594
42777e96010K98104O45779J09337n81284n11619N9925K31380o9619j14993K56745
42767b72255L57308p5952l10067J96060Q26879O89224r0210o38761n55151j82326
$$ plain form
42757 -55251 57812 330576 569003 490162 27484 -481187 -660505 -532031 -388079 -372725
42747 -372725 -396513 -351841 -201765 67829 395691 601104 549992 307392 -5112 -398000
42737 -398000 -874672 -1193725 -1028914 -403440 228078 418371 149093 -230487 -391859 -302103
42727 -302103 -185430 -284880 -646945 -1085119 -1313555 -1126220 -541206 131442 436073 186378
42717 186378 -232690 -191782 439828 1078922 1132628 722195 426982 445447 403349 27614
42707 27614 -388661 -413929 -102051 111355 14776 -178512 -232631 -220138 -339717 -585578
42697 -585578 -767150 -776968 -671278 -505542 -269687 -37539 3881 -176707 -297719 -107770
42687 -107770 186218 134661 -287266 -580231 -442041 -221106 -338309 -579742 -443297 11319
$$ packed form
42757e5251J13063K72764K38427p8841m62678n08671j79318J28474J43952J5354
42747c72725k3788M4672J50076K69594L27862K05413n1112k42600l12504l92888
42737c98000m76672l19053J64811O25474O31518J90293k69278l79580j61372Q9756
42727c02103J16673r9450l62065m38174k28436J87335N85014O72648L04631k49695
42717A86378m19068M0908O31610O39094N3706m10433k95213J8465m2098l75735
42707B7614m16275k5268L11878K13406r6579j93288n4119J2493j19579k45861
42697e85578j81572r818J05690J65736K35855K32148M1420j80588j21012J89949
42687a07770K93988n1557m21927k92965J38190K20935j17203k41433J36445M54616
$$ plain form
42677 11319 262569 248284 506994 1200425 1656333 1311008 567767 152629 38878 -291146
42667 -291146 -788219 -860209 -415583 -58926 -71398 34788 595509 1112171 998871 483787
42657 483787 189016 215172 253036 279947 466010 597920 319730 -136417 -195445 65004
42647 65004 -69472 -771952 -1276484 -995307 -333658 87178 384155 931265 1400958 1105564
42637 1105564 131012 -622954 -581264 -85918 238614 200869 -20614 -228814 -312023 -290376
42627 -290376 -357808 -606688 -712295 -275478 485211 849106 541007 92160 29469 180876
42617 180876 132944 -55854 -73767 27784 -29739 -187918 -167494 -59448 -241082 -666387
42607 -666387 -773956 -266262 460865 881849 955214 919035 815950 569778 311404 253860
$$ packed form
42677A1319K51250j4285K58710O93431M55908l45325p43241m15138j13751l30024
42667b91146m97073p1990M44626L56657j2472J06186N60721N16662j13300n15084
42657D83787k94771K6156L7864K6911J86063J31910k78190m56147n9028K60449
42647F5004j34476p02480n04532K81177O61649M20836K96977N47110M69693k95394
42637A105564r74552p53966M1690M95346L24532l7745k21483k08200q3209K1647
42627b90376o7432k48880j05607M36817P60689L63895l08099m48847o2691J51407
42617A80876m7932j88798j7913J01551n7523j58179K0424J08046j81634m25305
42607f66387j07569N07694P27127M20984P3365l6179j03085k46172k58374n7544
$$ plain form
42597 253860 337983 324898 199939 187954 359199 499159 442613 304347 257995 258909 139163
42586 139163 -110094 -280605 -147403 324665 922110 1294200 1212175 793185 405251 288473
42576 288473 343025 347121 254187 137406 -36616 -338876 -607228 -514532 -2497 566464
42566 566464 834495 853284 890198 983372 936435 693167 459521 421229 537945 665359
42556 665359 706727 584382 237990 -235913 -560093 -507917 -110490 401612 774188 832949
42546 832949 570207 213625 72997 207640 351443 264628 32397 -114992 -149402 -226456
42536 -226456 -398663 -554268 -633922 -726323 -905508 -1095203 -1139021 -935210 -503088 80
42526 80 331297 323081 16342 -411069 -825416 -1183603 -1430865 -1448467 -1136465 -538837 95205
$$ packed form
42597B53860Q4123j3085j24959j1985J71245J39960n6546j38266m6352R14j19746
42586A39163k49257j70511J33202M72068N97445L72090q2025m18990l87934j16778
42576B88473N4552M096r2934j16781j74022l02260k68352R2696N12035N68961
42566E66464K68031J8789L6914R3174m6937k43268k33646l8292J16716J27414
42556F65359M1368j22345l46392m73903l24180N2176L97427N12102L72576N8761
42546H32949k62742l56582j40628J34643J43803q6815k32231j47389l4410p7054
42536b26456j72207j55605p9654r2401j79185j89695m3818K03811M32122N03168
42526H0L31217q216l06739m27411m14347l58187k47262j7602L12002N97628O34042
$$ plain form
42515 95205 405175 199443 -311436 -682078 -693264 -512823 -355048 -215796 -83113 -123719
42505 -123719 -369556 -452574 -55604 502387 592486 169978 -134976 85243 488752 555763
42495 555763 283743 30420 -22687 59758 198643 302042 217040 -44499 -190114 -6318
42485 -6318 331757 549455 661185 775463 739581 384113 -27127 -56346 238669 356036
42475 356036 113751 -93535 58490 336765 352742 140037 50207 265886 666044 1051572
42465 1051572 1300534 1377957 1336664 1247989 1074033 744390 411591 407336 796465 1177986
42455 1177986 1142570 785253 538475 599635 770778 828623 811947 885949 1071730 1188554
42445 1188554 1028330 588364 135935 -43313 6721 -46427 -357725 -658466 -639184 -415255
$$ packed form
42515I5205L09970k05732n10879l70642j1186J80441J57775J39252J32683m0606
42505a23719k45837q3018L96970N57991R0099m22508l04954K20219M03509O7011
42495E55763k72020k53323n3107Q2445J38885J03399q5002k61539j45615J83796
42485f318L38075K17698J11730J14278l5882l55468m11240k9219K95015J17367
42475C56036k42285k07286J52025K78275J5977k12705q9830K15679M00158L85528
42465A051572K48962P7423m1293q8675j73956l29643l32799m255L89129L81521
42455A177986l5416l57317k46778O1160J71143N7845j6676P4002J85781J16824
42445A188554j60224m39966m52429j79248N0034n3148l11298l00741J9282K23929
$$ plain form
42435 -415255 -364116 -583840 -783316 -705669 -417401 -137877 4974 -18590 -192664 -413996
42425 -413996 -514307 -402848 -123698 225381 523955 604638 366552 -63023 -433870 -662109
42415 -662109 -856026 -1044015 -1085248 -907773 -620957 -298780 131969 656548 1037542 1096202
42405 1096202 958639 835625 722615 534109 377744 417743 556914 539092 329987 127505
42395 127505 14486 -114244 -263959 -282991 -173621 -169638 -359643 -486688 -321304 -39583
42385 -39583 -1066 -272677 -595648 -754805 -770922 -749614 -726330 -689732 -637870 -586126 -585295
42374 -585295 -702036 -898625 -980962 -783367 -381537 -7944 221849 367713 460767 410958
42364 410958 189144 -29870 -29260 196178 453151 595649 646875 649915 515874 145635 -336605
$$ packed form
42435d15255N1139k19724j99476P7647K88268K79524J42851k3564j74074k21332
42425d13996j00311J11459K79150L49079K98574Q0683k38086m29575l70847k28239
42415f62109j93917j87989m1233J77475K86816L22177M30749N24579L80994N8660
42405A096202j37563j23014j13010j88506j56365L9999J39171j7822k09105k02482
42395A27505j13019j28730j49715j9032J09370L983j90005j27045J65384K81721
42385c9583L8517k71611l22971j59157j6117K1308K3284L6598N1862N1744Q31
42374e85295j16741j96589q2337J97595M01830L73593K29793J45864R3054m9809
42364D10958k21814k19014O10K25438K56973J42498N1226L040j34041l70239m82240
$$ plain form
42353 -336605 -640211 -660000 -620259 -741277 -902322 -841517 -585724 -392478 -297524 -80648
42343 -80648 239404 274998 -133934 -543208 -471741 -87116 82062 -65674 -169917 -76047
42333 -76047 -39593 -226926 -475223 -657552 -857597 -1033021 -932195 -560518 -324161 -432113
42323 -432113 -530702 -273977 81237 67397 -268014 -492701 -475761 -460876 -529011 -465540 -190896
42312 -190896 91934 254272 388943 517741 486330 265403 70682 68118 199680 368190
42302 368190 529259 548589 290804 -56067 -97137 180054 304341 32487 -215527 30795
42292 30795 565034 824750 727486 692588 904336 1057505 918031 702774 704080 850094
42282 850094 878112 741360 600480 522532 417301 253768 165063 288764 583199 847118
$$ packed form
42353c36605l03606j9789L9741j21018j61045O0805K55793J93246R4954K16876
42343h0648L20052L5594m08932m09274P1467L84625J69178j47736j04243R3870
42333g6047L6454j87333k48297j82329k00045j75424J00826L71677K36357j07952
42323d32113r8589K56725L55214j3840l35411k24687J6940J4885o8135O3471K74644
42312a90896K82830J62338J34671J28798l1411k20927j94721k564J31562J68510
42302C68190J61069J9330k57785l46871m1070K77191J24287k71854k48014K46322
42292C0795N34239K59716r7264l4898K11748J53169j39474k15257J306J46014
42282H50094K8018j36752j40880p7948j05231j63533q8705J23701K94435K63919
$$ plain form
42272 847118 900565 729789 461223 220362 59793 19624 155685 424216 614542 537963
42262 537963 278374 122253 205705 351922 333874 205431 247055 586720 977752 1028574
42252 1028574 641876 158131 16797 310590 739395 968979 913802 658878 280037 -131765
42242 -131765 -385061 -310491 38065 416020 605073 518443 168520 -312103 -649924 -617147
42232 -617147 -284485 33394 108063 -35243 -259930 -453658 -500282 -318482 -18758 147741
42222 147741 105638 61589 170615 272767 156380 -57513 -54262 201367 396421 308760
42212 308760 87873 10703 138573 337503 510005 663721 800485 842370 670922 234237
42202 234237 -328640 -694397 -629699 -286589 -48890 -12607 157394 681409 1203586 1189808
$$ packed form
42272H47118N3447j70776k68566k40861j60569m0169J36061K68531J90326p6579
42262E37963k59589j56121Q3452J46217j8048j28443M1624L39665L91032N0822
42252A028574l86698m83745j41334K93793M28805K29584n5177k54924l78841m11802
42242a31765k53296P4570L48556L77955J89053q6630l49923m80623l37821L2777
42232f17147L32662L17879P4669j43306k24687j93728m6624J81800K99724J66499
42222A47741m2103m4049J09026J02152j16387k13893L251K55629J95054q7661
42212C08760k20887p7170J27870J98930J72502J53716J36764M1885j71448m36685
42202B34237n62877l65757O4698L43110K37699L6283J70001N24015N22177j3778
$$ plain form
42192 1189808 666225 183662 53003 26021 -145649 -259299 -67659 183330 46824 -431000
42182 -431000 -722462 -509045 3841 502812 936851 1334575 1557967 1468368 1170639 900039
42172 900039 771424 771155 874197 1031203 1147590 1204503 1297056 1437886 1453299 1218776 866957
42161 866957 585302 328046 -48064 -439635 -550788 -312046 -30458 -45991 -370580 -729247
42151 -729247 -870494 -794085 -716603 -805047 -925531 -758927 -256953 150711 -2833 -636714
42141 -636714 -1180221 -1197206 -771359 -291446 -55228 -90908 -168831 33402 583176 1089283
42131 1089283 1060273 506817 -38793 -161745 27773 222629 370016 586447 832036 931395
42121 931395 828957 620869 389572 158040 -51118 -227665 -366653 -370198 -111077 281418
$$ packed form
42192A189808n23583m82563j30659k6982j71670j13650J91640K50989j36506m77824
42182d31000k91462K13417N12886M98971M34039L97724K23392q9599k97729k70600
42172I00039j28615k69J03042J57006J16387N6913R2553J40830J5413k34523l51819
42161H66957k81655k57256l76110l91571j11153K38742K81588j5533l24589l58667
42151g29247j41247P6409P7482q8444j20484J66604N01974M07664j53544o33881
42141f36714n43507j6985M25847M79913K36218l5680p7923K02233N49774N06107
42131A089283k9010n53456n45610j22952J89518J94856J47387K16431K45589R9359
42121I31395j02438k08088k31297k31532k09158j76547j38988l545K59121L92495
$$ plain form
42111 281418 398599 30909 -498519 -741374 -711628 -724492 -753752 -409840 356772 966457
42101 966457 884431 299529 -162256 -208818 -48842 93700 253004 456784 513468 260617
42091 260617 -149325 -426066 -526272 -650501 -866694 -968382 -812942 -609125 -655653 -885086
42081 -885086 -931004 -669287 -419145 -468161 -636302 -560951 -262900 -102102 -195657 -226538
42071 -226538 54206 433841 571335 518227 610313 918533 1109995 898433 394126 -84411
42061 -84411 -347328 -357975 -107805 321548 655309 606270 183785 -305483 -567517 -523628
42051 -523628 -244838 140461 458603 588749 607016 686428 817237 814503 662608 605814
42041 605814 745946 798135 499230 68212 -62031 134301 268595 121990 -108850 -186225
$$ packed form
42111B81418J17181l67690n29428k42855K9746j2864k9260L43912P66612O09685
42101I66457q2026n84902m61785m6562J59976J42542J59304K03780N6684k52851
42091B60617m09942k76741j00206j24229k16193j01688J55440K03817m6528k29433
42081h85086m5918K61717K50142m9016j68141P5351K98051J60798r3555l0881
42071b26538K80744L79635J37494n3108R2086L08220J91462k11562n04307m78537
42061h4411k62917j0647K50170M29353L33761m9039m22485m89268k62034M3889
42051e23628K78790L85299L18142J30146J8267P9412J30809k734j51895n6794
42041F05814J40132N2189k98905m31018j30243J96332J34294j46605k30840p7375
$$ plain form
42031 -186225 -114222 51448 353129 712095 822150 497703 -25367 -338592 -309777 -128392
42021 -128392 648 54691 132626 296638 452037 388291 41000 -317458 -333047 -11604
42011 -11604 320561 498943 660503 844841 826438 519416 203669 105775 65198 -111489
42001 -111489 -274031 -231220 -137554 -196390 -237139 -17619 279237 335420 305439 589147 1088131
41990 1088131 1258598 916874 450683 162034 -68024 -328300 -402574 -158662 204443 495470
41980 495470 735533 863772 668050 226772 -2743 191161 444792 401438 248248 335223
41970 335223 593063 707860 617939 480679 361611 271910 294863 388002 316147 65849
41960 65849 1940 269411 425456 137730 -137933 184380 770387 743516 10325 -597810
$$ packed form
42031a86225P2003J65670L01681L58966J10055l24447n23070l13225K8815J81385
42021a28392J29040N4043P7935J64012J55399o3746l47291l58458j5589L21443
42011a1604L32165J78382J61560J84338j8403l07022l15747r7894m0577j76687
42001a11489j62542M2811R3666n8836m0749K19520K96856N6183k9981K83708M98984
41990A088131J70467l41724m66191k88649k30058k60276p4274K43912L63105K91027
41980D95470K40063J28239j95722m41278k29515J93904K53631m3354j53190Q6975
41970C35223K57840J14797q9921j37260j19068q9701K2953R3139p1855k50298
41960F5849o3909K67471J56045k87726k75663L22313N86007k6871p33191o08135
$$ plain form
41950 -597810 -579052 -361965 -413164 -496697 -263487 16190 -126647 -579208 -830364 -715654
41940 -715654 -506943 -407233 -389996 -452829 -624986 -744590 -585904 -232669 -23566 -86121
41930 -86121 -193901 -143984 -21280 16232 2860 66547 191926 224492 65116 -218991 -445232
41919 -445232 -447048 -217387 41489 81819 -117769 -299215 -212795 81526 281757 189122
41909 189122 -121503 -484972 -844606 -1151431 -1198420 -802699 -161091 237976 185244 13749
41899 13749 100354 316360 285312 57527 109917 623921 1153510 1195951 797569 367232
41889 367232 133157 56425 91427 205055 231561 31278 -225446 -222917 40435 239907
41879 239907 212118 155979 245213 346020 318441 332014 581332 848749 703272 117462
$$ packed form
41950e97810J8758K17087n1199q3533K33210K79677j42837m52561k51156J14710
41940g15654K08711R9710J7237o2833j72157j19604J58686L53235K09103o2555
41930h6121j07780M9917J22704L7512j3372O3687J25379L2566j59376k84107k26241
41919d45232j816K29661K58876M0330j99588j81446Q6420K94321K00231r2635
41909A89122l10625l63469l59634l06825m6989L95721O41608L99067n2732j71495
41899A3749Q6605K16006l1048k27785N2390N14004N29589M2441l98382m30337
41889C67232k34075p6732L5002J13628K6506k00283k56724K529K63352J99472
41879B39907k7789n6139Q9234J00807k7579J3573K49318K67417j45477n85810
$$ plain form
41869 117462 -423626 -494541 -163247 233331 502087 618745 539707 238339 -134555 -342318
41859 -342318 -327266 -238685 -187176 -105851 111839 446382 776063 1009390 1173692 1401135
41849 1401135 1777523 2134046 2083937 1441320 567137 82856 210801 608282 896201 1072184
41839 1072184 1249690 1277198 929709 329669 -163857 -440722 -679735 -880482 -724438 -86898
41829 -86898 599895 798482 555372 426370 711008 1057503 972244 507833 189966 321694
41819 321694 627230 654707 304135 -196744 -642257 -917492 -837965 -273910 507958 925893
41809 925893 665911 5298 -555643 -793145 -775654 -609942 -377377 -173849 -26983 107508
41799 107508 148574 -94932 -531603 -677505 -240890 401659 676788 582154 555115 705959
$$ packed form
41869A17462n41088p0915L31294L96578K68756J16658p9038l01368l72894k07763
41859c42318J5052Q8581N1509Q1325K17690L34543L29681K33327J64302K27443
41849A401135L76388L56523n0109o42617q74183m84281J27945L97481K87919J75983
41839A072184J77506K7508l47489o00040m93526k76865k39013k00747J56044O37540
41829h6898O86793J98587k43110j29002K84638L46495q5259m64411l17867J31728
41819C21694L05536K7477l50572n00879m45513k75235P9527N64055P81868M17935
41809I25893k59982o60613n60941k37502J7491J65712K32565K03528J46866J34491
41799A07508M1066k43506m36671j45902M36615O42549K75129r4634k7039J50844
$$ plain form
41789 705959 703883 431670 218103 270595 341185 179993 -64880 -148203 -96425 -15154 177887
41778 177887 546120 902587 1055669 1068270 1018869 751680 183111 -351982 -431343 -103327
41768 -103327 230199 395939 558082 790434 914125 823868 679179 672065 815685 1030145
41758 1030145 1243005 1339270 1193977 843746 501450 339730 352201 434160 475885 374292
41748 374292 105966 -174078 -245836 -94470 42167 -45464 -296229 -473819 -444399 -303720
41738 -303720 -239694 -285453 -239962 85999 534923 663809 258820 -328652 -537390 -229703
41728 -229703 214334 408737 357579 294850 325462 366383 356772 371995 491248 620869 536005
41717 536005 132082 -420947 -840864 -992240 -885350 -514095 84370 646392 866958 840982
$$ packed form
41789G05959k076k72213k13567N2492P0590j61192k44873q3323N1778Q1271J93041
41778A77887L68233L56467J53082J2601m9401k67189n68569n35093p9361L28016
41768a03327L33526J65740J62143K32352J23691r0257j44689p114J43620K14460
41758A030145K12860R6265j45293l50231l42296j61720J2471Q1959M1725j01593
41748C74292k68326k80044p1758J51366J36637q7631k50765j77590K9420J40679
41738c03720O4026m5759M5491L25961M48924J28886m04989n87472k08738L07687
41728b29703M44037J94403n1158o2729L0612M0921r611J5223J19253J29621q4864
41717E36005m03923n53029m19917j51376J06890L71255N98465N62022K20566k5976
$$ plain form
41707 840982 995077 1426168 1660701 1346655 852561 768513 1046909 1131456 827517 512750
41697 512750 450789 402959 95394 -326211 -541496 -482427 -309514 -163668 -105248 -130055
41687 -130055 -117736 85341 445952 754155 883475 853983 646407 234425 -160487 -175485
41677 -175485 217034 637916 821056 878955 914204 756512 333970 -55492 -162237 -158265
41667 -158265 -242480 -196274 202888 574016 313499 -485871 -1047096 -900511 -387174 -54598
41657 -54598 5633 11472 54863 95707 153241 240488 259125 169829 135889 298462 513631
41646 513631 509628 245978 -48347 -151493 -27192 219723 420200 411876 188044 -33722
41636 -33722 -37841 96349 95757 -82761 -138504 132046 465069 444166 101437 -99978 71209
$$ packed form
41707H40982J54095M31091K34533l14046m94094q4048K78396Q4547l03939l14767
41697E12750o1961m7830l07565m21605k15285N9069J72913J45846N8420k4807
41687a30055J2319K03077L60611L08203J29320k9492k07576m11982l94912j4998
41677a75485L92519M20882J83140N7899L5249j57692m22542l89462j06745L972
41667a58265q4215M6206L99162L71128k60517p99370n61225J46585N13337L32576
41657e4598O0231N839M3391M0844N7534Q7247J8637q9296l3940J62573K15169
41646E13631m003k63650k94325j03146J24301K46915K00477q324k23832k21766
41636c3722m119J34190n92j78518n5743K70550L33023k0903l42729k01415J71187
$$ plain form
41625 71209 280697 140469 -202412 -287744 -9806 281204 313108 186605 87144 27991
41615 27991 4983 120917 380017 587385 627170 625725 663913 570230 234310 -102073 -157494
41604 -157494 -25238 47084 123621 432692 841921 912307 507053 -32336 -388804 -591144
41594 -591144 -722158 -657669 -297874 195316 588829 813516 859502 654229 231827 -160675
41584 -160675 -327817 -358904 -427842 -507771 -465078 -292803 -50357 296871 751257 1101219
41574 1101219 1119834 901121 763991 836763 956420 974272 919875 813506 557531 149210
41564 149210 -164771 -115358 274651 720587 962707 910035 555502 -66107 -760731 -1155961
41554 -1155961 -997233 -490182 -179270 -357194 -702406 -682483 -247671 134626 156915 70673
$$ packed form
41625G1209K09488j40228l42881q5332K77938K91010L1904j26503r9461n9153
41615B7991k3008J15934K59100K07368L9785j445L8188r3683l35920l36383n5421
41604a57494J32256P2322P6537L09071M09229P0386m05254n39389l56468k02340
41594e91144j31014O4489L59795M93190L93513K24687M5986k05273m22402l92502
41584a60675j67142l1087o8938p9929M2693J72275K42446L47228M54386L49962
41574A101219J8615k18713j37130P2772J19657J7852n4397j06369k55975m08321
41564A49210l13981M9413L90009M45936K42120n2672l54533o21609o94624l95230
41554a155961J58728N07051L10912j77924l45212J9923M34812L82297K2289q6242
$$ plain form
41544 70673 239054 567351 687013 550087 471345 597629 692668 544845 290571 168428
41534 168428 179653 185919 170175 181002 130681 -117745 -492131 -727982 -651204 -319034 94663
41523 94663 418226 516025 370210 145897 37013 35732 -3903 -76366 -2525 235194 348404
41512 348404 97901 -341757 -553128 -333283 177972 741253 1184695 1368859 1223555 875102
41502 875102 558139 338386 85436 -222604 -374861 -242558 -29750 4624 -40949 171660
41492 171660 717029 1262041 1467672 1329657 1041289 709323 346024 6561 -241835 -431261
41482 -431261 -623806 -756329 -690937 -420805 -103943 123873 256121 312922 264817 132755
41472 132755 48425 92479 138472 -2805 -301709 -512622 -486782 -358330 -348241 -467432
$$ packed form
41544G0673J68381L28297J19662j36926p8742J26284R5039j47823k54274j22143
41534A68428J1225O266j5744J0827n0321k48426l74386k35851P6778L32170M13697
41523I4663L23563R7799j45815k24313j08884j281l9635p2463P3841K37719J13210
41512C48404k50503m39658k11371K19845N11255N63281M43442J84164j45304l48453
41502H75102l16963k19753k52950l08040j52257J32303K12808L4374m5573K12609
41492A71660N45369N45012K05631j38015k88368l31966l63299l39463k48396j89426
41482d31261j92545j32523O5392K70132L16862K27816J32248N6801m8105j32062
41472A32755q4330M4054M5993j41277k98904k10913K5840J28452J0089j19191
$$ plain form
41462 -467432 -500601 -250439 252613 747028 920236 664651 201865 -122039 -204852 -238032
41452 -238032 -331330 -283776 77896 493326 508272 79958 -370699 -534825 -511751 -447365
41442 -447365 -257842 62394 202286 -42410 -342617 -243828 135872 268201 49479 -12085
41432 -12085 409902 892819 783140 48714 -675645 -795985 -303340 328298 621690 499764
41422 499764 316049 464503 930740 1316838 1329144 1079470 827345 617984 347297 43746
41412 43746 -143036 -193856 -262427 -443483 -633076 -664139 -513204 -338820 -314884 -406581 -358784
41401 -358784 -22857 340070 302630 -125918 -403840 -134091 400044 625824 410849 83699
41391 83699 -136830 -341913 -573995 -645269 -419074 -6742 404392 698882 775995 612914
$$ packed form
41462d67432l3169K50162N03052M94415J73208k55585m62786l23904q2813l3180
41452b38032r3298M7554L61672M15430J4946m28314m50657j64126K3074O4386
41442d47365J89523L20236J39892k44696l00207R8789L79700J32329k18722o1564
41432a2085M21987M82917j09679p34426p24359j20340M92645O31638K93392j21926
41422D99764j83715J48454M66237L86098J2306k49674k52125k09361k70687l03551
41412D3746j86782n0820o8571j81056j89593l1063J50935J74384K3936r1697M7797
41401c58784L35927L62927l7440m28548k77922K69749N34135K25780k14975l27150
41391H3699k20529k05083k32082p1274K26195M12332M11134K94490P7113j63081
$$ plain form
41381 612914 433269 507035 698088 553450 -11271 -489373 -493269 -328569 -494542 -894806
41371 -894806 -1005347 -677912 -291390 -120286 -1456 284696 677713 1019904 1271921 1392400
41361 1392400 1259685 890998 549548 470102 615524 814332 975969 1048209 931706 611027
41351 611027 276784 172307 354995 661173 829363 646960 120913 -458259 -778028 -858066
41341 -858066 -954342 -1098554 -1021929 -632820 -244267 -128546 -146342 -78586 -38197 -204382
41331 -204382 -377977 -220506 185155 421564 327688 123960 -13642 -110348 -120340 96858
41321 96858 453688 651866 621220 609180 733473 784952 610478 370767 257676 248165 297051
41310 297051 478201 752559 875805 730715 494444 307266 72442 -219833 -309134 -84338
$$ packed form
41381F12914j79645P3766J91053j44638n64721m78102l896J64700j65973m00264
41371h94806j10541L27435L86522J71104J18830K86152L93017L42191K52017J20479
41361A392400j32715l68687l41450p9446J45422J98808J61637P2240j16503l20679
41351F11027l34243j04477J82688L06178J68190j82403n26047n79172l19769q0038
41341h58066r6276j44212P6625L89109L88553J15721j7796O7756M0389j66185
41331b04382j73595J57471M05661K36409r3876k03728j37602r6706r992K17198
41321I6858L56830J98178l0646j2040J24293N1479j74474k39711j13091r511M8886
41310B97051J81150K74358J23246j45090k36271j87178k34824k92275q9301K24796
$$ plain form
41300 -84338 127745 32078 -149006 -46995 216875 207422 -128933 -375550 -243536 83040
41290 83040 221891 -27978 -550319 -952656 -841222 -269670 233604 325292 318392 659992
41280 659992 1173141 1297129 947833 595648 501911 421250 146725 -166650 -387951 -648492
41270 -648492 -959151 -989837 -518371 186079 681335 833979 796378 731974 743536 866818
41260 866818 985675 957314 921302 1217244 1872008 2468032 2689227 2699984 2782019 2890855
41250 2890855 2820394 2554319 2202154 1814797 1502249 1488058 1769946 1949719 1699194 1205812
41240 1205812 864884 727104 582449 420019 421587 583723 712482 774192 931008 1211408
41230 1211408 1416464 1390632 1178037 895236 628485 457431 424013 484246 598064 800394
$$ packed form
41300h4338K12083r5667j81084J02011K63870r453l36355k46617J32014L26576
41290H3040J38851k49869n22341m02337J11434N71552N03274R1688o900L41600
41280F59992N13149J23988l49296l52185r3737q0661k74525l13375k21301k60541
41270f48492l10659l0686M71466P04450M95256J52644l7601o4404J1562J23282
41260H66818J18857k8361l6012K95942O54764N96024K21195J0757Q2035J08836
41250B890855p0461k66075l52165l87357l12548j4191K81888J79773k50525m93382
41240A205812l40928j37780j44655j62430J568J62136J28759O1710J56816K80400
41230A211408K05056k5832k12595k82801k66751j71054l3418O0233J13818K02330
$$ plain form
41220 800394 1074263 1269080 1283112 1198856 1105246 974715 890637 1138847 1765197 2252194
41210 2252194 2038851 1273276 665705 630481 936432 1185801 1243413 1133698 889780 650243
41200 650243 626220 826487 1012396 1004542 836292 572720 237723 -12191 66882 434363
41190 434363 671379 446769 -75279 -453090 -474408 -303720 -213460 -300349 -431952 -397900
41180 -397900 -131511 213222 454384 612343 831672 1093820 1170908 922276 518682 285664
41170 285664 366923 593347 682387 552624 395558 381693 386411 201626 -23654 123378
41160 123378 689329 1169120 1175639 969497 998778 1196716 1158837 830456 561399 562808 725676
41149 725676 921453 1090060 1088899 851422 632222 681835 760663 450746 -115215 -385814
$$ packed form
41220H00394K73869J94817J4032q4256r3610j30531q4078K48210O26350M86997
41210B252194k13343p65575o07571l5224L05951K49369N7612j09715k43918k39537
41200F50243k4023K00267J85909p854j68250k63572l34997k49914P9073L67481
41190D34363K37016k24610n22048l77811k1318J70688R0260q6889j31603L4052
41180c97900K66389L44733K41162J57959K19329K62148P7088k48632m03594k33018
41170B85664Q1259K26424Q9040j29763j57066j3865M718j84785k25280J47032
41160A23378N65951M79791O519k06142K9281J97938l7879l28381k69057J409J62868
41149G25676J95777J68607j161k37477k19200M9613P8828l09917n65961k70599
$$ plain form
41139 -385814 -246939 -145497 -280718 -309270 -49191 145257 11001 -182825 -179367 -211383
41129 -211383 -522170 -850451 -840130 -602223 -433695 -305439 -73781 94786 -26267 -287085
41119 -287085 -412106 -456433 -568693 -534417 -72921 558696 787779 504902 148813 27209
41109 27209 4235 -95071 -191958 -186853 -166193 -240485 -383154 -509157 -555064 -457338 -198505
41098 -198505 120718 364075 478616 468016 369261 321400 451837 597891 430347 17816
41088 17816 -90006 382727 971125 1135289 1026154 1087122 1213311 950837 364557 22271
41078 22271 127847 308468 334385 443586 793683 1132640 1231857 1203784 1190942 1139764 1058093
41067 1058093 1102851 1239118 1202516 972602 884581 1086589 1298681 1320574 1350036 1537664
$$ packed form
41139c85814J38875J01442j35221k8552K60079J94448j34256j93826L458l2016
41129b11383l10787l28281J0321K37907J68528J28256K31658J68567j21053k60818
41119b87085j25021m4327j12260L4276M61496O31617K29083k82877l56089j21604
41109B7209k2974r9306r6887N105K0660p4292j42669j26003m5907R7726K58833
41098a98505L19223K43357J14541j0600r8755m7861J30437J46054j67544m12531
41088A7816j07822M72733N88398J64164j09135O0968J26189k62474n86280l42286
41078B2271J05576J80621K5917J09201L50097L38957R9217k8073j2842n1178q1671
41067A058093M4758J36267l6602k29914q8021K02008K12092K1893K9462J87628
$$ plain form
41057 1537664 1647925 1472325 1184524 955459 627300 172233 64550 655606 1463080
41048 1463080 1673809 1213933 764438 780306 1036055 1154150 1055323 779999 344805 -32840
41038 -32840 29612 568822 1090353 1133885 804687 538579 553930 764161 1035495 1240707
41028 1240707 1171207 712720 112204 -194598 -90258 92198 30010 -184825 -240969 -47687
41018 -47687 239512 556132 1009291 1548516 1811259 1518858 911472 538260 610217 775579
41008 775579 606373 124941 -283818 -360575 -206076 -74763 -95403 -224789 -362473 -434651
40998 -434651 -403341 -259748 -33639 196786 329484 316000 236235 259875 479496 782167
40988 782167 934607 814628 523810 255711 108064 74246 154948 352762 549416 527947
$$ packed form
41057A537664J10261j75600k87801k29065l28159m55067j07683N91056Q07474
41048A463080K10729m59876m49495J5868K55749J18095r8827k75324m35194l77645
41038c2840O2452N39210N21531M3532l29198k66108J5351K10231K71334K05212
41028A240707o9500m58487o00516l06802J04340J82456o2188k14835n6144J93282
41018d7687K87199L16620M53159N39225K62743k92401o07386l73212P1957J65362
41008G75579j69206m81432m08759p6757J54499J31313k0640j29386j37684p2178
40998d34651L1310J43593K26109K30425J32698j3484p9765K3640K19621L02671
40988G82167J52440j19979k90818k68099j47647l3818Q0702J97814J96654k1469
$$ plain form
40978 527947 203593 -249036 -582025 -715154 -712898 -623552 -476815 -365414 -359766 -367946 -231567
40967 -231567 59948 390353 704312 1001307 1189052 1160479 1010607 959123 1047324 1124980
40957 1124980 1137379 1189247 1326456 1520332 1856973 2406588 2879168 2813522 2228710 1687633
40947 1687633 1535220 1475112 1144614 711420 561359 712139 905695 1045887 1196975 1331953
40937 1331953 1385676 1401748 1404284 1326604 1235435 1318242 1461205 1255991 703380 430810 804132
40926 804132 1296721 1259925 891858 841523 1222506 1672807 2070013 2483949 2695035 2516333
40916 2516333 2386205 2853154 3610239 3833346 3379261 2840218 2492592 2077209 1630102
40907 1630102 1595991 1960437 2136009 1919508 1744847 1776622 1608277 1151313 971915 1347460
$$ packed form
40978E27947l24354m52629l32989j33129K256Q9346J46737J11401N648q180J36379
40967b31567K91515L30405L13959K96995J87745k8573j49872n1484Q8201P7656
40957A124980J2399N1868J37209J93876L36641N49615M72580o5646n84812n41077
40947A687633j52413o0108l30498m33194j50061J50780J93556J40192J51088J34978
40937A331953N3723J6072K536p7680r1169Q2807J42963k05214n52611k72570L73322
40926H04132M92589l6796l68067n0335L80983M50301L97206M13936K11086j78702
40916B516333j30128M66949P57085K23107m54085n39043l47626m15383m47107
40907A630102l4111L64446J75572k16501j74661L1775j68345m56964j79398L75545
$$ plain form
40897 1347460 1764007 1786945 1717681 1939761 2295633 2576646 2964578 3480253 3630234 3166333
40887 3166333 2640068 2626372 2878030 2808598 2378115 1944148 1607614 1248927 940471 877191
40877 877191 1111012 1621462 2334267 2876815 2768739 2100568 1553388 1522610 1739541 1934923
40867 1934923 2212308 2509180 2427798 1964482 1684597 1789983 1768595 1381873 1176489 1513744
40857 1513744 1924762 1993720 2035969 2288378 2318133 1940295 1810810 2292108 2627124 2166936
40847 2166936 1570441 1765773 2487209 2896918 2938171 2980311 2811086 2145652 1550075 1713295
40837 1713295 2315304 2661083 2837369 3183452 3311447 2828456 2349875 2566394 2992599
40828 2992599 2906231 2771083 3339891 4124981 4289266 4299220 5035593 5978754 6060596 5678042
$$ packed form
40897A347460M16547K2938o9264K22080L55872K81013L87932N15675J49981m63901
40887C166333n26265j3696K51658o9432m30483m33967l36534l58687l08456o3280
40877H77191K33821N10450P12805N42548j08076o68171n47180l0778K16931J95382
40867A934923K77385K96872q1382m63316k79885J05386k1388l86722k05384L37255
40857A513744M11018O8958M2249K52409K9755l77838j29485M81298L35016m60188
40847B166936n96495J95332P21436M09709M1253M2140j69225o65434n95577J63220
40837A713295O02009L45779J76286L46083J27995m82991m78581K16519M26205
40828B992599q6368j35148N68808P85090J64285R954P36373R43161Q1842l82554
$$ plain form
40818 5678042 5994653 6817700 7087987 6943370 7352412 8255614 9043012 10207062 12434330
40809 12434330 14874614 16607094 18869932 23294513 29082829 34811847 41530722 50535177
40801 50535177 59919723 67996081 78375455 96057803 120856217 152852432 201793532
40794 201793532 276385055 358847325 404496549 380942895 303028741 217761548 158256582
40787 158256582 123514586 99094004 80133576 68698601 62073143 54640392 46075758
40780 46075758 39642760 35285946 30463938 25519653 22816071 21933023 20244139 17339048
40772 17339048 15076476 13966670 12800859 11311074 10318042 9701039 8698754 7704670
40764 7704670 7535696 7547588 6618293 5330232 5057056 5534205 5431104 4711104 4325160
$$ packed form
40818E678042L16611Q23047K70287j44617M09042R03202P87398J164050K227268
40809A2434330K440284J732480K262838M424581N788316N729018O718875R004455
40801E0535177R384546Q076358J0379374J7682348K4798414L1996215M8941100
40794B01793532P4591523Q2462270M5649224k3553654p7914154q5267193n9504966
40787A58256582l4741996k4420582j8960428j1434975o625458p432751q564634
40780D6075758o432998m356814m822008m944285k703582q83048j688884k905091
40772A7339048k262572j109806j165811j489785r93032o17003j002285r94084
40764G704670j68974J1892r29295j288061k73176M77149j03101p20000l85944
$$ plain form
40755 4325160 4146928 3360624 2431973 2532836 3325355 3413885 2757265 2563660 2968071 2918658
40745 2918658 2335393 2290394 2914049 3129540 2704291 2643551 3250638 3667221 3674887 4082700
40735 4082700 4942609 5306551 5233477 6017285 7811883 9284400 10644438 14551314 22026345
40726 22026345 29256082 30943435 26141062 18790042 12998888 9723176 7856200 6464761
40718 6464761 5266118 4233247 3570565 3513609 3789155 3767016 3303818 2900057 2911086 3191401
40708 3191401 3686054 4735566 6392252 7863515 8141797 7084521 5532962 4375849
40700 4375849 3753647 3250322 2632182 2132887 2027418 2218760 2424285 2554674 2637121 2527952
40690 2527952 2067416 1451537 1058327 911349 727151 521106 675322 1248010 1701470
$$ packed form
40755D325160j78232p86304r28651J00863P92519Q8530o56620j93605M04411m9413
40745B918658n83265m4999O23655K15491m25249o0740O07087M16583P666M07813
40735D082700Q59909L63942p3074P83808J794598J472517J360038L906876P475031
40726B2026345P229737J687353m802373p351020n791154l275712j866976j391439
40718F464761j198643j032871o62682n6956K75546k2139m63198m03761J1029K80315
40708C191401M94653J049512J656686J471263K78282j057276j551559j157113
40700D375849o22202n03325o18140m99295j05469J91342K05525J30389Q2447j09169
40690B527952m60536o15879l93210j46978j84198k06045J54216N72688M53460
$$ plain form
40681 1701470 1609742 1245260 1115294 1225463 1185212 830179 368854 48281 -2941 276189
40671 276189 755408 1015018 701395 -11228 -568869 -665640 -508862 -436212 -483987 -435185
40661 -435185 -175987 114758 148640 -112913 -337422 -164172 333710 687667 599712 301466
40651 301466 215298 405456 567011 484071 274894 171929 254576 472322 780120 1123943
40641 1123943 1370124 1395025 1253554 1151992 1215408 1372056 1525899 1735403 2086086 2450567
40631 2450567 2567514 2383256 2144305 2086810 2174837 2208113 2046640 1670584 1186492 847191
40621 847191 861033 1064622 1010777 559673 156479 266334 716307 914289 616420 143501
40611 143501 -134901 -195350 -174681 -77878 159872 457223 588877 406863 21013 -276512
$$ packed form
40681A701470r1728l64482j29966J10169m0251l55033m61325l20573n1222K79130
40671B76189M79219K59610l13623p12623n57641r6771J56778P2650m7775M8802
40661d35185K59198K90745L3882k61553k24509J73250M97882L53957q7955k98246
40651C01466q6168J90158J61555q2940k09177j02965Q2647K17746L07798L43823
40641A123943K46181K4901j41471j01562O3416J56648J53843K09504L50683L64481
40631B450567J16947j84258k38951n7495Q8027L3276j61473l76056m84092l39301
40621H47191J3842K03589n3845m51104m03194J09855M49973J97982k97869m72919
40611A43501k78402o0449K0669R6803K37750K97351J31654j82014l85850k97525
$$ plain form
40601 -276512 -319853 -266522 -359506 -531075 -475849 -141526 152462 188342 116062 86506 -12512
40590 -12512 -199070 -153006 306027 812612 931142 750757 580816 369514 -40367 -354970
40580 -354970 -177338 247311 308638 -19324 -192098 -45990 -2034 -217900 -283628 -16139
40570 -16139 122237 -232655 -738802 -887069 -707215 -544109 -490171 -410798 -253073 -26997
40560 -26997 264849 453229 256552 -273444 -672015 -630563 -319014 26362 421693 821324
40550 821324 952036 787660 761763 1132693 1528013 1519667 1269516 1150099 1077469 749320
40540 749320 288146 99845 235544 374210 336024 196277 7656 -182156 -148797 263776
40530 263776 793315 1017407 879799 638896 427146 207394 18052 -108255 -318719 -653004
$$ packed form
40601b76512m3341N3331r2984j71569N5226L34323K93988L5880p2280k9556r9018
40590a2512j86558M6064M59033N06585J18530j80385j69941k11302m09881l14603
40580c54970J77632M24649O1327l27962j72774J46108M3956k15866o5728K67489
40570a6139J38376l54892n06147j48267J79854J63106N3938P9373J57725K26076
40560b6997K91846J88380j96677n29996l98571M1452L11549L45376L95331L99631
40550H21324J30712j64376k5897L70930L95320q346k50151j19417p2630l28149
40540G49320m61174j88301J35699J38666l8186j39747j88621j89812L3359M12573
40530B63776N29539K24092j37608k40903k11750k19752j89342j26307k10464l34285
$$ plain form
40520 -653004 -765467 -375829 176814 335801 144644 99782 272885 221455 -182820 -485378
40510 -485378 -390536 -201896 -264600 -450908 -487260 -376318 -196253 141222 605617 847875
40500 847875 640931 271084 154106 278634 374374 439909 698510 1105693 1288068 1017241
40490 1017241 469789 -35988 -340188 -431249 -353502 -228698 -220382 -359421 -479484 -397114
40480 -397114 -88370 355586 833796 1198795 1236119 880850 428162 297737 523366 704226
40470 704226 595140 488472 740456 1132506 1124411 683638 396737 657083 1164365 1416419
40460 1416419 1313040 1021309 604527 130955 -125196 18485 316738 388617 196251 -62321
40450 -62321 -339672 -661090 -840902 -693713 -417556 -351627 -438955 -365621 -171285 -224102
$$ packed form
40520f53004j12463L89638N52643J58987j91157m4862J73103n1430m04275l02558
40510d85378R4842J88640o2704j86308l6352J10942J80065L37475M64395K42258
40500H47875k06944l69847j16978J24528R5740O5535K58601M07183J82375k70827
40490A017241n47452n05777l04200r1061P7747J24804Q316j39039j20063Q2370
40480c97114L08744M43956M78210L64999L7324l55269m52688j30425K25629J80860
40470G04226j09086j06668K51984L92050q095m40773k86901K60346N07282K52054
40460A416419j03379k91731m16782m73572k56151J43681K98253P1879j92366k58572
40450f2321k77351l21418j79812J47189K76157O5929q7328P3334J94336n2817
$$ plain form
40440 -224102 -549505 -676020 -298189 309467 705865 762204 570943 222956 -116341 -192901
40430 -192901 51364 376904 573147 671640 724738 653696 486776 463657 663445 769918
40420 769918 496135 63881 -72350 100918 106727 -334509 -847803 -827700 -196098 492522
40410 492522 730389 619250 566155 579637 251203 -503462 -1105960 -1007072 -420793 4598
40400 4598 43375 1277 100822 229515 288033 343412 367564 206370 -103276 -316239 -337095
40389 -337095 -274731 -132226 166873 422783 308402 -12616 74565 742326 1330526 1182789
40379 1182789 506210 28015 62826 286330 264289 -109775 -604207 -851922 -646963 -162376
40369 -162376 242322 450611 597758 670363 491533 181932 160405 479912 632320 305300
$$ packed form
40440b24102l25403j26515L77831O07656L96398N6339j91261l47987l39297p6560
40430a92901K44265L25540J96243R8493N3098p1042j66920k3119J99788J06473
40420G69918k73783m32254j36231J73268N809m41236n13294K0103O31602O88620
40410D92522K37867j11139n3095J3482l28434p54665o02498R8888N86279M25391
40400D598L8777m2098R9545J28693N8518N5379K4152j61194l09646k12963k0856
40389c37095O2364J42505K99099K55910j14381l21018Q7181O67761N88200j47737
40379A182789o76579m78195L4811K23504k2041l74064m94432k47715K04959M84587
40369a62376M04698K08289J47147P2605j78830l09601k1527L19507J52408l27020
$$ plain form
40359 305300 -116286 -160940 44391 115867 46247 29622 8273 -95436 -17710 415221 778327
40348 778327 595716 181476 246885 777320 1018887 613131 58360 -109031 17851 100927
40338 100927 97807 127560 166828 142934 76411 -22562 -154919 -164042 124735 535476 666812
40327 666812 474023 354158 533293 754665 739501 584077 497659 489666 528538 680286
40317 680286 868259 830075 563075 475413 792203 1125548 994497 514145 173638 124822
40307 124822 111057 -11993 -105211 -75938 -21679 -19925 -60892 -193565 -448970 -592008 -249638
40296 -249638 605243 1508420 1941245 1766792 1207053 593366 204524 134060 185030 56959
40286 56959 -231913 -268606 228337 927474 1172085 739844 94253 -190441 -68716 53632
$$ packed form
40359C05300m21586m4654K05331P1476o9620j6625k1349j03709P7726M32931L63106
40348G78327j82611m14240O5409N30435K41567m05756n54771j67391J26882Q3076
40338A00927l120K9753L9268k3894o6523r8973j32357r123K88777M10741J31336
40327F66812j92789j19865J79135K21372j5164j55424q6418p993L8872J51748
40317F80286J87973l8184k67000q7662L16790L33345j31051m80352l40507m8816
40307A24822j3765j23050r3218K9273N4259J754m0967j32673k55405j43038L42370
40296b49638Q54881R03177M32825j74453n59739o13687l88842p0464N0970j28071
40286E6959k88872l6693M96943O99137K44611m32241o45591k84694J21725J22348
$$ plain form
40276 53632 -88429 -319218 -329377 -105816 65776 -28027 -267195 -344797 -139913 119386
40266 119386 125716 -99374 -204340 14417 298434 282217 31899 -73515 46813 75022
40256 75022 -105969 -143111 193059 517727 335380 -214219 -560980 -501620 -318941 -183512
40246 -183512 44780 368832 508152 367469 236352 311866 376648 186311 -129415 -304721
40236 -304721 -319687 -295391 -235938 -129483 -109007 -257062 -411647 -394120 -264638 -131381
40226 -131381 98619 505392 860121 856788 550947 293358 292157 472840 682852 799253
40216 799253 730626 547982 496351 630988 609325 166748 -371226 -471137 -167343 41912
40206 41912 31312 195344 649619 894665 578529 80066 -85341 -38866 -231469 -659068
$$ packed form
40276E3632j42061k30789j0159K23561J71592r3803k39168p7602K04884K59299
40266A19386O330k25090j04966K18757K84017j6217k50318j05414J20328K8209
40256G5022j80991l7142L36170L24668j82347n49599l46761N9360J82679J35429
40246a83512K28292L24052J39320j40683j31117P5514O4782j90337l15726j75306
40236c04721j4966K4296N9453J06455K0476j48055j54585J7527J29482J33257
40226a31381K30000M06773L54729l333l05841k57589j201J80683K10012J16401
40216G99253o8627j82644n1631J34637k1663m42577n37974r9911L03794K09255
40206D1912j0600J64032M54275K45046l16136m98463j65407M6475j92603m27599
$$ plain form
40196 -659068 -924895 -923844 -913248 -935540 -702184 -145606 370250 556138 540290 526660 467176
40185 467176 315537 290912 564183 890545 890964 578682 295952 215777 228490 277079 444084
40174 444084 645486 576933 131744 -369727 -558129 -449844 -322001 -303374 -304395 -261223
40164 -261223 -218956 -186086 -97509 53554 192899 296891 412400 517419 502300 352647
40154 352647 225542 243918 307045 238496 84863 110003 434758 800149 828093 499583
40144 499583 218288 313310 596253 585071 143906 -302059 -279843 150067 475252 329497
40134 329497 -143091 -525950 -605702 -539149 -585344 -748325 -756221 -418900 78745 364159
40124 364159 333285 256994 392110 652744 765474 611364 295557 4080 -73085 192814
$$ packed form
40196f59068k65827J051J0596k2292K33356N56578N15856J85888j5848j3630n9484
40185D67176j51639k4625K73271L26362M19l12282k82730q0175J2713M8589J67005
40174D44084K01402o8553m45189n01471j88402J08285J27843J8627j021M3172
40164b61223M2267L2870Q8577J51063J39345J03992J15509J05019j5119j49653
40154C52647j27105J8376O3127o8549j53633K5140L24755L65391K7944l28510
40144D99583k81295R5022K82943j1182m41165m45965K2216M29910L25185j45755
40134C29497m72588l82859p9752O6553m6195j62981p896L37321M97645K85414
40124C64159l0874p6291J35116K60634J12730j54110l15807k91477p7165K65899
$$ plain form
40114 192814 689907 1025975 867237 307246 -243715 -512245 -573086 -641792 -799537 -922383
40104 -922383 -794079 -329413 240752 509031 333600 25807 -47024 94850 191172 179973
40094 179973 209840 305453 328501 250159 185988 176312 202133 381269 822847 1285514 1339301
40083 1339301 937238 495367 329169 358145 458331 687961 952323 846142 177210 -613426
40073 -613426 -910607 -655966 -322873 -281634 -474852 -650426 -646698 -446695 -141624 134340
40063 134340 322638 465488 575526 594562 549221 602072 836402 1105382 1196569 1054730
40053 1054730 790733 583710 581662 731107 717606 309459 -248624 -487216 -365665 -288837
40043 -288837 -410333 -398530 -90325 121668 -103631 -484568 -562647 -371518 -224373 -137283
$$ packed form
40114A92814M97093L36068j58738n59991n50961k68530o0841o8706j57745j22846
40104i22383J28304M64666N70165K68279j75431l07793p2831J41874R6322j1199
40094A79973K9867R5613K3048p8342o4171r676K5821J79136M41578M62667N3787
40083A339301m02063m41871j66198K8976J00186K29630K64362j06181o68932p90636
40073f13426k97181K54641L33093M1239j93218j75574L728K00003L05071K75964
40063A34340J88298J42850J10038J9036m5341N2851K34330K68980R1187j41839
40053A054730k63997k07023k048J49445j3501m08147n58083k38592J21551P6828
40043b88837j21496J1803L08205K11993k25299l80937p8079J91129J47145Q7090
$$ plain form
40033 -137283 57303 254598 223376 53290 19800 145174 290298 495571 799044 916398
40023 916398 596036 135915 35725 262036 376536 268413 197211 203219 82377 -83999
40013 -83999 14015 315391 441398 363788 395554 490795 257102 -226238 -348325 55250
40003 55250 392393 278738 88910 159750 161160 -218947 -601101 -540037 -291382 -288296 -294025
39992 -294025 196239 1009855 1479509 1399566 1134185 887348 524634 101126 -62246 69480
39982 69480 123786 -115539 -421736 -518673 -423471 -282547 -133954 68535 369412 754135
39972 754135 1027380 860664 196826 -515273 -773994 -597347 -337177 -74331 376698 929423
39962 929423 1189492 1057241 941453 1167904 1473951 1330246 617756 -187112 -454548 10871
$$ packed form
40033a37283J94586J97295l1222j70086l3490J25374J45124K05273L03473J17354
40023I16398l20362m60121j00190K26311J14500j08123p1202O008j20842j66376
40013h3999R8014L01376J26007p7610L1766R5241k33693m83340j22087M03575
40003E5250L37143j13655j89828P0840J410l80107l82154O1064K48655L086n729
39992b94025M90264Q13616M69654p9943k65381k46837l62714m23508j63372J31726
39982F9480N4306k39325l06197r6937R5202J40924J48593K02489L00877L84723
39972G54135K73245j66716o63838p12099k58721J76647K60170K62846M51029N52725
39962I29423K60069j32251j15788K26451L06047j43705p12490q04868k67436M65419
$$ plain form
39952 10871 758544 1089377 739581 98393 -312382 -381437 -282362 -74890 243484 468286
39942 468286 364729 47522 -166179 -231196 -358784 -579280 -686002 -593326 -392094 -75786
39932 -75786 399187 787858 716973 227910 -229683 -398510 -420850 -426587 -378548 -393030 -690012
39921 -690012 -1071410 -990536 -382481 111035 67413 -102101 101442 408016 256129 -248542
39911 -248542 -538375 -539683 -690960 -1019748 -928338 -131087 766269 1001142 609578 250953
39901 250953 284866 439697 371657 164139 94948 152020 82177 -128294 -149659 179886 512544
39890 512544 435583 85756 -30072 240977 529802 512475 262901 -23077 -250815 -258456
39880 -258456 129107 664726 741917 199893 -352172 -388944 -219347 -376004 -637276 -350218
$$ packed form
39952A0871P47673L30833l49796o41188m10775o9055R9075K07472L18374K24802
39942D68286j03557l17207k13701o5017j27588k20496j06722R2676K01232L16308
39932g5786M74973L88671p0885m89063m57593j68827k2340n737M8039j4482k96982
39921f90012l81398Q0874O08055M93516m3622j69514K03543L06574j51887n04671
39911b48542k89833j308j51277l28788R1410P97251Q97356K34873l91564l58625
39901B50953L3913J54831o8040k07518o9191N7072o9843k10471k1365L29545L32658
39890E12544p6961l49827j15828K71049K88825j7327k49574k85978k27738p641
39880b58456L87563N35619P7191n42024n52065l6772J69597j56657k61272K87058
$$ plain form
39870 -350218 453462 1014884 961313 776760 966787 1342904 1451470 1259494 1038704 875305
39860 875305 672021 468283 436144 617948 873982 1046346 1057807 927960 779961 739418
39850 739418 775284 771733 801780 1149825 1960665 3003807 3879539 4358064 4488886 4528263
39840 4528263 4793428 5433868 6350890 7537204 9407780 12357259 15840514 18317017 18495281
39831 18495281 16510778 13673971 11239641 9619689 8551161 7672721 6956872 6742527
39823 6742527 7276479 8234569 9077980 10042881 12178956 15791975 19227570 20084740 17712222
39814 17712222 13819561 10497390 8354551 6862744 5678854 4865367 4257307 3494777
39806 3494777 2667162 2259632 2354500 2432237 2146490 1814764 1849597 2083082 2049383 1721369
$$ packed form
39870c50218Q03680N61422n3571j84553J90027L76117J08566j91976k20790j63399
39860H75305k03284k03738l2139J81804K56034J72364J1461j29847j47999m0543
39850G39418L5866l551L0047L48045Q10840J043142Q75732M78525J30822L9377
39840D528263K65165O40440R17022J186314J870576K949479L483255K476503J78264
39831A8495281j984503k836807k434330j619952j068528q78440p15849k14345
39823F742527N33952R58090Q43411R64901K136075L613019L435595Q57170k372518
39814A7712222l892661l322171k142839j491807j183890q13487o08060p62530
39806C494777q27615m07530R4868P7737k85747l31726L4833K33485l3699l28014
$$ plain form
39796 1721369 1540529 1747774 2046812 2031282 1701521 1405578 1394284 1572186 1646290 1442407
39786 1442407 1096464 958325 1250073 1789850 2122916 1962521 1425562 815028 329775
39777 329775 95104 280690 903633 1572357 1755315 1395215 990582 934753 1037618 913567
39767 913567 598675 458591 618963 844003 947644 984920 1003178 923759 754208 632863
39757 632863 570929 440997 327829 549792 1134663 1605165 1568465 1231974 1000116 837297
39747 837297 477554 64925 26549 341232 497412 286330 104343 240566 364858 109521
39737 109521 -215761 9192 796784 1468280 1480354 972905 452599 230291 251098 247765
39727 247765 -27259 -541837 -885468 -606815 254447 1108365 1382363 1058133 596005 449901
$$ packed form
39796A721369j80840K07245K99038j5530l29761k95943j1294J77902P4104k03883
39786A442407l45943j38139K91748N39777L33066j60395n36959o10534m85253
39777C29775k34671J85586O22943O68724J82958l60100m04633n5829J02865j24051
39767I13567l14892j40084J60372K25040J03641L7276J8258p9419j69551j21345
39757F32863o1934j29932j13168K21963N84871M70502l6700l36491k31858j62819
39747H37297l59743m12629l8376L14683J56180k11082j81987J36223J24292k55337
39737A09521l25282K24953P87592O71496J2074n07449n20306k22308K0807l333
39727B47765k75024n14578l43631K78653Q61262Q53918K73998l24230m62128j46104
$$ plain form
39717 449901 726935 1192875 1485763 1393468 1039402 773175 810931 1023548 1134221 1047247
39707 1047247 877285 715380 525413 293612 141792 208816 489388 857147 1186776 1382091
39697 1382091 1352230 1085233 738552 539124 555753 640523 603590 361400 -69131 -558217
39687 -558217 -804208 -502952 258607 930246 1032954 683701 392423 427384 619077 718905
39677 718905 653532 432478 119817 -54671 129307 517617 716201 685088 807291 1182503
39667 1182503 1293937 732742 -112341 -546369 -480127 -337959 -251664 39516 511426 707734
39657 707734 442698 143169 228298 529490 605383 348319 16404 -121978 37619 416955
39647 416955 733019 708125 464225 452120 795440 1011033 683143 134689 1824 301769
$$ packed form
39717D49901K77034M65940K92888r2295l54066k66227L7756K12617J10673q6974
39707A047247j69962j61905j89967k31801j51820O7024K80572L67759L29629J95315
39697A382091k9861k66997l46681j99428J6629Q4770l6933k42190m30531m89086
39687e58217k45991L01256P61559O71639J02708l49253k91278L4961J91693R9828
39677G18905o5373k21054l12661j74488J83978L88310J98584l1113J22203L75212
39667A182503J11434n61195q45083m34028O6242J42168Q6295K91180M71910J96308
39657G07734k65036k99529Q5129L01192P5893k57064l31915j38382J59597L79336
39647D16955L16064k4894k43900j2105L43320K15593l27890n48454j32865K99945
$$ plain form
39637 301769 416736 17616 -463250 -462942 -47548 241361 124080 -132991 -161078 27740
39627 27740 133693 28033 -83935 4239 187985 229406 129254 92017 157730 134225 -54153
39616 -54153 -205434 -137761 70227 258648 391072 443715 321967 69991 -57889 49446
39606 49446 148968 31495 -101926 33327 299197 351127 241638 358872 763631 1029125
39596 1029125 856249 477609 270124 254968 194350 -9257 -211013 -223691 -8970 257052
39586 257052 301658 79082 -58447 244871 781150 929531 476838 -48512 -69439 308563
39576 308563 543530 403845 123795 -52219 -111853 -82842 68527 279395 374736 287786
39566 287786 115318 -79874 -311778 -471374 -343205 40495 297238 164873 -101475 -81331
$$ packed form
39637C01769J14967l99120m80866L08M15394K88909j17281k57071k8087J88818
39627B7740J05953j05660j11968Q8174J83746M1421j00152l7237O5713k3505j88378
39616e4153j51281O7673K07988J88421J32424N2643j21748k51976j27880J07335
39606D9446R9522j17473j33421J35253K65870N1930j09489J17234M04759K65494
39596A029125j72876l78640k07485j5156o0618k03607k01756j2678K14721K66022
39586B57052M4606k22576j37529L03318N36279J48381m52693n25350k0927L78002
39576C08563K34967j39685k80050j76014n9634K9011J51369K10868R5341q6950
39566B87786j72468j95192k31904j59596J28169L83700K56743j32365k66348K0144
$$ plain form
39556 -81331 174983 216914 -87243 -294658 -44213 357555 347452 -80401 -375443 -211915
39546 -211915 131194 257525 151721 4663 -144752 -324278 -408575 -274731 -24684 212633
39536 212633 537265 1023866 1363309 1166356 583782 201532 263649 406074 290941 100425
39526 100425 151450 347730 360848 180856 149523 488759 1039223 1463462 1546307 1313407
39516 1313407 982132 773735 688831 528643 209666 -63501 -67919 109342 188735 76149
39506 76149 -61366 -71050 14607 101232 173813 253628 304152 243922 39971 -208100 -279655
39495 -279655 -14963 449089 720567 559314 188112 44417 241718 463534 442260 343139
39485 343139 496251 857322 998131 696586 311766 369457 883649 1345575 1379527 1128229
$$ packed form
39556h1331K56314M1931l04157k07415K50445M01768j0103m27853k95042J63528
39546b11915L43109J26331j05804j47058j49415j79526q4297J33844K50047K37317
39536B12633L24632M86601L39443j96953n82574l82250O2117J42425j15133j90516
39526A00425N1025J96280J3118j79992l1333L39236N50464M24239Q2845k32900
39516A313407l31275k08397q4904j60188l18977k73167m418J77261P9393j12586
39506G6149j37515r684Q5657Q6625P2581P9815N0524o0230k03951k48071p1555
39495b79655K64692M64052K71478j61253l71202j43695J97301K21816k1274r9121
39485C43139J53112L61071J40809l01545l84820N7691N14192M61926L3952k51298
$$ plain form
39475 1128229 898890 731431 543270 443057 553890 676748 526586 245453 256459 578750
39465 578750 738898 506680 280146 474025 894635 1071625 931109 739106 562101 225029
39455 225029 -240694 -507063 -371305 18807 426164 763437 983082 943143 542092 -83793
39445 -83793 -596522 -705351 -404438 18523 263301 314116 353430 394361 230058 -162810
39435 -162810 -451106 -397540 -250511 -379660 -693302 -773018 -498805 -174512 -46456 -45082
39425 -45082 -44639 -63333 -127769 -205843 -344207 -617794 -883449 -865968 -587222 -421542 -566820
39414 -566820 -722810 -519837 -81657 97910 -226583 -761814 -1011206 -784293 -342384 -70467
39404 -70467 -33011 68813 442853 834771 790031 221238 -502712 -1007926 -1214498 -1179182
$$ packed form
39475A128229k29339j67459j88161j00213J10833J22858j50162k81133J1006L22291
39465E78750J60148k32218k26534J93879M20610J76990j40516j92003j77005l37072
39455B25029m65723k66369J35758L90112M07357L37273K19645l9939m01051o25885
39445h3793n12729j08829L00913M22961K44778N0815L9314M0931j64303l92868
39435a62810k88296N3566J47029j29149l13642p9716K74213L24293J28056J374
39425d5082M43j8694o4436p8074j38364k73587k65655J7481K78746J65680j45278
39414e66820j55990K02973M38180J79567l24493n35231k49392K26913M41909K71917
39404g0467L7456J01824L74040L91918m4740n68793p23950n05214k06572L5316
$$ plain form
39394 -1179182 -926394 -544929 -225317 -54703 80232 291224 534585 731160 877337
39385 877337 953218 871919 603519 227255 -171025 -507697 -624310 -430205 -136280 -76206
39375 -76206 -243769 -302112 -128239 -6207 -135436 -304122 -274912 -165152 -170686 -218633 -211795
39364 -211795 -323084 -653127 -836123 -455638 268840 669755 470243 21063 -290850 -441436
39354 -441436 -504548 -395614 -68593 302204 517825 557659 475239 264030 -62197 -389639
39344 -389639 -591007 -594405 -348734 137820 698848 1095313 1234790 1183078 966278 539017
39334 539017 -13583 -418443 -459944 -205093 68371 133116 17506 -15581 233506 592592
39324 592592 666567 376021 104748 130380 208401 56218 -43574 348606 970222 1038966
$$ packed form
39394a179182K52788L81465L19612J70614J34935K10992K43361J96575J46177
39385H77337P5881q1299k68400l76264l98280l36672j16613J94105K93925O0074
39375g6206j67563n8343J73873J22032j29229j68686K9210J09760n534m7947O838
39364b11795j11289l30043j82996L80485P24478M00915j99512m49180l11913j50586
39354d41436o3112J08934L27021L70797K15621L9834q2420k11209l26227l27442
39344c89639k01368l398K45671M86554N61028L96465J39477n1712k16800m27261
39334E39017n52600m04860m1501K54851K73464O4745j15610l3087K49087L59086
39324E92592P3975k90546k71273K5632P8021j52183r9792L92180O21616O8744
$$ plain form
39314 1038966 344695 -439483 -700043 -566953 -403636 -183332 210353 516318 446282 220865
39304 220865 263633 537489 631982 391231 51305 -156993 -175970 16137 347682 536303
39294 536303 381729 102728 37794 114312 19035 -192232 -141219 214204 476870 470780 518353
39283 518353 863225 1246862 1318032 1112133 857408 616970 404026 366256 534404 609588
39273 609588 329413 -108205 -277949 -50114 379154 824885 1185923 1308229 1097385 713858
39263 713858 391634 127994 -195691 -481342 -503257 -273890 -22212 156374 335788 488172
39253 488172 500590 445673 497697 573830 414755 50825 -191268 -202395 -203593 -260631 -152094
39242 -152094 112824 149310 -149439 -309739 -21473 284223 119748 -202042 -50102 459042
$$ packed form
39314A038966o94271p84178k60560J33090J63317K20304L93685L05965p0036k25417
39304B20865M2768K73856R4493k40751l39926k08298j8977J92107L31545J88621
39294E36303j54574k79001o4934P6518r5277k11267N1013L55423K62666o090M7573
39283E18353L44872L83637P1170k05899k54725k40438k12944l7770J68148P5184
39273F09588k80175m37618j69744K27835M29268M45731L61038J22306k10844l83527
39263G13858l22224k63640l23685k85651k1915K29367K51678J78586J79414J52384
39253D88172J2418n4917N2024P6133j59075l63930k42093j1127j198n7038J08537
39242a52094K64918L6486k98749j60300K88266L05696j64475l21790J51940N09144
$$ plain form
39232 459042 625112 293314 45145 188595 314537 104632 -102130 59226 334846 302884
39222 302884 46983 -98440 -133694 -225685 -231693 61503 389749 257649 -318302 -817111
39212 -817111 -963419 -977902 -1018395 -875598 -421196 53722 220205 153851 151882 321965
39202 321965 566460 785809 890603 777215 489425 251038 149929 -35522 -464178 -856562
39192 -856562 -799474 -337540 66851 149381 89223 89921 68389 -58518 -75422 241430 688945
39181 688945 815503 509344 130413 23206 160972 359370 565132 728043 608723 35833
39171 35833 -715702 -1121234 -1013438 -718184 -523862 -327441 21200 325213 312458 128550
39161 128550 176596 491217 645493 382972 20712 11366 324742 538666 441684 247324
$$ packed form
39232D59042J66070l31798k48169J43450J25942k09905k06762J61356K75620l1962
39222C02884k55901j45423l5254r1991o008K93196L28246j32100n75951m98809
39212h17111j46308j4483m0493J42797M54402M74918J66483o6354j969J70083
39202C21965K44495K19349J04794j13388k87790k38387j01109j85451m28656l92384
39192h56562N7088M61934M04391Q2530o0158O98k1532j26907j6904L16852M47515
39181F88945J26558l06159l78931j07207J37766J98398K05762J62911j19320n72890
39171C5833p51535m05532J07796K95254J94322J96421L48641L04013j2755j83908
39161A28550M8046L14621J54276k62521l62260r346L13376K13924r6982j94360
$$ plain form
39151 247324 176771 101499 -212818 -653922 -824263 -584972 -297757 -362794 -689244 -879053
39141 -879053 -834257 -824932 -922764 -783178 -212057 410775 627761 554411 599969 733163 570132
39130 570132 143820 -17600 278110 531801 307103 -128411 -281157 -165484 -129302 -241744
39120 -241744 -330183 -426564 -678958 -926560 -854567 -535254 -341008 -327624 -214446 -27466
39110 -27466 -176535 -682908 -914170 -494233 -4006 -224846 -990747 -1424249 -1189800 -842154
39100 -842154 -839075 -853068 -405831 282240 568910 300491 -32644 -17685 209987 299403
39090 299403 160388 -55156 -216441 -259450 -115068 202553 502872 589280 492967 395020
39080 395020 349665 240148 -3149 -306735 -594268 -856541 -1031601 -982872 -701631 -408866
$$ packed form
39151B47324p0553p5272l14317m41104j70341K39291K87215o5037l26450j89809
39141h79053M4796R325r7832J39586N71121O22832K16986p3350M5558J33194j63031
39130E70132m26312j61420K95710K53691k24698m35514j52746J15673L6182j12442
39120b41744q8439r6381k52394k47602P1993L19313J94246J3384J13178J86980
39110b7466j49069n06373k31262M19937M90227k20840p65901m33502K34449L47646
39100h42154L079j3993M47237O88071K86670k68419l33135J4959K27672Q9416
39090B99403j39015k15544j61285m3009J44382L17621L00319Q6408r6313r7947
39080C95020m5355j09517k43297l03586k87533k62273j75060M8729K81241K92765
$$ plain form
39070 -408866 -333684 -460540 -582999 -528782 -250394 201034 665580 919915 881865 731771
39060 731771 704298 801116 841849 754423 648451 608065 587543 555179 588210 739866 903317
39049 903317 888302 608055 181122 -127743 -132449 24294 -53832 -516140 -925619 -700449
39039 -700449 96924 736988 709822 314753 139218 246147 249502 28201 -89380 115410
39029 115410 395135 398949 137110 -95071 -97858 79997 260176 290497 169916 97063 290137
39018 290137 686169 946101 856641 601917 507806 619607 690651 546143 317718 296627
39008 296627 602272 995104 1052899 630925 106681 -20434 242457 433831 357243 343859
38998 343859 590533 690312 265626 -280687 -252095 287297 620263 502842 451334 760600
$$ packed form
39070d08866P5182j26856j22459N4217K78388M51428M64546K54335l8050j50094
39060G31771k7473R6818M0733q7426j05972m0386k0522l2364L3031J51656J63451
39049I03317j5015k80247m26933l08865m706J56743p8126m62308m09479K25170
39039g00449P97373O40064k7166l95069j75535J06929L355k21301j17581K04790
39029A15410K79725L814k61839k32181k787J77855J80179L0321j20581p2853J93074
39018B90137L96032K59932q9460k54724r4111J11801P1044j44508k28425k1091
39008B96627L05645L92832N7795m21974n24244j27115K62891J91374p6588j3384
38998C43859K46674R9779m24686n46313K8592N39392L32966j17421n1508L09266
$$ plain form
38988 760600 982044 740537 416869 497091 759380 720634 512324 637793 1079544 1320360
38978 1320360 1171253 966340 941734 976943 974974 964983 788066 235793 -402557 -500338 9552
38967 9552 425636 219204 -294296 -522700 -390208 -195935 -50140 127017 283690 292886
38957 292886 176934 -471 -281594 -603910 -666432 -296559 239557 565029 636297 597435
38947 597435 425952 56602 -326433 -469875 -402070 -314234 -241030 -142794 -117312 -201613 -152399
38936 -152399 203561 574647 579338 379180 478029 960903 1398873 1504555 1437769 1422648
38926 1422648 1472311 1552926 1644667 1585518 1220389 754765 588570 740467 810253 576440
38916 576440 246702 36392 -106067 -248892 -337208 -407123 -549190 -574630 -178264 435861
$$ packed form
38988G60600K21444k41507l23668Q0222K62289l8746k08310J25469M41751K40816
38978A320360j49107k04913k4606L5209j969r991j76917n52273o38350r7781N09890
38967I552M16084k06432n13500k28404J32492J94273J45795J77157J56673R196
38957B92886j15952j77405k81123l22316o2522L69873N36116L25472P1268l8862
38947E97435j71483l69350l83035j43442O7805Q7836P3204R8236K5482q4301M9214
38936a52399L55960L71086M691k00158R8849M82874M37970J05682o6786j5121
38926A422648M9663Q0615R1741n9149l65129m65624j66195J51897O9786k33813
38916E76440l29738k10310j42459j42825q8316o9915j42067k5440L96366O14125
$$ plain form
38906 435861 617660 200980 -153062 108308 634127 758259 470722 255407 240893 109569
38896 109569 -250602 -540954 -524347 -297193 -45357 149767 224173 126578 -49934 -134931
38886 -134931 -93939 -16057 66110 170969 246801 240003 213801 214453 114839 -180298 -445881
38875 -445881 -316803 236214 818453 1021973 774332 289982 -163448 -428952 -504602 -459573
38865 -459573 -301323 -5554 314763 444759 346530 210043 126849 -44699 -324803 -398481
38855 -398481 -39409 457931 607025 381205 219951 434829 881753 1194988 1117480 636865
38845 636865 2869 -424782 -506179 -424874 -348041 -180852 140173 354992 211222 -89956
38835 -89956 -153121 22464 102302 309 3828 303049 743275 1092668 1282897 1367879 1478765
$$ packed form
38906D35861J81799m16680l54042K61370N25819J24132k87537k15315j4514j31324
38896A09569l60171k90352J6607K27154K51836J95124P4406r7595j76512q4997
38886a34931M0992P7882Q2167J04859P5832o798k6202O52r9614k95137k65583
38875d45881J29078N53017N82239K03520k47641m84350m53430k65504p5650M5029
38865d59573J58250K95769L20317J29996r8229j36487q3194j71548k80104p3678
38855c98481L59072M97340J49094k25820j61254K14878M46924L13235p7508m80615
38845F36865o33996m27651q1397Q1305P6833J67189L21025K14819j43770l01178
38835h9956o3165J75585P9838j01993L519K99221M40226L49393J90229Q4982J10886
$$ plain form
38824 1478765 1779374 2227568 2480111 2321061 2054344 2111185 2383969 2376238 1951695 1480501
38814 1480501 1251076 1193653 1217973 1363486 1526568 1460408 1156499 867327 696399 542287
38804 542287 469078 692028 1133805 1435025 1481467 1495350 1561426 1529134 1423946 1451944 1561660
38793 1561660 1547062 1592549 2066491 2743984 3004910 2921051 3296745 4419128 5679211 6725297
38783 6725297 7991853 9679088 11306750 12849204 15191940 18908819 24083764 32127604
38775 32127604 45401238 62523172 75585859 75777771 62472040 44273200 30303342
38768 30303342 22667058 18207753 14603740 12084648 10776880 9577930 7897430 6450165
38760 6450165 5768214 5290578 4433775 3508134 3033104 2906025 2738823 2469344 2236085
$$ packed form
38824A478765L00609M48194K52543j59050k66717N6841K72784p731m24543m71194
38814A480501k29425n7423K4320J45513J63082o6160l03909k89172j70928j54112
38804E42287p3209K22950M41777L01220M6442J3883O6076l2292j05188K7998J09716
38793A561660j4598M5487M73942O77493K60926q3859L75694J122383J260083J046086
38783F725297J266556J687235J627662J542454K342736L716879N174945Q043840
38775C2127604J3273634J7121934J3062687J91912j3305731j8198840j3969858
38768C0303342p636284m459305l604013k519092j307768j198950j680500j447265
38760F450165o81951m77636q56803r25641m75030j27079j67202k69479k33259
$$ plain form
38751 2236085 2060700 1969029 2092651 2407283 2644772 2621792 2390727 1987048 1367033 711694
38741 711694 437059 710853 1221981 1576657 1670577 1558268 1264443 904368 707928 703451
38731 703451 607341 239313 -175743 -346812 -332974 -346373 -344488 -170267 28929 -70527 -423147
38720 -423147 -585423 -331032 46719 210904 242871 371563 499853 365115 49436 -68717
38710 -68717 108243 232494 43317 -248057 -299060 -109693 86969 215291 353030 456012
38700 456012 389775 204215 117321 231270 484869 845945 1281861 1561503 1415574 957452
38690 957452 629734 621567 643432 427136 133797 46649 149785 292996 517328 865789
38680 865789 1068596 838509 391581 235482 420534 432693 -31668 -567425 -591243 -113187
$$ packed form
38751B236085j75385r1671J23622L14632K37489k2980k31065m03679o20015o55339
38741G11694k74635K73794N11128L54676R3920j12309k93825l60075j96440m477
38731G03451r6110l68028m15056j71069J3838j3399J885J74221J99196r9456l52620
38720d23147j62276K54391L77751J64185L1967J28692J28290j34738l15679j18153
38710f8717J76960J24251j89177k91374n1003J89367J96662J28322J37739J02982
38700D56012o6237j85560q6894J13949K53599L61076M35916K79642j45929m58122
38690I57452l27718q167K1865k16296k93339q7148J03136J43211K24332L48461
38680H65789K02807k30087m46928j56099J85052J2159m64361n35757k3818M78056
$$ plain form
38670 -113187 318779 321280 54052 -70650 155711 588656 883745 769178 279012 -252610
38660 -252610 -506072 -490921 -465484 -557344 -600678 -395062 14551 419940 696901 822249
38650 822249 730521 369450 -93266 -331275 -219242 16584 95759 -7824 -146346 -227266
38640 -227266 -225708 -111230 75781 197878 230259 349190 616262 747801 478972 21391
38630 21391 -179060 -55619 76196 77543 125118 269253 310316 239954 369765 819732 1264333
38619 1264333 1414371 1386279 1346401 1167927 756703 366657 219521 115036 -179433 -428661
38609 -428661 -273172 137824 330831 186654 -11107 -80629 -40650 183876 660787 1101994
38599 1101994 1103582 739269 465006 438685 406084 265912 221551 294215 215285 -53410 -197870
$$ packed form
38670a13187M31966K501k67228j24702K26361M32945K95089j14567m90166n31622
38660b52610k53462J5151K5437r1860m3334K05616M09613M05389K76961J25348
38650H22249r1728l61071m62716k38009J12033K35826P9175j03583j38522q0920
38640b27266J558J14478J87011J22097L2381J18931K67072J31539k68829m57581
38630B1391k00451J23441J31815J347M7575J44135M1063p0362J29811M49967M44601
38619A264333J50038k8092l9878j78474m11224l90046j47136j04485k94469k49228
38609d28661J55489M10996J93007j44177j97761o9522L9979K24526M76911M41207
38599A101994J588l64313k74263k6321l2601j40172m4361P2664p8930k68695j44460
$$ plain form
38588 -197870 -129047 -185501 -535300 -850864 -841119 -657026 -494870 -266639 10198 -12219
38578 -12219 -412645 -619291 -154657 585581 867452 669365 587509 842903 1013154 766752
38568 766752 332501 137129 353920 856050 1291105 1227011 586984 -85081 -171402 230110
38558 230110 459242 206823 -183937 -345465 -299827 -130761 238045 714898 953604 872538
38548 872538 848192 1085606 1201133 824341 270533 139040 460872 718098 578228 157753
38538 157753 -358842 -894638 -1275421 -1291937 -1039228 -811965 -596641 -92357 623235 912795
38528 912795 380377 -496078 -932392 -804769 -606019 -574982 -403611 106013 578822 549147
38518 549147 115473 -209486 -150655 133568 433802 750138 1119309 1430918 1541698 1433106
$$ packed form
38588a97870O8823n6454l49799l15564R745J84093J62156K28231K76837k2417
38578a2219m00426k06646M64634P40238K81871j98087q1856K55394J70251k46402
38568G66752m34251j95372K16791N02130M35055o4094o40027o72065q6321M01512
38558B30110K29132k52419l90760j61528M5638J69066L68806M76853K38706q1066
38548H72538k4346K37414J15527l76792n53808j31493L21832K57226j39870m20475
38538A57753n16595n35796l80783j6516K52709K27263K15324N04284P15592K89560
38528I12795n32418q76455m36314J27623J98750L1037J71371N09624M72809k9675
38518E49147m33674l24959N8831K84223L00234L16336L69171L11609J10780j08592
$$ plain form
38508 1433106 1154394 717205 149744 -410292 -766290 -793406 -512813 -96139 212522 284012
38498 284012 230505 246183 337068 366656 361356 524203 861147 1061782 933366 712377 691811
38487 691811 749722 582974 263223 148046 264635 214428 -194040 -590472 -533522 -90439
38477 -90439 310818 430802 393461 429749 656715 1050426 1462992 1685364 1614283 1352419
38467 1352419 1085090 892053 712908 441839 48252 -319342 -389216 -81916 269850 263407
38457 263407 -2186 -22265 344403 589498 299797 -162371 -133181 421336 913925 969183
38447 969183 765779 559716 377843 315567 653432 1377995 1922058 1743686 1006092 393989
38437 393989 353818 751187 1185732 1385902 1304434 1038453 717019 384447 1685 -393844
$$ packed form
38508A433106k78712m37189n67461n60036l55998k7116K80593M16674L08661P1490
38498B84012n3507J5678R0885K9588n300J62847L36944K00635j28416k20989k0566
38487F91811N7911j66748l19751j15177J16589n0207m08468l96432N6950M43083
38477i0439M01257J19984l7341L6288K26966L93711M12566K22372p1081k61864
38467A352419k67329j93037j79145k71069l93587l67594o9874L07300L51766o443
38457B63407k65593k0079L66668K45095k89701m62168K9190N54517M92589N5258
38447I69183k03404k06063j81873o2276L37865P24563N44063j78372p37594o12103
38437C93989m0171L97369M34545K00170q1468k65981l21434l32572l82762l95529
$$ plain form
38427 -393844 -631403 -618788 -506505 -484647 -495967 -337188 -4293 264340 301247 189750
38417 189750 95234 71564 84976 92703 34419 -144098 -405332 -657703 -906963 -1232927 -1563940
38406 -1563940 -1645740 -1364268 -968926 -805218 -898153 -972572 -851314 -654487 -584078 -660896
38396 -660896 -726601 -602048 -209309 353223 808055 878114 548774 91656 -210946 -281166
38386 -281166 -161751 117328 455500 599433 371530 -32014 -176360 121933 594206 875600
38376 875600 908556 879171 884847 845299 701092 530061 447538 521263 806457 1308867 1822438
38365 1822438 1946096 1454968 634247 58224 -23184 77788 -32247 -272705 -244753 128655
38355 128655 440189 385454 225949 405447 875740 1141072 945668 586538 459309 579027
$$ packed form
38427c93844k37559J2615J12283K1858j1320J58779L32895K68633L6907j11497
38417A89750r4516k3670J3412P727n8284j78517k61234k52371k49260l25964l31013
38406a563940q1800K81472L95342J63708r2935p4419J21258J96827P0409p6818
38396f60896o5705J24553L92739N62532M54832P0059l29340m57118l02602p0220
38386b81166J19415K79079L38172J43933k27903m03544j44346K98293M72273K81394
38376H75600L2956k9385N676l9548j44207j71031q2523P3725K85194N02410N13571
38365A822438J23658m91128q20721n76023q1408J00972j10035k40458K7952L73408
38355A28655L11534n4735j59505J79498M70293K65332j95404l59130j27229J19718
$$ plain form
38345 579027 711151 748242 737376 678509 526145 329779 189849 114678 64605 74846 180078
38334 180078 282546 269229 208313 244422 341586 336148 222779 160716 183545 142304 -3896
38323 -3896 -70716 77561 334283 540812 685098 783985 746526 515776 209379 -34842
38313 -34842 -228190 -398623 -431760 -237654 29161 126398 44151 -15362 73366 266976 490948
38302 490948 669319 655194 353833 -72824 -323622 -309907 -210843 -155199 -55426 168319
38292 168319 396779 481069 477200 566803 801836 1046068 1164887 1200440 1317803 1566421
38282 1566421 1745290 1633075 1376448 1443959 2045910 2815351 3328796 3750257 4591777 6027050
38272 6027050 8003842 10922902 15285374 20232568 23244893 22249664 17866685 12834107
$$ packed form
38345E79027J32124L7091j0866n8867j52364j96366j39930p5171n0073J0241J05232
38334A80078J02468j3317o0916L6109R7164n438j13369o2063K2829m1241j46200
38323c896o6820J48277K56722K06529J44286R8887l7459k30750l06397k44221
38313c4842j93348j70433l3137J94106K66815R7237q2247n9513Q8728J93610K23972
38302D90948J78371j4125l01361m26657k50798J3715R9064N5644R9773K23745
38292A68319K28460Q4290l869Q9603K35033K44232J18819L5553J17363K48618
38282A566421J78869j12215k56627O7511O01951P69441N13445M21461Q41520J435273
38272F027050J976792K919060M362472M947194L012325r95229m382979n032578
$$ plain form
38264 12834107 9265890 7157708 5542443 4133915 3303264 3085926 3001327 2724695 2374323
38255 2374323 2110982 1852639 1466900 977842 502233 148588 1529 58837 189252 283277
38245 283277 394345 572172 643139 405187 16668 -94818 222623 642853 806973 736728
38235 736728 662486 661435 671581 698937 773317 796967 664745 470868 381812 367761 301723
38224 301723 269398 465913 760548 724167 246356 -199952 -171689 126046 182867 -29488
38214 -29488 -51027 301363 617974 513010 196782 154986 490192 893228 1131490 1224997
38204 1224997 1165421 811928 196270 -315088 -369252 -31779 321515 452060 430848 387666
38194 387666 292158 88951 -83103 2050 325570 558717 415140 -31209 -473844 -719503
$$ packed form
38264A2834107l568217k108182j615265j408528q30651k17338q4599k76632l50372
38255B374323k63341k58343l85739m89058m75609l53645j47059N7308J30415R4025
38245B83277J11068J77827P0967k37952l88519j11486L17441M20230J64120p0245
38235G36728p4242j051J0146K7356P4380K3650j32222j93877q9056j4051o6038
38224C01723l2325J96515K94635l6381m77811m46308K8263K97735N6821k12355
38214b9488k1539L52390L16611j04964l16228m1796L35206M03036K38262R3507
38204A224997n9576l53493o15658n11358n4164L37473L53294J30545k1212m3182
38194C87666r5508k03207j72054Q5153L23520K33147j43577m46349m42635k45659
$$ plain form
38184 -719503 -764679 -613142 -242246 234655 588947 734564 784107 780590 600290 250502
38174 250502 9273 32851 33666 -336165 -915287 -1203670 -1045642 -765920 -604668 -408519
38164 -408519 -8566 443879 720558 824437 843594 734166 487898 323013 442367 720864
38154 720864 868202 809543 693152 610259 527889 445629 419944 455940 512542 562459 549875
38143 549875 413920 267793 357896 662847 768556 423367 -7230 -16912 290457 392313
38133 392313 191610 127621 407733 680655 644453 479523 424926 374229 209558 135477
38123 135477 296836 398180 134923 -254816 -329069 -145895 -142045 -401983 -533124 -276925
38113 -276925 186532 594393 865816 933044 699559 317692 168897 367253 549169 366914
$$ packed form
38184g19503m5176J51537L70896M76901L54292J45617M9543l517j80300l49788
38174B50502k41229K3578Q15l69831n79122k88383J58028K79722J61252J96149
38164d08519L99953M52445K76679J03879J9157j09428k46268j64885J19354K78497
38154G20864J47338n8659j16391q2893q2370q2260k5685L5996N6602M9917j2584
38143E49875j35955j46127R0103L04951J05709l45189m30597r682L07369J01856
38133C92313k00703o3989K80112K72922l6202j64930n4597n0697j64671p4081
38123A35477J61359J01344k63257l89739p4253J83174L850k59938j31141K56199
38113b76925M63457M07861K71423O7228k33485l81867j48795J98356J81916j82255
$$ plain form
38103 366914 -24044 -190353 22731 370240 541484 433225 155639 -75377 -76170 157961
38093 157961 429220 491392 226564 -273108 -705527 -712668 -227309 340828 477323 151356
38083 151356 -184459 -208592 -57783 54172 202937 500849 762941 765029 662973 790444
38073 790444 1116134 1262560 1073781 832095 822792 952527 933159 656721 258401 -65967
38063 -65967 -204005 -179510 -120537 -98159 -3221 278107 576805 551277 167916 -145988 1228
38052 1228 469227 788280 759958 615603 583320 548187 278623 -155033 -397163 -256066
38042 -256066 31538 112587 11415 107157 565247 997239 890837 288187 -215327 -177459
38032 -177459 208920 443983 352900 219304 366229 764926 1075659 1015469 684080 510278
$$ packed form
38103C66914l90958j66309K13084L47509J71244j08259k77586k31016p93K34131
38093A57961K71259O2172k64828m99672m32419p141M85359N68137J36495l25967
38083A51356l35815k4133J50809J11955J48765K97912K62092K088j02056J27471
38073G90444L25690J46426j88779k41686r303J29735j9368k76438l98320l24368
38063f5967j38038K4495N8973K2378R4938K81328K98698k5528l83361l13904J47216
38052A228M67999L19053k8322j44355l2283l5133k69564m33656k42130J41097
38042b56066K87604Q1049j01172R5742M58090M31992j06402o02650n03514L7868
38032a77459L86379K35063r1083j33596J46925L98697L10733o0190l31389j73802
$$ plain form
38022 510278 783833 1235218 1245742 574151 -277736 -589784 -215361 332672 513929 259463
38012 259463 -138726 -382972 -332408 -18206 351703 518629 440583 357241 471102 647068
38002 647068 585937 257402 -21312 23051 299763 510360 513518 412599 338457 285902 177850
37991 177850 -12037 -229483 -355538 -250619 96362 433780 430749 103862 -112182 80019
37981 80019 359592 165478 -502531 -1041560 -1074347 -904052 -915232 -929760 -594138 -138263
37971 -138263 -163248 -699013 -1048224 -742806 -174022 23903 -169786 -312649 -232949 -146618
37961 -146618 -152017 -79965 101562 133879 -122066 -414905 -441529 -251382 -101832 -51147 71256
37950 71256 332980 540224 452828 53732 -422743 -673437 -550685 -183349 119810 150264
$$ packed form
38022E10278K73555M51385J0524o71591q51887l12048L74423N48033J81257k54466
38012B59463l98189k44246N0564L14202L69909J66926p8046q3342J13861J75966
38002F47068o1131l28535k78714M4363K76712K10597L158j00919p4142n2555j08052
37991A77850j89887k17446j26055J04919L46981L37418l031l26887k16044J92201
37981H0019K79573j94114o68009n39029l2787J70295j1180j4528L35622M55875
37971a38263k4985n35765l49211L05418N68784J97925j93689j42863P9700Q6331
37961a46618n399P2052J81527L2317k55945k92839k6624J90147J49550N0685J22403
37950G1256K61724K07244q7396l99096m76475k50694J22752L67336L03159L0454
$$ plain form
37940 150264 -7616 -104361 -18153 164739 350926 583175 897050 1131861 1041732 605485
37930 605485 100848 -184592 -220499 -143480 -10934 203574 415373 426849 188492 -78468
37920 -78468 -124980 47472 243762 320546 260489 92093 -94536 -96587 226151 681649 838527
37909 838527 496231 -62405 -391198 -333272 -34578 346828 713014 871812 621075 100731
37899 100731 -180085 119980 744601 1167271 1242460 1241792 1284232 1125319 662596 277170
37889 277170 338463 610495 566466 175516 -78391 55737 323246 530650 844466 1261376
37879 1261376 1309364 747357 164596 284927 910209 1208295 946864 723412 898178 1045046
37869 1045046 768987 419567 501417 841290 898179 599526 313922 185847 51456 -80294
$$ packed form
37940A50264j57880r6745Q6208J82892J86187K32249L13875K34811r0129m36247
37930F05485n04637k85440l5907P7019J32546K14508K11799J1476k38357k66960
37920g8468m6512J72452J96290P6784o0057j68396j86629k051L22738M55498J56878
37909H38527l42296n58636l28793N7926K98694L81406L66186J58798k50737n20344
37899A00731k80816L00065O24621M22670P5189o68M2440j58913m62723l85426
37889B77170O1293K72032m4029l90950k53907J34128K67509K07404L13816M16910
37879A261376M7988n62007n82761J20331O25282K98086k61431k23452J74766J46868
37869A045046k76059l49420Q1850L39873N6889k98653k85604j28075j34391j31750
$$ plain form
37859 -80294 -9740 188315 190503 -14679 -71788 114105 177427 -55658 -165293 252563 897361
37848 897361 1108068 727983 226554 26834 84081 153925 142306 70294 -59588 -192519
37838 -192519 -163666 125258 538322 830396 889428 758867 485853 93495 -309964 -565751
37828 -565751 -673773 -816378 -1049785 -1111260 -751945 -191415 59058 -114270 -227983 118573
37818 118573 645786 807166 618729 627263 1041310 1349688 1021126 256210 -272757 -259678
37808 -259678 -22407 22329 -157875 -314800 -284428 -113436 67986 162602 122557 -34064
37798 -34064 -177321 -105690 261569 708177 832338 435169 -225416 -658247 -616781 -286784
$$ packed form
37859h0294P0554J98055K188k05182n7109J85893O3322k33085j09635M17856O44798
37848H97361K10707l80085n01429j99720N7247O9844j1619p2012j29882j32931
37838a92519K8853K88924M13064K92074N9032j30561k73014l92358m03459k55787
37828e65751j08022j42605k33407o1475L59315N60530K50473j73328j13713L46556
37818A18573N27213J61380j88437Q534M14047L08378l28562p64916n28967J3079
37808b59678K37271M4736j80204j56925L0372J70992J81422R4616m0045j56621
37798c4064j43257P1631L67259M46608J24161l97169o60585m32831M1466L29997
$$ [...]
##END NTUPLES=NMR SPECTRUM
##END=
