##TITLE=31Pdec_LR-724-B1
 CDCl3, 24 sc
 1.10.2020
##JCAMPDX= 6.0         $$ Bruker NMR JCAMP-DX V2.0
##DATA TYPE= NMR SPECTRUM
##DATA CLASS= NTUPLES
##ORIGIN= UXNMR, Bruker Analytische Messtechnik GmbH
##OWNER= root
$$ XWIN-NMR		Version 3.5
$$ Thu Oct  1 10:30:53 2020 Russian Standard Time (UT+4h)  she@DPX200
##.OBSERVE FREQUENCY= 81.013821
##.OBSERVE NUCLEUS= ^31P
##.ACQUISITION MODE= SIMULTANEOUS
##.ACQUISITION SCHEME= undefined
##.AVERAGES= 24
##.DIGITISER RES= 17
##SPECTROMETER/DATA SYSTEM= spect
##.PULSE SEQUENCE= zgpg30
##.SOLVENT NAME= CDCl3
##.SHIFT REFERENCE= (INTERNAL, CDCl3, 0, 182.463)
##AUDIT TRAIL= $$ (NUMBER, WHEN, WHO, WHERE, WHAT)
$$ ##TITLE= Audit trail, XWIN-NMR		Version 3.5
$$ ##JCAMPDX= 5.01
$$ ##ORIGIN= Bruker BioSpin GmbH
$$ ##OWNER= she
$$ F:/spectra/data/she/nmr/P31/1/pdata/1/auditp.txt
$$ ##AUDIT TRAIL=  $$ (NUMBER, WHEN, WHO, WHERE, WHAT)
(   1,<2020-10-01 10:29:48.12 +0400>,<she>,<DPX200>,
      <created by zg, POWCHK disabled, PULCHK disabled
       configuration hash MD5:
       00 E9 B6 7A A2 85 ED C7 34 08 36 98 17 FE 4E 26
       data hash MD5: 32K
       3D 84 22 EC 48 8A F3 42 8F 58 23 71 E1 C7 CB 53>)
(   2,<2020-10-01 10:29:50.70 +0400>,<she>,<DPX200>,
      <Start of raw data processing
       efp BC_mod = 2 LB = 1 FT_mod = 6 PKNL = 1 PHC0 = -2712.261 PHC1 = -0.5986252 SI = 64K 
       data hash MD5: 64K
       14 D3 B7 01 DE F3 34 77 D3 24 B0 D2 A5 EA 5D 3E>)
(   3,<2020-10-01 10:30:24.53 +0400>,<she>,<DPX200>,
      <pk PHC0 = -26.69544 PHC1 = 68.59999 
       data hash MD5: 64K
       41 91 2F B0 12 F9 D5 BE E9 D5 28 56 16 19 3B B6>)
$$ ##END=
$$ 
$$ hash MD5
$$ 29 80 2D 6D 26 3A F9 36 0A 88 16 97 78 9A 2F AE
##$RELAX= 
##$RELAX= 
##$RELAX= 
##$RELAX= 
##$RELAX= 
##$RELAX= 
##$RELAX= 
##$RELAX= 
$$ Bruker specific parameters
$$ --------------------------
##$DU= <F:/spectra>
##$EXPNO= 1
##$NAME= <P31>
##$PROCNO= 1
##$TYPE= <nmr>
##$USER= <she>
##$AMP= (0..31)
100 100 100 100 100 100 100 100 100 100 100 100 100 100 100 100 100 100 
100 100 100 100 100 100 100 100 100 100 100 100 100 100 
##$AQSEQ= 0
##$AQ_mod= 1
##$AUNM= <au_zg>
##$AUTOPOS= <>
##$BF1= 81.014009
##$BF2= 200.13
##$BF3= 200.13
##$BF4= 200.13
##$BF5= 200.13
##$BF6= 200.13
##$BF7= 200.13
##$BF8= 200.13
##$BYTORDA= 1
##$CFDGTYP= 0
##$CFRGTYP= 5
##$CHEMSTR= <none>
##$CNST= (0..31)
1 1 145 1 1 1 1 1 1 1 1 1 1 1 1 1 1 1 1 1 1 1 1 1 1 1 1 1 1 1 1 1 
##$CPDPRG= <waltz16>
##$CPDPRG1= <>
##$CPDPRG2= <waltz16>
##$CPDPRG3= <>
##$CPDPRG4= <mlev>
##$CPDPRG5= <mlev>
##$CPDPRG6= <mlev>
##$CPDPRG7= <mlev>
##$CPDPRG8= <mlev>
##$CPDPRGB= <>
##$CPDPRGT= <>
##$D= (0..31)
0 1 0 0 0 0 0 0 0 0 0 0.03 2e-05 3e-06 0 0 0 0 0 0 0 0 0 0 0 0 0 0 0 0 
0 0 
##$DATE= 1601533787
##$DBL= (0..7)
120 120 120 11 120 120 24 19 
##$DBP= (0..7)
150 150 150 150 150 150 150 150 
##$DBP07= 0
##$DBPNAM0= <>
##$DBPNAM1= <>
##$DBPNAM2= <>
##$DBPNAM3= <>
##$DBPNAM4= <>
##$DBPNAM5= <>
##$DBPNAM6= <>
##$DBPNAM7= <>
##$DBPOAL= (0..7)
0.5 0.5 0.5 0.5 0.5 0.5 0.5 0.5 
##$DBPOFFS= (0..7)
$$ [...]
##$SUBNAM2= <"">
##$SUBNAM3= <"">
##$SUBNAM4= <"">
##$SUBNAM5= <"">
##$SUBNAM6= <"">
##$SUBNAM7= <"">
##$SUBNAM8= <"">
##$SUBNAM9= <"">
##$SW= 369.568048894756
##$SWIBOX= (0..15)
0 1 3 0 0 0 0 0 0 0 0 0 0 0 0 0 
##$SW_h= 29940.119760479
##$TD= 32768
##$TD0= 1
##$TE= 0
##$TE2= 300
##$TE3= 300
##$TEG= 300
##$TL= (0..7)
0 120 53 12 22 120 120 120 
##$TP= (0..7)
150 150 150 150 150 150 150 150 
##$TP07= 0
##$TPNAME0= <>
##$TPNAME1= <>
##$TPNAME2= <>
##$TPNAME3= <>
##$TPNAME4= <>
##$TPNAME5= <>
##$TPNAME6= <>
##$TPNAME7= <>
##$TPOAL= (0..7)
0.5 0.5 0.5 0.5 0.5 0.5 0.5 0.5 
##$TPOFFS= (0..7)
0 0 0 0 0 0 0 0 
##$TUNHIN= 0
##$TUNHOUT= 0
##$TUNXOUT= 0
##$USERA1= <user>
##$USERA2= <user>
##$USERA3= <user>
##$USERA4= <user>
##$USERA5= <user>
##$V9= 5
##$VALIST= <valist>
##$VCLIST= <CCCCCCCCCCCCCCC>
##$VD= 0
##$VDLIST= <DDDDDDDDDDDDDDD>
##$VPLIST= <PPPPPPPPPPPPPPP>
##$VTLIST= <TTTTTTTTTTTTTTT>
##$WBST= 1024
##$WBSW= 4
##$XGAIN= (0..3)
0 0 0 0 
##$XL= 0
##$YL= 0
##$YMAX_a= 15017
##$YMIN_a= -19110
##$ZGOPTNS= <>
##$ZL1= 120
##$ZL2= 120
##$ZL3= 120
##$ZL4= 120
##$ABSF1= 0
##$ABSF2= 0
##$ABSG= 0
##$ABSL= 0
##$ALPHA= 0
##$AQORDER= 0
##$ASSFAC= 0
##$ASSFACI= 0
##$ASSFACX= 0
##$ASSWID= 0
##$AUNMP= <proc_1d>
##$AZFE= 0.1
##$AZFW= 0.5
##$BCFW= 0
##$BC_mod= 2
##$BYTORDP= 0
##$COROFFS= 0
##$CY= -3
##$DATMOD= 1
##$DC= 0
##$DFILT= <>
##$DTYPP= 0
##$F1P= 0
##$F2P= 0
##$FCOR= 1
##$FTSIZE= 65536
##$FT_mod= 6
##$GAMMA= 0
##$GB= 0
##$INTBC= 1
##$INTSCL= 5.30512e-09
##$ISEN= 30
##$LB= 1
##$LEV0= 0
##$LPBIN= 0
##$MAXI= 10000
##$MC2= 0
##$MEAN= 0
##$ME_mod= 0
##$MI= 50
##$NCOEF= 0
##$NC_proc= -7
##$NLEV= 6
##$NOISF1= 182.463
##$NOISF2= 159.3651
##$NSP= 0
##$NTH_PI= 0
##$NZP= 0
##$OFFSET= 182.463
##$PC= 4
##$PHC0= -2738.957
##$PHC1= 68.00137
##$PH_mod= 1
##$PKNL= yes
##$PPARMOD= 0
##$PSCAL= 0
##$PSIGN= 0
##$REVERSE= no
##$SF= 81.0140089999434
##$SI= 65536
##$SIGF1= 159.3651
##$SIGF2= -187.1042
##$SINO= 113.3802
##$SIOLD= 16384
##$SREGLST= <1H.CDCl3>
##$SSB= 0
##$STSI= 65536
##$STSR= 0
##$SW_p= 29940.119760479
##$SYMM= 0
##$S_DEV= 0
##$TDeff= 32768
##$TDoff= 0
##$TI= <>
##$TILT= no
##$TM1= 0
##$TM2= 0
##$TOPLEV= 0
##$USERP1= <user>
##$USERP2= <user>
##$USERP3= <user>
##$USERP4= <user>
##$USERP5= <user>
##$WDW= 1
##$XDIM= 65536
##$YMAX_p= 471789657
##$YMIN_p= -73986015
$$ End of Bruker specific parameters
$$ ---------------------------------
##NTUPLES= NMR SPECTRUM
##VAR_NAME=  FREQUENCY,     SPECTRUM/REAL,   SPECTRUM/IMAG
##SYMBOL=    X,             R,               I
##VAR_TYPE=  INDEPENDENT,   DEPENDENT,       DEPENDENT
##VAR_FORM=  AFFN,          ASDF,            ASDF
##VAR_DIM=   65536,         65536,           65536
##UNITS=     HZ,            ARBITRARY UNITS, ARBITRARY UNITS
##FACTOR=    0.456856943014862, 1,           1
##FIRST=     14782.0589164792, 0,            0
##LAST=      -15158.0608439998, 0,           0
##MIN=       -15158.0608439998, -73986015,   0
##MAX=       14782.0589164792, 471789657,    0
$$ Real data points
##PAGE= N=1
##DATA TABLE= (X++(R..R)), XYDATA
$$ [...]
$$ plain form
37811 4187388 4497170 2926206 -127764 -2975733 -3730325 -2399339 -786587 212875 1460837
37802 1460837 3009212 3158810 1679532 1450993 4441271 8146472 8943821 7245165 5999899
37793 5999899 5545677 3966008 1829031 1993169 4261653 4800721 2386194 863036 2732953
37784 2732953 4192167 614541 -5571475 -7413994 -3218453 987661 -135402 -4366753
37776 -4366753 -5894155 -3342134 -402125 445954 1112105 3883890 7017252 6612405 1885633
37767 1885633 -3603793 -6093797 -5366627 -3823225 -3111008 -2706201 -1273622 1506329 4405426
37758 4405426 5531862 4004536 1083099 -759257 -294699 1318095 2214169 2028326 1732076
37749 1732076 1804271 1651794 882986 195999 487119 1514651 2032335 1317231 158010
$$ packed form
37811D187388L09782j570964l053970k847969p54592J330986J612752R99462J247962
37802A460837J548375J49598j479278k28539K990278L705201P97349j698656j245266
37793E999899m54222j579669k136977J64138K268484N39068k414527j523158J869917
37784B732953J459214l577626o186016j842519M195541M206114j123063m231351
37776d366753j527402K552021K940009Q48079O66151K771785L133362m04847m726772
37767A885633n489426k490004P27170J543402P12217M04807J432579K779951K899097
37758D405426J126436j527326k921437j842356M64558J612794Q96074j85843k96250
37749A732076P2195j52477p68808o86987K91120J027532N17684p15104j159221
$$ plain form
37740 158010 -168371 165274 -469745 -2563026 -3774616 -1392816 3694640 7275068 6598176
37731 6598176 3353741 1064886 999832 1890518 2459232 2560883 2324876 1566556 54788
37722 54788 -2204919 -4536652 -5245139 -2913246 1330897 4311265 4543169 3878253 4193608
37713 4193608 4418385 2852689 571958 -239689 -24285 -796804 -2165617 -1771125 484909
37704 484909 1970333 1358715 11527 -1064880 -2364916 -3263906 -1726709 1965644 4385420
37695 4385420 3597224 1707184 951447 358955 -1255439 -2056578 -312284 1597782 174193
37686 174193 -3558412 -5232510 -3384617 -1012593 -1017123 -3263077 -6234897 -8517218 -8320877
37677 -8320877 -4667661 132694 2028201 359733 -1102896 490854 3238160 3759693
$$ packed form
37740A58010l26381L33645o35019k093281j211590K381800N087456L580428o76892
37731F598176l244435k288855o5054Q90686N68714J01651k36007p58320j511768
37722E4788k259707k331733p08487K331893M244143K980368K31904o64916L15355
37713D193608K24777j565696k280731q11647K15404p72519j368813L94492K256034
37704D84909J485424o11618j347188j076407j300036q98990J537197L692353K419776
37695D385420p88196j890040p55737n92492j614394q01139J744294J910066j423589
37686A74193l732605j674098J847893K372024m530k245954k971820k282321J96341
37677h320877L653216M800355J895507j668468j462629J593750K747306N21533
$$ plain form
37669 3759693 2072347 869859 1433153 2700720 3616412 4066616 3674482 1754516 -1111654
37660 -1111654 -2901214 -2127521 767183 4111795 6294092 6354621 4341063 1493887 -587519
37651 -587519 -1402941 -1888085 -3207724 -5537229 -7918106 -8834334 -7200380 -3624150 -557420
37642 -557420 -47427 -1177429 -1108984 762648 1295390 -2353031 -8365574 -11935870 -10798339
37633 -10798339 -7043103 -3567190 -1098151 706974 1662965 1980302 2851303 4421294
37625 4421294 4881708 3541477 3036310 5702354 9030283 8286725 3379082 -780870 -1552470
37616 -1552470 -2182485 -5941374 -10199849 -10160478 -6537145 -4992848 -7829679 -10274044 -6808758
37607 -6808758 1455161 8185672 9343522 6818694 4714874 4343174 4068989 2706370
$$ packed form
37669C759693j687346j202488N63294J267567R15692M50204l92134j919966k866170
37660a111654j789560P73693K894704L344612K182297O0529k013558k847176k081406
37651e87519q15422m85144j319639k329505k380877r16228J633954L576230L066730
37642e57420N09993j130002O8445J871632N32742l648421o012543l570296J137531
37633a0798339L755236L475913K469039J805125R55991L17337Q71001J569991
37625D421294M60414j340231n05167K666044L327929p43558m907643m159952p71600
37616a552470o30015l758889m258475L9371L623333J544297k836831k444365L465286
37607f808758Q263919O730511J157850k524828k103820l71700k74185j362619
$$ plain form
37599 2706370 1090717 249542 -312991 -1559557 -3104865 -3627354 -2688924 -1133108 33379
37590 33379 179134 -1125979 -3485543 -4992869 -3691687 -69658 3183984 4325450 4229018
37581 4229018 4425920 4785385 4023741 1612774 -1625084 -4183053 -4656284 -2659829 571379
37572 571379 3235551 4802359 5788531 5722807 3163895 -1441635 -4660856 -3367419 1739359
37563 1739359 7056398 9731479 9435764 7429712 5166028 3505144 2508507 2087968 2699119
37554 2699119 4478789 5975617 5385552 3063251 836977 -1126158 -3946791 -6153583
37546 -6153583 -4093485 1853535 5391950 2105983 -3852034 -5064186 -735902 3380752
37538 3380752 3746886 2641793 2883046 3743154 3500246 2289242 639855 -1951706 -5225284
$$ packed form
37599B706370j615653q41175n62533j246566j545308n22489R38430J555816J166487
37590C3379J45755j305113k359564j507326J301182L622029L253642J141466r6432
37581D229018J96902L59465p61644k410967l237858k557969m73231J996455L231208
37572E71379K664172J566808R86172o5724k558912m605530l219221J293437N106778
37563A739359N317039K675081k95715k006052k263684j660884r96637m20539O11151
37554B699119J779670J496828n90065k322301k226274j963135k820633k206792
37546f153583K060098N947020L538415l285967n958017j212152M328284M116654
37538C380752L66134j105093K41253Q60108k42908j211004j649387k591561l273578
$$ plain form
37529 -5225284 -7152301 -6373341 -4060039 -2155025 -1068925 79619 2110367 5069820
37521 5069820 7799093 8429341 6661416 4827341 4783402 4845158 2628868 -72119 836996
37512 836996 5081224 7507098 5193958 1087147 -885103 -500148 715704 2327537
37504 2327537 3548869 2447585 -690782 -2254735 -323194 2095386 1649283 -513757
37496 -513757 -1615289 -1838066 -2232728 -1024422 3155853 6483764 3916043 -2745361 -6025744
37487 -6025744 -2361826 4003456 7312289 6217751 2495455 -1926484 -4870051 -4358038
37479 -4358038 -1371849 355541 -874991 -2389293 -1196970 1877661 3956412 4006035
37471 4006035 3011170 1924379 1483053 2704935 5383370 6937305 4867563 69144
$$ packed form
37529e225284j927017P78960K313302J905014J086100J148544K030748K959453
37521E069820K729273O30248j767925j834075m3939O1756k216290k700987R09115
37512H36996M244228K425874k313140m106811j972250L84955J215852J611833
37504B327537J221332j101284l138367j563953J931541K418580m46103k163040
37496e13757j101532k22777l94662J208306M180275L327911k567721o661404l280383
37487f025744L663918O365282L308833j094538l722296m421939k943567N12013
37479d358038K986189J727390j230532j514302J192323L074631K078751M9623
37471D006035r94865j086791m41326J221882K678435J553935k069742m798419
$$ plain form
37463 69144 -3999851 -5373275 -5402643 -6452258 -8935969 -11021612 -10674591 -7715149 -4014338
37454 -4014338 -1594558 -552786 665563 2842446 4688080 4630180 3288754 3064093 5121077
37445 5121077 7637931 7706463 4656917 697762 -1814838 -2660648 -2564913 -1003264 2733376
37436 2733376 6644492 7012530 3382303 49748 631186 3261930 3836204 2244683 1748502
37427 1748502 2894874 2366009 -1141112 -3718991 -1286653 4636675 8843398 8809401 6737809
37418 6737809 5802273 6501430 6991498 5621151 2506476 -901891 -3330808 -4548216 -4775294
37409 -4775294 -4029041 -2813339 -2610070 -4089042 -5255410 -3481141 425539 2453711
37401 2453711 502615 -2900962 -4243476 -3320025 -2156546 -1512013 -879678 -862279 -2845153
$$ packed form
37463F9144m068995j373424k9368j049615k483711k085643L47021K959442L700811
37454d014338K419780J041772J218349K176883J845634n7900j341426k24661K056984
37445E121077K516854O8532l049546l959155k512600q45810R5735J561649L736640
37436B733376L911116L68038l630227l332555N81438K630744N74274j591521m96181
37427A748502J146372n28865l507121k577879K432338N923328M206723l3997k071592
37418F737809r35536O99157M90068j370347l114675l408367k428917j217408k27078
37409d775294P46253J215702K03269j478972j166368J774269L906680K028172
37401B453711j951096l403577j342514R23451J163479O44533O32335J7399j982874
$$ plain form
37392 -2845153 -6358897 -8879138 -8612163 -6115602 -3138862 -1203485 -1246697 -3093683 -4967846
37383 -4967846 -4845243 -2765173 -828377 -604870 -1484662 -1876650 -1093507 366567 1659975
37374 1659975 2324512 2672673 3530387 4956795 5376015 3077760 -1208527 -4411068 -4433412
37365 -4433412 -2539764 -1715267 -3237956 -5545692 -6078361 -3697053 311681 3126884
37357 3126884 2710503 -199040 -2695854 -2695983 -899193 579209 813104 583441 930464
37348 930464 2172903 3984935 5446913 5326808 3393450 1191347 309298 176522 -855193
37339 -855193 -2423577 -2337360 -339371 790881 -647220 -2310967 -1277993 1161309 1055649
37330 1055649 -2606867 -6723438 -8344073 -7377444 -4889182 -1548522 1483977 2685775
$$ packed form
37392b845153l513744k520241K66975K496561K976740J935377m3212j846986j874163
37383d967846J22603K080070J936796K23507q79792l91988P83143J460074J293408
37374A659975O64537L48161Q57714J426408M19220k298255m286287l202541k2344
37365d433412J893648Q24497j522689k307736n32669K381308M008734K815203
37357C126884m16381k909543k496814j29J796790J478402K33895k29663L47023
37348I30464J242439J812032J461978j20105j933358k202103q82049j32776j031715
37339h55193j568384Q6217J997989J130252j438101j663747J032974K439302j05660
37330A055649l662516m116571j620635R66629K488262L340660L032499J201798
$$ plain form
37322 2685775 2251301 1901634 1845890 429333 -2200414 -3026797 -576029 2311128 2419336
37313 2419336 474276 -1026625 -1941897 -3336587 -4231315 -3132654 -1405010 -1311738 -1628997
37304 -1628997 820084 5661518 8933738 8530933 5887547 2265463 -2342634 -6054770
37296 -6054770 -5473071 -836419 3215638 3852593 3210461 3497494 3270973 1418903 633958
37287 633958 2960869 5307081 3987379 1141849 1542031 4671653 5488483 2706430 864621
37278 864621 3031491 6087066 5487013 1466089 -1993923 -2414998 -881837 125445 -562021
37269 -562021 -1876334 -1779551 77575 1281788 -577759 -4447897 -6793766 -5910104 -3380576
37260 -3380576 -1194063 452272 1965369 3062920 3646269 4338791 5168364 5064571 3551522
$$ packed form
37322B685775m34474l49667n5744j416557k629747q26383K450768K887157J08208
37313B419336j945060j500901r15272j394690q94728J098661J727644R3272l17259
37304a628997K449081M841434L272220m02805k643386l622084m608097l712136
37296f054770N81699M636652M052057O36955o42132K87033k26521j852070p84945
37287F33958K326911K346212j319702k845530M00182L129622Q16830k782053j841809
37278H64621K166870L055575o00053m020924l460012m21075J533161J007282o87466
37269e62021j314313R6783J857126J204213j859547l870138k345869Q83662K529528
37260c380576K186513J646335J513097J097551N83349O92522Q29573j03793j513049
$$ plain form
37251 3551522 1712694 680781 336998 159591 47720 -392708 -1877339 -3755835 -3747027
37242 -3747027 -699970 3479153 5988634 6247649 5467987 4092141 1572418 -1502007
37234 -1502007 -2860355 -803811 3671214 7271643 6773493 1641635 -4850014 -7628349
37226 -7628349 -4253544 2513212 7433504 8050774 6268917 4852259 4077852 2756994
37218 2756994 1054518 291185 274062 -987847 -4008743 -5922759 -3606245 1968532 6409060
37209 6409060 7030809 5498282 4679623 4668361 3555635 1121179 -369466 743429 3130059
37200 3130059 3867487 1502600 -2719153 -6171691 -7065322 -5756596 -4179786 -3833251 -4291460
37191 -4291460 -3932673 -2053098 206099 1254786 1057134 1197924 2666676 4044160 2975378
$$ packed form
37251C551522j838828j031913l43783j77407j11871m40428j484631j878496Q808
37242c747027L047057M179123K509481K59015p79662j375846k519723l074425
37234a502007j358348K056544M475025L600429m98150n131858o491649k778335
37226g628349L374805O766756M920292O17270j781857j416658p74407j320858
37218B756994j702476p63333j7123j261909l020896j914016K316514N574777M440528
37209F409060O21749j532527q18659j1262j112726k434456j490645J112895K386630
37200C130059P37428k364887m221753l452538q93631J308726J576810L46535m58209
37191d291460L58787J879575K259197J048687j97652J40790J468752J377484j068782
$$ plain form
37182 2975378 -267993 -2187369 -465045 2216207 1283207 -3047241 -5313332 -2079234
37174 -2079234 3301194 5321714 3362609 1220920 1143155 1679265 1168146 312649 592596
37165 592596 2074447 3489113 3423292 1467638 -867701 -1004468 1758950 5109156 6835632
37156 6835632 7502771 8070224 7015092 3209557 -9666 1827442 7414051 10854789
37148 10854789 10100272 9212022 11023358 12780956 11590441 9373239 8815188 8378704 5583755
37139 5583755 2133422 1176997 1746809 663347 -1565058 -1593240 792202 2348343 1975582
37130 1975582 1994147 3152801 2844294 -85333 -2625629 -2073115 -275236 -639427 -2790693
37121 -2790693 -3042777 516940 5663149 8718168 8088643 4961180 1618279 -314889
$$ packed form
37182B975378l243371j919376J722324K681252r33000m330448k266091L234098
37174b079234N380428K020520j959105k141689p7765N36110n11119q55497K79947
37165E92596J481851J414666o5821j955654k335339j36767K763418L350206J726476
37156F835632O67139N67453j055132l805535l219223J837108N586609L440738
37148A0854789p54517q88250J811336J757598j190515k217202n58051m36484k794949
37139E583755l450333r56425N69812j083462k228405k8182K385442J556141l72761
37130A975582J8565J158654l08507k929627k540296N52514J797879l64191k151266
37121b790693k52084L559717N146209L055019o29525l127463l342901j933168
$$ plain form
37113 -314889 -363325 1187268 3489984 5200142 5464564 5182380 6064018 7838688 7999817
37104 7999817 5561445 3283099 3972769 5949057 5153038 1322634 -1151110 879710
37096 879710 5363409 8199717 8091095 6614061 5048993 3090507 246121 -2848402
37088 -2848402 -4686596 -4156130 -1744889 511514 701049 -1398876 -4616990 -7538359
37080 -7538359 -8815311 -7553806 -4730488 -3122001 -4005080 -4880261 -2713060 1368669
37072 1368669 3430494 2490054 1716094 3339018 5455190 5184217 2530420 -341765 -1725082
37063 -1725082 -1075819 1044089 2732110 2337135 1078724 1896977 4924369 6777370 5511272
37054 5511272 3325835 2700241 2980375 3070883 4255045 7075014 8173463 4324533 -2088514
$$ packed form
37113c14889m8436J550593K302716J710158K64422k82184Q81638J774670J61129
37104G999817k438372k278346O89670J976288p96019l830404k473744K030820
37096H79710M483699K836308j08622j477034j565068j958486k844386l094523
37088b848402j838194N30466K411241K256403J89535k099925l218114k921369
37080g538359j276952J261505K823318J608487q83079q75181K167201M081729
37072A368669K061825r40440p73960J622924K116172k70973k653797k872185j383317
37063a725082O49263K119908J688021l94975j258411Q18253L027392J853001j266098
37054E511272k185437o25594K80134R0508J184162K819969J098449l848930o413047
$$ plain form
37045 -2088514 -5689403 -5146047 -3657713 -3136423 -2064589 753762 4136985 6829000
37037 6829000 8626135 8723926 6178590 2645962 1387830 2663752 3377987 2398101 2648379
37028 2648379 6021842 9624652 9942616 8208628 8364406 11269092 14196388 15322359
37020 15322359 15608886 16135222 16140691 14526908 11751481 9468971 9052623 10698627 13373603
37011 13373603 15690336 17385012 19621336 23176630 26834150 28658795 28732113 29477620
37003 29477620 32907891 38282611 42944305 44970590 44400816 42099367 38401778 33499752
36995 33499752 28431472 24348170 20861858 16706784 12407207 10260623 10557837 10175390
36987 10175390 7181817 4682888 6663637 11445808 13592943 11923965 10789850 12604164
$$ packed form
37045b088514l600889N43356J488334N21290J071834K818351L383223K692015
37037F829000J797135R7791k545336l532628j258132J275922P14235r79886K50278
37028B648379L373463L602810L17964j733988J55778K904686K927296J125971
37020A5322359K86527N26336N469j613783k775427k282510m16348J646004K674976
37011A3373603K316733J694676K236324L555294L657520J824645P3318P45507
37003B9477620L430271N374720M661694K026285n69774k301449l697589m902026
36995C3499752n068280m083302l486312m155074m299577k146584K97214l82447
36987A0175390k993573k498929J980749M782171K147135j668978j134115J814314
$$ plain form
36979 12604164 14206808 12849753 11019031 11818983 13465993 12607012 10143835 9183479
36971 9183479 9445302 8575252 7445473 8903234 11850482 11832344 7922512 4211141 3477823
36962 3477823 3826400 3004813 1933529 2076705 2918929 4027878 6299701 9107690 9474715
36953 9474715 6447922 3271826 2628911 2654244 752291 -1257444 394889 5332068 9053986
36944 9053986 8552402 5118132 1919786 989709 2181694 3445499 2895963 1735006 3252897
36935 3252897 7336517 8758683 3962274 -2919951 -4884658 -1292184 2148563 1687866
36927 1687866 -948965 -3210128 -4888428 -5683298 -4147989 -765956 1722478 2737570
36919 2737570 4920650 8960796 11239983 9229515 5729213 4557717 4992103 4115478
$$ packed form
36979A2604164J602644j357055j830722P99952J647010q58981k463177r60356
36971I183479K61823q70050j129779J457761K947248j8138l909832l711371p33318
36962C477823L48577q21587j071284J43176Q42224J108949K271823K807989L67025
36953I474715l026793l176096o42915K5333j901953k009735J652333M937179L721918
36944I053986n01584l434270l198346r30077J191985J263805n49536j160957J517891
36935C252897M083620J422166m796409o882225j964707L592474L440747m60697
36927A687866k636831k261163j678300p94870J535309L382033K488434J015092
36919B737570K183080M040146K279187k010468l500302j171496M34386q76625
$$ plain form
36911 4115478 2349712 2593024 5121968 7133327 6847508 4986873 2721007 1034674
36903 1034674 1487947 4495467 7292170 6918069 5083921 6444499 11547649 15312495
36895 15312495 13986691 10120133 8245160 8463393 7543177 4696241 2680155 3382395
36887 3382395 5347783 6352855 6104119 5286192 3763681 1321985 -905543 -1562562 -1266512
36878 -1266512 -1915048 -3568877 -3776008 -991846 2705770 3912053 2197128 338056
36870 338056 397868 1388756 1286873 -171151 -1494697 -1162500 1261863 4691883 6742818
36861 6742818 5706923 2954510 1947662 3999189 6507458 6515437 4428812 2667396 2121315
36852 2121315 1943482 1768324 1941531 2170094 1995288 2151382 3517067 5194230 5644549
$$ packed form
36911D115478j765766K43312K528944K011359k85819j860635k265866j686333
36903A034674M53273L007520K796703l74101j834148J360578N103150L764846
36895A5312495j325804l866558j874973K18233r20216k846936k016086P02240
36887C382395J965388J005072k48736q17927j522511k441696k227528o57019K96050
36878a266512o48536j653829k07131K784162L697616J206283j714925j859072
36870C38056N9812R90888j01883j458024j323546L32197K424363L430020K050935
36861F742818j035895k752413j006848K051527K508269P979k086625j761416n46081
36852B121315j77833j75158J73207K28563j74806J56094J365685J677163M50319
$$ plain form
36843 5644549 5258578 5568964 6287285 5665975 3783715 2761435 3279883 3563426 2644806
36834 2644806 2017904 2771356 3484222 2699171 1537537 1848459 3073862 2888774 234035
36825 234035 -3728642 -7030380 -8144405 -6607241 -3526686 -940944 -3745 -502431 -2272272
36816 -2272272 -5361782 -8176345 -7790305 -3830690 -89064 70628 -1548530 -566847 3501313
36807 3501313 6437565 5098395 1222838 -1384336 -1282919 195459 1334608 1360068 281796
36798 281796 -1204746 -1875025 -950521 975133 2360128 2090457 313266 -1964498 -3875235
36789 -3875235 -5154339 -5659242 -4880220 -2512875 609098 2907295 3538551 2883822 1629561
36780 1629561 276232 -508067 -402730 -530621 -2378058 -4984438 -5104888 -1459585 2919456
$$ packed form
36843E644549l85971L10386P18321o21310j882260j022280N18448K83543r18620
36834B644806o26902P53452P12866p85051j161634L10922J225403j85088k654739
36825B34035l962677l301738j114025J537164L080555K585742R37199m98686j769841
36816b272272l089510k814563L86040L959615L741626J59692j619158R81683M068160
36807C501313K936252j339170l875557k607174J01417J478378J139149K5460j078272
36798B81796j486542o70279R24504J925654J384995k69671j777191k277764j910737
36789c875235j279104n04903P79022K367345L121973K298197O31256o54729j254261
36780A629561j353329p84299J05337j27891j847437k606380j20450L645303M379041
$$ plain form
36771 2919456 4337894 2970415 1706157 1780298 2111500 2189636 2714002 3342966 2524151
36762 2524151 150392 -1857565 -2281691 -1892352 -1401652 -359235 917335 565009 -2027285
36753 -2027285 -4396325 -3924676 -1395995 328096 338129 245143 1018868 1497196 625969
36744 625969 -604102 -686796 -69775 -646496 -2950541 -5133664 -5189487 -3293115 -1199145
36735 -1199145 -48398 92367 -993039 -3606964 -6516646 -7120142 -4300750 17255
36727 17255 3101559 4012343 3071808 518715 -2482314 -3068110 361560 4985249 6004786
36718 6004786 2275181 -2695651 -5244119 -4706224 -2225705 717861 2072454 328720
36710 328720 -3066523 -4778730 -3999944 -3322406 -4266975 -4935989 -3775532 -2591819 -3243591
$$ packed form
36771B919456J418438j367479j264258P4141L31202P8136N24366O28964q18815
36762B524151k373759k007957m24126L89339M90700J042417J276570l52326k592294
36753b027285k369040M71649K528681J724091J0033r2986P73725M78328q71227
36744F25969j230071q2694O17021n76721k304045k183123n5823J896372K093970
36735a199145J150747J40765j085406k613925k909682o03496K819392M318005
36727A7255L084304R10784r40535k553093l001029n85796L429670M623689J019537
36718F004786l729605m970832k548468N37895K480519K943566J354593j743734
36710C28720l395243j712207P78786O77538r44569o69014J160457J183713o51772
$$ plain form
36701 -3243591 -3935574 -2059707 1080568 1917074 41745 -1407054 -502138 1377171 2326043
36692 2326043 2101384 1211518 251261 593937 3439886 7449264 9351330 7840236 5213712
36683 5213712 4216484 4737692 4772765 3585235 2608470 3437230 5647410 6804663 4830923
36674 4830923 531242 -2781248 -2660638 146164 3250020 5248005 5692512 3966548
36666 3966548 347598 -2675802 -2652299 -555864 345610 -1075972 -2902663 -3768274 -4585064
36657 -4585064 -5914498 -6319318 -4876530 -3313565 -3864124 -6217418 -7964434 -7130300 -3384992
36648 -3384992 2048234 6730743 8419723 7157564 5164195 4271111 4692255 6455002
36640 6455002 9891120 13731563 14796131 11239770 4885075 -784914 -3629913 -3132246
$$ packed form
36701c243591o91983J875867L140275Q36506j875329j448799R04916J879309R48872
36692B326043k24659q89866r60257L42676K845949M009378J902066j511094k626524
36683E213712r97228N21208L5073j187530r76765Q28760K210180J157253j973740
36674D830923m299681l312490J20610K806802L103856J997985M44507j725964
36666C966548l618950l023400K3503K096435R01474j421582j826691q65611q16790
36657d585064j329434m04820J442788J562965n50559k353294j747016Q34134L745308
36648c384992N433226M682509J688980j262159j993369q93084M21144J762747
36640F455002L436118L840443J064568l556361o354695n669989k844999M97667
$$ plain form
36632 -3132246 220544 4390627 6485978 5629712 3658759 1991580 160478 -1294234
36624 -1294234 127176 4292011 6262385 2683506 -2334668 -2541659 1218576 2796979
36616 2796979 827995 423235 3849813 6184607 3379943 -813663 -517756 3438140
36608 3438140 5430644 3722608 2101293 3140256 4276673 1937146 -3145194 -6465839
36600 -6465839 -4639884 1169771 6452265 7691938 5372814 2429251 464842 -990285
36592 -990285 -1881932 -884279 1907807 3943753 3385889 1408033 -96788 -1028282 -1636079
36583 -1636079 -926294 1109849 1815437 -623757 -3665869 -3675895 -1419359 -701789 -2292092
36574 -2292092 -3079527 -1280254 1300019 2829558 3799134 4739242 4675587 3224001 1671854
$$ packed form
36632c132246L352790M170083K095351q56266j970953j667179j831102j454712
36624a294234J421410M164835J970374l578879n018174k06991L760235J578403
36616B796979j968984m04760L426578K334794k804664m193606K95907L955896
36608C438140J992504j708036j621315J038963J136417k339527n082340l320645
36600f465839J825955N809655N282494J239673k319124k943563j964409j455127
36592i90285q91647R97653K792086K035946n57864j977856j504821r31494o07797
36583a636079P09785K036143P05588k439194l042112j0026K256536P17570j590303
36574b292092p87435J799273K580273J529539R69576R40108o3655j451586j552147
$$ plain form
36565 1671854 807227 177721 516386 3873142 9550294 12723883 9629979 2248795 -4381949
36556 -4381949 -7761784 -8634879 -7983234 -6231917 -4459385 -3558925 -2480569 341867 3933687
36547 3933687 5331015 3408770 332290 -1282611 -1324045 -1779959 -4162501 -7635327 -9431622
36538 -9431622 -7447512 -2723753 1307302 2359343 1080026 -917852 -2947702 -4161880
36530 -4161880 -2752769 1613838 6047562 7495855 6480223 5385977 4238374 1372651
36522 1372651 -2247388 -3152327 -562946 1851081 1005978 -1343674 -1382754 1451357 4029810
36513 4029810 3640756 944914 -973770 256078 3809233 6103839 4415493 91800
36505 91800 -2858712 -2363157 -73003 1542661 2065827 2391101 2786374 2819567 2181267
$$ packed form
36565A671854q64627o29506L38665L356756N677152L173589l093904p381184o630744
36556d381949l379835q73095O51645J751317J772532R00460J078356K822436L591820
36547C933687J397328j922245l076480j614901m1434m55914k382542l472826j796295
36538i431622J984110M723759M031055J052041j279317j997878k029850j214178
36530d161880J409111M366607M433724J448293j015632j094246j147603k865723
36522A372651l620039r04939K589381K414027q45103k349652l9080K834111K578453
36513D029810l89054k695842j918684J229848L553155K294606j688346m323693
36505I1800k950512M95555K290154J615664N23166L25274L95273L3193o38300
$$ plain form
36496 2181267 833136 -688785 -867051 1291422 3877936 3313928 -888103 -4641401
36488 -4641401 -4301298 -1475788 -680994 -3299534 -6099739 -5342119 -633660 4965114 7358854
36479 7358854 4605899 -927590 -4344815 -3480158 -1318556 -1632922 -3820076 -4648716 -3804127
36470 -3804127 -4031673 -5924624 -6541837 -4387801 -2221826 -2738160 -4226722 -3320485 -155045
36461 -155045 2326447 3191013 4356638 6586556 7685885 5783429 2208287 -408294
36453 -408294 -1433335 -2058282 -2881453 -3509206 -4143048 -5618230 -7546813 -8130331 -6691955
36444 -6691955 -5086998 -5421376 -7310001 -8690846 -8562060 -7363985 -5307467 -2360560
36436 -2360560 244412 766141 -320700 -578237 571118 595183 -2150999 -5447908 -6339422
$$ packed form
36496B181267j348131j521921j78266K158473K586514n64008m202031l753298
36488d641401L40103K825510P94794k618540k800205P57620M708459N598774K393740
36479G358854k752955n533489l417225Q64657K161602l14366k187154q28640Q44589
36470c804127k27546j892951o17213K154036K165975n16334j488562R06237L165440
36461a55045K481492Q64566J165625K229918J099329j902456l575142k616581
36453d08294j025041o24947q23171o27753o33842j475182j928583n83518J438376
36444f691955J604957l34378j888625j380845J28786J198075K056518K946907
36436b360560K604972N21729j086841k57537J149355K4065k746182l296909q91514
$$ plain form
36427 -6339422 -5323858 -4792837 -4782061 -3452291 -1041312 66296 -761090 -1679818 -2030836
36418 -2030836 -3476167 -6378063 -8113588 -6777531 -4075886 -2583293 -2316037 -2148855
36410 -2148855 -2512746 -4001887 -4924009 -3311435 -467421 580421 -240153 -103812 1758463
36401 1758463 2429112 -194416 -4051613 -5951243 -5867903 -5893562 -6234505 -4950968 -1499842
36392 -1499842 1876534 2998886 2264843 1346181 793403 370090 743964 2729748 4886533
36383 4886533 4184143 225628 -3004494 -1565300 3305000 6732933 6399967 4612742
36375 4612742 4057411 4406878 4286600 3859631 3464273 1987067 -809733 -2164554 317361
36366 317361 4296280 5175040 2561859 675235 2029255 4404302 5142617 4802817 4631223
$$ packed form
36427f339422J015564N31021J0776J329770K410979J107608q27386r18728l51018
36418b030836j445331k901896j735525J336057K701645J492593K67256J67182
36410b148855l63891j489141r22122J612574K844014J047842q20574J36341J862275
36401A758463O70649k623528l857197j899630Q3340k5659l40943J283537L451126
36392a499842L376376J122352p34043r18662n52778m23313L73874J985784K156785
36383D886533p02390l958515l230122J439194M870300L427933l32966j787225
36375D612742n55331L49467j20278m26969l95358j477206k796800j354821K481915
36366C17361L978919Q78760k613181j886624J354020K375047P38315l39800j71594
$$ plain form
36357 4631223 3761505 1733905 1091681 3959028 7757829 8091143 5141892 3568733 6028986
36348 6028986 10147454 12424191 11991543 9465523 5068323 -276605 -4222534 -5496115
36340 -5496115 -5691046 -6710809 -7660968 -6326034 -2949470 -376554 -466800 -2085181 -2963818
36331 -2963818 -2251820 -714202 689954 1712918 2522937 2981801 2625899 1611007 1176328
36322 1176328 2240747 3776221 3991089 3261306 4001671 6812712 8842276 7673029 5015189
36313 5015189 4106411 4763447 4082177 1562436 129582 1436589 3244636 2920383 1066710
36304 1066710 -173582 -525876 -1199123 -2359658 -3053983 -2930519 -2262862 -828222 1513225
36295 1513225 3500537 3491107 1820550 651076 1233982 2506666 2643130 974899 -1818143
$$ packed form
36357D631223q69718k027600o42224K867347L798801L33314k949251j573159K460253
36348F028986M118468K276737m32648k526020m397200n344928l945929j273581
36340e496115j94931j019763r50159J334934L376564K572916r0246j618381q78637
36331b963818P11998J537618J404156J022964Q10019M58864l55902j014892m34679
36322A176328J064419J535474K14868p29783P40365K811041K029564j169247k657840
36313E015189r08778O57036o81270k519741j432854J307007J808047l24253j853673
36304A066710j240292l52294o73247j160535o94325J23464O67657J434640K341447
36295A513225J987312r430j670557j169474N82906J272684J36464j668231k793042
$$ plain form
36286 -1818143 -4376259 -5170265 -3382442 -57922 2132154 1117202 -2425193 -5468536
36278 -5468536 -5444202 -2636421 475735 2236151 3368626 4905943 5715794 4054270 1243821
36269 1243821 1004943 4057983 6138938 3767380 -116843 247859 5030268 7933879
36261 7933879 4590128 -1552701 -3796120 -407792 4284514 5933536 4687463 3519661
36253 3519661 4120034 5604772 6467375 6498667 6392268 6106273 4648951 1854109 -461151
36244 -461151 -110694 2885888 6221485 7761320 7307341 6014728 5042699 4940679 5455496
36235 5455496 5664600 5073509 4756192 6454564 10133044 13312422 13495280 10738843 7318232
36226 7318232 5257102 4628749 4039990 2514373 920933 1205964 3761277 6155922 5635375
$$ packed form
36286a818143k558116p94006J787823L324520K190076j014952l542395l043343
36278e468536K4334K807781L112156J760416J132475J537317Q09851j661524k810449
36269A243821k38878L053040K080955k371558l884223L64702M782409K903611
36261G933879l343751o142829k243419L388328M692306J649022j246073j167802
36253C519661O00373J484738Q62603L1292j06399k85995j457322k794842k315260
36244d61151L50457K996582L335597J539835m53979j292613r72029j02020N14817
36235E455496K09104n91091l17317J698372L678480L179378J82858k756437l420611
36226G318232k061130o28353n88759j525617j593440K85031K555313K394645n20547
$$ plain form
36217 5635375 2635437 338324 582978 1888657 2192553 1754296 1836839 1821194 -125615
36208 -125615 -3666283 -5726324 -4253103 -1171477 -81919 -1481206 -2077341 429831
36200 429831 3435314 2263300 -3437246 -8492030 -8289118 -4030653 -298009 799695
36192 799695 566103 65340 -1141955 -2580123 -2446959 -704942 88753 -1431477 -3066633
36183 -3066633 -2338238 -308328 137649 -1369497 -2440032 -1535520 380752 1896411 2939885
36174 2939885 3815901 3762402 1663556 -1996827 -4811829 -4766494 -2747170 -1773253 -3210142
36165 -3210142 -4865340 -4071601 -1580783 -367191 -1175830 -1806377 -834201 693963 1804368
36156 1804368 3013622 4192404 3819179 1845635 697584 1739677 3291830 3882130
$$ packed form
36217E635375k999938k297113K44654J305679L03896m38257Q2543j5645j946809
36208a25615l540668k060041J473221L081626J089558j399287n96135K507172
36200D29831L005483j172014n700546n054784K02912M258465L732644J097704
36192G99695k33592n00763j207295j438168J33164J742017P93695j520230j635156
36183c066633P28395K029910M45977j507146j070535R04512J916272J515659J043474
36174B939885Q76016n3499k098846l660383k815002M5335K019324R73917j436889
36165c210142j655198P93739K490818J213592q08639o30547R72176J528164J110405
36156A804368J209254J178782l73225j973544j148051J042093J552153N90300
$$ plain form
36148 3882130 4506592 5385146 3797149 -1427676 -6119699 -5693276 -1790765 479977 286235
36139 286235 998437 3326549 4119645 2324043 775410 888476 550941 -1021079 -1218327
36130 -1218327 775757 1341147 -1838201 -5367666 -5152704 -2382158 -437867 1062402
36122 1062402 4217808 7114666 5910746 1980629 1193619 5162037 8396861 6249851
36114 6249851 1282493 -1261980 -778026 -226891 -184305 1333009 3717845 3228198 -1050041
36105 -1050041 -4516318 -3036968 865581 1267271 -2749804 -5759805 -3711743 450842
36097 450842 1128127 -2144145 -4320485 -1826269 2866219 4546055 1451846 -3211570
36089 -3211570 -5380848 -4578233 -3837768 -5598547 -8591886 -9584745 -7635666 -4989229 -3541756
$$ packed form
36148C882130O24462Q78554j587997n224825m692023M26423L902511K270742j93742
36139B86235P12202K328112P93096j795602j548633J13066l37535j572020j97248
36130a218327J994084N65390l179348l529465K14962K770546J944291J500269
36122A062402L155406K896858j203920l930117p87010L968418L234824k147010
36114F249851m967358k544473M83954N51135M2586J517314K384836m89647m278239
36105a050041l466277J479350L902549M01690m017075l010001K048062M162585
36097D50842O77285l272272k176340K494216M692488J679836l094209m663416
36089c211570k169278Q02615P40465j760779k993339r92859J949079K646437J447473
$$ plain form
36080 -3541756 -2498979 -833089 -156943 -2764020 -7647637 -10979696 -10594920 -7954719
36072 -7954719 -5406120 -3462348 -1544952 157960 805050 310895 -186644 610335 2635721
36063 2635721 4228507 4109967 3371796 3951827 4977231 3113259 -2196824 -6591031 -6243748
36054 -6243748 -2972543 -802235 206790 2585023 5708264 6487217 5148602 5008150
36046 5008150 6181446 4938997 559078 -2478425 -1279026 1293418 1835878 1324420
36038 1324420 1793807 2320777 1841168 2158914 4303874 5435938 3606932 2260132 5070491
36029 5070491 9065285 8410409 3256754 -849913 -1419629 -1194865 -2015724 -2134329 -607774
36020 -607774 595750 518738 1160635 3722296 6303004 6992602 6219119 4572936 1435550
$$ packed form
36080c541756J042777J665890O76146k607077m883617l332059L84776K640201
36072g954719K548599J943772J917396J702912O47090m94155m97539P96979K025386
36063B635721J592786j18540p38171N80031J025404j863972n310083m394207L47283
36054f243748L271205K170308J009025K378233L123241P78953j338615j40452
36046E008150J173296j242449m379919l037503J199399K572444N42460n11458
36038A324420M69387N26970m79609L17746K144960J132064j829006j346800K810359
36029E070491L994794o54876n153655m106667n69716K24764q20859j18605J526555
36020f07774J203524p7012O41897K561661K580708O89598p73483j646183l137386
$$ plain form
36011 1435550 -2509010 -4490292 -3615781 -2999968 -5406833 -8877270 -9483952 -6989867 -4840442
36002 -4840442 -5112969 -6189161 -5709475 -3676886 -1677735 -312420 1297717 3639920
35994 3639920 5526154 5441547 3866850 3115458 4362313 5892594 5392272 3241452 2052796
35985 2052796 3132023 4883704 5051986 3392252 1526053 823343 1072157 1139968 569374
35976 569374 114784 492823 1193056 1351720 1225647 1371550 828204 -1691509 -4710575
35967 -4710575 -4820172 -1584896 1043414 -189339 -3732978 -6045918 -6128970 -5020621 -3063634
35958 -3063634 -425377 1454743 1721866 1913076 3360017 4504603 3553332 1943672 1974087
35949 1974087 2708644 1836808 217010 691804 3221190 4934547 4557642 3463557 2854000
$$ packed form
36011A435550l944560j981282Q74511O15813k406865l470437o06682K494085K149425
36002d840442k72527j076192M79686K032589J999151J365315J610137K342203
35994C639920J886234q4607j574697p51392J246855J530281n00322k150820j188656
35985B052796J079227J751681J68282j659734j866199p02710K48814O7811n70594
35976E69374m54590L78039P00233J58664j26073J45903n43346k519713l019066
35967d710575j09597L235276K628310j232753l543639k312940q3052J108349J956987
35958c063634K638257J880120K67123J91210J446941J144586r51271j609660L0415
35949A974087P34557q71836j619798M74794K529386J713357l76905j094085o09557
$$ plain form
35940 2854000 2941142 4097179 5814276 5692501 2586387 -662346 -756870 1715082 4627755
35931 4627755 7955250 10905265 9265029 1566011 -5541384 -5154954 -319511 1581414
35923 1581414 1483867 5946245 14077981 18504889 18608910 20673419 24721794 24689997 22921603
35914 22921603 29156389 42390063 52217710 64508467 103104377 169795986 221897697
35907 221897697 214232633 154194253 91638591 59432984 48176075 38021446 27861364
35900 27861364 24290379 23816000 20486923 17785039 20180570 22403592 18095529 11320691
35892 11320691 9306458 10213169 7847809 3277031 2222204 4597875 5417751 3655279
35884 3655279 2517245 2714355 2172789 913088 359488 -522458 -2936034 -4071724 -890689
$$ packed form
35940B854000Q7142J156037J717097j21775l106114l248733r4524K471952K912673
35931D627755L327495K950015j640236p699018p107395L86430M835443J900925
35923A581414r7547M462378Q131736M426908J04021K064509M048375l1797j768394
35914B2921603O234786J3233674R827647J2290757L8595910O6691609N2101711
35907B21897697p665064o0038380o2555662l2205607j1256909j0154629j0160082
35900B7861364l570985m74379l329077k701884K395531K223022m308063o774838
35892A1320691k014233R06711k365360m570778j054827K375671Q19876j762472
35884C655279j138034J97110n41566j259701n53600q81946k413576j135690L181035
$$ plain form
35875 -890689 3603584 3656150 -857273 -4883754 -6015122 -6173998 -6061522 -3924228 -500846
35866 -500846 208920 -3274782 -7423633 -8457197 -6349968 -3106294 -157404 1515045
35858 1515045 1459774 921570 1542854 2379112 761992 -3376111 -6811330 -7431824 -6544585
35849 -6544585 -5654377 -3765210 109166 3818079 4004116 483221 -3253102 -3932681 -1694976
35840 -1694976 753114 1273091 85003 -1176576 -1404012 -654708 522369 1494141 1542004
35831 1542004 569916 -169589 828494 3462184 6377718 8867240 10699006 10375074 6180866
35822 6180866 -444545 -5191697 -5658676 -3613742 -1621091 -166286 623621 -372321 -2771907
35813 -2771907 -3776590 -2216697 -695909 -1067808 -921665 2029954 5189256 4974444 2727157
$$ packed form
35875h90689M494273N2566m513423m026481j131368j58876J12476K137294L423382
35866e00846P09766l483702m148851j033564K107229L243674K948890J672449
35858A515045n5271n38204O21284Q36258j617120m138103l435219o20494Q87239
35849f544585Q90208J889167L874376L708913J86037l520895l736323o79579K237705
35840a694976K448090N19977j188088j261579k27436P49304J177077R71772M7863
35831A542004r72088p39505R98083K633690K915534K489522J831766l23932m194208
35822F180866o625411m747152m66979K044934J992651J454805P89907r95942k399586
35813b771907j004683J559893J520788l71899J46143K951619L159302k14812k247287
$$ plain form
35804 2727157 1675998 327469 -4936598 -11736198 -13001320 -7218805 -1198233 -715498
35796 -715498 -3767270 -5553918 -5224667 -4452076 -3401138 -1846627 -1340568 -2711755 -3638632
35787 -3638632 -1928647 682310 1068606 -571366 -1552276 -942981 64137 1192835 3516678
35778 3516678 6925893 9468710 9521428 7295751 4316846 2279662 1790988 1524399 -278099
35769 -278099 -2844805 -3285924 -1073363 311548 -1734823 -4760752 -4885953 -2670174 -1735511
35760 -1735511 -2797604 -3258180 -2438583 -2758241 -4797372 -5377951 -2602841 571837 496600
35751 496600 -1872152 -2793607 -1325436 -103315 -1196362 -3820798 -6103337 -6895899 -5583316
35742 -5583316 -2012903 2685498 6429631 7912498 7310526 5319722 2532291 -237244
$$ packed form
35804B727157j051159j348529n264067o799600j265122N782515O020572M82735
35796g15498l051772j786648L29251P72591J050938J554511N06059j371187r26877
35787c638632J709985K610957L86296j639972r80910O09295J007118J128698K323843
35778C516678L409215K542817N2718k225677k978905k037184m88674k66589j802498
35769b78099k566706m41119K212561J384911k046371l025929j25201K215779R34663
35760a735511j062093m60576Q19597l19658k039131n80579K775110L174678p5237
35751D96600k368752r21455J468171J222121j093047k624436k282539p92562J312583
35742e583316L570413M698401L744133J482867o01972j990804k787431k769535
$$ plain form
35734 -237244 -2230486 -3541427 -4531125 -4495697 -2497609 292940 1191171 -133705 -566322
35725 -566322 1932051 4708118 4006368 867639 56318 3292391 7049843 7899934 6714417
35716 6714417 5861518 5206271 3489892 1502016 851381 928110 116479 -889373 -214925
35707 -214925 1154304 -34423 -4191998 -7685260 -7920218 -6672808 -6648920 -7331572 -6543856
35698 -6543856 -4197662 -1925564 -256049 1299525 2180983 1417982 50496 394240 2629723
35689 2629723 4310965 3794876 2187800 1160915 755716 521841 1162027 3355844 5897253
35680 5897253 6688249 5236117 2870339 799124 -765042 -1750754 -1879525 -1279706 -260089
35671 -260089 1573132 4559366 7143774 6677179 3090359 48772 656276 3194382 3405431
$$ packed form
35734b37244j993242j310941r89698L5428J998088K790549Q98231j324876m32617
35725e66322K498373K776067p01750l138729q11321L236073L757452Q50091j185517
35716F714417q52899o55247j716379j987876o50635P6729q11631j005852O74448
35707b14925J369229j188727m157575l493262k34958J247410K3888o82652P87716
35698f543856K346194K272098J669515J555574Q81458p63001j367486L43744K235483
35689B629723J681242n16089j607076j026885m05199k33875O40186K193817K541409
35680E897253P90996j452132k365778k071215j564166r85712j28771N99819J019617
35671b60089J833221K986234K584408m66595l586820l041587O07504K538106K11049
$$ plain form
35662 3405431 465813 -1965124 -1051787 1419996 1889895 -243144 -2518463 -2834373 -1161284
35653 -1161284 1362845 3174237 2514626 -1132837 -5581083 -7396857 -5275105 -988757
35645 -988757 3043262 5775573 6867803 5716939 2429255 -1142706 -2808194 -2452644
35637 -2452644 -2050942 -3085080 -4762396 -5292126 -4315822 -3097046 -2308632 -823225 2455496
35628 2455496 6420206 8837817 9283634 9316400 9564364 8584992 5528970 2143525 607945
35619 607945 688343 704567 216738 -157033 -757866 -2535412 -4953399 -6223586 -5614808
35610 -5614808 -3876436 -1619060 829299 2147821 883514 -2020694 -3591654 -2333142
35602 -2333142 356579 2710156 4619314 6475669 7887182 8482853 8377489 7060282
$$ packed form
35662C405431k939618k430937R13337K471783M69899k133039k275319l15910J673089
35653a161284K524129J811392o59611l647463m448246j815774K121752M286348
35645i88757M032019K732311J092230j150864l287684l571961j665488L55550
35637b452644M01702j034138j677316n29730R76304J218776P88414J485407L278721
35628B455496L964710K417611M45817L2766K47964r79372l056022l385445j535580
35619F07945Q0398J6224m87829l73771o00833j777546k417987j270187O08778
35610e614808J738372K257376K448359J318522j264307k904208j570960J258512
35602b333142K689721K353577J909158J856355J411513N95671j05364j317207
$$ plain form
35594 7060282 3622735 -936501 -3518718 -2408177 570587 2648700 3303012 3489315
35586 3489315 3431720 3103361 3531474 5332460 6693325 5100247 976885 -2308999 -2356126
35577 -2356126 -279660 1012659 204819 -1110753 -240104 3353311 6719657 6367306 2757955
35568 2757955 261116 1651021 4307344 3664530 -718995 -4730803 -4938729 -2188769
35560 -2188769 213768 283913 -1167534 -1803780 -160466 2630021 3648919 1418630 -2039665
35551 -2039665 -3319683 -1534711 921970 1402053 -261945 -2197746 -2833915 -2379854 -2184796
35542 -2184796 -2805386 -3065912 -1639107 730481 1845793 1075072 202107 585122 1082638
35533 1082638 33070 -2029404 -3145002 -2549320 -1197670 -347048 -625390 -1719456 -2222933
$$ packed form
35594G060282l437547m559236k582217J110541K978764K078113O54312J86303
35586C489315n7595l28359M28113J800986J360865j593078m123362l285884m7127
35577b356126K076466J292319q07840j315572Q70649L593415L366346l52351l609351
35568B757955k496839J389905K656323o42814m383525m011808k07926K749960
35560b188769K402537P0145j451447o36246J643314K790487J018898k230289l458295
35551b039665j280018J784972K456681M80083j663998j935801o36169M54061J95058
35542b184796o20590k60526J426805K369588J115312p70721q72965L83015M97516
35533A082638j049568k062474j115598N95682J351650Q50622k78342j094066n03477
$$ plain form
35524 -2222933 -919404 1137748 1485022 -35573 -733627 460456 881656 -1249833 -3185973
35515 -3185973 -2074008 -216881 -1256231 -3097112 -383559 6451613 10658543 8781930
35507 8781930 5188469 4753300 6095276 5505834 3550613 3394613 4909225 4735178 1416205
35498 1416205 -2824783 -5272787 -5365140 -4214132 -3091826 -2314326 -849225 2323859 6056387
35489 6056387 7676320 6485699 4796794 4425140 4195721 2518211 475430 227179 1748343
35480 1748343 3249961 3777058 3489118 2370042 565163 -774451 -659785 385842 1324775
35471 1324775 1834392 1455909 -692477 -3704730 -4389933 -1318763 2381845 2996762 1445602
35462 1445602 1385712 3277180 3988184 1962298 -789650 -2109156 -1874892 -339332 2490016
$$ packed form
35524b222933J303529K057152L47274j520595o98054J194083M21200k131489j936140
35515c185973J111965J857127j039350j840881K713553O835172M206930j876613
35507H781930l593461m35169J341976n89442j955221j56000J514612j74047l318973
35498A416205m240988k448004r2353J151008J122306P77500J465101L173084L732528
35489F056387J619933j190621j688905l71654k29419j677510k042781k48251J521164
35480A748343J501618N27097k87940j119076j804879j339614J14666J045627R38933
35471A324775N09617l78483k148386l012253o85203L071170L700608O14917j551160
35462A445602n9890J891468P11004k025886k751948j319506K34264J535560K829348
$$ plain form
35453 2490016 4944656 4289447 711165 -1790318 -153482 4031141 7032299 7448856
35445 7448856 6632432 6115469 6286852 6815544 7159125 7084441 7088772 7501854 7239832 5005636
35435 5005636 1817016 243428 633860 603925 -602638 -47438 4333918 9362040 10020603
35426 10020603 6217588 2912858 3502280 5967158 6397122 4009899 1267563 468679
35418 468679 1753315 3807779 5190431 5021998 3347570 1172785 -279205 -661129 -673140
35409 -673140 -892694 -682854 1065123 3925956 5542841 4110792 794457 -1439434 -1233009
35400 -1233009 155763 1234925 2001612 2623016 2084130 -273992 -2763872 -2697469 321439
35391 321439 3793350 5165935 4169776 2121756 177494 -906890 -192956 2802706 6663668
$$ packed form
35453B490016K454640o55209l578282k501483J636836M184623L001158M16557
35445G448856q16424n16963J71383N28692L43581p4684M331M13082k62022k234196
35435E005636l188620j573588L90432k9935j206563N55200M381356N028122O58563
35426A0020603l803015l304730N89422K464878M29964k387223k742336p98884
35418D68679J284636K054464J382652j68433j674428k174785j451990l81924j2011
35409f73140k19554K09840J747977K860833J616885j432049l316335k233891K06425
35400a233009J388772J079162P66687O21404n38886k358122k489880O6403L018908
35391C21439L471911J372585r96159k048020j944262j084384P13934K995662L860962
$$ plain form
35382 6663668 8324412 5737979 200127 -4699118 -6614353 -6368648 -6158415 -6667402 -6687170
35373 -6687170 -5065954 -2122524 680412 1772477 543956 -1783415 -2754089 -1150361
35365 -1150361 1549759 3308180 4405278 6361646 8513781 8346874 5678937 3679464
35357 3679464 4376404 5757208 5361722 4367317 5185242 6663423 5276684 654158 -3541832
35348 -3541832 -4682887 -4010773 -3414005 -2293223 438721 3320645 3770396 1761479 79243
35339 79243 990373 3926538 6467173 6758874 4988412 3011010 2426087 2851380 2625693
35330 2625693 1356655 705075 1976493 4050902 4919171 4502504 4444522 5436130 6358733
35321 6358733 6287153 5910416 6308044 7279324 7636335 6638493 4636045 2716220 2011330
$$ packed form
35382F663668J660744k586433n537852m899245j915235K45705K10233n08987j9768
35373f687170J621216K943430K802936J092065j228521k327371r70674J603728
35365a150361K700120J758421J097098J956368K152135j66907k667937j999473
35357C679464O96940J380804l95486r94405Q17925J478181j386739m622526m195990
35348c541832j141055O72114N96768J120782K731944K881924M49751k008917j682236
35339G9243R11130K936165K540635K91701j770462j977402n84923M25293k25687
35330B625693j269038o51580J271418K074409Q68269m16667n7982R91608R22603
35321F358733p1580l76737L97628R71280L57011r97842k002448j919825p04890
$$ plain form
35312 2011330 2774124 3752938 3127737 644251 -1722695 -1912770 -153457 1543394 1834209
35303 1834209 1022409 -160728 -1469532 -2548460 -2619086 -1522087 -255579 385565 1044419
35294 1044419 2617604 4325606 4403105 2816392 1833631 3140067 5466088 6183621 4620407
35285 4620407 2546432 1654808 1983410 3061983 5109188 8029626 10196816 9795060 7308301
35276 7308301 5372592 5812276 7845877 9629754 10394726 10195034 8708432 5877266 3221974
35267 3221974 2699379 4119730 5350410 5477372 6037753 8320757 11188241 12863396 13295258
35258 13295258 13062810 11458290 8045554 5108735 5656316 9186956 12289948 13625260
35250 13625260 15181795 17793470 18830707 16318843 12446064 10303959 9443769 7801419
$$ packed form
35312B011330P62794R78814o25201k483486k366946j90075J759313J696851K90815
35303A834209q11800j183137j308804j078928p0626J096999J266508O41144O58854
35294A044419J573185J708002P7499j586713r82761J306436K326021P17533j563214
35285D620407k073975q91624L28602J078573K047205K920438K167190m01756k486759
35276G308301j935709M39684K033601J783877P64972j99692j486602k831166k655292
35267C221974n22595J420351J230680J26962N60381K283004K867484J675155M31862
35258A3295258k32448j604520l412736k936819N47581L530640L102992J335312
35250A3625260J556535K611675J037237k511864l872779k142105q60190j642350
$$ plain form
35242 7801419 6237824 7423568 11041223 13892267 14679811 14976916 15114144 13220609 9806701
35233 9806701 9259938 13860174 19268888 19710187 16068019 14950225 19949019 27352376
35225 27352376 31430323 31300864 30951041 34008185 40229857 46791653 51935241 57122628
35217 57122628 65751711 79652762 96969787 113898525 128528570 142712011 160358696
35210 160358696 184320336 214676784 249168803 284465827 316395785 338940700 344760361
35203 344760361 329733936 298251540 261947462 230726007 205364867 180369724 152999940
35196 152999940 126951535 107345620 94883312 86007210 77040532 67099934 58139070
35189 58139070 52845015 51487614 50698222 46832566 40505321 35583398 33434581 31245603
$$ packed form
35242G801419j563595J185744L617655K851044P87544K97105J37228j893535l413908
35233I806701n46763M600236N408714M41299l642168j117794M998794P403357
35225B7352376M077947j29459l49823L057144O221672O561796N143588N187387
35217E7122628Q629083J3901051J7317025J6928738J4630045J4183441J7646685
35210A60358696K3961640L0356448L4492019L5297024L1929958K2544915N819661
35203C44760361j5026425l1482396l6304078l1221455k5361140k4995143k7369784
35196A52999940k6048405j9605915j2462308q876102q966678r940598q960864
35189E8139070n294055j357401p89392l865656o327245m921923k148817k188978
$$ plain form
35181 31245603 27306274 24406261 25015516 25954438 22199425 14708998 9792923 10478909
35173 10478909 12849212 12289926 9544802 8192449 9021469 9988458 10159147 10595219 11695298
35164 11695298 12124150 10776970 8316460 6332663 5735618 6068637 6021425 4929429 3956898
35155 3956898 4911828 7499879 9127677 8370253 7075312 7397851 8218261 7018963 4571096
35146 4571096 4688678 8841089 13686188 15134418 12764466 8892412 5360544 3245974
35138 3245974 4025971 8128490 12726532 13716484 10477549 6622834 5294701 5692844 5443145
35129 5443145 4428895 4099774 4142000 2612260 -478017 -2187378 -274267 3950544 7561550
35120 7561550 9278651 9396202 7981095 5304922 3282723 4022060 6776436 8315756
$$ packed form
35181C1245603l939329k900013O09255R38922l755013p490427m916075O85986
35173A0478909K370303n59286k745124j352353Q29020R66989J70689M36072J100079
35164A1695298M28852j347180k460510j983797n97045L33019m7212j091996r72531
35155C956898R54930K588051J627798p57424j294941L22539Q20410j199298k447867
35146D571096J17582M152411M845099J448230k369952l872054l531868k114570
35138C245974P79997M102519M598042R89952l238935l854715j328133L98143k49699
35129E443145j014250l29121M2226j529740l090277j709361J913111M224811L611006
35120G561550J717101J17551j415107k676173k022199P39337K754376J539320
$$ plain form
35112 8315756 6726062 3225025 43592 -1529754 -620391 3275002 8542684 11780751
35104 11780751 11626740 10580020 11141244 11849716 9739172 5558759 3356161 4891187
35096 4891187 7443645 7978430 6943146 6442759 6537805 5455376 2810275 692995 1084230
35087 1084230 3183371 4188988 2671953 306255 -490510 35744 -450230 -2391627 -3212844
35078 -3212844 -1323180 1010724 979661 -388203 -126180 1533889 1508620 -784639 -2175422
35069 -2175422 -826339 768284 -309467 -3048117 -4225637 -2750041 -216698 1716966
35061 1716966 2647263 2716886 1992324 426848 -1882961 -3854212 -3335228 351062 4035275
35052 4035275 3558607 -459027 -2644273 160829 4964416 7368198 7130237 6524630 6043827
$$ packed form
35112H315756j589694l501037l181433j573346R09363L895393N267682L238067
35104A1780751j54011j046720N61224P08472k110544m180413k202598J535026
35096D891187K552458N34785j035284n00387R5046j082429k645101k117280L91235
35087A084230K099141J005617j517035k365698p96765N26254m85974j941397q21217
35078c212844J889664K333904l1063j367864K62023J660069k5269k293259j390783
35069b175422J349083J594623j077751k738650j177520J475596K533343J933664
35061A716966R30297O9623p24562j565476k309809j971251N18984L686290L684213
35052D035275m76668m017634k185246K805102M803587K403782k37961o05607m80803
$$ plain form
35043 6043827 4951189 3901653 3627253 2803291 602037 -423817 2172021 5894281
35035 5894281 6242456 3410137 1401093 1090264 -525935 -3747953 -4471386 -1005372 2341547
35026 2341547 1424694 -1884863 -3280691 -2332786 -1686384 -2224761 -2601035 -2228372 -1590112
35017 -1590112 -435332 1675125 3718284 4388050 4201492 4381657 4613668 4162690 4149895
35008 4149895 5849271 7256273 4677879 -1620889 -6273061 -4904234 528230 4357890
35000 4357890 4114704 2730936 3809718 6658046 7566525 5325016 3261346 4887157
34992 4887157 9366248 13291208 15626436 17892673 19822689 18590616 13608474 8754297
34984 8754297 7535692 8533788 8225223 6238372 4852296 4884057 5369865 6384161 8796360
$$ packed form
35043F043827j092638j049536k74400q23962k201254j025854K595838L722260
35035E894281L48175k832319k009044l10829j616199l222018p23433L466014L346919
35026B341547r16853l309557j395828R47905O46402n38377l76274L72663O38260
35017a590112J154780K110457K043159O69766j86558J80165K32011m50978j2795
35008D149895J699376J407002k578394o298768m652172J368827N432464L829660
35000D357890k43186j383768J078782K848328R08479k241509k063670J625811
34992D887157M479091L924960K335228K266237J930016j232073m982142m854177
34984H754297j218605R98096l08565j986851j386076L1761M85808J014296K412199
$$ plain form
34975 8796360 11501382 12042445 10150424 7915324 6357787 4724440 3430685 4401434
34967 4401434 7410552 9126983 7535405 4870214 4229954 5347064 5936992 5656310 6179293
34958 6179293 8011377 9424903 8538039 5062375 247500 -3680502 -4482220 -1851964
34950 -1851964 1572950 2437626 185340 -2503825 -2891145 -938117 1297159 2149002 1649907
34941 1649907 759186 -3801 -817968 -1598656 -1386456 666038 3870282 6442729 7605174
34932 7605174 8348301 9522741 10040241 8113650 4028691 511981 -46631 1865191 3468862
34923 3468862 2491297 -804427 -3991023 -4578867 -2077173 1534190 3386656 2192818
34915 2192818 -646191 -2532426 -2225806 -525644 1513838 3981772 6876317 8391616
$$ packed form
34975H796360K705022N41063j892021k235100j557537j633347j293755R70749
34967D401434L009118J716431j591578k665191o40260J117110N89928k80682N22983
34958F179293J832084J413526q86864l475664m814875l928002q01718K630256
34950a851964L424914Q64676k252286k689165l87320J953028K235276Q51843m99095
34941A649907q90721p62987q14167p80688K12200K052494L204244K572447J162445
34932G605174P43127J174440N17500j926591m084959l516710n58612J911822J603671
34923C468862r77565l295724l186596n87844K501694L611363J852466j193838
34915B192818k839009j886235L06620J700162K039482K467934K894545J515299
$$ plain form
34907 8391616 6307388 1364958 -2468390 -2207195 719723 2375507 873654 -2138197
34899 -2138197 -3872909 -2889753 438611 4417350 6840554 6531184 4485356 2824806
34891 2824806 2546813 2903504 2764985 1752466 223171 -951185 -770830 788665 2281995
34882 2281995 2378129 1576825 1157240 879969 -572402 -2941805 -4082103 -2797162 -427195
34873 -427195 988131 752786 -766959 -2896239 -4311264 -3402298 -143049 3309656 4818036
34864 4818036 4421890 3823795 4572270 7021691 9894336 10578418 7460600 2627725 549018
34855 549018 3024374 6996896 8561534 7535908 6520114 6907622 7827103 8158128 7659750
34846 7659750 6508405 5248252 4830479 5439661 5769349 4610360 2549560 1042793 652517
$$ packed form
34907H391616k084228m942430l833348K61195K926918J655784j501853l011851
34899b138197j734712R83156L328364L978739K423204l09370k045828j660550
34891B824806k77993L56691j38519j012519j529295j174356J80355J559495J493330
34882B281995R6134q01304m19585k77271j452371k369403j140298J284941K369967
34873d27195J415326k35345j519745k129280j415025R08966L259249L452705J508380
34864D818036l96146n98095P48475K449421K872645O84082l117818m832875k078707
34855E49018K475356L972522J564638j025626j015794L87508R19481L31025m98378
34846G659750j151345j260153m17773O09182L29688j158989k060800j506767l90276
$$ plain form
34837 652517 1284688 2951393 4801921 4699511 1788121 -1470181 -1994817 -155937 991900
34828 991900 -77158 -2168592 -3816494 -4409159 -3214040 -32581 3084764 3478917 1595343
34819 1595343 483410 1224277 1685840 524593 -634371 -370670 53794 -668062 -1184814
34810 -1184814 227814 2364617 2407496 -420626 -4222054 -6476744 -5470782 -1134323
34802 -1134323 4022134 6339309 5145150 4015866 6081692 9724624 11253451 10275782
34794 10275782 9458987 9980775 10512242 10404870 10583982 10961499 10117357 8434740 8634884
34785 8634884 11676480 14457633 13514604 9492084 6095985 5480173 6252090 5745970 3251646
34776 3251646 951110 1702944 5455378 8396891 7069476 2959816 869491 2617234
$$ packed form
34837F52517O32171J666705J850528j02410k911390l258302n24636J838880J147837
34828I91900j069058k091434j647902n92665J195119L181459L117345L94153j883574
34819A595343j111933P40867M61563j161247j158964K63701M24464p21856n16752
34810a184814J412628K136803M2879k828122l801428k254690J005962M336459
34802a134323N156457K317175j194159j129284K065826L642932J528827r77669
34794A0275782q16795N21788N31467j07372J79112L77517q44142j682617K00144
34785H634884L041596K781153r43029m022520l396099o15812P71917n06120k494324
34776C251646k300536P51834L752434K941513j327415m109660k090325J747743
$$ plain form
34768 2617234 5136788 5821220 6576915 10050834 14276016 14645202 10223329 4663018 1057338
34759 1057338 -798629 -1645385 -705305 2073976 4396706 4378290 3263914 3415631 4863681
34750 4863681 5869644 5963376 6220875 6900456 6901348 5691680 4003476 2346129 515039
34741 515039 -954389 -568829 1920622 4477498 5160684 4499973 4138174 3981854 2519830
34732 2519830 -238698 -2079337 -1451286 463982 1588536 1788204 2481035 3906134 4426149
34723 4426149 2927985 618261 -529009 -414994 -770603 -2606518 -4760124 -5288485 -3562545
34714 -3562545 -586606 2123414 3512311 3497896 3215953 4220654 6569300 8128305 6886397
34705 6886397 3740409 1637056 1754845 1905441 -670773 -6056892 -11863780 -15494763
$$ packed form
34768B617234K519554O84432P55695L473919M225182L69186m421873n560311l605680
34759A057338j855967q46756R40080K779281K322730j8416j114376J51717J448050
34750D863681J005963R3732K57499O79581Q92j209668j688204j657347j831090
34741E15039j469428L85560K489451K556876O83186o60711l61799j56320j462024
34732B519830k758528j840639O28051J915268J124554J99668O92831J425099N20015
34723D426149j498164k309724j147270J14015l55609j835915k153606n28361J725940
34714c562545K975939K710020J388897j4415k81943J004701K348646J559005j241908
34705F886397l145988k103353J17789J50596k576214n386119n806888l630983
$$ plain form
34697 -15494763 -15372534 -11344692 -5496830 -1663183 -2159281 -5159932 -6918845 -6336191
34689 -6336191 -5436412 -5395362 -4629710 -1875876 1058120 1566157 7380 -833360 539962
34680 539962 3033395 5161640 6693304 7784631 8044107 7203912 5743802 4263783 3076112
34671 3076112 2864650 4610480 7863875 9965142 8496937 4421805 1382704 1436558 2648495
34662 2648495 1818304 -1258890 -3623401 -3015609 -369640 2041857 3498871 4618317
34654 4618317 5229486 4331666 2136974 388230 58119 233522 203251 1189072 4401386
34645 4401386 8317580 9971894 8893138 7800097 8827637 10795206 11305527 10132796
34637 10132796 8867409 7971700 6216586 3249593 901385 839329 1977028 1670418 -724450
$$ packed form
34697a5494763J22229M027842N847862L833647m96098l000651j758913N82654
34689f336191Q99779M1050P65652K753834K933996N08037j558777q40740J373322
34680E39962K493433K128245J531664J091327K59476q40195j460110j480019j187671
34671C076112k11462J745830L253395K101267j468205m075132l039101N3854J211937
34662B648495q30191l077194k364511O07792K645969K411497J457014J119446
34654D618317O11169q97820k194692j748744l30111J75403l0271R85821L212314
34645D401386L916194J654314j078756j093041J027540J967569N10321j172731
34637A0132796j265387q95709j755114k966993k348208o2056J137699l06610k394868
$$ plain form
34628 -724450 -2869103 -2555479 -850948 -972253 -4017733 -6911507 -5544505 265326 6040321
34619 6040321 7421546 4895777 2697357 3402042 5231784 5220010 3355545 1979423 2031696
34610 2031696 2115355 1397567 1239844 2753335 4183930 2438556 -3106014 -9486708 -12877315
34601 -12877315 -11882899 -8368038 -5529692 -4980855 -5543150 -5217169 -3952011 -3177854 -2765346
34592 -2765346 -819086 2470577 3399577 -338528 -5190742 -5521323 -1025247 3147762
34584 3147762 3632621 2544554 3041802 4668516 5034899 3580747 1526041 -168710 -1012764
34575 -1012764 -744923 -410372 -1929634 -4995914 -6335069 -4008093 -539827 596511
34567 596511 -127154 278148 2313926 3587953 2902604 1841429 2267391 4549897 8166711
$$ packed form
34628g24450k144653L13624J704531j21305l045480k893774J367002N809831N774995
34619F040321J381225k525769k198420P04685J829742j1774j864465j376122N2273
34610B031696Q3659p17788j57723J513491J430595j745374n544570o380694l390607
34601a2877315R94416L514861K838346N48837n62295L25981J265158P74157M12508
34592b765346J946260L289663R29000l738105m852214l30581M496076M173009
34584C147762M84859j088067M97248J626714L66383j454152k054706j694751q44054
34575a012764K67841L34551j519262l066280j339155K326976L468266J136338
34567E96511p23665M05302K035778J274027o85349j061175M25962K282506L616814
$$ plain form
34558 8166711 11970914 14144838 13934549 12983993 13020915 13297824 12812441 13475069 17205030
34549 17205030 20905924 19362199 13516001 10537045 13870490 18280765 17780573 13921572
34541 13921572 11981562 12443523 11466518 7989549 5161655 5012690 6088765 6733792 6960853
34532 6960853 6379689 3720521 -333995 -2713499 -1937332 -309825 -483456 -1625930 -957518
34523 -957518 1963708 4504529 4365085 2180924 203734 -698939 -1660038 -3353236 -4120937
34514 -4120937 -1941205 2114890 4383701 3197662 1037985 879884 2351551 3436551
34506 3436551 4074261 5175639 5369339 2447220 -2057396 -3562310 -776975 1965234
34498 1965234 527035 -3536579 -5514873 -3549858 314127 3643494 5591862 6052795
$$ packed form
34558H166711L804203K173924k10289r50556L6922K76909m85383O62628L729961
34549A7205030L700894j543725n846198k978956L333445M410275n00192l859001
34541A3921572j940010M61961r77005l476969k827894j48965J076075O45027K27061
34532F960853n81164k659168m054516k379504P76167J627507j73631j142474O68412
34523i57518K921226K540821j39444k184161j977190r02673r61099j693198p67701
34514d120937K179732M056095K268811j186039k159677j58101J471667J085000
34506C436551O37710J101378J93700k922119m504616j504914K785335K742209
34498A965234j438199m063614j978294J965015L863985L329367J948368M60933
$$ plain form
34490 6052795 5219343 3979856 3056267 1772187 -958583 -4569839 -7021034 -6829679 -3890843
34481 -3890843 1010195 5920920 7686407 4575532 -867969 -3819789 -2647845 -366287
34473 -366287 113113 -241235 809549 2618268 2825768 1536241 1301780 3021998 4616937
34464 4616937 4387708 3291466 2819213 2710250 2234362 2024225 2861653 3876588 3772988
34455 3772988 2960836 2749443 3269022 4041443 5758148 9164631 12578391 13060030 10269746
34446 10269746 6887074 4900257 3850323 3223708 3828914 5549187 6252800 4773212
34438 4773212 3004170 3075034 4069210 3586802 1263617 -1248251 -2681377 -2644602 -837780
34429 -837780 2262863 4931225 6249788 7468684 9383952 9951213 7205900 3205123
$$ packed form
34490F052795q33452j239487r23589j284080k730770l611256k451195J91355K938836
34481c890843M901038M910725J765487l110875n443501k951820J171944K281558
34473c66287M79400l54348J050784J808719K07500j289527k34461J720218J594939
34464D616937k29229j096242m72253j08963m75888k10137Q37428J014935j03600
34455C772988q12152k11393N19579P72421J716705L406483L413760M81639k790284
34446A0269746l382672j986817j049934o26615O05206J720273P03613j479588
34438D773212j769042P0864R94176m82408k323185k511868j433126L6775J806822
34429h37780L100643K668362J318563J218896J915268N67261k745313m000777
$$ plain form
34421 3205123 1696045 2539247 2066516 -1013993 -3717714 -3477516 -1409713 214956 760721
34412 760721 143223 -2222846 -5638547 -7600642 -6911290 -5467640 -5316527 -5664540 -4478959
34403 -4478959 -1571764 1443294 2977516 2096249 -1120984 -4705985 -6052580 -5282270
34395 -5282270 -5384473 -7564543 -8783004 -6091915 -1310275 1416245 1268829 1040116 2645020
34386 2645020 5214281 7304326 8375323 8036217 6081423 3553137 2040812 1812095
34378 1812095 2018231 2392627 3109288 3374301 2095839 -132446 -1547684 -1771719 -2151434
34369 -2151434 -3417517 -4609133 -4625411 -3545154 -2171035 -1274440 -1232934 -1472386 -651864
34360 -651864 1502377 3126996 2333118 -151384 -1856141 -1482568 511835 3411196 6494870
$$ packed form
34421C205123j509078Q43202m72731l080509k703721K40198K067803J624669N45765
34412G60721o17498k366069l415701j962095O89352J443650J51113l48013J185581
34403d478959K907195L015058J534222q81267l217233l585001j346595P70310
34395e282270j02203k180070j218461K691089M781640K726520j47416k28713J604904
34386B645020K569261K090045J070997l39106j954794k528286j512325k28717
34378A812095K06136L74396P16661K65013j278462k228285j415238k24035l79715
34369b151434j266083j191616j6278J080257J374119Q96595M1506k39452Q20522
34360f51864K154241J624619p93878k484502j704757L73573J994403K899361L083674
$$ plain form
34351 6494870 8513404 8893083 8797802 8977976 7586806 2859210 -2850771 -5117190 -3430637
34342 -3430637 -1581193 -1622590 -1272822 1304589 3747788 2914063 -506475 -3285149 -3851713
34333 -3851713 -3066261 -2117399 -1473174 -968029 251779 2749403 5127159 5173407 3413848
34324 3413848 3026598 4917137 5748506 3080730 -247439 51073 3542959 6243689 6615046
34315 6615046 6591653 7076651 6286941 3352008 470282 14821 1387016 2050485 601610
34306 601610 -2028588 -3779727 -3541294 -2408905 -2489278 -3973759 -4530640 -2759982 -780990
34297 -780990 -1229326 -2786712 -1662813 2622663 6040329 5416012 2264783 -128458 -1132201
34288 -1132201 -2203974 -3389955 -2866376 106114 3535014 4646468 2776309 -205960
$$ packed form
34351F494870K018534L79679r5281J80174j391170m727596n709981k266419J686553
34342c430637J849444m1397L49768K577411K443199q33725l420538k778674n66564
34333c851713P85452R48862O44225N05145J219808K497624K377756M6248j759559
34324C413848l87250J890539Q31369k667776l328169K98512L491886K700730L71357
34315F615046k3393M84998p89710k934933k881726m55461J372195O63469j448875
34306F01610k630198j751139K38433J132389q0373j484481n56881J770658J978992
34297g80990m48336j557386J123899M285476L417666o24317l151229k393241j003743
34288a132201j071773j185981N23579K972490L428900J111454j870159k982269
$$ plain form
34280 -205960 -2154927 -2807551 -3275968 -3719459 -2720100 409368 3843928 5094611 3972983
34271 3972983 2230525 743614 -1047228 -2869536 -2932446 -494081 2397960 3135016 1831044
34262 1831044 1111148 2697839 5178749 5682096 3450455 941307 837157 2648634 3667110
34253 3667110 3076543 2952963 4400163 5170218 3153585 178496 -582404 351249 -248186
34244 -248186 -2881129 -4577198 -3787650 -2246142 -1026197 1403881 5257593 7026123
34236 7026123 3927845 -1564202 -4633757 -3978493 -1967970 -270303 1618988 3991887
34228 3991887 5854116 6427608 5836244 4331395 2403402 1320311 1900378 3061842 3116697
34219 3116697 2001964 707767 -581801 -1714990 -949831 2993270 7587222 8427855
$$ packed form
34280b05960j948967o52624m68417m43491R99359L129468L434560J250683j121628
34271C972983j742458j486911j790842j822308o2910K438365K892041P37056j303972
34262A831044p19896J586691K480910N03347k231641k509148j04150J811477J018476
34253C667110n90567j23580J447200P70055k016633k975089p60900R33653n99435
34244b48186k632943j696069P89548J541508J219945K430078L853712J768530
34236G026123l098278n492047l069555O55264K010523J697667J889291K372899
34228C991887J862229N73492n91364j504849j927993j083091N80067J161464N4855
34219C116697j114733j294197j289568j133189P65159L943101M593952Q40633
$$ plain form
34211 8427855 4950770 1149607 -162409 -456824 -1426254 -1456761 1011850 3562980 3116225
34202 3116225 1343415 2360387 5643917 6036461 1716824 -2418490 -1808481 1067548
34194 1067548 802755 -2451015 -3181816 1234697 6813767 8564650 6345622 3253669
34186 3253669 925393 -963024 -2268081 -2392353 -2178446 -3297383 -5604922 -6864762
34178 -6864762 -5244942 -849513 4785731 9140856 9382294 5064541 155982 -297229
34170 -297229 3841809 7684392 8018935 7135614 8124967 9304004 6610284 9477 -5930139
34161 -5930139 -7432161 -4581154 659443 6265439 9634514 8677541 5037966 3622542
34153 3622542 6814553 10993403 11035580 6804387 2522433 607313 -585605 -2507869
$$ packed form
34211H427855l477085l801163j312016k94415r69430l0507K468611K551130m46755
34202C116225j772810J016972L283530L92544m319637m135314O10009K876029
34194A067548k64793l253770p30801M416513N579070J750883k219028l091953
34186C253669k328276j888417j305057j24272K13907j118937k307539j259840
34178f864762J619820M395429N635244M355125K41438m317753m908559m53211
34170b97229M139038L842583L34543q83321R89353J179037k693720o600807n939616
34161e930139j502022K851007N240597N605996L369075r56973l639575j415424
34153C622542L192011M178850M2177m231193m281954j915120j192918j922264
$$ plain form
34145 -2507869 -3272886 -917130 2292492 1935471 -2378951 -5623176 -3206996 3503430
34137 3503430 8916845 9407267 6286815 3236853 2470938 3529848 4511883 4028560 2704785
34128 2704785 2839906 5733520 9392953 10069563 6355687 745493 -3088852 -3507111 -1347085
34119 -1347085 1250852 1925869 -383521 -3993321 -5754384 -4612441 -2553865 -1204024
34111 -1204024 598226 4167973 7620716 7633777 3914208 -286329 -1930850 -744176
34103 -744176 1662336 3394675 3120548 994122 -1181312 -1913888 -1768650 -1943571 -2077913
34094 -2077913 -1382143 -915671 -1997596 -2869471 -282276 5163063 8594478 7066939 3324140
34085 3324140 1724216 2976967 4950530 6406355 7347402 7239219 5641271 3858316
$$ packed form
34145b507869p65017K355756L209622l57021m314422l244225K416180O710426
34137C503430N413415M90422l120452l049962p65915J058910R82035m83323j323775
34128B704785J35121K893614L659433O76610l713876n610194l834345m18259K160026
34119a347085K597937O75017k309390l609800j761063J141943K058576J349841
34111a204024J802250L569747L452743J3061l719569m200537j644521J186674
34103g44176K406512J732339k74127k126426k175434p32576J45238j74921j34342
34094b077913O95770M66472j081925q71875K587195N445339L431415j527539l742799
34085C324140j599924J252751J973563J455825R41047j08183j597948j782955
$$ plain form
34077 3858316 3635356 4673691 5395313 5565013 6023518 6281851 4860130 2217649 972010
34068 972010 2332117 4189936 3994945 2184851 1289899 2323920 3558031 2929065 595950
34059 595950 -1353517 -1201789 883631 3410794 5148964 6096688 7192208 9135221 11263742
34050 11263742 11810945 9978610 7680677 7980854 11234953 14126184 13715879 11301820
34042 11301820 10630426 13165276 17064757 20188064 21795466 21522765 19270568 16517997
34034 16517997 15427574 16079116 16703531 16958074 18361454 20889314 22148164 21183991 20233611
34025 20233611 21172313 23139290 25398873 29193307 34237025 36831202 35112238 33403778
34017 33403778 37116190 45340732 52937061 58322377 64155351 71071756 76206759 78683434
$$ packed form
34077C858316k22960J038335P21622J69700M58505K58333j421721k642481j245639
34068I72010J360107J857819j94991j810094q94952J034021J234111o28966k333115
34059E95950j949467J51728K085420K527163J738170R47724J095520J943013K128521
34050A1263742N47203j832335k297933L00177L254099K891231m10305k414059
34042A1301820o71394K534850L899481L123307J607402k72701k252197k752571
34034A6517997j090423O51542O24415K54543J403380K527860J258850r64173r50380
34025B0233611R38702J966977K259583L794434N043718K594177j718964j708460
34017C3403778L712412Q224542P596329N385316N832974O916405N135003K476675
$$ plain form
34009 78683434 81910462 88940871 98991012 109539149 118575111 124101027 125092879 124033858
34001 124033858 124940152 127669860 127684465 122662900 115646069 110193780 106345844 103118488
33993 103118488 100696005 97643022 90328692 78671439 68695879 65284020 65470019 63181527
33985 63181527 57786638 53110527 50260545 46917834 42699921 39892750 38897452 37567000
33977 37567000 35252590 33273224 31226411 27268265 22642667 21421617 24386732 27156028
33969 27156028 26048153 22262360 18550223 15302604 12204900 10688146 11985447 14766026
33961 14766026 16871437 17638787 16889704 13872305 9215148 5796930 5355800 5936082 4898983
33952 4898983 2829964 2126975 3153185 4286869 4738779 4871717 4435084 2823384 803637
$$ packed form
34009G8683434L227028P030409J0050141J0548137R035962N525916R91852j059021
34001A24033858R06294K729708J4605n021565p016831n452289l847936l227356
33993A03118488k422483l052983p314330j1657253r975560l411859J85999k288492
33985F3181527n394889m676111k849982l342711m217913k807171r95298j330452
33977C7567000k314410j979366k046813l958146m625598j221050K965115K769296
33969B7156028j107875l785793l712137l247619l097704j516754J297301K780579
33961A4766026K105411P67350p49083l017399m657157l418218m41130N80282j037099
33952D898983k069019p02989J026210J133684M51910J32938m36633j611700k019747
$$ plain form
33943 803637 72357 1182057 3151687 4654073 4639682 2858116 885364 1160704 3565314
33934 3565314 4749546 2787469 490987 1399392 4301109 5196118 3421977 1843211
33926 1843211 1533402 625647 -1245964 -1808874 -704117 -985804 -3960691 -6180390 -4319870
33917 -4319870 -63769 2940717 4466279 6477360 8408926 7800424 4992858 3228069
33909 3228069 3748658 4345680 3742101 4073058 7003321 9937459 8986125 4607107 1405038
33900 1405038 2150109 4393371 4119417 1041987 -1591800 -1792413 -1240821 -2310843 -4406551
33891 -4406551 -4803110 -2422393 823160 2443049 1851244 199407 -1201962 -1810808 -1854341
33882 -1854341 -1831124 -1845449 -1619187 -1380782 -1900823 -2841140 -2216722 860425 3861785
$$ packed form
33943H03637p31280J109700J969630J502386j4391j781566j972752K75340K404610
33934C565314J184232j962077k296482R08405K901717Q95009j774141j578766
33926A843211l09809r07755j871611n62910J104757k81687k974887k219699J860520
33917d319870M256101L004486J525562K011081J931566o08502k807566j764789
33909C228069N20589N97022o03579L30957K930263K934138r51334m379018l202069
33900A405038P45071K243262k73954l077430k633787k00613N51592j070022k095708
33891d406551l96559K380717L245553J619889n91805j651837j401369o08846m3533
33882a854341K3217j4325K26262K38405n20041r40317O24418L077147L001360
$$ plain form
33873 3861785 3630360 1092277 444467 3428433 7273622 9033247 8998330 8599396 7887648
33864 7887648 6791969 6047631 4978939 1406232 -3880089 -5946187 -2375952 2131399
33856 2131399 2213681 98204 1848154 7110224 9107089 4927660 -451510 -1841875
33848 -1841875 -16366 1821205 2734284 2727271 1264170 -121388 1991322 7131616 9638555
33839 9638555 6645932 3039088 4049111 6988988 5973524 1736051 179699 2694263
33831 2694263 4555385 2841822 -176951 -2228509 -3873918 -4832393 -2942173 1057779
33823 1057779 2650904 247659 -1582263 1067127 5140413 5178446 1409006 -1170091
33815 -1170091 -339699 1008938 -98753 -2909253 -4801970 -4514918 -2711912 -845263
$$ packed form
33873C861785k31425k538083o47810K983966L845189J759625l4917l98934p11748
33864G887648j095679p44338j068692l572707n286321k066098L570235M507351
33856B131399Q2282k115477J749950N262070J996865m179429n379170j390365
33848a841875J825509J837571R13079p013j463101j385558K112710N140294K506939
33839I638555k992623l606844J010023K939877j015464m237473j556352K514564
33831B694263J861122j713563l018773k051558j645409r58475J890220L999952
33823A057779J593125k403245j829922K649390M073286L8033l769440k579097
33815a170091Q30392J348637j107691k810500j892717K87052J803006J866649
$$ plain form
33807 -845263 -3214 -39194 172192 1043073 1473370 594017 -595638 -610180 257432 515638
33797 515638 -245553 -1196500 -1995336 -3010269 -3881463 -3514372 -1894038 -582875 -762829
33788 -762829 -1648879 -1529493 60670 1785839 2090183 1040939 318685 1185062 2733033
33779 2733033 2745112 282004 -3193844 -5305885 -4787031 -2219465 344049 707434 -1344427
33770 -1344427 -3440464 -3531712 -2938900 -4273466 -6553262 -5703352 -880673 3341800 3375296
33761 3375296 1838843 2985829 5656889 5294761 1519268 -1224017 -523627 1011148
33753 1011148 434323 -1808777 -4033607 -5624746 -5751924 -3195670 706310 2078889
33745 2078889 -384987 -3180387 -3086652 -1575932 -1391343 -1661878 -149942 1845301 1202283
$$ packed form
33807h45263Q42049l5980K11386Q70881M30297q79353j189655j4542Q67612K58206
33797E15638p61191r50947p98836j014933q71194L67091J620334J311163j79954
33788g62829q86050J19386J590163J725169L04344j049244p22254Q66377J547971
33779B733033J2079k463108l475848k112041N18854K567566K563514L63385k051861
33770a344427k096037r1248N92812j334566k279796Q49910M822679M222473L3496
33761C375296j536453J146986K671060l62128l775493k743285P00390J534775
33753A011148n76825k243100k224830j591139j27178K556254L901980J372579
33745B078889k463876k795400R3735J510720J84589k70535J511936J995243o43018
$$ plain form
33736 1202283 -1541415 -2837678 -1956082 -1801651 -3432078 -3982243 -1373352 2667256 6044437
33727 6044437 9183589 12134206 12249988 8276859 4252162 5066257 9278332 10622734
33719 10622734 6562815 1170517 -1381023 -2126238 -3896069 -5816514 -4565936 329503
33711 329503 5539186 7882425 6913043 3870228 402437 -1515576 -609330 2038956 3912648
33702 3912648 4084092 3719963 3256624 1329046 -2242331 -4528978 -2855147 972353 2249634
33693 2249634 -863675 -5180167 -6494401 -4119700 -644811 1565755 2341131 2543980
33685 2543980 2218871 692466 -1700345 -3070468 -2124228 -352179 -474027 -2501251 -3337345
33676 -3337345 -1435348 178879 -2120049 -6779484 -8309278 -4327050 1528125 4591661
$$ packed form
33736A202283k743698j296263Q81596J54431j630427n50165K608891M040608L377181
33727F044437L139152K950617J15782l973129m024697Q14095M212075J344402
33719A0622734m059919n392298k551540p45215j769831j920445J250578M895439
33711C29503N209683K343239r69382l042815l467791j918013R06246K648286J873692
33702C912648J71444l64129m63339j927578l571377k286647J673831L827500J277281
33693B249634l113309m316492j314234K374701L474889K210566P75376K02849
33685B543980l25109j526405k392811j370123R46240J772049j21848k027224q36094
33676c337345J901997J614227k298928m659435j529794L982228N855175L063536
$$ plain form
33668 4591661 4482212 3806188 3725501 3343653 2577936 2974295 5186656 7397176 7257794
33659 7257794 4692478 2011808 1490223 3297472 5681229 6676120 5465705 2568125
33651 2568125 -630860 -2578252 -2608659 -1657267 -1280135 -1669842 -1548269 -485452 11925
33642 11925 -1170361 -2677561 -2662111 -1718163 -1579423 -1686682 57530 3208607 4706378
33633 4706378 3708207 3312370 5751120 8638392 8419098 5513958 3384846 3902041 6237197
33624 6237197 9176325 11653515 11671750 7837830 2246999 -775697 521156 3759877
33616 3759877 6058958 6976431 7086817 6018028 3655264 1777645 2415556 4988456 6636433
33607 6636433 5482452 2613094 733054 1527820 4399157 7140894 7571607 4996650
$$ packed form
33668D591661j09449o76024q0687l81848p65717L96359K212361K210520j39382
33659G257794k565316k680670n21585J807249K383757R94891j210415k897580
33651B568125l198985j947392l0407R51392L77132l89707J21573J062817M97377
33642A1925j182286j507200J5450R43948J38740j07259J744212L151077J497771
33633D706378r98171l95837K438750K887272k19294k905140k129112N17195K335156
33624F237197K939128K477190J8235l833920n590831l022696J296853L238721
33616C759877K299081R17473J10386j068789k362764j877619O37911K572900J647977
33607F636433j153981k869358j880040P94766K871337K741737M30713k574957
$$ plain form
33599 4996650 749921 -2508700 -2514902 849502 5269465 7781102 7105944 4236629 1097118
33590 1097118 -752933 -396677 2186232 5676680 8169466 8939477 8707066 7863474 5732679
33581 5732679 2386967 -204258 -300195 1179085 1804074 635650 -1289569 -2851339 -3592336
33572 -3592336 -2899383 -248888 3383915 5663356 5029876 2204786 -431761 -590272 2249344
33563 2249344 6206685 8623085 8920816 8885321 9457195 9034559 6592388 4571540 5831984
33554 5831984 8858924 9372402 6502851 3962501 4533904 6603698 7306340 6239110 4487512
33545 4487512 2416752 325490 -573214 278109 1546789 1862202 1713984 2278633 3642740
33536 3642740 5326452 7165723 8526834 8174418 6202240 4578503 4476647 4694229 4069925
$$ packed form
33599D996650m246729l258621o202L364404M419963K511637o75158k869315l139511
33590A097118j850051L56256K582909L490448K492786P70011k32411q43592k130795
33581E732679l345712k591225r5937J479280O24989j168424j925219j561770p40997
33572c592336O92953K650495L632803K279441o33480k825090k636547j58511K839616
33563B249344L957341K416400K97731l5495N71874m22636k442171k020848J260444
33554E831984L026940N13478k869551k540350N71403K069794P02642j067230j751598
33545D487512k070760k091262q98704Q51323J268680L15413j48218N64649J364107
33536C642740J683712J839271J361111l52416j972178j623737j01856K17582o24304
$$ plain form
33527 4069925 3502170 3741147 3241715 762073 -1580351 -973354 1295919 1054474 -2709376
33518 -2709376 -6016242 -4935097 -258722 3917144 4928846 3987974 4494453 8067184
33510 8067184 11933227 11141096 4401878 -3389313 -6201062 -3603556 -401653 -149326
33502 -149326 -1564456 -1551697 608054 2934331 3059980 319143 -3244072 -3910882 120549
33493 120549 6090072 9219273 7927804 4830914 2761892 2119950 2355172 3384745 4562623
33484 4562623 4628050 3934991 4587991 7034737 8738737 7908971 6344518 6381070 6998686
33475 6998686 5813627 3623707 3713847 6911657 10297045 11222611 10122488 8654574 7365552
33466 7365552 6397996 6665587 8660780 11058466 11963262 11097893 9690863 8634902 7898764
$$ packed form
33527D069925n67755K38977m99432k479642k342424O06997K269273k41445l763850
33518b709376l306866J081145M676375M175866J011702r40872N06479L572731
33510H067184L866043p92131o739218p791191k811749K597506L201903K52327
33502a49326j415130J2759K159751K326277J25649k740837l563215o66810M031431
33493A20549N969523L129201j291469l096890k069022o41942K35222J029573J177878
33484D562623O5427o93059O53000K446746J704000q29766j564453L6552O17616
33475F998686j185059k189920R0140L197810L385388R25566j100123j467914j289022
33466G365552r67556K67591J995193K397686R04796q65369j407030j055961p36138
$$ plain form
33457 7898764 7581611 8294789 10067370 11719764 12031984 11175101 10345522 10162308 10152948
33448 10152948 9880155 9724329 10070045 10461888 10401721 10448991 11374190 12404440 11722105
33439 11722105 9143485 7077482 7938104 11377130 14996872 17234707 18525871 19941199
33431 19941199 21807905 23784160 25359251 25933897 25158717 23789895 23792081 26879324 32904560
33422 32904560 40112462 47001368 53401782 59546952 64951332 69252277 73843851 81184559
33414 81184559 91862218 103427078 113016598 120263264 126608484 132731038 138245564 143334954
33406 143334954 148662212 153524799 155888727 154689238 150533059 143795214 134027821 122185767
33398 122185767 111373815 103587447 97067634 88861423 79136868 70905534 65912182 62910180
$$ packed form
33457G898764l17153P13178J772581J652394L12220q56883q29579j83214r360
33448A0152948k72793j55826L45716L91843o0167M7270R25199J030250o82335
33439A1722105k578620k066003Q60622L439026L619742K237835J291164J415328
33431A9941199J866706J976255J575091N74646p75180j368822K186L087243O025236
33422C2904560P207902O888906O400414O145170N404380M300945M591574P340708
33414H1184559J0677659J1564860R589520P246666O345220O122554N514526N089390
33406A43334954N327258M862587K363928j199489m156179o737845r767393j1842054
33398A22185767j0811952p786368o519813q206211r724555q231334m993352l002002
$$ plain form
33390 62910180 60041882 56856879 53424306 49373104 45020143 42085094 41671229 42084600
33382 42084600 40182654 34946224 28478864 23135487 18934659 14820242 11508847 11211539
33374 11211539 14348418 18318577 20487244 20915662 20748884 19449419 16079096 12492090
33366 12492090 12002958 14378907 15308406 12352811 8613260 8127661 9949218 10085313 8069750
33357 8069750 7819650 11631384 16483412 17618853 13821287 7923166 3559811 2579113
33349 2579113 4509001 7261114 8707370 8269640 6869167 5470889 4419103 3999026
33341 3999026 4377460 4758485 3865558 1734413 -88357 -578484 -258513 347169 1837616
33332 1837616 4426864 6485814 6139182 3914828 2513107 3893760 7333777 10334541
$$ packed form
33390F2910180k868298l185003l432573m051202m352961k935049m13865M13371
33382D2084600j901946n236430o467360n343377m200828m114417l311395k97308
33374A1211539L136879L970159K168667M28418j66778j299465l370323l587006
33366A2492090m89132K375949R29499k955595l739551m85599J821557J36095k015563
33357H069750k50100L811734M852028J135441l797566n898121m363355r80698
33349B579113J929888K752113J446256m37730j400473j398278j051786m20077
33341C999026L78434L81025q92927k131145j822770m90127L19971O05682J490447
33332A837616K589248K058950l46632k224354j401721J380653L440017L000764
$$ plain form
33324 10334541 10950749 9355260 7449704 6773948 6834649 6095554 4434710 3233071 2651636
33315 2651636 688399 -3594277 -7381872 -6901012 -2393657 1919054 2946609 1771504
33307 1771504 1101185 1621988 1968529 968859 -1222299 -3337649 -3560522 -961917 2752304
33298 2752304 4197575 2253887 -157022 208503 2649505 4128357 4123608 4821160 6541143
33289 6541143 6571689 3954918 2153905 4258011 7857308 8128459 4801653 2283357 2954019
33280 2954019 4200277 3284901 1759496 2672224 5652782 7591971 7155485 6032600 5975631
33271 5975631 6817457 7683796 8391090 9005054 9229680 8975901 8855761 9509337 10745419
33262 10745419 11704242 11754905 11056924 10174069 9158901 7429285 5036237 3561255 4604479
$$ packed form
33324A0334541O16208j595489j905556o75756O0701p39095j660844j201639n81435
33315B651636j963237m282676l787595M80860M507355M312711J027555j175105
33307A771504o70319N20803L46541r99670k191158k115350k22873K598605L714221
33298B752304J445271j943688k410909L65525K441002J478852m749O97552J719983
33289F541143L0546k616771j801013K104106L599297K71151l326806k518296O70662
33280B954019J246258r15376j525405R12728K980558J939189m36486j122885n6969
33271E975631Q41826Q66339P07294O13964K24626k53779j20140O53576J236082
33262A0745419R58823N0663o97981q82855j015168j729616k393048j474982J043224
$$ plain form
33253 4604479 7476215 9830102 10828122 11990768 14293125 16370830 16865335 16708594 17346299
33244 17346299 18304820 18523016 18553308 19062742 18674761 16397203 15163334 19270949 28353454
33235 28353454 37383587 43014691 46493812 49813756 53019906 56865807 64168079 75808707
33227 75808707 88409354 98924568 109003655 121522260 134890289 144635263 149525118
33220 149525118 152268988 154261968 153058525 145778004 132644847 116582570 101152385
33213 101152385 89100063 80995824 74830723 68328833 61637877 56331935 52292320 47737873
33205 47737873 42247410 37387894 33944965 30761958 27051205 23820813 22001135 20848772
33197 20848772 19321141 17727912 17030300 17525669 18887403 20445485 20990322 19596988
$$ packed form
33253D604479K871736K353887R98020J162646K302357K077705M94505j56741O37705
33244A7346299R58521K18196L0292N09434l87981k277558j233869M107615R082505
33235B8353454R030133N631104L479121L319944L206150L845901P302272J1640628
33227G5808707J2600647J0515214J0079087J2518605J3368029R744974M889855
33220A49525118K743870J992980j203443p280521j3133157j6062277j5430185
33213A01152385j2052322q104239o165101o501890o690956n305942m039615m554447
33205D7737873n490463m859516l442929l183007l710753l230392j819678j152363
33197B0848772j527631j593229o97612M95369J361734J558082N44837j393334
$$ plain form
33189 19596988 17119907 15448183 14771898 13204983 9800048 6180204 4233426 3952989
33181 3952989 4663832 6388992 8342957 8013678 4170772 -387250 -1592287 962589
33173 962589 4077212 5424997 5557885 5504152 4834970 2781514 -477016 -4146782 -6992283
33164 -6992283 -7208991 -4216030 -872059 -1339116 -5588300 -8434794 -5848676 -166975
33156 -166975 3291014 3056740 1960481 1834772 1476791 161790 -411510 876381 2601391
33147 2601391 3883362 6796480 12748089 18315958 18408006 13014904 7197217 4198443
33139 4198443 2405996 283828 224555 4500306 10230535 12254618 9739349 6336256
33131 6336256 4471226 3283528 2312762 3123390 5765764 7071071 4925966 1897986
$$ packed form
33189A9596988k477081j671724o76285j566915l404935l619844j946778k80437
33181C952989P10843J725160J953965l29279l842906m558022j205037K554876
33173I62589L114623J347785J32888n3733o69182k053456l258530l669766k845501
33164f992283k16708K992961L343971m67057m249184k846494K586118N681701
33156a66975L457989k34274j096259j25709l57981j315001n73300J287891J725010
33147B601391J281971K913118N951609N567869R2048n393102n817687k998774
33139D198443j792447k122168n9273M275751N730229K024083k515269l403093
33131F336256j865030j187698r70766Q10628K642374J305307k145105l027980
$$ plain form
33123 1897986 1948859 5046292 7610052 7360834 5270042 3181202 1775778 859341 -132679
33114 -132679 -1836835 -3690829 -3547683 -530117 2327991 1010759 -3784934 -6824259
33106 -6824259 -5073375 -1316402 582159 1081575 2780390 5003431 4528764 1280720
33098 1280720 -588298 1579212 5042662 5265728 1479645 -3274179 -6319119 -7436417
33090 -7436417 -7404751 -6605147 -5422364 -4589624 -4475560 -4656962 -4434612 -3345318 -1396081
33081 -1396081 483087 589051 -1764460 -4678887 -5258524 -2998165 -187847 1369752
33073 1369752 2169791 2599417 950831 -3855193 -8965634 -10090094 -7142664 -4385403
33065 -4385403 -4293227 -4296466 -1333158 2996581 4631613 2856027 679230 -67099 -572456
$$ packed form
33123A897986N0873L097433K563760k49218k090792k088840j405424r16437r92020
33114a32679j704156j853994J43146L017566K858108j317232m795693l039325
33106f824259J750884L756973J898561M99416J698815K223041m74667l248044
33098A280720j869018K167510L463450K23066l786083m753824l044940j117298
33090g436417L1666P99604J182783Q32740J14064j81402K22350J089294J949237
33081a396081J879168J05964k353511k914427n79637K260359K810318J557599
33073A369752Q00039M29626j648586m806024n110441j124460K947430K757261
33065d385403R2176l239K963308M329739J635032j775586k176797p46329n05357
$$ plain form
33056 -572456 -1356743 -132974 4466563 9325945 10008314 6647254 3782693 4220290 5849914
33047 5849914 5631616 4180989 4079003 5153799 4564381 1641272 -345921 1256701 4283078
33038 4283078 4431017 1199535 -1386071 -82825 3827681 6945900 7926868 7679446 6747960
33029 6747960 4599708 1231371 -2313616 -5241036 -7429478 -8378135 -7275665 -4676516
33021 -4676516 -2585779 -1881221 -972160 1697463 5055728 7045829 7792191 8718400 9035198
33012 9035198 6263006 981242 -2134811 -92528 3996726 4957242 2267998 -397607
33004 -397607 -1147234 -1560602 -2553140 -2633915 -1380145 -910027 -1961930 -1848226 1054817
32995 1054817 3722699 2782016 126666 222120 3153150 4715613 3090649 1015721 640374
$$ packed form
33056e72456p84287J223769M599537M859382O82369l361060k864561M37597J629624
33047E849914k18298j450627j01986J074796n89418k923109j987193J602622L026377
33038D283078J47939l231482k585606J303246L910506L118219R80968k47422r31486
33029F747960k148252l368337l544987k927420k188442r48657J102470K599149
33021d676516K090737P04558R09061K669623L358265J990101P46362R26209L16798
33012I035198k772192n281764l116053K042283M089254R60516k689244k665605
33004c97607p49627m13368r92538q0775J253770M70118j051903J13704K903043
32995A054817K667882r40683k655350R5454K931030J562463j624964k074928l75347
$$ plain form
32986 640374 417387 -1173661 -2332569 -858421 2015579 3205890 1780427 -522806
32978 -522806 -1620782 -537438 2141889 4060320 2941781 -57398 -754693 2608344
32970 2608344 6288439 5655429 1222946 -2531932 -3092592 -1746385 -262746 1150396
32962 1150396 2427456 2845344 2337846 1794052 1555011 1023727 -37073 -1067691 -1479457
32953 -1479457 -731308 1739462 5154772 6829981 5077467 2044053 1253541 2791642
32945 2791642 3695219 2910339 2575241 3828542 4703021 3582721 1863835 1371837 1540328
32936 1540328 1127484 698428 1301597 2278348 2381912 1754752 1061195 72875 -1121480
32927 -1121480 -1064755 775105 2010416 75579 -3856144 -6003565 -4514346 -877729
$$ packed form
32986F40374k22987j591048j158908J474148K874000J190311j425463k303233
32978e22806j097976J083344K679327J918431j118539k999179o97295L363037
32970B608344L680095o33010m432483l754878n60660J346207J483639J413142
32962A150396J277060M17888n07498n43794k39041n31284j060800j030618m11766
32953a479457P48149K470770L415310J675209j752514l033414p90512J538101
32945B791642R03577p84880l35098J253301Q74479j120300j718886m91998J68491
32936A540328m12844m29056O03169R76751J03564o27160o93557r88320j194355
32927a121480N6725J839860J235311j934837l931723k147421J489219L636617
$$ plain form
32919 -877729 2561452 4423263 4256755 2994514 3096037 5896663 8926914 8210724 3340834
32910 3340834 -2002681 -4742341 -5123322 -4305171 -2065204 1624305 4878239 5670770 4196618
32901 4196618 2118738 489102 -481735 -710722 -467781 -313578 164980 2258811 5583400
32892 5583400 7215682 5303568 2243649 1774046 3683632 4410990 2925541 2610373 5908782
32883 5908782 10081226 10867865 8462979 6751646 7478789 8500445 8022052 7297724 7786686
32874 7786686 8343791 7365769 5802127 5532981 6005533 5203338 3336377 2705745 3833731
32865 3833731 4527777 3499888 2374418 2879120 4174916 4492086 3749801 3037941 2900263
32856 2900263 3527242 5234262 7305403 7859689 6495857 5509941 6567448 7806199 6721841
$$ packed form
32919h77729L439181J861811j66508j262241J01523K800626L030251p16190m869890
32910C340834n343515k739660l80981Q18151K239967L689509L253934P92531j474152
32901D196618k077880j629636r70837k28987K42941J54203M78558K093831L324589
32892E583400J632282j912114l059919m69603J909586P27358j485449l15168L298409
32883E908782M172444P86639k404886j711333P27143J021656m78393p24328M88962
32874G786686N57105r78022j563642k69146M72552q02195j866961o30632J127986
32865C833731O94046j027889j125470N04702J295796L17170p42285p11860j37678
32856B900263O26979J707020K071141N54286j363832r85916J057507J238751j084358
$$ plain form
32847 6721841 4486653 4252436 5918120 6038805 3037537 -742526 -2777533 -3072572 -2122375
32838 -2122375 800311 5466962 9074104 8983945 5863351 2549843 920477 1147581 2791387
32829 2791387 5148569 7349983 9205953 11119324 12502366 11715873 8576054 5341940
32821 5341940 3885878 3438163 2681319 2354131 3541404 4732807 3430283 279169 -1132473
32812 -1132473 1053078 4684749 6592862 6010112 4183939 2110637 -103146 -2280869
32804 -2280869 -3599377 -3152389 -1100027 772140 357970 -2279684 -4450424 -3867402 -1536972
32795 -1536972 -437738 -1868495 -4546355 -6909077 -8524115 -9170063 -8359568 -6407496
32787 -6407496 -4641441 -3887923 -3689047 -3359576 -2802680 -2045958 -1156804 -906847 -2146025
$$ packed form
32847F721841k235188k34217J665684J20685l001268l780063k035007k95039R50197
32838b122375K922686M666651L607142r0159l120594l313508j629366K27104J643806
32829B791387K357182K201414J855970J913371J383042p86493l139819l234114
32821E341940j456062m47715p56844l27188J187273J191403j302524l151114j411642
32812a132473K185551L631671J908113n82750j826173k073302k213783k177723
32804b280869j318508M46988K052362J872167m14170k637654k170740N83022K330430
32795a536972J099234j430757k677860k362722j615038o45948Q10495J952072
32787f407496J766055P53518J98876L29471N56896P56722Q89154K49957j239178
$$ plain form
32778 -2146025 -3951949 -3762815 -269462 4772857 8377147 9127156 7646439 5471816
32770 5471816 4319184 5340220 7922535 9911123 9946761 8851662 7904316 6896557 5257250
32761 5257250 4067884 4979247 7392804 8634497 7208489 4279254 1474610 -1157179
32753 -1157179 -3981744 -5836880 -4903347 -1378555 1993458 2597625 610312 -1550496
32745 -1550496 -2196263 -2038506 -2570251 -3562391 -3360740 -1614181 -202386 -654368 -1954018
32736 -1954018 -2316663 -2117175 -2974365 -4317518 -3499170 -104565 2317041 668583 -3245128
32727 -3245128 -5033266 -3536483 -1686308 -1750044 -2609939 -2657940 -2739231 -4239677 -6011729
32718 -6011729 -5695345 -3355454 -1384536 -873879 -422778 917992 1745459 648429 -1217807
$$ packed form
32778b146025j805924J89134L493353N042319L604290P50009j480717k174623
32770E471816j152632J021036K582315J988588L5638j095099r47346j007759j639307
32761E257250j189366R11363K413557J241693j426008k929235k804644k631789
32753a157179k824565j855136R33533L524792L372013O04167j987313k160808
32745a550496o45767J57757n31745r92140K01651J746559J411795m51982j299650
32736a954018l62645J99488q57190j343153Q18348L394605K421606j648458l913711
32727c245128j788138J496783J850175o3736q59895m8001q1291j500446j772052
32718f011729L16384K339891J970918N10657M51101J340770Q27467j097030j866236
$$ plain form
32709 -1217807 -1725429 -1066582 -1465104 -3622441 -5259159 -4062416 -1033270 402700 -1395073
32700 -1395073 -4035241 -3880704 -680219 1881771 788975 -2407991 -3673956 -1656293
32692 -1656293 1212635 2608132 2948260 3462745 3931241 3758367 3414683 3134979 1920013
32683 1920013 -240031 -983507 983306 2668666 403142 -4230835 -5953936 -3280248
32675 -3280248 -425329 -830292 -2744852 -3088389 -2114986 -1624752 -1475213 -864339 -627297
32666 -627297 -935504 1164904 7925928 15845297 18678680 15274134 10451871 7875673
32658 7875673 6230493 3639005 1701519 2493514 4468991 4498188 2331848 189776 -965173
32649 -965173 -1871000 -2250262 -677314 2358664 3805071 1742921 -1895429 -3682142 -2646729
$$ packed form
32709a217807n07622O58847l98522k157337j636718J196743L029146J435970j797773
32700a395073k640168J54537L200485K561990j092796l196966j265965K017663
32692a656293K868928J395497L40128N14485M68496j72874l43684k79704j214966
32683A920013k160044p43476J966813J685360k265524m633977j723101K673688
32675c280248K854919m04963j914560l43537R73403M90234J49539O10874K37042
32666f27297l08207K100408O761024P919369K833383l404546m822263k576198
32658G875673j645180k591488j937486P91995J975477K9197k166340k142072j154949
32649i65173r05827l79262J572948L035978J446407k062150l638350j786713J035413
$$ plain form
32640 -2646729 -381809 1992684 4898117 8036633 9075588 6248416 1491251 -920016
32632 -920016 817690 4027934 5095799 3837697 3121791 4741328 7078289 7114019 3989711
32623 3989711 149711 -1043493 1038499 3227029 1943539 -2337309 -5362423 -4358759
32615 -4358759 -1274684 560453 1190445 3001964 6062877 7685771 6784499 5590905
$$ packed form
32640b646729K264920K374493K905433L138516J038955k827172m757165k411267
32632i20016J737706L210244J067865j258102p15906J619537K336961L5730l124308
32623C989711l840000j193204K081992K188530j283490m280848l025114J003664
32615d358759L084075J835137O29992J811519L060913J622894r01272j193594
$$ [...]
##END NTUPLES=NMR SPECTRUM
##END=
