##TITLE=31Pdec_LR-724-0
 CDCl3, 24 sc
 1.10.2020
##JCAMPDX= 6.0         $$ Bruker NMR JCAMP-DX V2.0
##DATA TYPE= NMR SPECTRUM
##DATA CLASS= NTUPLES
##ORIGIN= UXNMR, Bruker Analytische Messtechnik GmbH
##OWNER= root
$$ XWIN-NMR		Version 3.5
$$ Thu Oct  1 10:23:55 2020 Russian Standard Time (UT+4h)  she@DPX200
##.OBSERVE FREQUENCY= 81.013821
##.OBSERVE NUCLEUS= ^31P
##.ACQUISITION MODE= SIMULTANEOUS
##.ACQUISITION SCHEME= undefined
##.AVERAGES= 24
##.DIGITISER RES= 17
##SPECTROMETER/DATA SYSTEM= spect
##.PULSE SEQUENCE= zgpg30
##.SOLVENT NAME= CDCl3
##.SHIFT REFERENCE= (INTERNAL, CDCl3, 0, 182.463)
##AUDIT TRAIL= $$ (NUMBER, WHEN, WHO, WHERE, WHAT)
$$ ##TITLE= Audit trail, XWIN-NMR		Version 3.5
$$ ##JCAMPDX= 5.01
$$ ##ORIGIN= Bruker BioSpin GmbH
$$ ##OWNER= she
$$ F:/spectra/data/she/nmr/P31/1/pdata/1/auditp.txt
$$ ##AUDIT TRAIL=  $$ (NUMBER, WHEN, WHO, WHERE, WHAT)
(   1,<2020-10-01 10:22:55.50 +0400>,<she>,<DPX200>,
      <created by zg, POWCHK disabled, PULCHK disabled
       configuration hash MD5:
       00 E9 B6 7A A2 85 ED C7 34 08 36 98 17 FE 4E 26
       data hash MD5: 32K
       A3 B2 7B EB 58 B1 EF B3 7F 51 4E 71 43 8F 7B B1>)
(   2,<2020-10-01 10:22:58.28 +0400>,<she>,<DPX200>,
      <Start of raw data processing
       efp BC_mod = 2 LB = 1 FT_mod = 6 PKNL = 1 PHC0 = -2742.478 PHC1 = 74.00137 SI = 64K 
       data hash MD5: 64K
       7F 6D 69 C2 52 78 50 16 1D 71 17 6B DF D0 DC A3>)
(   3,<2020-10-01 10:23:23.34 +0400>,<she>,<DPX200>,
      <pk PHC0 = 30.21692 PHC1 = -74.6 
       data hash MD5: 64K
       2E 00 17 2E 11 8B 8C C0 30 8A 18 01 A5 E7 F8 61>)
(   4,<2020-10-01 10:23:26.56 +0400>,<she>,<DPX200>,
      <abs ABSG = 5 
       data hash MD5: 64K
       55 7D 1B 13 4B 67 93 A1 00 67 A3 CD D4 42 08 40>)
$$ ##END=
$$ 
$$ hash MD5
$$ AA 0C 49 3B D0 6C B7 57 41 05 40 59 F1 2D CB BB
##$RELAX= 
##$RELAX= 
##$RELAX= 
##$RELAX= 
##$RELAX= 
##$RELAX= 
##$RELAX= 
##$RELAX= 
$$ Bruker specific parameters
$$ --------------------------
##$DU= <F:/spectra>
##$EXPNO= 1
##$NAME= <P31>
##$PROCNO= 1
##$TYPE= <nmr>
##$USER= <she>
##$AMP= (0..31)
100 100 100 100 100 100 100 100 100 100 100 100 100 100 100 100 100 100 
100 100 100 100 100 100 100 100 100 100 100 100 100 100 
##$AQSEQ= 0
##$AQ_mod= 1
##$AUNM= <au_zg>
##$AUTOPOS= <>
##$BF1= 81.014009
##$BF2= 200.13
##$BF3= 200.13
##$BF4= 200.13
##$BF5= 200.13
##$BF6= 200.13
##$BF7= 200.13
##$BF8= 200.13
##$BYTORDA= 1
##$CFDGTYP= 0
##$CFRGTYP= 5
##$CHEMSTR= <none>
##$CNST= (0..31)
1 1 145 1 1 1 1 1 1 1 1 1 1 1 1 1 1 1 1 1 1 1 1 1 1 1 1 1 1 1 1 1 
##$CPDPRG= <waltz16>
##$CPDPRG1= <>
##$CPDPRG2= <waltz16>
##$CPDPRG3= <>
##$CPDPRG4= <mlev>
##$CPDPRG5= <mlev>
##$CPDPRG6= <mlev>
##$CPDPRG7= <mlev>
##$CPDPRG8= <mlev>
##$CPDPRGB= <>
##$CPDPRGT= <>
##$D= (0..31)
0 1 0 0 0 0 0 0 0 0 0 0.03 2e-05 3e-06 0 0 0 0 0 0 0 0 0 0 0 0 0 0 0 0 
0 0 
##$DATE= 1601533374
##$DBL= (0..7)
120 120 120 11 120 120 24 19 
##$DBP= (0..7)
150 150 150 150 150 150 150 150 
##$DBP07= 0
##$DBPNAM0= <>
##$DBPNAM1= <>
##$DBPNAM2= <>
$$ [...]
##$SUBNAM3= <"">
##$SUBNAM4= <"">
##$SUBNAM5= <"">
##$SUBNAM6= <"">
##$SUBNAM7= <"">
##$SUBNAM8= <"">
##$SUBNAM9= <"">
##$SW= 369.568048894756
##$SWIBOX= (0..15)
0 1 3 0 0 0 0 0 0 0 0 0 0 0 0 0 
##$SW_h= 29940.119760479
##$TD= 32768
##$TD0= 1
##$TE= 0
##$TE2= 300
##$TE3= 300
##$TEG= 300
##$TL= (0..7)
0 120 53 12 22 120 120 120 
##$TP= (0..7)
150 150 150 150 150 150 150 150 
##$TP07= 0
##$TPNAME0= <>
##$TPNAME1= <>
##$TPNAME2= <>
##$TPNAME3= <>
##$TPNAME4= <>
##$TPNAME5= <>
##$TPNAME6= <>
##$TPNAME7= <>
##$TPOAL= (0..7)
0.5 0.5 0.5 0.5 0.5 0.5 0.5 0.5 
##$TPOFFS= (0..7)
0 0 0 0 0 0 0 0 
##$TUNHIN= 0
##$TUNHOUT= 0
##$TUNXOUT= 0
##$USERA1= <user>
##$USERA2= <user>
##$USERA3= <user>
##$USERA4= <user>
##$USERA5= <user>
##$V9= 5
##$VALIST= <valist>
##$VCLIST= <CCCCCCCCCCCCCCC>
##$VD= 0
##$VDLIST= <DDDDDDDDDDDDDDD>
##$VPLIST= <PPPPPPPPPPPPPPP>
##$VTLIST= <TTTTTTTTTTTTTTT>
##$WBST= 1024
##$WBSW= 4
##$XGAIN= (0..3)
0 0 0 0 
##$XL= 0
##$YL= 0
##$YMAX_a= 24113
##$YMIN_a= -22903
##$ZGOPTNS= <>
##$ZL1= 120
##$ZL2= 120
##$ZL3= 120
##$ZL4= 120
##$ABSF1= 182.463
##$ABSF2= -187.1042
##$ABSG= 5
##$ABSL= 3
##$ALPHA= 0
##$AQORDER= 0
##$ASSFAC= 0
##$ASSFACI= 0
##$ASSFACX= 0
##$ASSWID= 0
##$AUNMP= <proc_1d>
##$AZFE= 0.1
##$AZFW= 0.5
##$BCFW= 0
##$BC_mod= 2
##$BYTORDP= 0
##$COROFFS= 0
##$CY= -3
##$DATMOD= 1
##$DC= 0
##$DFILT= <>
##$DTYPP= 0
##$F1P= 0
##$F2P= 0
##$FCOR= 1
##$FTSIZE= 65536
##$FT_mod= 6
##$GAMMA= 0
##$GB= 0
##$INTBC= 1
##$INTSCL= 5.30512e-09
##$ISEN= 30
##$LB= 1
##$LEV0= 0
##$LPBIN= 0
##$MAXI= 10000
##$MC2= 0
##$MEAN= 0
##$ME_mod= 0
##$MI= 50
##$NCOEF= 0
##$NC_proc= -4
##$NLEV= 6
##$NOISF1= 182.463
##$NOISF2= 159.3651
##$NSP= 0
##$NTH_PI= 0
##$NZP= 0
##$OFFSET= 182.463
##$PC= 4
##$PHC0= -2712.261
##$PHC1= -0.5986252
##$PH_mod= 1
##$PKNL= yes
##$PPARMOD= 0
##$PSCAL= 0
##$PSIGN= 0
##$REVERSE= no
##$SF= 81.0140089999434
##$SI= 65536
##$SIGF1= 159.3651
##$SIGF2= -187.1042
##$SINO= 113.3802
##$SIOLD= 16384
##$SREGLST= <1H.CDCl3>
##$SSB= 0
##$STSI= 65536
##$STSR= 0
##$SW_p= 29940.119760479
##$SYMM= 0
##$S_DEV= 0
##$TDeff= 32768
##$TDoff= 0
##$TI= <>
##$TILT= no
##$TM1= 0
##$TM2= 0
##$TOPLEV= 0
##$USERP1= <user>
##$USERP2= <user>
##$USERP3= <user>
##$USERP4= <user>
##$USERP5= <user>
##$WDW= 1
##$XDIM= 65536
##$YMAX_p= 484765781
##$YMIN_p= -6574051
$$ End of Bruker specific parameters
$$ ---------------------------------
##NTUPLES= NMR SPECTRUM
##VAR_NAME=  FREQUENCY,     SPECTRUM/REAL,   SPECTRUM/IMAG
##SYMBOL=    X,             R,               I
##VAR_TYPE=  INDEPENDENT,   DEPENDENT,       DEPENDENT
##VAR_FORM=  AFFN,          ASDF,            ASDF
##VAR_DIM=   65536,         65536,           65536
##UNITS=     HZ,            ARBITRARY UNITS, ARBITRARY UNITS
##FACTOR=    0.456856943014862, 1,           1
##FIRST=     14782.0589164792, 0,            0
##LAST=      -15158.0608439998, 0,           0
##MIN=       -15158.0608439998, -6574051,    0
##MAX=       14782.0589164792, 484765781,    0
$$ Real data points
##PAGE= N=1
##DATA TABLE= (X++(R..R)), XYDATA
$$ [...]
46176 -57256 106438 541184 702072 242924 -420181 -698728 -622381 -601239 -689635 -615137
46166 -615137 -375006 -258758 -330977 -388235 -401312 -500382 -524585 -136414 515741 780012
46156 780012 345966 -325918 -619958 -424987 -6202 370415 471590 161776 -297765 -375898
46146 -375898 28669 364011 188891 -209089 -320945 -196107 -253267 -549482 -736772 -642285
46136 -642285 -440509 -285341 -179273 -209363 -513345 -928556 -1018703 -603460 -24912 262482
46126 262482 201178 99050 213411 505250 758955 832825 760154 640135 496128 299943
46116 299943 97780 -3235 10031 27188 -31092 -138657 -258950 -370006 -369014 -137702 222008
46105 222008 401053 238927 -98673 -404214 -701250 -1074089 -1387643 -1385104 -996736 -404380
46095 -404380 148669 516423 690354 754304 736405 516064 29198 -461621 -566015 -285554
46085 -285554 -44657 -101660 -235972 -161320 83711 349880 627439 825808 668915 156533
46075 156533 -201376 -23010 358831 401826 177806 148008 307711 189506 -302464 -668988
46065 -668988 -547234 -179708 2924 -118987 -400819 -637861 -619420 -292828 59203 113240
46055 113240 -9916 78237 364540 392181 -21618 -482744 -590566 -382998 -39320 411033
46045 411033 835014 876914 425869 -110436 -300305 -187748 -51937 21069 45508 -72737
46035 -72737 -322961 -433278 -255140 -56808 -107879 -233427 -153992 -21063 -170487 -511433
46025 -511433 -627348 -412990 -182476 -163804 -275564 -414154 -589724 -715111 -588625 -205352
46015 -205352 142032 179131 -69802 -350992 -416881 -207094 100674 255124 199327 60863
46005 60863 -141581 -508869 -871493 -769719 -101895 569926 749686 702635 932527 1286217
45995 1286217 1229684 817662 627193 742663 597697 1697 -419640 -155337 426131 665364
45985 665364 491861 279597 202570 179688 188022 225915 168521 -9105 -74795 97503 246188
45974 246188 119216 -88282 -41541 200195 314119 191133 -68948 -444380 -881780 -1070325
45964 -1070325 -769109 -273540 -132516 -440562 -795658 -908481 -840921 -667758 -360943 -68806
45954 -68806 -64122 -281192 -307430 -7436 230626 106720 -91859 58067 418411 456363
45944 456363 25608 -412777 -435215 -226826 -296329 -744761 -1068652 -762293 43854 711331
45934 711331 802340 471409 147547 50302 109762 154641 30407 -294971 -589466 -506805
45924 -506805 -56011 284091 147192 -231534 -384264 -250098 -85140 77989 419138 856956
45914 856956 1066170 990740 899350 873190 675984 237901 -157354 -322284 -412554 -556370
45904 -556370 -616610 -516683 -431946 -425739 -249878 215142 629636 605067 204341 -229816 -509755
45893 -509755 -619601 -554975 -428498 -503935 -830403 -1043474 -818173 -333537 -5211 61955
45883 61955 67042 127880 198917 254810 312723 381554 543803 888872 1225100 1161956 670724
45872 670724 196127 -24186 -280537 -687904 -734447 -112839 521581 413800 -49024 113274
45862 113274 881429 1209092 618206 -172340 -430168 -301309 -175119 -12869 212188 147513
45852 147513 -300776 -571949 -271466 143098 90958 -205782 -182817 84865 79998 -253625
45842 -253625 -521749 -625497 -796565 -961753 -758953 -233475 95018 -16942 -244164 -289756
45832 -289756 -277740 -346811 -302040 24587 371948 325746 -154519 -713796 -1011926 -992572
45822 -992572 -817944 -682645 -684944 -797325 -915827 -919116 -726188 -408133 -226694 -370383
45812 -370383 -616547 -515634 -25389 342147 212484 -133683 -237134 -126635 -74077 36329
45802 36329 506113 1105024 1190884 618259 -28468 -254604 -197608 -151149 -47479 256335
45792 256335 554453 537118 242685 -40827 -163766 -162263 -74615 67376 191195 298925
45782 298925 488918 724893 768716 502054 122690 -149237 -356022 -602687 -792028 -808235
45772 -808235 -787725 -932533 -1173063 -1268164 -1140093 -875233 -498928 -8946 435351 609566
45762 609566 488330 231322 -26709 -194583 -156458 68724 202347 31664 -202540 -66210
45752 -66210 424792 756337 581928 134158 -151657 -162346 -89496 -92218 -173860 -284773 -390542
45741 -390542 -488943 -634302 -870283 -1096015 -1111560 -853479 -479111 -179130 -31076 -50679
45731 -50679 -187316 -204172 187492 905058 1418438 1330766 877436 587525 589935 589085 447373
45720 447373 365384 413345 317755 -52698 -354066 -279214 -142059 -481892 -1182107 -1496362
45710 -1496362 -1047597 -343173 -66960 -236531 -389376 -311092 -155831 -7919 206379 383724
45700 383724 266113 -94374 -271776 -44283 278609 324846 182566 176782 324443 334975
45690 334975 66384 -312257 -594623 -726361 -707295 -523285 -234994 18922 167388 259706
45680 259706 353667 443721 509176 547156 548145 498671 395534 223343 -12189 -177657 -64603
45669 -64603 330659 697019 739690 525909 328970 238486 148994 41959 1253 -8418 -81067
45658 -81067 -96128 167237 596514 772968 554767 304253 348710 512413 428306 75883
45648 75883 -255909 -355769 -189111 206616 647390 784346 474942 69347 22136 301236
45638 301236 487572 374485 112397 -187951 -572504 -918223 -925023 -596527 -353581 -443102
45628 -443102 -558534 -326589 102736 289212 135000 -76862 -171273 -239059 -315720 -249754
45618 -249754 7454 224526 135010 -266772 -730145 -934957 -683874 -89901 404701 401173
45608 401173 2832 -294648 -247675 -155095 -338951 -588144 -446056 58984 361169 113418
45598 113418 -330026 -395384 -39681 259105 177497 -85677 -168185 -16004 165542 268078
45588 268078 367055 504963 599707 597250 547394 476086 335806 152295 58817 73089 348
45577 348 -274046 -533777 -501436 -273002 -208493 -402759 -567362 -520369 -497138 -778732 -1225627
45566 -1225627 -1433474 -1243727 -860697 -510607 -215271 73696 299948 335263 106492 -319598
45556 -319598 -705803 -748070 -357051 163146 373996 193458 2217 181018 636308 893002
45546 893002 630709 40755 -373562 -312266 53558 336773 379244 332273 323874 243257 -43109
45535 -43109 -426657 -679863 -739791 -696210 -602420 -507834 -574928 -876135 -1112553 -862553 -159167
45524 -159167 490223 744751 770344 812232 785629 538197 208721 -6428 -210661 -562911
45514 -562911 -852984 -738731 -321077 -54059 -88460 -130840 -17035 9522 -239711 -540867
45504 -540867 -602163 -453627 -232463 118929 594231 808420 404753 -291791 -487829 108981
45494 108981 887439 1076754 632606 156756 100416 311456 351201 51408 -330314 -431095
45484 -431095 -175993 167711 311182 265261 282473 500872 742815 710612 324872 -176067
45474 -176067 -447238 -343121 -65469 -17 -319660 -748198 -846900 -567966 -339848 -479166
45464 -479166 -713488 -550637 -19723 309185 102260 -285903 -336997 -66107 123864 116541
45454 116541 205710 540052 840015 832548 659615 600320 609018 457731 225479 265168 637178
45443 637178 919595 756094 340983 122367 192806 260745 151232 16161 -4283 -41685
45433 -41685 -258034 -538289 -632523 -506732 -352167 -286235 -232218 -102652 64132 190128
45423 190128 243273 187123 -29436 -360917 -645514 -776847 -818093 -874427 -932779 -915676 -824490
45412 -824490 -719015 -586332 -338857 40955 418114 596192 485151 189895 -70810 -165343
45402 -165343 -159933 -191100 -280941 -378316 -512910 -708678 -766827 -430139 135485 346526 -56939
45391 -56939 -530812 -352597 405600 935290 720625 129729 -122036 214890 806867 1194086
45381 1194086 1174515 869845 565176 422772 304004 -31183 -551144 -946987 -1022758 -893783
45371 -893783 -742707 -591441 -412461 -266539 -198137 -148405 -86066 -82060 -160464 -226503 -225190
45360 -225190 -204150 -145807 57079 360850 528432 449618 277570 122976 -112314 -422049
45350 -422049 -529171 -310027 -109411 -281318 -625250 -671174 -381878 -152291 -177636 -256694
45340 -256694 -255298 -352414 -672151 -973086 -917645 -514571 -141975 -159130 -528588 -820033
45330 -820033 -660593 -194294 80613 -15757 -128146 10383 116703 -108654 -324112 7510
45320 7510 682390 914374 462079 -20552 63100 493836 707604 568111 309139 38504
45310 38504 -292217 -575899 -548504 -96326 576987 1055511 980242 387670 -194366 -209972
45300 -209972 318028 866310 1094559 1129629 1127377 965383 563013 157010 6776 78447
45290 78447 221620 402131 575398 612792 557688 664366 967395 1122889 923916 649138
45280 649138 607947 664377 556419 374336 313042 220107 -142537 -571071 -621611 -233006
45270 -233006 260166 621043 811119 731189 333247 -67802 -67366 230452 311364 -21670
45260 -21670 -417262 -512836 -322601 -39790 178102 167067 -140861 -503908 -592928 -459975
45250 -459975 -419439 -453423 -207065 320410 593006 287706 -223160 -451342 -456076 -541886
45240 -541886 -620817 -357557 204845 619781 620553 381552 185731 130038 201189 372576 528502
45229 528502 500242 305149 204916 380175 634265 593673 203630 -148192 -100661 224789
45219 224789 424414 386421 373037 488821 427212 -17001 -481568 -463393 -45505 233151
45209 233151 178213 142442 347801 465481 129671 -448311 -710414 -460905 -72949 -14838
45199 -14838 -349740 -725930 -773227 -472652 -130674 -7620 -67183 -133580 -133787 -54185 154902
45188 154902 410370 415723 55137 -287159 -183290 169956 184610 -261424 -695051 -802014
45178 -802014 -771010 -759503 -576937 -161308 127049 31723 -185263 -204183 -150519 -259569
45168 -259569 -376767 -220298 107845 281023 219639 44900 -222174 -541237 -642690 -343725
45158 -343725 83217 237192 129720 34155 -17611 -165175 -305441 -214784 4671 52211
45148 52211 -56897 -44415 106815 132751 -14348 -92673 -21321 24125 12156 131008 390867
45137 390867 547231 502962 409860 308097 76267 -172157 -91524 327291 604095 408134
45127 408134 3428 -164364 -13168 257070 490899 593995 491227 296677 296031 561200
45117 561200 806034 794890 642655 529828 394050 127193 -166438 -338129 -406276 -404781
45107 -404781 -258160 -3839 125368 56937 32630 168133 182994 -116128 -410434 -338412
45097 -338412 -121103 -243500 -701867 -1072726 -1206638 -1309116 -1365206 -1064882 -424283 38216
45087 38216 -8298 -235373 -158884 176040 327942 107983 -205056 -262842 -49962 149263
45077 149263 91971 -162919 -344510 -304168 -169390 -117792 -144210 -186268 -313609 -549252
45067 -549252 -631310 -289700 267560 503749 250902 -86214 -146920 -90936 -232508 -483766
45057 -483766 -485469 -153868 210382 331492 239952 125020 82280 63691 -18215 -185619 -366346
45046 -366346 -465358 -466728 -427603 -374922 -277001 -122211 54923 226442 353298 326856 65949
45035 65949 -314758 -582585 -655236 -631747 -551006 -353781 -146849 -219723 -621417 -960546
45025 -960546 -863286 -448857 -101873 56936 171580 256381 171578 -31531 -110638 -47287
45015 -47287 -126173 -455269 -699128 -520265 -90328 108305 -89764 -361438 -379354 -259363
45005 -259363 -382596 -843481 -1246464 -1141000 -575052 -54613 58922 -76977 -112682 -7641
44995 -7641 18173 -89520 -135631 -13029 146501 213143 212694 162983 -6693 -251094 -340275
44984 -340275 -164473 52405 15714 -283958 -628592 -862885 -955907 -874464 -593124 -207998
44974 -207998 96904 196335 89761 -103070 -173594 2512 243311 189996 -219620 -610755
44964 -610755 -678789 -606909 -711442 -883815 -765944 -371768 -107512 -158560 -253270 -131602
44954 -131602 103021 247349 313066 391437 432221 343321 147824 -95040 -372653 -627385
44944 -627385 -761463 -817639 -944430 -1090764 -987597 -566951 -132248 64371 136299 227166
44934 227166 156323 -255822 -712649 -693614 -123136 533047 811117 630737 194575 -220153
44924 -220153 -404474 -395279 -464585 -721901 -859306 -585094 -161450 -97875 -379252 -475648
44914 -475648 -157882 187468 200999 43616 12189 74447 97167 201751 529454 879557
44904 879557 925859 644189 253206 -96559 -307085 -217610 154358 417797 220649 -249309
44894 -249309 -529978 -540874 -570502 -684766 -625979 -344703 -162377 -258129 -406108 -412369 -423166
44883 -423166 -550507 -553837 -226475 178425 269310 64482 -130888 -220572 -307365 -320355 -87019
44872 -87019 254291 336536 98489 -152082 -270465 -452416 -743788 -804708 -426791 66124
44862 66124 252543 166415 78825 -6134 -214912 -356235 -110993 375929 581567 347146
44852 347146 93974 165615 365020 362665 215642 189633 301279 329419 142974 -207873
44842 -207873 -602358 -862495 -795145 -412236 15117 281563 465166 659963 720630 524312
44832 524312 267734 177461 104813 -200259 -534150 -412555 208476 818799 1023938 923374
44822 923374 730505 454160 154626 105266 384101 599074 362568 -159574 -501578 -549412
44812 -549412 -596163 -824056 -1074221 -1150479 -1065644 -917072 -748010 -627040 -669747 -842164
44802 -842164 -880256 -589039 -183377 -143621 -651113 -1285751 -1439423 -1006543 -489006 -363377
44792 -363377 -532071 -544254 -197586 294662 621981 614564 255407 -243270 -422336 10044
44782 10044 711696 1008366 734831 395232 371638 424714 231788 -25730 -15733 149656
44772 149656 149732 41986 101309 237560 129924 -123186 -78115 271810 380029 18845 -273028
44761 -273028 28315 614507 756735 291566 -260231 -455693 -375624 -277965 -180335 41000
44751 41000 351290 550900 499511 227183 -146914 -517545 -811163 -961946 -918975 -694565
44741 -694565 -395212 -167878 -78424 -41789 94010 367172 622217 657387 458032 220811
44731 220811 112884 90331 35944 -17282 44066 177429 224894 189614 239331 383485 399691
44720 399691 194034 -17279 -45438 7904 33970 186471 555952 816028 612396 166871
44710 166871 36297 313710 542437 464415 361376 496308 684037 692480 679515 866533
44700 866533 1059824 911184 504378 279153 411692 625821 651302 551627 481618 370989
44690 370989 53713 -389815 -616002 -387023 120649 444749 284701 -214050 -646819 -770443
44680 -770443 -665469 -515892 -357495 -96322 301570 711948 944965 937011 847244 894818
44670 894818 1067666 1113609 912704 698171 719539 837123 733734 429450 233864 221687
44660 221687 165890 37402 105064 366976 358141 -154641 -697463 -742953 -527535 -696257
44650 -696257 -1307352 -1748255 -1631322 -1263068 -1107340 -1188045 -1200148 -931934 -431751 35347
44640 35347 130393 -223550 -604585 -475237 126613 590135 527674 218685 81200 77397
44630 77397 -33293 -146866 49672 523513 874777 847483 551696 208356 -17225 45579
44620 45579 443950 864264 869440 474137 154013 157351 179424 -55030 -269283 -76178 340518
44609 340518 469166 252340 106823 178818 127674 -200327 -399537 -124848 305718 341340
44599 341340 -8797 -250641 -164746 -57735 -220567 -496796 -539250 -279745 22639 125508
44589 125508 96990 247157 733935 1257817 1304106 748531 19101 -467216 -772437 -1117539
44579 -1117539 -1373490 -1253250 -836861 -472460 -246223 5435 219721 154071 -72059 -30903
44569 -30903 291698 370075 -50850 -545210 -703878 -730782 -934184 -1079335 -779811 -221644
44559 -221644 66503 -5812 -60541 89289 226604 151936 -89579 -393661 -650580 -631448
44549 -631448 -169761 531862 1062170 1240932 1141865 795390 222996 -318257 -529517 -491789
44539 -491789 -528827 -691597 -778759 -816833 -1026773 -1284040 -1149757 -585133 -126142 -123913
44529 -123913 -283376 -241431 -154239 -322639 -589912 -566744 -245879 27381 74902 6103
44519 6103 -103299 -308663 -583576 -786416 -856529 -844502 -764147 -604734 -466436 -478021 -558912
44508 -558912 -447164 -42993 385937 448437 78541 -326664 -307609 106666 392538 184251
44498 184251 -248784 -414707 -322720 -404257 -768227 -1020256 -930288 -795143 -893277 -1008830
44488 -1008830 -833306 -489371 -285369 -250908 -305157 -585573 -1132036 -1481255 -1135482 -336812
44478 -336812 160005 59732 -239813 -390154 -511758 -738743 -857846 -657864 -270183 79972
44468 79972 364174 590583 644913 502686 335991 205284 -92561 -649885 -1172794 -1317831
44458 -1317831 -1086807 -677407 -201504 194689 221041 -181386 -570025 -505337 -170727 -70859
44448 -70859 -241384 -257695 -3907 112788 -156717 -507877 -606719 -579983 -661466 -705000 -451500
44437 -451500 -44505 138976 33408 -132207 -284641 -507762 -644390 -396105 79934 158385
44427 158385 -413857 -1044871 -1009531 -375563 157816 193245 14546 61552 378507 677136
44417 677136 727198 580201 495449 647920 855656 728482 225243 -143979 39214 432754
44407 432754 333252 -322543 -856601 -817427 -518574 -393892 -330471 -34363 336183 394652
44397 394652 152186 -49855 -85164 -76845 -5794 242425 488703 400724 52547 -112239
44387 -112239 51525 215877 192492 234262 486932 592406 213369 -364207 -568765 -300450
44377 -300450 34424 145513 157139 296999 569375 781386 738181 429707 120211 125268
44367 125268 363797 339155 -190687 -745345 -701023 -190064 56241 -254359 -619411 -559991
44357 -559991 -278873 -193846 -235052 -46568 372183 701981 857443 1034386 1211004 1057283
44347 1057283 471222 -158629 -421786 -352232 -237234 -201683 -213947 -304880 -491807 -596036
44337 -596036 -433662 -154937 -110813 -355362 -550213 -450540 -232925 -176357 -229477 -154234
44327 -154234 -425 -126493 -672133 -1248249 -1348751 -971341 -604288 -578397 -662234 -463458
44317 -463458 -67319 28802 -368008 -816490 -817821 -481258 -312330 -466584 -585244 -389491
44307 -389491 -74020 31981 -109683 -375853 -782985 -1351036 -1802261 -1734907 -1116197 -363119
44297 -363119 113328 262344 257648 204400 98635 -26282 -46880 133246 435796 613466
44287 613466 475618 125189 -128383 -132658 -32000 21981 91793 219267 200704 -96123
44277 -96123 -356668 -176801 253830 297883 -210833 -674340 -591996 -278704 -341411 -762295
44267 -762295 -986024 -761226 -399786 -212821 -147366 -86827 -120207 -312700 -486472 -453794
44257 -453794 -290732 -184300 -144161 -54527 81508 129968 18510 -188754 -374327 -430142
44247 -430142 -295692 -37597 163880 212741 222947 332453 464253 440217 301752 310727
44237 310727 570107 812904 693684 203480 -322482 -571955 -535196 -430397 -428726 -476402
44227 -476402 -368972 -1879 462932 731636 694471 537644 500078 604306 713047 767888
44217 767888 819118 843770 720675 453041 259874 312264 465632 405568 39507 -384333
44207 -384333 -557584 -406366 -89172 193746 341909 386056 435561 547477 623531 508530
44197 508530 216044 -51720 -171607 -255920 -410488 -460500 -151976 393205 683567 417309
44187 417309 -162954 -608782 -785030 -867765 -966879 -1006088 -937153 -823301 -674819 -414788
44177 -414788 -83334 102842 2379 -261131 -453453 -479253 -413462 -383968 -479009 -668892
44167 -668892 -780919 -672285 -446316 -327255 -297350 -98241 328894 689155 770818 735165
44157 735165 750390 665955 386734 258877 615193 1158376 1338792 1205186 1263422 1535189
44147 1535189 1466529 904930 447952 501915 643795 373826 -58664 -150342 -20851 -141349
44137 -141349 -476008 -566698 -327043 -119212 -103752 -109608 -131662 -356606 -643793 -580127 -189803
44126 -189803 -21612 -319611 -640555 -579451 -379770 -443142 -642560 -584020 -286723 -139319
44116 -139319 -302723 -544500 -613890 -474406 -200357 97325 258495 192536 -1903 -166389
44106 -166389 -257562 -278714 -191104 -71496 -180782 -606564 -962861 -770357 -100181 479735
44096 479735 628526 593079 741446 1015162 1058425 747121 365170 255107 416444 495937
44086 495937 160091 -530060 -1140425 -1288509 -1004472 -610432 -308820 -31160 315542 632630
44076 632630 750709 641950 385472 2427 -513494 -1019610 -1255210 -1117836 -785290 -482684
44066 -482684 -255367 -87620 -88104 -322347 -552949 -464307 -158630 -77640 -325408 -457751
44056 -457751 -183459 113723 -43875 -431541 -449848 -98229 -12410 -496257 -1094664 -1302391
44046 -1302391 -1192349 -1082714 -1007963 -834363 -571511 -269029 115871 482664 523369 187677
44036 187677 -97163 -14891 130345 -93128 -493556 -483624 79880 758887 1169079 1300751
44026 1300751 1225264 927076 493069 104503 -226995 -603125 -896471 -816043 -382074 1715
44016 1715 54336 -93693 -202575 -215974 -147732 25635 209966 178892 -132610 -510793 -734607
44005 -734607 -759257 -571996 -145269 348266 562724 407499 213020 273140 433674 349985
43995 349985 -25519 -439384 -682404 -718951 -576715 -329046 -145002 -184520 -444818 -780448
43985 -780448 -1009671 -958088 -543324 77598 571843 748392 696323 544033 283028 -41237
43975 -41237 -200635 -82857 58523 -62471 -291126 -201422 295581 812639 984181 828125
43965 828125 538198 188547 -185870 -412240 -320637 -7378 226407 207021 33343 -118541
43955 -118541 -200534 -239983 -198485 -14084 252194 435507 429970 226717 -173333 -693556
43945 -693556 -1020525 -799224 -155076 246006 -50055 -662828 -865055 -563343 -343439 -545282
43935 -545282 -790463 -596830 -35439 488479 769947 815466 593088 116799 -384576 -679421
43925 -679421 -784375 -775681 -563355 -163196 17496 -407098 -1181692 -1610953 -1372305 -765694
43915 -765694 -169044 335928 724212 844656 679618 471255 379321 270498 37061 -148132
43905 -148132 -136321 -112214 -292921 -503826 -406946 -56388 137417 -5756 -226291 -268309
43895 -268309 -214764 -231618 -245357 -100453 129892 226237 127671 -49887 -229321 -394856
43885 -394856 -448120 -280611 6423 189061 253114 382192 560309 509186 183358 -8674
43875 -8674 226754 560777 503491 168117 73159 266463 226527 -265068 -722392 -697883 -452170
43864 -452170 -503524 -869103 -1184174 -1311037 -1363888 -1297441 -955245 -468214 -157794 -42228
43854 -42228 143129 405595 416482 91437 -166500 -22248 319741 447056 275178 -23216
43844 -23216 -403083 -918480 -1403466 -1517038 -1152507 -581057 -122146 163664 368801 462016
43834 462016 283520 -172629 -599212 -630234 -256410 142934 252954 177976 204491 337966
43824 337966 329768 135218 37325 205843 395472 280625 -91104 -407340 -528693 -561752
43814 -561752 -549749 -374738 -31779 230979 191494 -60278 -263792 -330406 -377613 -449216
43804 -449216 -394654 -108445 247765 403661 300726 116030 747 -42737 -25899 81386
43794 81386 203575 161053 -49502 -169322 -59297 22917 -190122 -446746 -213859 548400
43784 548400 1222220 1268932 830912 433156 348293 468856 590733 565968 314526 -66735
43774 -66735 -293884 -207736 -13196 -7978 -176365 -286073 -285062 -308517 -356154 -315496 -317139
43763 -317139 -665579 -1276959 -1572727 -1210988 -627439 -485339 -775477 -876708 -439105 231765
43753 231765 721552 993163 1120573 926421 266014 -528564 -905173 -763084 -519678 -480993
43743 -480993 -490736 -312557 -20977 212009 444829 769281 971630 773304 352588 223424
43733 223424 516875 756546 543558 149640 123832 517797 874709 904508 765478 618115
43723 618115 298688 -333079 -1003660 -1301810 -1206361 -1025650 -880975 -596853 -140537 180706
43713 180706 127543 -136608 -333279 -467957 -676447 -856275 -797107 -597914 -582230 -773838
43703 -773838 -812597 -498136 -92505 89668 103105 150307 176563 -14858 -376490 -636392
43693 -636392 -651633 -510690 -334521 -201012 -223567 -455082 -697180 -625621 -165070 410966
43683 410966 778177 820843 603333 263045 -34779 -191456 -268637 -373398 -457985 -389446
43673 -389446 -214240 -155200 -292890 -430970 -365941 -152052 -12564 -92936 -358751 -632213
43663 -632213 -688389 -435490 -53664 144943 28177 -270594 -551731 -683874 -572529 -229627
43653 -229627 79059 497 -469863 -910907 -963318 -726699 -549188 -600249 -801232 -1009427
43643 -1009427 -1088417 -930904 -600022 -343137 -292238 -259527 -21072 293397 318294 -69177
43633 -69177 -575135 -794087 -557740 -10250 527624 785137 745193 617845 572168 582805
43623 582805 584966 602444 601846 433278 125821 30834 360801 741118 609390 3607 -453183
43612 -453183 -371076 16265 350897 579212 671799 357236 -475261 -1374604 -1743102 -1529842
43602 -1529842 -1166527 -926531 -727561 -522714 -461588 -559606 -556465 -285125 72031 285703
43592 285703 421220 642603 834104 715120 308623 19780 142725 458170 482101 70472
43582 70472 -370210 -340313 159404 621040 641267 389476 319411 521286 622803 361001
43572 361001 -30265 -163458 -10077 149696 132190 -43091 -327463 -626976 -676420 -262921
43562 -262921 392146 772925 663929 344087 128344 21255 -58424 -36099 120919 225252
43552 225252 129900 -39884 -134414 -232968 -392160 -372179 45264 619565 891027 782113
43542 782113 638292 725949 993017 1276641 1440532 1338673 944061 496878 249291 105031
43532 105031 -203159 -648123 -948426 -1007559 -950901 -785981 -433441 -52760 116131 211918
43522 211918 543448 927694 851758 389051 253181 676852 940599 450811 -349039 -704615
43512 -704615 -641101 -658530 -770394 -618026 -291268 -246394 -487136 -561293 -398215 -452706
43502 -452706 -869141 -1128423 -797895 -161327 195471 94531 -199873 -413156 -498904 -581343
43492 -581343 -782193 -1024016 -1046264 -774925 -541609 -648462 -869740 -810067 -630832 -817233
43482 -817233 -1195502 -916071 263479 1342696 1288614 417115 -117922 57253 216089
43473 216089 -172095 -628520 -496591 13100 188358 -71043 -155492 235936 585358 340721
43463 340721 -229621 -410022 -33591 388814 467616 345913 221318 -35575 -514669 -917703
43453 -917703 -943013 -752298 -682632 -693701 -494693 -99717 137062 13847 -308429 -571137
43443 -571137 -622653 -390645 85473 602329 972518 1203723 1341333 1296364 1054458 848074
43433 848074 820939 740984 412344 133733 270611 569442 477181 45562 -107940 247957
43423 247957 656943 702901 448877 41373 -509147 -970465 -921985 -414993 -55556 -153599
43413 -153599 -328832 -255038 -203587 -431668 -584232 -243859 339356 612327 493030 266780
43403 266780 -6162 -445358 -909545 -1100392 -990750 -765264 -499489 -253952 -253685 -553985
43393 -553985 -746467 -460583 19354 112843 -226678 -527665 -539048 -451795 -429090 -401750
43383 -401750 -345970 -329757 -250048 80160 543118 777286 665102 436561 285631 218470
43373 218470 267665 481700 677127 576908 260017 128485 350477 654637 749889 634312
43363 634312 406899 94183 -210338 -313611 -178908 -11852 10569 -82582 -199878 -302092
43353 -302092 -321884 -182697 32048 113562 -7622 -187047 -280988 -278488 -218659 -147513 -159036
43342 -159036 -319091 -552811 -731769 -814157 -783102 -588873 -320624 -236460 -374779 -360468
43332 -360468 57496 488800 369969 -192436 -549796 -415992 -114477 73585 236001 400138
43322 400138 338157 24797 -178004 -54276 133259 90155 -80482 -142321 -98516 -49095
43312 -49095 39151 173608 194731 21530 -176755 -237855 -217827 -195613 -108498 73324 261456
43301 261456 466928 817073 1220104 1334412 1049056 685969 545730 568803 616466 714931
43291 714931 796059 587417 57149 -385899 -446447 -343954 -334726 -235978 136073 429976
43281 429976 230049 -180954 -145737 376858 733978 519764 77072 -59838 188560 515278
43271 515278 636224 478829 166681 -78734 -150125 -175510 -291713 -366293 -158946 284042
43261 284042 637492 702505 585228 442311 242274 -143037 -702761 -1183255 -1224263 -702707
43251 -702707 13984 322504 5977 -540082 -792658 -614157 -180037 317289 675684 669597
43241 669597 336474 85038 219921 524646 598034 414485 236105 162286 131132 206936
43231 206936 468242 716290 682536 453683 336225 386352 427487 420743 427636 320492 -28867
43220 -28867 -355142 -265207 144092 411014 427065 517879 786003 920112 771067 597009
43210 597009 558594 444463 116694 -185563 -217163 -52478 149823 371159 558647 570746
43200 570746 454774 433402 474682 255067 -285734 -741913 -785842 -556435 -339120 -234192
43190 -234192 -285754 -507161 -617710 -245784 396110 577272 76517 -405139 -223118 356644
43180 356644 712959 765928 826081 1007679 1297936 1780489 2308539 2433559 2153017 2163212
43170 2163212 2841324 3761409 4997040 7875597 12933282 17715357 18555848 14790405 9604605
43161 9604605 6244311 4888307 3946217 2855570 2222586 2169077 2099643 1839463 1802476
43152 1802476 2065605 2188957 1979776 1716128 1590710 1515873 1453992 1428373 1293688 990210
43142 990210 867732 1200410 1552389 1278969 553196 181359 408116 648873 511344 329814
43132 329814 436109 590637 508602 380116 445195 514317 347721 139357 193411 417085
43122 417085 537979 563033 621693 585176 268119 -141679 -256908 -15759 289276 420123
43112 420123 337098 45988 -370893 -634476 -499290 -99078 186912 191294 62873 -31681
43102 -31681 -65591 -36190 78991 241460 385495 499721 553139 452125 228726 119077
43092 119077 247327 396828 343203 232026 312511 471014 420217 228393 214136 363042
43082 363042 321832 15423 -183472 -17515 316831 534047 613980 646157 633005 593406
43072 593406 601468 637023 660052 833834 1305785 1759209 1659784 1043316 546602 493426 501067
43061 501067 241068 -928 88534 255777 168768 31293 150382 297873 128910 -92562
43051 -92562 123819 604005 710185 331038 -13936 -40984 -8367 -88815 -60468 211091
43041 211091 497943 599390 596665 596315 598883 685494 931403 1099776 869667 406745 220547
43030 220547 405383 556341 503889 515479 627273 461934 -11052 -216168 123039 452017
43020 452017 258718 -102916 -71028 140961 -62371 -623393 -938920 -819443 -633839 -580647
43010 -580647 -484382 -322978 -338402 -535420 -603314 -444584 -306844 -283184 -150002 146717
43000 146717 282695 45870 -319725 -487405 -486357 -543404 -682887 -682018 -337950 293171 855740
42989 855740 962437 651306 438502 698684 1230052 1807917 2844892 4764707 6798326
42980 6798326 7340405 5861235 3706137 2467119 2189281 1849955 1077615 489933 515271
42971 515271 776841 782988 554656 337665 197425 139404 231190 372750 277922 -95854
42961 -95854 -388644 -318286 -58097 71705 39976 4406 -1504 -29846 -43439 -30446 -148222
42950 -148222 -497222 -859914 -915979 -646488 -300859 -37094 169063 315087 329955 238566
42940 238566 140324 8019 -283316 -693471 -965918 -887387 -477333 61885 445017 433073
42930 433073 89478 -145566 84621 536895 637866 295102 47627 275073 667109 748256
42920 748256 575119 529944 663031 678066 468834 258096 202792 205641 161532 104707 59250
42909 59250 -4550 -13316 167719 468461 618814 515358 384935 469064 705760 845870
42899 845870 766045 549028 333057 193199 149878 213087 363732 470600 300690 -230182
42889 -230182 -808658 -946187 -553594 -71807 110817 96286 106772 627 -446175 -1011022
42879 -1011022 -1253499 -1137334 -950185 -736622 -366057 -74870 -270007 -743230 -783632 -252139
42869 -252139 151162 -30510 -365944 -381448 -362248 -727933 -1183204 -1190544 -872890 -720253
42859 -720253 -706076 -450362 -63940 -47682 -399433 -560385 -319857 -114031 -285288 -624005
42849 -624005 -822707 -871977 -804085 -498170 29125 494968 693675 666178 443273 -4921
42839 -4921 -467911 -570788 -316333 -147070 -281638 -404324 -250956 -83469 -245016 -582762
42829 -582762 -699107 -541173 -361842 -252034 -77111 185072 347665 268144 14804 -216596
42819 -216596 -254038 -73472 162870 278653 305745 374313 398357 163202 -205805 -227145
42809 -227145 271310 789627 757615 255277 -201441 -402891 -581359 -878394 -1065227 -873703
42799 -873703 -361695 143401 341066 181001 -101677 -186542 10214 258543 327035 262181
42789 262181 236948 243453 123497 -146367 -370866 -337214 -6041 463086 801556 812645
42779 812645 541874 203515 -95551 -420524 -743702 -833159 -579771 -263294 -256073 -546800
42769 -546800 -781475 -741137 -570176 -502635 -514263 -334625 204092 860968 1135282 845039
42759 845039 444299 495733 883605 950821 484140 71116 221672 620369 695330 531364
42749 531364 613335 895537 824900 287113 -122982 50752 526522 767874 648916 379745
42739 379745 121346 -27278 81216 458473 833854 922774 727405 421485 112774 -101827
42729 -101827 -42400 332715 725009 774570 499537 242163 201023 229261 119464 -109179
42719 -109179 -297468 -383844 -423708 -419132 -270902 37193 289213 210507 -183932 -541675
42709 -541675 -562901 -336654 -163834 -139146 -92957 93788 329409 489062 558613 544272
42699 544272 415276 221627 117934 169567 256212 261422 240987 299370 406427 461970 470668
42688 470668 529424 673636 829150 899144 840765 683825 512191 382599 235438 -39685
42678 -39685 -407410 -651066 -622154 -456083 -423503 -585291 -703930 -531705 -125361 178296
42668 178296 96280 -315498 -717851 -806902 -554185 -167285 102325 109089 -104426 -300453
42658 -300453 -221053 130987 469381 577443 568907 656111 791919 772055 614139 552344 650769
42647 650769 702849 584328 449319 459294 535742 521189 406157 257550 81346 -104073
42637 -104073 -199285 -160650 -81327 -39835 -28000 -116007 -447157 -894394 -981792 -441417 329669
42626 329669 699233 570741 374025 363317 344399 146836 -53898 -71855 -37664 -139896
42616 -139896 -273775 -214442 18066 222006 321089 356766 282742 61392 -97584 61812
42606 61812 376916 365417 -79035 -443881 -304266 26488 -67102 -589288 -905308 -615961
42596 -615961 -28345 357524 446153 428296 395062 354877 398579 533236 508988 126558 -384574
42585 -384574 -603069 -467035 -287355 -252518 -245069 -169703 -141403 -246208 -360091 -318485 -100213
42574 -100213 206232 459986 501818 334267 235029 437527 740903 758514 522261 427620
42564 427620 550812 523792 238888 133912 466532 810245 714224 435501 464507 651340
42554 651340 457353 -87526 -362051 -104876 232514 228326 53666 58515 216450 270587
42544 270587 147689 -36952 -193877 -263366 -142493 223919 752366 1271655 1560664 1384775
42534 1384775 738340 51890 -150824 114728 306582 116531 -120829 5912 328663
42525 328663 356043 11018 -259896 -100616 318319 547825 370510 -24224 -297398 -316107
42515 -316107 -232250 -228263 -286457 -300913 -306560 -400756 -499902 -427494 -233071 -139531 -152295 -55273
42503 -55273 128260 62678 -327569 -606650 -450265 -177595 -268041 -608724 -683407 -359167
42493 -359167 -7087 114944 142898 231389 310176 316183 313233 251563 -67281 -609154 -964743
42482 -964743 -816048 -375851 -150330 -350204 -699790 -796408 -551250 -256481 -225408 -393330
42472 -393330 -400492 -132665 40208 -204891 -573211 -502141 -4896 304480 99688 -227392
42462 -227392 -245320 -147919 -359027 -776041 -878048 -489074 -14413 123208 -30730 -147133
42452 -147133 -79206 734 -124447 -394839 -490634 -221967 176428 315163 181514 131120
42442 131120 303773 394223 185207 -42455 50414 292072 270079 -20570 -234781 -258452
42432 -258452 -262397 -233615 27195 386051 386153 -34843 -318996 -66314 371396 438485 182425
42421 182425 68305 204008 249565 48069 -126601 -58277 41369 -149953 -597950 -964684
42411 -964684 -1024809 -870678 -733383 -699090 -621693 -314212 160538 450134 268182 -229033
42401 -229033 -562280 -464051 -157702 -22503 -117242 -196797 -124141 -43929 -106407 -217144 -188480
42390 -188480 -2621 236584 509625 833401 1066900 1016452 750346 551224 491549 335293
42380 335293 -10814 -249232 -123007 167318 270286 180370 84601 -76202 -447849 -790095
42370 -790095 -674338 -155508 241458 265992 189787 219200 190052 30903 -21657 31723 -265064
42359 -265064 -1061220 -1683944 -1431896 -555264 113759 250325 170453 79130 -145771 -459736
42349 -459736 -586669 -541074 -665117 -1006333 -1153005 -865612 -425116 -144876 59518 371202
42339 371202 690220 811936 717384 465813 58931 -373826 -519049 -261712 81407 146506
42329 146506 -32289 -168150 -129231 18466 211395 394568 440913 280440 44508 -66208
42319 -66208 17264 244454 506899 596632 324961 -146453 -307846 122553 768197 983077
42309 983077 578465 -51499 -446554 -507334 -443617 -470284 -560446 -454372 -9737 450215
42299 450215 393076 -195462 -643177 -403898 230743 576629 489252 400937 539562 628299
42289 628299 432582 138093 -22184 -161353 -482542 -856303 -940575 -621560 -113459 315076
42279 315076 512765 387072 -85119 -701636 -1060383 -919232 -501179 -293791 -521665 -947036
42269 -947036 -1221471 -1240000 -1035692 -576116 49947 434170 260904 -139320 -123124 333707
42259 333707 567761 260397 -46999 163847 537036 435854 -26044 -231981 -88807 -51330
42249 -51330 -198683 -68606 464718 874425 830528 754852 1130912 1730324 1970101 1704021
42239 1704021 1225678 739329 266523 -86460 -203255 -244539 -493788 -915455 -1169959 -1093256
42229 -1093256 -897383 -842083 -932502 -1018973 -1007943 -872139 -601743 -279409 -108073 -201681
42219 -201681 -367922 -271359 119136 410089 285413 9938 133222 687910 1057625 813298
42209 813298 305263 90217 96281 -140301 -599866 -756085 -440052 -129392 -207787 -460038
42199 -460038 -549340 -520883 -512237 -386291 -43076 244087 223827 121918 264040 474191
42189 474191 332215 -115762 -406759 -370324 -304276 -407714 -490302 -369483 -182374 -128173
42179 -128173 -174070 -175898 -80138 112816 387784 613397 597272 350808 119143 45467 -8363
42168 -8363 -183738 -348676 -266196 80520 485970 756042 803067 591842 169569 -252735
42158 -252735 -394603 -151822 291701 629112 694964 557119 369181 188708 -2916 -140020
42148 -140020 -74454 197166 436084 421317 220893 54320 -39241 -196490 -424792 -539721
42138 -539721 -465858 -391161 -506549 -747978 -925314 -977818 -952672 -830335 -552846 -191787
42128 -191787 81969 213376 310495 439210 497962 374566 130229 -83260 -234821 -411960
42118 -411960 -614334 -688920 -524231 -197247 144350 428395 577967 424981 -73082 -578920
42108 -578920 -604351 -67900 574112 835829 651785 241169 -213212 -546618 -510693 -33044
42098 -33044 501535 572121 162922 -197638 -118774 197785 334342 251773 244988 409664 461350
42087 461350 170635 -236280 -313452 23952 359854 289021 -86485 -323142 -206690 46691
42077 46691 145777 55251 -98179 -243883 -356457 -380326 -316289 -269565 -274801 -189832 86022
42066 86022 397320 499277 349254 87069 -158642 -281128 -158513 167896 394222 283159
42056 283159 1302 -126343 -93031 -139140 -302903 -416469 -506624 -768831 -1098716 -1104395
42046 -1104395 -734314 -464929 -631621 -948133 -972461 -720723 -495449 -387652 -311788 -311847
42036 -311847 -451064 -560208 -468209 -344927 -431338 -554929 -354180 73415 225785 -59540
42026 -59540 -380177 -412042 -332815 -386589 -426719 -212628 130201 308118 331294 422143 544866
42015 544866 390206 -140503 -718971 -948998 -764498 -400994 -117740 -26123 -85786 -178458
42005 -178458 -215557 -204876 -196856 -195517 -181541 -191144 -278853 -397552 -396900 -172773 212520 559782
41993 559782 671829 512044 258013 127151 103370 -50238 -414512 -698998 -593146 -217683
41983 -217683 36899 62524 99889 238201 240345 28946 -34830 326477 792186 858532 590285
41972 590285 487464 659023 655361 250445 -103505 88266 630773 942091 869329 753695
41962 753695 760442 630674 224491 -102722 37753 472584 683561 529143 389597 543715
41952 543715 742839 611192 228300 6873 95409 231340 197332 103236 111073 171013 210984
41941 210984 341094 629390 863103 803133 545373 368113 342386 365551 440228 577613
41931 577613 542647 125473 -367156 -363242 169052 635479 658699 515704 520537 488362 195948
41920 195948 -47424 215801 886164 1442569 1606469 1458636 1074118 500408 -11132 -211173
41910 -211173 -241766 -405339 -611852 -517186 -179974 -53507 -242381 -292511 75503 484699
41900 484699 444952 23745 -345529 -463023 -443577 -371931 -194344 101553 414687 616388
41890 616388 608699 387507 129698 84240 281046 486971 531230 492646 459410 326022 16312
41879 16312 -276836 -313802 -166042 -127183 -312853 -530381 -531021 -271981 38851 82126 -299183
41868 -299183 -867279 -1137754 -878811 -356478 33105 224809 397211 572548 583489 404460
41858 404460 243897 253646 360576 460809 578330 700751 630914 223888 -279215 -395208
41848 -395208 26403 535058 565620 121668 -258621 -244272 -140390 -394761 -915013 -1204827
41838 -1204827 -1067620 -782355 -561647 -256959 217857 540848 387257 -36638 -222293
41829 -222293 -36057 159782 67159 -154604 -150566 166111 537624 667314 520978 343381
41819 343381 385586 603513 680261 400753 -68698 -372351 -375680 -248941 -164184 -75433 130929
41808 130929 381047 441092 209434 -103574 -171478 67984 318272 284951 57132 -15807
41798 -15807 194360 429564 425454 266333 207695 277770 268212 87559 -82782 -44296 146600
41787 146600 258023 167257 -22858 -131352 -88295 33671 113269 65317 -118676 -343038
41777 -343038 -448001 -368933 -244604 -250272 -321829 -210810 138765 465914 548996 467286 337894
41766 337894 43812 -474910 -860136 -689099 -133864 160351 -96227 -529437 -722308 -739005
41756 -739005 -825003 -942175 -904799 -743450 -622522 -532638 -348580 -127092 -93922 -311139
41746 -311139 -516687 -367483 170843 693064 699798 165910 -349954 -344225 11956 173942
41736 173942 22164 -61449 110996 275262 273206 344120 603612 717524 453748 133232
41726 133232 93508 63547 -399951 -1087454 -1307202 -811034 -82779 293606 184727 -154665
41716 -154665 -357190 -162748 349076 763268 788863 610007 536086 498790 275563 50340
41706 50340 247838 816314 1165749 935967 422093 83303 -14416 -62957 -113571 -76553
41696 -76553 33778 82524 6906 -99503 -98932 24514 113905 1139 -260490 -430195 -399835
41685 -399835 -331760 -382226 -468593 -462776 -433807 -504719 -632654 -732972 -851108 -992687 -964948
41674 -964948 -639353 -210901 47071 115678 99760 14290 -28411 263645 863104 1150269
41664 1150269 657096 -145753 -400228 -64223 84877 -355046 -865727 -816501 -281148 184446
41654 184446 200336 -187930 -625392 -701911 -336666 77030 155957 42393 83198 164511
41644 164511 -110956 -664414 -958365 -811056 -617413 -670258 -823369 -944076 -1130845 -1319201
41634 -1319201 -1221354 -843089 -537530 -383596 -74360 399131 577981 307336 50409 102938
41624 102938 113607 -205225 -478945 -278526 170833 405480 425610 474293 490917 295554
41614 295554 8709 -174389 -329811 -505894 -419681 88182 611411 660116 305474 -80861
41604 -80861 -401352 -683782 -706092 -314658 149864 270231 153681 123350 99749 -157030
41594 -157030 -466844 -506153 -437486 -617441 -857950 -665206 -116836 183002 -4909 -364695
41584 -364695 -720167 -1223891 -1746169 -1749458 -1033091 -106492 424513 456145 201424 -199060
41574 -199060 -662189 -1039726 -1195102 -1060679 -629880 -86260 188979 46543 -144806 -18231
41564 -18231 182566 21063 -296422 -187787 249574 232891 -494219 -1191019 -1181482 -731441
41554 -731441 -450390 -394967 -285069 -156981 -213278 -314947 -201980 -56641 -297738 -858135
41544 -858135 -1165625 -916395 -465500 -299825 -424797 -482466 -297888 -67624 -31894 -151688
41534 -151688 -198513 -59830 183499 444750 709700 881123 742766 218731 -462645 -994961
41524 -994961 -1261888 -1279764 -1063649 -709480 -417282 -256003 -112983 -31955 -262968 -704827
41514 -704827 -720498 5201 782530 737781 76617 -232628 66288 229654 -183090 -608402
41504 -608402 -457858 -37815 55381 -122333 -148118 -45916 -155527 -422944 -454362 -206162
41494 -206162 -72201 -240864 -403383 -216619 249326 644508 723777 516046 238153 87547
41484 87547 54546 -43120 -298360 -575059 -694693 -638705 -468904 -191117 153623 383332
41474 383332 343799 123122 -54684 -101861 -96120 -91077 -60442 -31197 -122883 -387217 -684671
41463 -684671 -804563 -708727 -594744 -668303 -892305 -1050399 -1030691 -897717 -686141 -360147
41453 -360147 -64422 -121725 -552956 -861150 -624017 -100638 151623 115161 268590 723601
41443 723601 945057 509234 -283102 -807288 -837229 -623960 -463420 -419401 -372759 -201282
41433 -201282 41289 130094 -23257 -145044 79062 515830 728577 584114 352652 191831
41423 191831 -37108 -337184 -415621 -175291 27360 -109371 -392989 -494733 -456713 -517648
41413 -517648 -653031 -618318 -319664 113869 504717 674638 491794 95018 -100268 131752
41403 131752 500395 582976 393432 291944 435635 622244 644723 513915 301459 18753
41393 18753 -253182 -316385 -105546 108213 -42648 -536959 -876620 -638832 -35803 313648
41383 313648 177285 -37894 41985 191065 5819 -398363 -568127 -435087 -361975 -503119
41373 -503119 -607493 -516290 -406413 -419084 -438009 -376450 -342196 -381998 -368247 -254627 -166268
41362 -166268 -166695 -214558 -357832 -632400 -790139 -556127 -165794 -154600 -554058 -834369
41352 -834369 -757291 -685240 -823160 -780126 -269282 287552 335660 -14161 -239882 -192215
41342 -192215 -176791 -407320 -739812 -889455 -708713 -326440 -73569 -111363 -165567 92559
41332 92559 480950 536294 237866 -28740 -186017 -484203 -785871 -619910 -113558 -26118
41322 -26118 -544212 -887904 -537854 -18058 66109 -57108 -2656 -23646 -384714 -658644
41312 -658644 -459933 -232711 -460176 -712095 -403515 80290 38208 -267001 -82893 468272
41302 468272 651594 475694 604500 1059154 1197968 969938 1005472 1352234 1278376 577712
41292 577712 -21311 -105369 -220483 -794649 -1314158 -1161805 -582573 -227926 -256101 -396168
41282 -396168 -487687 -507313 -385421 -158752 -48788 -149279 -290138 -344744 -370574 -370794 -274936
41271 -274936 -207610 -373359 -635613 -654775 -474954 -470782 -664791 -672006 -442547 -446807 -881886
41260 -881886 -1258299 -1114199 -693768 -553355 -810385 -1097302 -1045529 -603485 -51145 198099
41250 198099 280 -298422 -270971 19952 161150 11706 -178228 -186816 35453 532258
41240 532258 1202082 1601197 1382164 831367 460086 216176 -276164 -840574 -880821 -373440
41230 -373440 64625 183933 387783 848871 1128776 947331 626544 474113 366134 215562
41220 215562 215325 328215 166775 -309666 -586350 -394175 -128970 -158989 -296695 -272711
41210 -272711 -157636 -9985 295960 584266 363613 -336323 -757847 -462695 31096 107367
41200 107367 -67358 -37246 133718 128402 5604 3152 67150 61127 115801 344708 531237
41189 531237 469465 293127 164105 9748 -161382 -127562 83203 88357 -195232 -320009
41179 -320009 -48788 236676 217395 124437 143922 -25112 -514029 -785009 -366729 403702
41169 403702 909165 1049140 1016465 802338 462415 367760 633798 782996 501716 196325
41159 196325 239737 260013 -154173 -604541 -492374 24 293409 340812 407540 341036
41149 341036 -118146 -626357 -648770 -324357 -173632 -215031 -125214 -13455 -244351 -682123
41139 -682123 -871388 -812556 -837917 -877120 -571676 -8487 338017 306517 109083 -140050
41129 -140050 -382668 -348963 42198 284899 -39493 -479395 -347671 143261 215678 -218154
41119 -218154 -526458 -465012 -405113 -469875 -329480 51996 272606 232475 295363 569449
41109 569449 693547 490810 234602 130944 79824 34348 66380 24206 -339372 -847199
41099 -847199 -1011344 -690074 -164873 367417 844108 977586 490724 -280972 -637666 -426538
41089 -426538 -161670 -202070 -351431 -326426 -117798 175326 445417 514310 349075 232205
41079 232205 329225 310832 -115280 -575286 -523013 -99219 157509 198378 334741 470170
41069 470170 289265 33714 199633 559007 419200 -140578 -256905 348269 888263 661639
41059 661639 -87172 -732110 -1025539 -1033558 -875890 -739954 -700511 -481952 113029 629974
41049 629974 448988 -232721 -604042 -371087 45927 370926 694019 851202 488693 -144763
41039 -144763 -339444 -13522 176843 -26935 -109471 237184 618780 725629 807493 1019172
41029 1019172 1032884 673481 293325 181820 188394 193150 355119 652729 764732 622254
41019 622254 513588 496820 320189 44223 73357 422837 627677 528617 469009 566858
41009 566858 487907 107141 -267176 -454825 -539141 -409503 93377 561251 383507 -206821
40999 -206821 -320591 264177 862197 1054562 1133142 1226551 1009459 538780 386210 634155
40989 634155 687707 372391 246011 513679 641337 414701 376212 778089 1062426 844885
40979 844885 519498 451908 438736 349546 414986 534497 252241 -234780 -81245 787526
40969 787526 1336796 1004401 572019 883023 1672378 2265313 2519744 2497458 2078367 1453551
40959 1453551 1176704 1266961 1098120 525015 162822 215116 92004 -425447 -756784 -660827
40949 -660827 -644286 -821098 -594371 65424 309545 -105906 -322675 105570 536168 598425
40939 598425 811343 1283529 1303878 839273 851036 1486849 1725387 1569136 2579403 5103996
40929 5103996 6960257 6345775 4323052 2890064 2254616 1670488 1364402 1739312 1957749
40920 1957749 1182833 184347 58002 397986 301491 77176 380955 761046 623359 532334
40910 532334 1037169 1398066 1006223 765016 1439028 2019936 1514578 955587 1670957 2864636
40900 2864636 2986515 2309363 2049450 2075762 1633050 1240508 1686079 2167968 1616424 833799
40890 833799 1121970 1846706 1659383 1085251 1476912 2350581 2246276 1407392 1160998 1422343
40880 1422343 1220899 897079 1358460 1977782 1659954 1131633 1704133 2692509 2629680 2095334
40870 2095334 2664251 3952937 4412799 4126921 4094630 3780344 2248245 671504 721634
40861 721634 1525934 1256680 533951 1027941 1992302 1677079 881460 1406763 2315700 1667310
40851 1667310 593221 1392349 2922161 2475066 966294 1329141 2918684 2821401 1768602
40842 1768602 3063972 6219507 7477206 6331115 5694294 5917647 4725768 2815725
40834 2815725 3132854 4749541 4077077 1927057 2325735 4615403 4440115 2383399 3195059
40825 3195059 6405736 6889476 5048351 6432538 10666943 11789050 10580215 14358369
40817 14358369 23007323 28725162 31530179 39455382 50826123 55086123 55586075 69050170
40809 69050170 95440210 117505998 145180308 223839761 362859846 482869869 484765781
40802 484765781 366591828 226741023 147919666 122295142 102195096 76180078 63038943
40795 63038943 63763758 60265729 48979654 42651125 43382353 39985585 30256544 23967749
40787 23967749 23787165 21816695 15846587 12725938 14177087 13737007 9632109 7750736
40779 7750736 9773076 10122586 6956343 5382379 7340182 8227616 6101226 5007191
40771 5007191 6586098 6984723 4745814 3665663 5153393 5449565 3132256 1993333
40763 1993333 3673804 4578851 3013972 2442738 4539411 5729507 4004182 2734433
40755 2734433 4160486 5309808 4141699 3685698 6014266 7958283 7170507 6772262 9298654
40746 9298654 11631391 11129800 11262049 15278915 19927105 22791977 30676702 50721136
40738 50721136 75248530 85879201 74399008 51653035 33444226 24638890 20491677
40731 20491677 17110592 14756384 13910553 13580092 13168281 12902035 12739710 13011660 15376614
40722 15376614 20714056 26285928 27383044 22473540 15141163 10112845 8548309 8206069
40714 8206069 7204388 5954905 5480863 5525481 5214303 4578592 4295387 4422815 4449370
40705 4449370 4294390 4242974 4103438 3467113 2662980 2380292 2424615 1984765 1131652 836081
40695 836081 1355739 1824176 1712618 1521456 1658466 1761005 1580067 1502855 1729593 1873489
40685 1873489 1787625 1845207 2015233 1655801 679485 -39536 81727 556195 752794 735699
40675 735699 746867 708230 666424 918559 1338875 1407680 1173232 1247086 1599196 1444742
40665 1444742 670588 209894 521792 858872 626434 331723 496406 703152 502781
40656 502781 304872 549712 827967 612686 156911 -15386 151706 550595 1229151 1952309
40646 1952309 2250674 2298226 2800448 3621309 3657580 2616637 1688858 1723504 1967304 1516641
40636 1516641 830585 707145 802710 382084 -300579 -566676 -548989 -714482 -784624 -263933
40626 -263933 486434 772293 693155 766628 913514 784496 633274 907125 1374988 1532412
40616 1532412 1437851 1337599 995651 261191 -266629 -74766 318105 223732 22191 455405
40606 455405 1182091 1223447 532129 -26902 -53203 99316 248063 567665 921958 929682
40596 929682 663779 523960 543063 526741 630568 1030571 1306946 990407 464560 471269
40586 471269 945008 1182349 950769 595729 279917 -33990 -77871 379454 911636 1007056
40576 1007056 980423 1397590 1898450 1648519 762769 174609 176104 190580 -13664 -4414
40566 -4414 302008 368618 6619 -304157 -289847 -245397 -331504 -304477 -123796 -69236 -107508
40555 -107508 106898 483655 519567 182688 -9548 90979 81307 -115306 -40508 407992
40545 407992 689454 496638 175831 18989 -131761 -324830 -285252 -34159 408 -229814
40535 -229814 -225456 143128 302268 -71361 -482931 -429294 -111232 114071 365853 827884
40525 827884 1248079 1353891 1314393 1339337 1253622 904748 571527 519484 522675 264563 -112147
40514 -112147 -267127 -182913 -46419 119931 348827 483981 378063 155414 27251 24750
40504 24750 88798 198658 269886 188310 62694 136229 345317 335190 33666 -213877 -242467
40493 -242467 -329856 -616680 -735530 -370533 192058 447775 317950 76921 -92477 -141684
40483 -141684 2123 307776 540022 564248 562652 692787 741091 414505 -167994 -554905
40473 -554905 -456661 30038 592998 931502 910472 645367 385199 245232 133595 -54021
40463 -54021 -308755 -573876 -767756 -763215 -539116 -309751 -275005 -314512 -221380 -152816 -448958
40452 -448958 -1008920 -1284670 -992331 -443150 -49883 129503 219993 253181 235702 215087
40442 215087 142889 -83389 -378500 -548413 -639600 -874846 -1202972 -1288610 -1022496 -664413
40432 -664413 -405309 -188464 -44331 -148471 -402908 -414074 -87272 177472 98548 -87527
40422 -87527 -82184 12880 -19779 -94478 12530 316599 665642 909570 897266 586291 267215
40411 267215 333070 689953 782298 376450 -96995 -213831 -146770 -268780 -530713 -618877
40401 -618877 -496738 -433155 -609582 -933253 -1144949 -1006373 -538965 -114785 -77299 -271947
40391 -271947 -267702 -21558 106697 17439 20693 212028 264966 59574 -32107 229919 562902
40380 562902 707976 853460 1143856 1257657 909489 360448 803 -197707 -399405 -460474
40370 -460474 -226300 50897 42835 -172209 -340315 -448801 -538249 -423202 -4722 440868
40360 440868 665693 813392 1011003 1012989 717131 605677 1074386 1659111 1593312 921281
40350 921281 401564 419394 616206 575759 333934 162365 250085 608518 995477 1035664
40340 1035664 694805 424019 514790 615615 318780 -106511 -135318 130461 166369 -45817
40330 -45817 -1289 436654 805082 794366 643972 637722 699272 653448 485992 212455 -164449
40319 -164449 -488944 -572419 -508595 -530347 -560978 -294441 262216 720818 826251 673213
40309 673213 398624 56530 -171202 -64919 245565 372771 243017 197035 416716 639742
40299 639742 605931 443470 412770 535015 664755 723030 692387 536201 259917 -32703
40289 -32703 -199538 -129334 177670 494255 465937 4211 -549115 -825325 -806959 -604149
40279 -604149 -160336 457154 776097 454590 -90322 -170753 161704 231587 -146562 -375687
40269 -375687 -65364 356524 358575 88922 9619 140122 144250 -44617 -135224 34950 260216
40258 260216 259001 9770 -270614 -394935 -380089 -339600 -268118 -75614 156599 183335 -31053
40247 -31053 -199319 -144543 -53484 -46744 154847 731402 1245944 1162361 672521 412464 479465
40236 479465 385016 -23790 -276647 -57654 324547 460092 334465 91085 -240305 -546934
40226 -546934 -578433 -327387 -115281 -109747 -105990 44767 164128 94609 -34933 -79194 -74600
40215 -74600 -9394 234769 535104 511573 88179 -278384 -169959 293317 716295 875018
40205 875018 723754 307271 -124788 -246782 -96599 -53905 -220654 -236115 80076 366099
40195 366099 315594 195442 357764 605321 517110 150633 -51714 94813 381773 613700
40185 613700 784794 903933 948855 980806 1087328 1223397 1240225 1036653 646450 280443
40175 280443 237950 545407 739974 372094 -292617 -540858 -239136 -32755 -332783 -705084
40165 -705084 -607656 -181626 131118 270452 366647 304978 20060 -156988 -7301 75720
40155 75720 -299339 -744830 -632921 -162319 -104667 -584396 -903561 -641732 -195517 -44548
40145 -44548 -131676 -241507 -439351 -781227 -992303 -797555 -326434 82364 282079 315117
40135 315117 202440 -43348 -305568 -430987 -359179 -122823 192698 451123 526018 399173
40125 399173 144126 -153107 -374089 -346569 10351 547234 995865 1178008 1049526 673319
40115 673319 254291 41304 53800 63489 -35755 -80656 -27345 -164559 -629145 -1002273 -811098
40104 -811098 -234581 140232 124917 22630 15081 -25977 -122682 -101747 -672 -93271 -386219
40093 -386219 -527394 -375214 -246264 -394232 -624463 -676187 -652010 -769987 -952175 -984335
40083 -984335 -907374 -919699 -967752 -740584 -118117 569393 827451 489126 -122552 -512495
40073 -512495 -463027 -139707 191951 404963 455549 329662 189972 339920 791809 1069444
40063 1069444 770417 184316 -35640 251773 548515 473022 200497 31781 -63770 -246530
40053 -246530 -452976 -510253 -431614 -391895 -513974 -788893 -1078492 -1132463 -781780 -196451
40043 -196451 232887 349383 368244 483053 576914 474841 267826 184884 285460 463906
40033 463906 648336 811102 849761 635899 195426 -247963 -431580 -265139 66679 236334
40023 236334 103824 -99731 -35157 311177 596988 532176 176583 -177449 -273530 -32072
40013 -32072 418394 810838 959136 922781 861547 791219 641618 476424 421047 410256 274158
40002 274158 78879 93412 355620 551119 445789 210388 170573 399361 681246 756470
39992 756470 514387 51221 -405126 -695110 -829856 -824790 -575948 -86253 361379 556368
39982 556368 727099 1159297 1576039 1419767 742840 242567 293279 517692 531437 524492
39972 524492 743966 919689 687122 218528 -38951 16670 198801 429980 649239 589128
39962 589128 127870 -341040 -374118 -132863 -73601 -156475 45221 516235 717417 422682
39952 422682 62854 42139 209796 280606 366486 734130 1277797 1563853 1310661 638001
39942 638001 -70918 -442345 -369688 -108786 -21582 -173173 -300106 -187051 98243 353721
39932 353721 404212 91951 -597636 -1285441 -1381662 -757406 -22641 130232 -279905 -648537
39922 -648537 -599203 -360489 -321036 -497218 -583566 -380266 -18292 208963 159234 -16295
39912 -16295 -32286 214914 513695 572500 366912 154105 117393 118508 -78040 -400439 -481757
39901 -481757 -145835 275788 287222 -161659 -599293 -600729 -256036 32923 83864 91165 298196
39890 298196 677221 971458 961758 649340 223252 -116510 -304474 -376966 -326660 -83370
39880 -83370 321745 676453 777843 655269 509172 468355 504791 544577 535430 416641 157816
39869 157816 -146364 -332649 -351237 -283030 -148486 146210 569167 816404 623065 197879
39859 197879 105232 587481 1167003 1138642 417442 -332067 -469378 -66330 325197 410864
39849 410864 396790 552182 819271 948564 826411 550263 308849 282234 527513 845213
39839 845213 871446 444589 -179019 -579547 -579547 -310533 16772 256467 307404 133251 -166180
39828 -166180 -400898 -427653 -210793 178641 538605 610193 341567 32404 29677 282708
39818 282708 400533 196044 -47902 2576 225675 201005 -167993 -446590 -199155 424679
39808 424679 810818 559814 -94752 -561537 -463615 94116 679674 851299 444934 -281553
39798 -281553 -826229 -900343 -673133 -448156 -216792 217386 743264 951967 742923 540020
39788 540020 643569 683565 130930 -803201 -1264179 -815281 -1688 345841 92216 -184838
39778 -184838 -13496 427345 602176 260051 -317600 -632117 -440596 78136 557397 776925
39768 776925 766021 659456 542624 434958 343429 283269 264525 275424 272557 209821 118537
39757 118537 133808 354850 661496 772367 569080 294147 299481 610324 880842 825538
39747 825538 546702 324782 224076 109142 -17819 31303 281579 440849 248158 -180084
39737 -180084 -504043 -533828 -306285 67159 439019 631643 630018 690849 1023505 1413150
39727 1413150 1420028 956263 415898 187563 262130 395458 461230 530404 713414 992160
39717 992160 1154597 943537 386278 -115583 -216269 -56830 -20050 -139650 -83604 287988
39707 287988 704446 876094 770826 446258 -18269 -318208 -64551 658745 1225096 1195482
39697 1195482 824316 613413 676895 821197 955274 1083586 1106873 952735 749723 620620
39687 620620 489296 323864 322694 567294 741164 547867 201251 119519 298145 382329
39677 382329 237934 45048 -103811 -301750 -535919 -639015 -543121 -315842 16550 418609
39667 418609 688337 637867 379474 169611 50136 -85313 -183499 -112523 38311 69055
39657 69055 7809 23556 95691 109886 174809 450652 740449 680102 312517 52099 66464
39646 66464 99496 -51789 -260847 -319409 -139071 281710 760324 879722 446379 -85984
39636 -85984 -133845 149382 101507 -375346 -656249 -428837 -166134 -271575 -416022 -163687
39626 -163687 279784 450267 358170 335447 433133 436291 284868 86675 -130316 -353872
39616 -353872 -441705 -330931 -223550 -299288 -425440 -397691 -262454 -149293 -12917 175650
39606 175650 209907 -51427 -343345 -294428 41507 250452 81745 -324733 -648089 -629542
39596 -629542 -215861 356929 720559 738702 585592 412706 194716 -1933 54587 365524
39586 365524 562140 411795 157571 92301 110437 -17566 -229012 -346407 -384672 -379374
39576 -379374 -231899 -38207 -171367 -634113 -774227 -196683 447133 279455 -481538 -806816
39566 -806816 -331450 276100 453827 449797 655385 907376 820177 381109 -89953 -291030
39556 -291030 -95780 353647 656513 589959 524147 964897 1693323 1930750 1466638 1003336
39546 1003336 1126621 1519340 1566765 1227399 840132 475971 17 -491619 -786169 -925993
39536 -925993 -1041096 -980838 -550490 4377 198212 -38917 -297172 -282959 -123620 -44133
39526 -44133 -72738 -145928 -219151 -170810 158423 706323 1158552 1292706 1202310 1094601 1039130
39515 1039130 1032266 1134584 1356006 1508957 1386709 1064670 837247 833382 866305 727098
39505 727098 465716 266830 184506 165719 236130 439941 622807 521949 138970 -179517
39495 -179517 -132483 225090 636902 907541 894086 476598 -232049 -815203 -963730 -866576
39485 -866576 -926145 -1146498 -1106060 -573057 120880 444922 252672 -108953 -198520 79894
39475 79894 411131 436274 174584 -17020 65082 194080 58641 -274071 -449785 -296161
39465 -296161 -4619 107954 -125046 -596109 -936228 -785126 -221809 231051 233019 56027
39455 56027 116367 302804 181230 -262281 -552133 -387871 48889 481790 821139 996853
39445 996853 917063 697917 569693 473858 151871 -275401 -294803 225342 707678 624706
39435 624706 204136 17251 186701 424483 625578 944027 1339236 1474701 1164667 663158
39425 663158 390282 486788 710188 736795 534692 382908 471531 605498 488897 194865
39415 194865 55604 126945 124831 -70113 -236234 -242361 -256122 -358516 -343713 -104990 174384
39404 174384 438770 922359 1584736 1855562 1391412 686796 407214 456851 313152 12180
39394 12180 81383 592203 1003715 1008508 881491 849108 726899 415606 204426 267558 321224
39383 321224 129079 -53650 61001 218392 -38658 -649552 -1095980 -1086973 -787395 -410599
39373 -410599 7960 367809 406778 49661 -357762 -374474 52486 561135 778501 651000
39363 651000 404923 266686 236768 125435 -172717 -473272 -482680 -211095 -43689 -264076
39353 -264076 -638123 -696575 -367428 -39174 27112 10090 109842 166062 -12283 -214454
39343 -214454 -126820 110325 103678 -114184 -114150 180513 297008 -53055 -502773 -561130 -235247
39332 -235247 174624 561360 947310 1207271 1216936 1084077 929435 660141 270987 97523
39322 97523 359218 682185 554675 91691 -169933 -117852 -113453 -213481 -3880 606809
39312 606809 1027412 761069 96867 -358616 -490573 -584093 -669013 -454136 124292 698843
39302 698843 898770 715187 363616 11178 -239435 -267910 -25734 323495 490301 337231
39292 337231 27615 -136921 -8328 293159 513151 469721 178712 -139831 -215064 -1204
39282 -1204 221210 163263 -77003 -149436 1331 12311 -347683 -799598 -960695 -880029 -857892
39271 -857892 -916392 -813777 -489948 -135096 145664 381839 462326 195184 -276268 -465461
39261 -465461 -105881 527532 982000 1076207 882433 534610 232469 204329 433404 562686
39251 562686 288891 -226668 -515665 -323686 160854 554667 629881 434637 178640 36437
39241 36437 21168 12782 -106538 -330072 -498010 -415678 -100327 107193 -132741 -664699
39231 -664699 -905936 -555183 12476 281498 264888 303547 428848 387752 192249 133357
39221 133357 233427 176756 -117616 -318921 -237418 -120082 -183760 -249639 -102082 125434
39211 125434 196048 117999 -2563 -181578 -379360 -376311 -92198 225303 385885 548993
39201 548993 844225 1003188 744647 286555 71406 157187 262972 251020 171453 -1250
39191 -1250 -238160 -212197 313399 929626 950346 353602 -168368 -179026 9569 -24338 -199811
39180 -199811 -241188 -162589 -93818 43923 319419 502701 364300 72961 -62851 -91460
39170 -91460 -276411 -562538 -587847 -223989 255486 588865 784136 900858 896095 799719
39160 799719 745172 682813 356935 -241744 -696759 -710220 -566144 -699415 -1007883 -1034707
39150 -1034707 -732115 -536325 -641716 -712166 -488478 -197523 -57584 182799 767890 1318053
39140 1318053 1234857 582204 31762 -48522 51395 -526 -106531 -69610 22944 22153 30784
39129 30784 214393 497401 693260 788596 882200 957859 905655 682139 312090 -167299
39119 -167299 -647541 -955087 -1036899 -1028657 -1043960 -1027854 -903080 -698590 -443174 -123035
39109 -123035 153934 185933 17375 2038 328410 734775 947208 1134722 1565795 2007427
39099 2007427 1923407 1243716 525224 269710 404934 552746 544637 512571 627070 882662
39089 882662 1090155 1059441 848488 761521 962454 1174400 984597 418043 -49558 -92269
39079 -92269 106255 204455 185246 279128 524923 652380 441276 34460 -228593 -232026 -185781
39068 -185781 -265441 -305665 -17948 561695 1055471 1178616 994168 714491 467505 307828
39058 307828 225367 68928 -292884 -654392 -608889 -125597 331183 427519 343798 299780
39048 299780 106986 -419132 -940495 -965106 -519959 -27123 275018 353604 88560 -501463
39038 -501463 -952649 -877058 -632592 -831890 -1323252 -1407574 -1009438 -772028 -889162 -764546
39028 -764546 -139811 327904 114278 -320385 -340711 -131893 -178986 -307715 -55556 385017
39018 385017 435669 124974 -2729 123369 -6467 -552689 -1002992 -942506 -568167 -247639
39008 -247639 -56357 50825 32983 -60444 -39205 134100 275148 290883 267115 199509 -11466
38997 -11466 -237585 -184735 122391 314978 260989 243073 385032 366978 -3534 -367082
38987 -367082 -340062 -122205 -146608 -378219 -417886 -153861 124091 184459 47552 -219662
38977 -219662 -533136 -651529 -376800 90552 331313 259903 158997 138878 -41392 -488082
38967 -488082 -888225 -938258 -761081 -631552 -523212 -238497 160671 384371 336125 216312
38957 216312 182603 150251 1092 -206928 -357454 -476704 -681508 -969687 -1168782 -1108292
38947 -1108292 -790174 -360042 65798 486020 895302 1149773 1083254 777678 568893 669999
38937 669999 884765 846732 499626 165773 107177 176701 15374 -474041 -968825 -1063405
38927 -1063405 -715682 -311648 -268139 -600012 -943750 -1007374 -881473 -825022 -854180 -724876
38917 -724876 -322861 105816 214317 -33708 -309887 -267000 115097 535536 690240 546823
38907 546823 298998 122498 74033 182056 440207 654316 520466 35617 -335129 -144095
38897 -144095 473378 953978 954077 586712 87507 -405857 -707429 -581889 -64817 451100
38887 451100 609505 408729 57496 -263320 -409015 -296653 -54775 72055 59631 81522
38877 81522 85140 -217311 -762432 -992912 -626838 -153117 -128758 -362736 -345963 -169181
38867 -169181 -310068 -666858 -600017 -11522 377601 98665 -367105 -370231 -55956 -32836
38857 -32836 -410093 -705992 -583805 -215936 78138 196925 194096 97126 -108892 -415326
38847 -415326 -736687 -887135 -682878 -154085 410442 717222 719342 575326 457004 455536
38837 455536 558335 629932 516898 259591 106168 234682 548561 808407 861168 691454
38827 691454 396982 197641 312693 726796 1250003 1924335 3107357 4854194 6392317
38818 6392317 6665107 5496513 3877784 2895958 2616940 2289775 1475399 575278 204828
38809 204828 418734 782601 959500 912649 667071 244234 -155887 -238180 32178 403267
38799 403267 708573 982643 1168568 1084105 810315 733922 1012662 1365539 1580570 1795549
38789 1795549 2052543 2119506 2089010 2513194 3455989 4178676 4552452 5943742 9346673
38780 9346673 13071970 13954023 11079194 6905853 4243230 3420230 3070431 2410471 1653192
38771 1653192 1024503 548624 415028 672748 872801 694190 515866 711419 877268
38762 877268 518105 3995 -21284 237010 132512 -225033 -177858 288702 572775 560431
38752 560431 695156 970634 869706 385905 114294 172169 18396 -416207 -431384 214519
38742 214519 726836 465044 -99532 -215836 59312 249814 334111 533269 685668 526472
38732 526472 270142 291541 480720 479217 330697 349676 527564 599186 566853 655135 825517
38721 825517 798026 519179 208619 -27728 -263154 -453066 -424598 -186423 30151 61277
38711 61277 -61344 -229375 -306120 -141881 233154 521507 503664 371489 438977 604437
38701 604437 445021 -131406 -656293 -654007 -203671 216973 324040 283766 378966 569216
38691 569216 534471 160846 -216963 -236314 -25258 -5271 -231018 -307260 -39615 235337
38681 235337 190308 34060 175786 594077 890202 847461 620387 425005 312186 231852
38671 231852 109301 -133897 -477460 -755177 -843365 -833484 -881488 -958681 -897106 -625655 -238849
38660 -238849 107175 266845 159352 -139368 -425460 -553324 -503656 -256686 203442 686253
38650 686253 835039 528588 61101 -229195 -336078 -450729 -644923 -843281 -922846 -703572
38640 -703572 -71713 724132 1158662 1011464 603217 259488 -108196 -583698 -798463 -395993
38630 -395993 302427 639221 501358 323632 274790 27609 -560780 -1071269 -1067282 -650508
38620 -650508 -230196 -2243 120178 252476 424325 613115 752155 768971 674846 548118
38610 548118 426456 308910 234236 234556 253143 245824 304641 516885 764506 852999 788954
38599 788954 736626 752752 766972 762702 748942 607835 223774 -265105 -596348 -742367 -888121
38588 -888121 -1078287 -1167234 -1113399 -1026294 -903939 -637870 -331272 -284304 -548553 -790660
38578 -790660 -745941 -550963 -466607 -504964 -512994 -429147 -258894 54617 531303 1007957 1257824
38567 1257824 1223580 1037520 858299 756435 709007 648442 539080 404914 250690 28382
38557 28382 -217763 -269416 14639 418401 572112 440445 360944 530799 702438 546315
38547 546315 143469 -94524 45307 301378 258679 -122374 -420901 -266361 174297 411808
38537 411808 289041 120258 113775 32284 -335272 -709985 -706316 -434820 -299052 -360663 -356645
38526 -356645 -239409 -227307 -357960 -451257 -512534 -718800 -984675 -999304 -737592 -478572
38516 -478572 -276930 79693 516253 637519 410361 307911 526839 618986 236587 -272641
38506 -272641 -420718 -276514 -163386 -64747 173816 383171 339130 241203 394397 601094
38496 601094 412403 -111791 -415003 -210509 209224 456339 452964 308148 132093 42040
38486 42040 84446 110465 -42323 -255686 -272432 -120799 -115571 -397465 -730460 -835383 -715011
38475 -715011 -554421 -455309 -368185 -207149 25380 202725 186695 15395 -85248 59615
38465 59615 382794 662778 719521 506403 137303 -153689 -227865 -220219 -320050 -422937 -300170
38454 -300170 -83002 -151058 -481026 -620010 -473080 -525479 -954459 -1148188 -656574 -73699
38444 -73699 -234908 -904510 -1094036 -510398 158964 396815 464603 691036 882606 761063
38434 761063 453227 236354 200400 383268 830652 1302815 1331732 828394 283106 121211
38424 121211 195207 161342 28066 31035 212634 412080 500625 409813 88697 -388168 -811884
38413 -811884 -1048648 -1099534 -922898 -465092 70979 311572 189240 27248 31757 46619
38403 46619 -41016 -44876 140509 273028 156373 -26810 -62943 -65360 -169603 -196847 5518
38392 5518 182602 60007 -122236 71840 573993 887126 778317 477831 239158 102120
38382 102120 79712 207157 378818 438877 430768 484464 519216 374851 165223 127820 165063
38371 165063 -41907 -439712 -567234 -227778 209038 348444 256320 202058 237734 280224
38361 280224 357305 506895 602276 502479 248408 -51329 -369176 -632464 -638634 -319893
38351 -319893 38050 69213 -242320 -566478 -590172 -249288 292971 749362 886686 746007
38341 746007 602399 609425 636205 575704 585199 795612 1010707 1031561 1107191 1617773 2346386
38330 2346386 2549584 1897695 960157 531430 747501 1090198 1040182 497521 -253720 -750311
38320 -750311 -657605 -119773 279766 112778 -415799 -762358 -706336 -496218 -426016 -531533
38310 -531533 -690400 -779898 -705677 -469400 -241973 -211882 -350073 -472778 -515517 -562753
38300 -562753 -616412 -544721 -302858 -30375 130009 195477 303057 582708 1019533 1370548
38290 1370548 1368229 1134456 1154187 1602865 1990878 1847255 1451169 1368682 1570924 1715229
38280 1715229 2035442 3028547 4439106 5779025 7857668 12077972 17473148 20190360
38272 20190360 17555024 11614207 6861284 5094102 4458372 3196847 1932070 1685228
38264 1685228 1828582 1338873 622401 616082 1012125 816106 94331 -189255 214735 602779
38254 602779 575113 444958 371564 56259 -542075 -985463 -1036172 -910635 -736923 -398584
38244 -398584 -48608 -123378 -615269 -905945 -602584 -64481 172741 73015 -75726 -138020
38234 -138020 -135376 -61437 37519 9598 -169941 -294306 -194034 64922 317838 416937 196260
38223 196260 -363321 -884652 -886705 -447040 -184526 -404340 -662009 -446921 66943 309661
38213 309661 88918 -298022 -550136 -604735 -494742 -278859 -81977 11245 55965 101436
38203 101436 80151 2599 76882 406233 733322 747338 511441 322875 283649 297783 362197
38192 362197 518868 603502 411348 86572 -17613 132722 241849 221955 298019 461983
38182 461983 309477 -293184 -795276 -633774 -43399 272689 124827 -12904 190296 482227
38172 482227 547141 524806 713287 1034935 1135819 883358 474030 119126 -108855 -150746
38162 -150746 44535 356968 550844 563420 553878 600600 555301 317947 67962 37546 176563
38151 176563 245077 178732 160196 321311 538015 569113 304864 -139234 -494666 -518595
38141 -518595 -217235 92914 65123 -286684 -573747 -479886 -152530 -50278 -410288 -951033
38131 -951033 -1158925 -850821 -378179 -220444 -435039 -636075 -514876 -196321 30432 158277
38121 158277 401013 750246 884206 613203 196386 41762 222502 486452 666900 836393
38111 836393 1025494 1052418 811903 557888 624820 919780 1000420 724256 505443 734297
38101 734297 1219355 1503573 1510453 1475175 1381286 986673 427978 238590 551868 772614
38091 772614 373563 -369526 -821558 -840910 -748247 -695449 -564151 -361664 -237023 -153810
38081 -153810 23441 162861 24626 -236334 -197502 161970 397501 314419 273962 580793
38071 580793 980434 1045106 750021 380879 88274 -203387 -566393 -914650 -996080 -541574
38061 -541574 363343 1088509 1004810 286741 -222709 -67029 335906 437140 287285 190182
38051 190182 89169 -214255 -539541 -539852 -258251 -12051 139594 366736 613117 631738
38041 631738 454858 407293 604655 778732 665537 312157 -28787 -110984 156844 587704
38031 587704 859268 981567 1396244 2283278 3020117 2826209 1811866 845193 432967
38022 432967 319856 220606 280536 582600 790400 647232 392762 315962 261360 -34185
38012 -34185 -417540 -542524 -404376 -263430 -185745 -24678 230787 412332 429340 315061
38002 315061 76700 -269198 -574519 -686460 -637307 -530103 -338251 -22994 255883 283669
37992 283669 84645 -129302 -237383 -259055 -228951 -219128 -360474 -618221 -693683 -424429
37982 -424429 -125386 -176655 -397250 -270786 246641 641460 636041 550993 670486 735447
37972 735447 423099 -46452 -222219 -101611 -43258 -128352 -69009 240336 481133 327725
37962 327725 -172420 -731282 -1100724 -1132474 -786818 -229616 212201 309267 83222 -302052
37952 -302052 -672911 -876611 -866587 -790655 -812342 -830825 -619597 -276217 -199468 -472413
37942 -472413 -628097 -314485 120064 101942 -334571 -665905 -706885 -778501 -1030672 -1152795
37932 -1152795 -937900 -651956 -574501 -585717 -524776 -564918 -817134 -888861 -362071 470701
37922 470701 890483 706626 397805 293004 187988 -57832 -105732 303670 762006 631833
37912 631833 -97254 -807349 -1048454 -964322 -891309 -870759 -728542 -439341 -192787 -129381
37902 -129381 -163603 -122041 20741 137144 162340 191043 294415 365647 292470 188065 235266
37891 235266 335614 174058 -316567 -810907 -1016690 -996319 -905751 -670881 -196491 271620
37881 271620 326375 -80273 -551234 -693247 -459576 -53926 297239 443058 360771 177048
37871 177048 35185 -65655 -203573 -362283 -476848 -586537 -737991 -786507 -557401 -205286
37861 -205286 -107827 -323061 -456318 -216042 178722 346993 246493 73087 -114772 -348350
37851 -348350 -470055 -253775 237993 707572 993068 1109473 993636 572309 78735 -106757
37841 -106757 -17084 -85954 -417509 -511620 -17081 641720 828898 601045 526547 763288
37831 763288 905110 759654 686731 951246 1223552 1063102 578385 246908 274444 461629
37821 461629 581411 582016 473886 276600 64414 -116676 -326729 -571739 -679198 -537674
37811 -537674 -331410 -269955 -207528 111101 487144 402595 -182846 -608443 -336469 338137
37801 338137 725678 645836 513925 646011 877131 903975 693666 443977 343331 465887
37791 465887 743190 953506 880658 572774 321826 303892 370686 305301 143209 58925
37781 58925 25546 -167612 -538530 -794130 -715103 -476971 -391533 -448025 -375700 -139777 -61785
37770 -61785 -322056 -626865 -631677 -498565 -659067 -1069034 -1125881 -487208 373137 724111
37760 724111 487723 240165 378003 659306 664617 396803 193556 217991 308309 305012 288377
37749 288377 406560 617936 732360 647634 429638 172875 -107988 -409671 -640544 -664752
37739 -664752 -441680 -89020 197703 293239 237896 190792 261217 393060 458828 444613 450488
37728 450488 510105 544176 535971 588637 695440 620572 210962 -283035 -446197 -214863 95201
37717 95201 255467 319586 314293 98579 -279061 -400282 29144 691999 1003260 838178
37707 838178 571753 437368 247678 -146418 -495780 -504950 -294456 -191808 -180749 89786
37697 89786 709635 1225654 1131429 465888 -277634 -744717 -987445 -1142209 -1110161 -739112
37687 -739112 -186985 140657 50158 -195545 -164433 294226 940141 1409294 1523588 1379695
37677 1379695 1207505 1152798 1175982 1148299 1015702 835605 682002 574887 491415 386341
37667 386341 216592 16023 -75775 41488 254189 313902 120509 -164589 -317820 -278184
37657 -278184 -139137 -605 119635 264458 432847 476616 195449 -347603 -713823 -519477
37647 -519477 57346 461677 461902 365251 473535 681569 797804 916585 1166513 1351752
37637 1351752 1213750 887209 715573 701308 521106 74192 -344364 -470364 -367085 -223754
37627 -223754 -123084 -89360 -127326 -121774 95518 498192 862330 1046216 1070883 920057
37617 920057 552168 180988 214075 731119 1287517 1438412 1224794 933504 635546 261769
37607 261769 -67151 -154958 -79756 -77292 -111306 88815 541688 919989 1036480 1083683 1218700
37596 1218700 1231672 910620 495241 389008 516570 371427 -238769 -852469 -940518 -569224
37586 -569224 -229018 -171104 -215097 -170618 -148738 -355266 -760012 -1104253 -1168365 -966850
37576 -966850 -722146 -655529 -749478 -752295 -509373 -217313 -178963 -363573 -457983 -357352 -308050
37565 -308050 -475062 -673021 -698883 -651388 -685207 -693552 -524797 -320257 -312611 -426132 -415612
37554 -415612 -315247 -400681 -725670 -1012818 -1021399 -762289 -356959 56405 302501 335609
37544 335609 397196 699725 988490 798893 179807 -260802 -166595 101773 19737 -426256
37534 -426256 -885566 -1178640 -1337742 -1267988 -746306 177926 999715 1143069 559758 -121812
37524 -121812 -194563 333153 746039 553078 108599 -1292 136187 10414 -359487 -418713
37514 -418713 -22176 342875 430298 593593 971822 1041044 458974 -241519 -360074 44864
37504 44864 473031 760472 961044 909120 577611 477725 948104 1364083 883606 -236389
37494 -236389 -948823 -920294 -775589 -817034 -532073 316186 1035468 972477 450508 173550
37484 173550 214681 173343 -44623 -187707 -188314 -236820 -414580 -596958 -649490 -503944 -181152
37473 -181152 85036 -39398 -541994 -954827 -930765 -715979 -782095 -1161863 -1427585 -1225363
37463 -1225363 -612211 46627 350594 143628 -336876 -688081 -774803 -761858 -705001 -433912
37453 -433912 46589 411740 493682 554788 803157 967723 714009 208840 -125757 -205249
37443 -205249 -219740 -165123 103558 448152 537184 356067 227926 296755 350621 211422
37433 211422 -26726 -217055 -326063 -311258 -110180 163939 269948 181316 156190 359532
37423 359532 614480 647772 422250 109159 -147303 -325599 -458299 -553834 -581323 -536169
37413 -536169 -518068 -640349 -803655 -720311 -312453 73345 68687 -233146 -467698 -562327
37403 -562327 -758524 -1097228 -1273642 -1114524 -868587 -834168 -936966 -884543 -585760 -229441
37393 -229441 -34594 -58320 -189959 -249939 -153334 -15088 -11573 -127730 -166124 -26979 165828
37382 165828 250562 187138 3500 -226212 -290476 40533 647379 995705 662049 -142620
37372 -142620 -752231 -717903 -171181 428568 733278 684690 437785 229064 247937 496753
37362 496753 745283 717959 401642 100686 74913 181969 67270 -297613 -535937 -439426
37352 -439426 -331399 -587808 -1005371 -1020738 -492957 103013 299164 129526 -75990 -110269
37342 -110269 -186 54736 -230813 -936839 -1631664 -1666226 -968835 -269288 -268946 -809151
37332 -809151 -1173224 -1043395 -766454 -700031 -705261 -461002 -13101 264600 183564 -39996
37322 -39996 -154817 -266446 -636251 -1150851 -1311734 -903940 -396887 -367836 -698964 -759912
37312 -759912 -342350 62688 31983 -215676 -281772 -224641 -328111 -493239 -335781 184742
37302 184742 655021 759309 600439 396543 158754 -184831 -559625 -817468 -937758 -1022183
37292 -1022183 -1132510 -1220052 -1205401 -1087768 -967114 -941744 -973968 -905782 -653155 -345605
37282 -345605 -216564 -367909 -666503 -854639 -776251 -546975 -463939 -647970 -826493 -641782
37272 -641782 -148092 228130 243948 86836 1455 -11900 17428 197846 477165 508277
37262 508277 163777 -101841 151126 600862 542045 -84331 -606852 -600233 -369173 -287968
37252 -287968 -212706 105098 445514 409083 36196 -296166 -470861 -705602 -1046862 -1185306
37242 -1185306 -916631 -519911 -459857 -813533 -1182963 -1182082 -858898 -538316 -346612 -99409
37232 -99409 297487 571534 416412 -34869 -344100 -334842 -238941 -251413 -244398 -46688 257229
37221 257229 492194 652527 792027 815234 609679 290453 93746 74361 94781 75459
37211 75459 71017 108412 122584 77028 14794 -34428 -85822 -121063 -90202 -23139 -38639 -192685
37199 -192685 -393011 -519223 -571785 -633505 -703742 -644844 -334946 147411 542500 632633
37189 632633 415227 44790 -326271 -597452 -702782 -673301 -673469 -817635 -952046 -796011
37179 -796011 -346782 37427 63428 -139472 -225309 -71430 154102 275162 256780 101025
37169 101025 -189689 -482477 -519776 -193702 252803 429584 215014 -111158 -181449 70779
37159 70779 388822 512465 421220 256023 128397 91385 196160 430932 638019 634686
37149 634686 423473 169364 -26298 -198368 -360416 -431481 -372813 -263291 -166944 -39320
37139 -39320 151771 303003 259960 -24662 -455651 -843679 -957773 -639636 37497 754044
37129 754044 1142829 1027380 539779 77493 45478 465805 879167 816969 337434 -125638
37119 -125638 -399272 -720061 -1185092 -1441745 -1170674 -605867 -267762 -329073 -526909 -613328
37109 -613328 -619247 -674474 -770550 -761361 -540090 -221852 -117211 -379861 -697894 -589952 -63794
37098 -63794 336500 276191 59021 63790 132150 -70737 -367607 -258440 310543 848946
37088 848946 985410 824944 636834 557130 618065 727093 615510 165297 -224054 -10749
37078 -10749 701906 1186259 1009598 512134 206959 125031 10161 -194485 -378023 -537507
37068 -537507 -715638 -817147 -737278 -562713 -456740 -444135 -437620 -356869 -137859 208199
37058 208199 476053 428270 162423 52129 198803 241735 -95350 -563152 -748180 -629821
37048 -629821 -494594 -486693 -516798 -463706 -238746 170748 517462 416251 -75543 -312615
37038 -312615 96169 587110 345013 -454420 -783007 -198080 533681 534424 -27082 -339049
37028 -339049 -135776 84079 -89428 -447498 -600445 -545677 -547778 -676571 -759297 -721297
37018 -721297 -685421 -680773 -520786 -149100 98162 -135389 -674135 -953027 -739219 -396107
37008 -396107 -324108 -452664 -489632 -403624 -368244 -402492 -382672 -327752 -371420 -461926 -356551
36997 -356551 29016 450888 586134 358462 1962 -138715 84459 447500 559616 308557
36987 308557 -14855 -111529 -19811 62393 100715 164558 217161 208938 236845 348108 319813
36976 319813 -55579 -549524 -692115 -373568 35992 166551 -10975 -308034 -509676 -434425
36966 -434425 -61183 374372 610735 656867 651317 533050 163693 -298119 -519864 -484846
36956 -484846 -482675 -591469 -568831 -323184 -82811 19125 120364 238931 127553 -254847
36946 -254847 -518387 -382602 -112421 -92752 -247488 -235453 -12747 166956 185074 156546
36936 156546 163183 168923 164912 174762 143191 -8520 -253571 -504898 -705344 -770906 -585880
36925 -585880 -199619 105682 100739 -146738 -426979 -628441 -695837 -548358 -229201 34677
36915 34677 120288 192775 398249 546096 344449 -175533 -701418 -984666 -934896 -538007
36905 -538007 38930 389023 228972 -226094 -514281 -495938 -407510 -410756 -401176 -281362 -140240
36894 -140240 -83485 -93119 -126481 -192989 -272833 -283972 -181623 -22419 77341 20230 -168226
36883 -168226 -287910 -157206 86869 85718 -230330 -475229 -346299 -78568 -77170 -305861
36873 -305861 -389004 -190054 65245 168173 101188 -111654 -412889 -606407 -532694 -307404
36863 -307404 -126918 58062 362532 590117 445631 71965 -53762 223684 580876 731771
36853 731771 688893 474851 29487 -473482 -644577 -399783 -119435 -126478 -332043 -534992
36843 -534992 -714239 -849677 -804184 -592367 -454830 -473201 -430682 -247259 -195044 -422898
36833 -422898 -609850 -415418 1883 250948 263374 245337 266416 245015 211759 253501 271170
36822 271170 90387 -220166 -383418 -258205 15329 177119 34517 -427487 -997535 -1371762
36812 -1371762 -1413870 -1192393 -773913 -216718 195156 64557 -569396 -1079878 -915972 -232221
36802 -232221 360145 488544 265999 25014 733 137627 112647 -239753 -505583 -92242
36792 -92242 837773 1355797 968072 289069 95707 253202 193929 12579 284297 1001798
36782 1001798 1501041 1444787 1185518 1067418 974670 709102 307264 -152260 -625397 -906392
36772 -906392 -782708 -447699 -333704 -490541 -567675 -435801 -333206 -339019 -223647 67711
36762 67711 290456 379774 541140 735735 630922 246121 80330 352136 662898 688431
36752 688431 639234 702656 608093 181802 -189133 -145419 36090 -71049 -351397 -461925
36742 -461925 -454717 -527026 -497124 -142153 211180 62735 -480174 -886113 -994577 -1042892
36732 -1042892 -1060081 -859457 -539027 -372332 -263341 77656 470658 437198 38127 -139948
36722 -139948 90223 282402 172593 34489 22048 -131053 -448035 -437343 86394 522901
36712 522901 334316 -156536 -366850 -371662 -581534 -887519 -852080 -531753 -385843 -455279
36702 -455279 -333635 23243 145205 -132901 -316320 -10078 453642 521951 215825 15999
36692 15999 139957 308373 190837 -196125 -569562 -685237 -517639 -235587 -47889 -47934
36682 -47934 -187800 -370968 -528009 -625426 -658191 -615674 -423994 -13637 466835 638133
36672 638133 295409 -241097 -423714 -118851 292726 462921 423271 308769 78058 -276638
36662 -276638 -520752 -475806 -342618 -415495 -604375 -578976 -317700 -144496 -199998 -240028
36652 -240028 -74061 115164 74294 -145680 -326673 -404592 -433299 -382102 -215683 -81972
36642 -81972 -169447 -402335 -491319 -295558 35015 279424 348881 268951 116190 -9011
36632 -9011 -74938 -177352 -373199 -496922 -335070 30734 283131 294408 242910 246178 171182
36621 171182 -38558 -132824 91354 408546 434560 155035 -109611 -188421 -197997 -214805 -126758
36610 -126758 115699 351971 412725 283914 15040 -331241 -580231 -534101 -268320 -112474
36600 -112474 -199004 -262724 -73914 160751 96335 -222252 -440696 -402743 -250278 -64650
36590 -64650 231061 571798 717325 659539 737803 1125149 1463557 1300029 709397 171973
36580 171973 -59342 -136936 -205976 -183743 -44516 -7984 -237845 -533984 -527662 -102212 509679
36569 509679 966915 1056549 792248 402986 157279 104245 64264 -59949 -108705 71075
36559 71075 332136 383346 150195 -191200 -441104 -451807 -100748 548545 1125016 1271177
36549 1271177 1065634 858078 722872 419974 -75366 -398405 -303293 -17427 108429 33582
36539 33582 -79914 -144316 -108046 101906 367721 357534 -34664 -464419 -608066 -588637
36529 -588637 -628926 -590591 -283498 36226 10974 -155438 15529 406025 395163 -94005
36519 -94005 -337406 110344 676506 558685 -162300 -697466 -606423 -214649 -57034 -274951
36509 -274951 -587097 -640259 -362641 -39484 27316 -84049 -82820 -27760 -324997 -1002307
36499 -1002307 -1430987 -1128885 -482572 -206805 -345805 -354741 -37764 192558 36156 -257828
36489 -257828 -361717 -351053 -453164 -603749 -536508 -177323 255230 483623 410305 192200
36479 192200 113589 298857 560016 642347 564999 533364 569007 490203 268634 117545 152074
36468 152074 237145 278931 382665 555265 533645 175645 -176359 -46961 520338 949966
36458 949966 804495 259672 -156109 -148276 110321 248628 89759 -233870 -479867 -527467
36448 -527467 -414493 -248724 -144571 -156126 -183573 -39810 280660 519827 500144 409630
36438 409630 513261 720831 768700 730084 911941 1242213 1258609 855580 552590 740452
36428 740452 1090543 1078433 731120 424363 235716 -6329 -231102 -205103 -5057 75518
36418 75518 36226 109290 231065 100375 -202323 -213150 151367 368229 102764 -249417
36408 -249417 -161582 268176 551135 504157 304207 63993 -225077 -452071 -492122 -505692
36398 -505692 -773772 -1233200 -1495557 -1371791 -1103323 -994075 -1035534 -1008274 -820888 -645148
36388 -645148 -734181 -1093235 -1335788 -1025183 -254739 322621 249799 -158122 -304061 -189767
36378 -189767 -339780 -876872 -1215135 -880586 -200069 170972 125765 123582 463851 923835
36368 923835 1143978 1088521 1001738 1045827 1109348 977866 653652 429206 558244 909852
36358 909852 1114322 1031400 838181 623906 233088 -305922 -540299 -155437 422654 441566
36348 441566 -197276 -810878 -863668 -603243 -557274 -744949 -739597 -353043 103739 254357
36338 254357 85320 -150933 -283699 -325823 -298423 -130380 189221 462017 453873 229739
36328 229739 126830 284148 383329 76575 -455669 -680981 -427314 -87161 -25591 -106422
36318 -106422 -5628 252671 346126 119012 -241821 -446403 -347997 -8056 333851 409952
36308 409952 177374 -128889 -282740 -298286 -284887 -256309 -253510 -449527 -861458 -1129256
36298 -1129256 -934632 -539795 -496159 -821186 -914845 -423735 236358 480342 345238 332576
36288 332576 646472 952247 859195 359897 -247862 -673990 -798175 -646989 -320174 42540
36278 42540 250174 121962 -303081 -652955 -527357 15456 457224 406614 21495 -269306
36268 -269306 -280513 -132739 38760 202193 325318 361402 325594 255723 150997 62814
36258 62814 131902 362213 475091 233434 -149377 -207977 139662 429268 248977 -199000
36248 -199000 -326669 123368 765044 1013875 746696 399118 390367 605540 620840 344527
36238 344527 127636 191452 287880 119752 -200708 -383204 -387909 -297140 -7252 526632
36228 526632 923584 769581 308111 193726 519567 648190 166819 -521112 -825217 -725860
36218 -725860 -560410 -432169 -232180 10705 183880 319594 461755 491567 376340 371490
36208 371490 636888 863498 677303 249813 69250 206339 275473 106521 -24716 73824
36198 73824 183011 54142 -215654 -391164 -430077 -417497 -371123 -286906 -223089 -199235 -157648
36187 -157648 -136249 -304349 -685002 -1012969 -1052369 -919832 -874892 -873797 -592619 68570
36177 68570 724523 894238 552983 131571 -21794 2803 -53845 -184733 -200749 -168271
36167 -168271 -395174 -864205 -1038412 -534180 242615 512984 82719 -486072 -639223 -391320
36157 -391320 -67782 134933 159001 -39029 -368441 -536622 -340445 60169 341015 421201
36147 421201 503621 731837 963010 942385 640445 336284 322567 560151 726689 624927
36137 624927 396775 255327 184669 67445 -58506 -97615 -113311 -192479 -226562 -126163
36127 -126163 -115527 -429679 -813949 -785429 -375892 -111484 -192362 -235426 4324 216379
36117 216379 124825 -24755 42925 106175 -126916 -437021 -448298 -279746 -319855 -569645
36107 -569645 -734814 -790561 -898165 -889410 -440556 263558 636977 526892 376804 451217
36097 451217 486293 326534 318560 679554 942938 551780 -260000 -702892 -462751 -39496
36087 -39496 -15167 -361426 -629332 -567544 -315451 -76264 158203 475014 783325 880889
36077 880889 766638 683420 755680 767266 469757 -31998 -422902 -606210 -735324 -871648
36067 -871648 -894775 -771361 -644176 -582536 -472773 -243845 -1581 153766 264711 382502
36057 382502 464629 493654 532820 571697 485690 261921 103605 164451 307216 291281 117189
36046 117189 7270 61709 106641 -34770 -222565 -119293 324442 674649 510970 28677
36036 28677 -185792 -16067 -28319 -593199 -1224784 -1239897 -759021 -464616 -534165 -497023
36026 -497023 -169239 -12947 -320434 -663579 -562505 -244412 -272849 -725329 -1192301 -1404337
36016 -1404337 -1438260 -1384535 -1165125 -694759 -28590 619793 920772 656322 40952 -381635
36006 -381635 -321228 -8621 265333 567414 1014092 1353049 1248787 807126 425452 239141
35996 239141 92429 -38878 -9034 132170 137566 -8785 -5920 305209 667882 725775 418907
35985 418907 -34699 -380571 -456484 -230946 164376 499750 608080 469757 175436 -129857
35975 -129857 -314834 -369010 -416995 -560224 -745186 -829900 -706617 -338593 185316 593710
35965 593710 628919 391804 268225 380918 377514 -21810 -531781 -677062 -471009 -351879
35955 -351879 -534357 -782612 -811887 -603072 -296675 -36709 44096 -105596 -369394 -591726
35945 -591726 -753342 -872214 -836777 -563161 -247474 -218520 -553669 -1010809 -1274931 -1116963
35935 -1116963 -466009 413657 938454 717393 26369 -475228 -462152 -160275 60230 34935
35925 34935 -194044 -451610 -515961 -341140 -149885 -132896 -166897 -20353 314646 706843
35915 706843 1112361 1483672 1679192 1728188 1930661 2414526 2903366 3219193 3607690 4240503
35905 4240503 5014055 6351317 9300014 13701450 16925687 16071175 11468681 6554336
35897 6554336 3991818 3296278 2699974 1786413 1236124 1142431 951324 556891 343430
35888 343430 392166 461920 502365 521994 278172 -255884 -493261 4229 711912 798641
35878 798641 281535 -189675 -387682 -562350 -681916 -456095 -26827 125006 -54411 -168821
35868 -168821 -65076 62477 171905 358918 455327 287968 201674 604289 1105573 922870
35858 922870 123632 -391787 -226661 65322 50241 34747 266806 349440 -26234 -421131
35848 -421131 -299335 144534 353727 225678 46260 -91503 -298302 -500885 -480140 -214429
35838 -214429 115213 375505 522179 515875 392462 311690 394322 605251 849214 1034414
35828 1034414 1043250 860320 710915 785932 850727 492943 -221655 -756050 -833247 -719499
35818 -719499 -667180 -558666 -301642 -98333 -38220 142863 563403 846980 658865 273562
35808 273562 190544 412465 519674 328830 100598 128872 400288 673995 754138 690899
35798 690899 732060 982472 1172543 982788 521839 150070 -105302 -498112 -926960 -927945
35788 -927945 -452006 -64612 -114264 -265790 -179855 -78416 -211140 -310199 -101407 120818
35778 120818 11369 -147634 82942 492476 547849 267372 98126 116749 27713 -174769
35768 -174769 -218899 -160260 -318136 -628902 -703411 -543837 -559146 -796229 -799482 -387763 31918
35757 31918 141249 159965 368447 661806 850624 979462 1063481 891994 402717 -59664
35747 -59664 -159019 -2182 91558 33478 -51700 -84072 -47766 88098 277936 354368 212316
35736 212316 -68028 -341916 -497094 -414397 -44398 438969 776695 928708 999682 904933
35726 904933 474542 -93679 -330689 -171455 -81692 -300345 -418146 -47527 493766 621106
35716 621106 332245 132133 250656 409079 351198 196658 178782 321267 484398 548437
35706 548437 471615 284809 73700 -93054 -193498 -171851 54355 405869 605781 507240
35696 507240 342645 428707 692372 735003 370436 -130219 -394903 -367976 -267550 -254073
35686 -254073 -279672 -230603 -100815 17384 56592 13859 -122677 -380622 -679913 -815438
35676 -815438 -691967 -489346 -418644 -388896 -164127 176353 261961 1703 -205402 -30979
35666 -30979 308843 426426 359860 413184 552121 426328 12689 -218120 43750 490279
35656 490279 672080 666915 900329 1409629 1695818 1396443 781714 368414 245300 63090
35646 63090 -380002 -848718 -1038145 -981038 -913296 -888696 -755933 -475656 -237022 -197918
35636 -197918 -265227 -242808 -114529 -48617 -118328 -139018 109949 534980 760582 600410
35626 600410 354129 444083 840821 1114152 1044864 863808 794737 713457 479363 283374
35616 283374 334107 436182 274205 -33259 -89284 125072 171380 -219271 -784902 -1077370
35606 -1077370 -904151 -399704 73296 92345 -449216 -1110430 -1336786 -1107575 -808366 -515360
35596 -515360 85960 982601 1592117 1514679 1079276 806823 705191 476077 118258 -98705
35586 -98705 -89108 -26859 -90902 -388886 -943226 -1488095 -1521279 -904620 -209715 -79634 -406769
35575 -406769 -560225 -308815 -44254 -97692 -304151 -364600 -266869 -173834 -161154 -228973 -372037
35564 -372037 -497272 -440624 -206269 -61995 -250218 -657259 -879234 -624850 -15505 536433
35554 536433 756679 763804 806934 819087 476083 -231236 -767347 -638884 -57503 253109
35544 253109 -131141 -921261 -1485665 -1454445 -954469 -387416 -28660 155663 271342 200207
35534 200207 -201685 -646588 -577931 35226 485922 245219 -267837 -285760 206500 528969
35524 528969 349471 77639 154965 475999 707481 779705 808230 792117 634657 331846
35514 331846 -11435 -268724 -338430 -207806 3853 156326 211995 161893 -39477 -287422
35504 -287422 -241713 269134 855276 933299 479326 72836 142043 481621 611207 342084
35494 342084 -127500 -476937 -522518 -341659 -164957 -62520 146787 526520 787961 717849
35484 717849 601755 781633 985057 674004 -16425 -357933 -132210 24420 -380890 -984302
35474 -984302 -1217040 -1128790 -1095920 -1123373 -951438 -601879 -354225 -330886 -464264 -717836
35464 -717836 -1015812 -1116121 -876446 -516486 -332801 -287819 -145365 132146 388202 535674
35454 535674 559362 388229 17589 -350105 -499458 -426443 -222637 66474 297848 204804
35444 204804 -241194 -677425 -802176 -722654 -602716 -304800 246188 666498 563654 154568
$$ [...]
##END NTUPLES=NMR SPECTRUM
##END=
