##TITLE=31Pdec_LR-723-R4-RM2
 CHCl2, 24 sc
 1.10.2024
##JCAMPDX= 6.0         $$ Bruker NMR JCAMP-DX V2.0
##DATA TYPE= NMR SPECTRUM
##DATA CLASS= NTUPLES
##ORIGIN= UXNMR, Bruker Analytische Messtechnik GmbH
##OWNER= root
$$ XWIN-NMR		Version 3.5
$$ Tue Oct  1 13:44:59 2024 Russian Standard Time (UT+4h)  she@DPX200
##.OBSERVE FREQUENCY= 81.013821
##.OBSERVE NUCLEUS= ^31P
##.ACQUISITION MODE= SIMULTANEOUS
##.ACQUISITION SCHEME= undefined
##.AVERAGES= 24
##.DIGITISER RES= 17
##SPECTROMETER/DATA SYSTEM= spect
##.PULSE SEQUENCE= zgpg30
##.SOLVENT NAME= CDCl3
##.SHIFT REFERENCE= (INTERNAL, CDCl3, 0, 198.062)
##AUDIT TRAIL= $$ (NUMBER, WHEN, WHO, WHERE, WHAT)
$$ ##TITLE= Audit trail, XWIN-NMR		Version 3.5
$$ ##JCAMPDX= 5.01
$$ ##ORIGIN= Bruker BioSpin GmbH
$$ ##OWNER= she
$$ F:/spectra/data/she/nmr/P31/2/pdata/1/auditp.txt
$$ ##AUDIT TRAIL=  $$ (NUMBER, WHEN, WHO, WHERE, WHAT)
(   1,<2024-10-01 13:43:10.87 +0400>,<she>,<DPX200>,
      <created by zg, POWCHK disabled, PULCHK disabled
       configuration hash MD5:
       00 E9 B6 7A A2 85 ED C7 34 08 36 98 17 FE 4E 26
       data hash MD5: 32K
       07 5F 92 D7 DA E5 07 38 24 9E FC 08 18 7A 2C 9E>)
(   2,<2024-10-01 13:43:16.75 +0400>,<she>,<DPX200>,
      <Start of raw data processing
       efp BC_mod = 2 LB = 1.5 FT_mod = 6 PKNL = 1 PHC0 = 2702.232 PHC1 = 68.08746 SI = 64K 
       data hash MD5: 64K
       54 91 F1 D7 DA A2 B8 10 0E 2B 5E 5B D3 E5 46 31>)
(   3,<2024-10-01 13:44:13.68 +0400>,<she>,<DPX200>,
      <pk PHC0 = 4.089262 PHC1 = 0 
       data hash MD5: 64K
       8D 27 78 8B E9 0F 73 B7 53 D8 D6 D7 21 86 20 5C>)
$$ ##END=
$$ 
$$ hash MD5
$$ FA F2 97 55 09 42 00 72 05 29 14 5F 72 3A 54 C3
##$RELAX= 
##$RELAX= 
##$RELAX= 
##$RELAX= 
##$RELAX= 
##$RELAX= 
##$RELAX= 
##$RELAX= 
$$ Bruker specific parameters
$$ --------------------------
##$DU= <F:/spectra>
##$EXPNO= 2
##$NAME= <P31>
##$PROCNO= 1
##$TYPE= <nmr>
##$USER= <she>
##$AMP= (0..31)
100 100 100 100 100 100 100 100 100 100 100 100 100 100 100 100 100 100 
100 100 100 100 100 100 100 100 100 100 100 100 100 100 
##$AQSEQ= 0
##$AQ_mod= 1
##$AUNM= <au_zg>
##$AUTOPOS= <>
##$BF1= 81.014009
##$BF2= 200.13
##$BF3= 200.13
##$BF4= 200.13
##$BF5= 200.13
##$BF6= 200.13
##$BF7= 200.13
##$BF8= 200.13
##$BYTORDA= 1
##$CFDGTYP= 0
##$CFRGTYP= 5
##$CHEMSTR= <none>
##$CNST= (0..31)
1 1 145 1 1 1 1 1 1 1 1 1 1 1 1 1 1 1 1 1 1 1 1 1 1 1 1 1 1 1 1 1 
##$CPDPRG= <waltz16>
##$CPDPRG1= <>
##$CPDPRG2= <waltz16>
##$CPDPRG3= <>
##$CPDPRG4= <mlev>
##$CPDPRG5= <mlev>
##$CPDPRG6= <mlev>
##$CPDPRG7= <mlev>
##$CPDPRG8= <mlev>
##$CPDPRGB= <>
##$CPDPRGT= <>
##$D= (0..31)
0 1 0 0 0 0 0 0 0 0.06 0 0.03 2e-05 3e-06 0 0 0.0002 0 0 0 0 0 0 0 0 0 
0 0 0 0 0 0 
##$DATE= 1727775790
##$DBL= (0..7)
120 120 120 11 120 120 24 19 
##$DBP= (0..7)
150 150 150 150 150 150 150 150 
##$DBP07= 0
##$DBPNAM0= <>
##$DBPNAM1= <>
##$DBPNAM2= <>
##$DBPNAM3= <>
##$DBPNAM4= <>
##$DBPNAM5= <>
##$DBPNAM6= <>
##$DBPNAM7= <>
##$DBPOAL= (0..7)
0.5 0.5 0.5 0.5 0.5 0.5 0.5 0.5 
##$DBPOFFS= (0..7)
$$ [...]
##$SUBNAM2= <"">
##$SUBNAM3= <"">
##$SUBNAM4= <"">
##$SUBNAM5= <"">
##$SUBNAM6= <"">
##$SUBNAM7= <"">
##$SUBNAM8= <"">
##$SUBNAM9= <"">
##$SW= 400.765351723535
##$SWIBOX= (0..15)
0 1 3 0 0 0 0 0 0 0 0 0 0 0 0 0 
##$SW_h= 32467.5324675325
##$TD= 32768
##$TD0= 1
##$TE= 0
##$TE2= 300
##$TE3= 300
##$TEG= 300
##$TL= (0..7)
0 120 53 12 22 120 120 120 
##$TP= (0..7)
150 150 150 150 150 150 150 150 
##$TP07= 0
##$TPNAME0= <>
##$TPNAME1= <>
##$TPNAME2= <>
##$TPNAME3= <>
##$TPNAME4= <>
##$TPNAME5= <>
##$TPNAME6= <>
##$TPNAME7= <>
##$TPOAL= (0..7)
0.5 0.5 0.5 0.5 0.5 0.5 0.5 0.5 
##$TPOFFS= (0..7)
0 0 0 0 0 0 0 0 
##$TUNHIN= 0
##$TUNHOUT= 0
##$TUNXOUT= 0
##$USERA1= <user>
##$USERA2= <user>
##$USERA3= <user>
##$USERA4= <user>
##$USERA5= <user>
##$V9= 5
##$VALIST= <valist>
##$VCLIST= <CCCCCCCCCCCCCCC>
##$VD= 0
##$VDLIST= <DDDDDDDDDDDDDDD>
##$VPLIST= <PPPPPPPPPPPPPPP>
##$VTLIST= <TTTTTTTTTTTTTTT>
##$WBST= 1024
##$WBSW= 4
##$XGAIN= (0..3)
0 0 0 0 
##$XL= 0
##$YL= 0
##$YMAX_a= 57646
##$YMIN_a= -51067
##$ZGOPTNS= <>
##$ZL1= 120
##$ZL2= 120
##$ZL3= 120
##$ZL4= 120
##$ABSF1= 0
##$ABSF2= 0
##$ABSG= 0
##$ABSL= 0
##$ALPHA= 0
##$AQORDER= 0
##$ASSFAC= 0
##$ASSFACI= 0
##$ASSFACX= 0
##$ASSWID= 0
##$AUNMP= <proc_1d>
##$AZFE= 0.1
##$AZFW= 0.5
##$BCFW= 0
##$BC_mod= 2
##$BYTORDP= 0
##$COROFFS= 0
##$CY= -3
##$DATMOD= 1
##$DC= 0
##$DFILT= <>
##$DTYPP= 0
##$F1P= 0
##$F2P= 0
##$FCOR= 1
##$FTSIZE= 65536
##$FT_mod= 6
##$GAMMA= 0
##$GB= 0
##$INTBC= 1
##$INTSCL= 9.790993e-09
##$ISEN= 30
##$LB= 1.5
##$LEV0= 0
##$LPBIN= 0
##$MAXI= 10000
##$MC2= 0
##$MEAN= 0
##$ME_mod= 0
##$MI= 50
##$NCOEF= 0
##$NC_proc= -2
##$NLEV= 6
##$NOISF1= 182.463
##$NOISF2= 159.3651
##$NSP= 0
##$NTH_PI= 0
##$NZP= 0
##$OFFSET= 198.0616
##$PC= 4
##$PHC0= 2706.321
##$PHC1= 68.08746
##$PH_mod= 1
##$PKNL= yes
##$PPARMOD= 0
##$PSCAL= 0
##$PSIGN= 0
##$REVERSE= no
##$SF= 81.0140089999434
##$SI= 65536
##$SIGF1= 159.3651
##$SIGF2= -187.1042
##$SINO= 113.3802
##$SIOLD= 16384
##$SREGLST= <1H.CDCl3>
##$SSB= 0
##$STSI= 65536
##$STSR= 0
##$SW_p= 32467.5324675325
##$SYMM= 0
##$S_DEV= 0
##$TDeff= 32768
##$TDoff= 0
##$TI= <>
##$TILT= no
##$TM1= 0
##$TM2= 0
##$TOPLEV= 0
##$USERP1= <user>
##$USERP2= <user>
##$USERP3= <user>
##$USERP4= <user>
##$USERP5= <user>
##$WDW= 1
##$XDIM= 65536
##$YMAX_p= 282441494
##$YMIN_p= -629916
$$ End of Bruker specific parameters
$$ ---------------------------------
##NTUPLES= NMR SPECTRUM
##VAR_NAME=  FREQUENCY,     SPECTRUM/REAL,   SPECTRUM/IMAG
##SYMBOL=    X,             R,               I
##VAR_TYPE=  INDEPENDENT,   DEPENDENT,       DEPENDENT
##VAR_FORM=  AFFN,          ASDF,            ASDF
##VAR_DIM=   65536,         65536,           65536
##UNITS=     HZ,            ARBITRARY UNITS, ARBITRARY UNITS
##FACTOR=    0.49542278885378, 1,            1
##FIRST=     16045.7642231865, 0,            0
##LAST=      -16421.768244346, 0,            0
##MIN=       -16421.768244346, -629916,      0
##MAX=       16045.7642231865, 282441494,    0
$$ Real data points
##PAGE= N=1
##DATA TABLE= (X++(R..R)), XYDATA
$$ [...]
40902f838j5152j295m055j6189j4823J166J3938J6580J5255R725l307j3470p628
40889b6093O657J1141O349Q242J7290J3969j1356m1560n1363l3409m293J0827
40877i3599K949r718m501J2975J6743K258o445R51L405j0645j8175j715J7049
40864h8468J4667P616J9806L4070J9162j3339k4395q153P276J2314K3841M1580
40852D5977M0264J2007j9329l3266l2563k4439j0814j20j228l828Q642K7257K6653
40839C5213M535j6952k7341l4009l3504j1817K2575L9598K9117J2067L733m290
40827A8925j8069k6753k4121j8658j2804L085K6598L6493K0738p296k7169k8716
40815e7747r899K1324M1208K8992n173l0634l3719k4069r121J0141K1793J2862
$$ y = [-6838, -21990, -23285, -27340, -43529, -58352, -57186, -43248, -26668, -11413, -1688, -4995, -18465, -26093, -19436, -8295, -1946, 6296, 23586, 37555, 26199, -15361, -66724, -100133, -104426, -93599, -90650, -100368, -104869, -91894, -75151, -72893, -79338, -78387, -74982, -85627, -103802, -105517, -88468, -73801, -66185, -46379, -12309, 6853, -6486, -30881, -39034, -31758, -19444, 4397, 45977, 86241, 98248, 78919, 45653, 13090, -11349, -22163, -22283, -23511, -27339, -18697, 8560, 35213, 39748, 22796, -4545, -38554, -72058, -83875, -61300, -21702, 7415, 19482, 23215, 18925, 856, -25897, -50018, -68676, -81480, -78395, -51797, -15304, 5434, -1862, -29031, -57747, -67646, -46322, -5114, 23878, 18705, -11929, -45648, -69717, -78838, -68697, -46904, -34042]
40803c4042l590k715J0951J0238o503j2413j474Q47j2849j3992J1716L4760K6876
40790G810L252o884m785q747j6703j1608O876J9826J4140l616j4677m490K0364
40777G58L2678J5714r840j0162J3913K8624J5655r415k7669l5113k8176m190J8161
40764I38J2677j3505k6755j9918j9381l2496l3592j6878j5090m2286o3959n2733
40752c22978k9991j9194j755L9216P0636N4194J0202j2855r449q043j0705M294
40740b36428K9871L3583J2625k535j813o632k0553j4786K0338M8550L6384R28
40728a00468j6190l533J5484K1395J8208J5295Q568j1416l9124n1791l1928J1205
40716a64295M8572N8838M3363J7041n035j2638n605K982J70q696p208P060K0114
$$ y = [-34042, -37632, -40347, -29396, -19158, -25661, -38074, -39548, -38701, -51550, -65542, -53826, -19066, 7810, 11062, 4178, -607, -9354, -26057, -37665, -30789, -10963, 3177, -439, -15116, -19606, 758, 33436, 49150, 39310, 29148, 43061, 71685, 87340, 77925, 50256, 15143, -13033, -17223, 938, 13615, 110, -26645, -46563, -65944, -98440, -132032, -148910, -164000, -206286, -270245, -322978, -352969, -372163, -373918, -334702, -264066, -209872, -199670, -212525, -221974, -230017, -240722, -236428, -206557, -172974, -160349, -162884, -164697, -171329, -191882, -206668, -186330, -137780, -101396, -100468, -116658, -120191, -104707, -83312, -65104, -49809, -41241, -52657, -91781, -143572, -175500, -164295, -115723, -56885, -13522, 3519, -1516, -14154, -19759, -16777, -16607, -25303, -32511, -25451, -5337]
40703e337K3420J9411N806k0940m3525l4273K169K4991J0836j5389k0670q059
40691f1560J333O081J6442K5686J7211q673l5256m7574l6233P68M3684N6962K9315
40678H186q716k5405k5657k7618k5998q557J1198J2324L318N910J3523L254j7591
40665h1829j6896R442K8491K1988J2223K1731L6108K7713k521k7995l1930k2691
40653b6166j6778j9487k4016k1739r434R675K6185K7132P800j5798j8694k80R317
40640g2283p323k2515k597L4355L9391P093j6144m902J1429M547q688m460O383
40627c5714O907Q787K3107K8021L869k5902k8228j1881n761o860O974K7414K2611
40614A3344j2599m9413o2547m6616p225L5022M7138K2145j536Q480K8487J8312
$$ y = [-5337, 18083, 37494, 43300, 22360, -21165, -55438, -53269, -28278, -17442, -32831, -53501, -61560, -60227, -54146, -37704, -12018, 5193, -3480, -38736, -86310, -122543, -121775, -78091, -21129, 8186, -530, -25935, -51592, -79210, -105208, -113765, -102567, -90243, -86925, -81015, -67492, -64238, -81829, -98725, -89283, -60792, -38804, -26581, -4850, 31258, 58971, 56450, 28455, -3475, -26166, -42944, -62431, -86447, -108186, -117620, -107945, -81760, -54628, -46828, -62626, -81320, -81600, -72283, -79606, -102121, -104718, -70363, -30972, -23879, -40023, -44925, -33496, -28949, -37637, -42097, -35714, -28807, -20020, 3087, 31108, 34977, 9075, -19153, -31034, -36795, -43655, -36681, -9267, 13344, 745, -48668, -111215, -157831, -165056, -130034, -82896, -60751, -62287, -53807, -25320, -7008]
40602g008j1244j7842K041J4137Q266O105J0581N27k1276k5015o182N122l866
40589d5654j0662j272R342J1003J3250J6186M934j5681j8579J334J5876P982o993
40576a8934j3954j6470j3422M639K5325K0229o432j5979L074J5110r84j4965J637
40563c1126K6371K4807O044J995J5789K6560K7759K8401K9941K8852K9017K8386
40551B42796R945k9171n6612m2097l847J2197o800k8906k5773o917M80j2049k8223
40538B5023l0159j9620j4097k2795l3109k7488o807J4352K8294L3631K1659j2749
40526d3865m7822m8681j0913L0307M0812K0016q965k2069o405K8284M8745L1376
40514A0820l901j7313l611Q186O382P741J2884k917l8322n0555j8409J8196J5085
$$ y = [-7008, -18252, -36094, -34053, -19916, -11650, -5545, 5036, 5563, -15713, -40728, -46910, -41788, -45654, -56316, -57588, -48246, -37243, -23993, -7807, -2873, -18554, -37133, -35799, -19923, -11941, -18934, -32888, -49358, -62780, -58141, -32816, -12587, -19019, -34998, -31924, -16814, -17798, -32763, -31126, -4755, 20052, 26096, 28091, 43880, 70440, 98199, 126600, 156541, 185393, 214410, 242796, 252741, 223570, 166958, 124861, 121014, 133211, 126411, 97505, 71732, 64815, 65295, 53246, 25023, -5136, -24756, -38853, -61648, -94757, -122245, -129052, -114700, -86406, -52775, -31116, -43865, -91687, -140368, -151281, -120974, -80162, -60146, -69111, -91180, -97585, -69301, -20556, 10820, 6919, -10394, -14005, -5819, 563, 8304, 21188, 18271, -20051, -70606, -89015, -70819, -55734]
40501e5734j1069j2555J6256L5228J8748j3736k7671j2277J2184J6719l481j8293
40489e5681Q43L5851L9975M149k8693k7538j3882j6642k3497j0007J1997J3710
40477f9415j977q382N57P769O340M062Q51r233j7368q168J3151K5218K0940J2840
40463b2815R496O194j128r619j7416k3953k3372j0078R912K3160K3427J5696Q625
40450a1871P217Q635M190p501j2316J185J9264J8479J711o478j402m272j9937
40437c096k3313l686J0583n179l1567l3049n726K6151M3035L9137J7424n168o770
40424A8776P803O569k1440m4430l5260j1203k11K911J4315K2888J2259j450N310
40411b3163J8132O589k0455k5091o94J9125J2862m056j1367r334m530M360J7320
$$ y = [-55734, -66803, -79358, -63102, -27874, -9126, -22862, -50533, -62810, -50626, -33907, -37388, -55681, -54838, -18987, 20988, 25137, -3556, -31094, -44976, -61618, -85115, -95122, -83125, -69415, -71392, -79774, -79217, -71448, -65108, -61046, -60195, -69428, -86796, -94964, -81813, -56595, -35655, -22815, -13319, -7125, -8253, -17872, -35288, -59241, -82613, -92691, -82779, -59619, -36192, -20496, -11871, -4654, 3981, 8171, 670, -11646, -10461, 8803, 27282, 28993, 22515, 21113, 16841, -3096, -26409, -30095, -19512, -24691, -56258, -89307, -95033, -68882, -25847, 13290, 30714, 25546, 18776, 26579, 33148, 11708, -32722, -67982, -79185, -79396, -76485, -62170, -39282, -27023, -28473, -23163, -5031, 1558, -18897, -43988, -44682, -25557, -12695, -16751, -28118, -37452, -41982, -37622, -20302]
40398b0302K5791K0575q63l1137n0111l7596K4L0277L3594K3716J7107P380j0795
40385G660j9989q440N059L190J155J3615J7984r251m2663l9514m961J9455J9922
40372c6778J6519J4083m611l6654n3155m0224j2395J4492L3122L3248J3304l647
40360f2696J757J1992K573j1560k864J2632r40l0771l0376M03J3573m104j1674
40347a12055P992J5616j2633l8990k4772J0618K8508K8609K9693K6437N943j6009
40335e1043j2868J2126L1827L0673J3591q074k1940j7993m86J4413J9550K0454
40323C0230J6153o79k0335k0076LJ1850K89j6568j7657n013R264J7816J4244L60
40309A9881j736K3300M6036K3559k7954m3271m267K9028R029l1734m0383k2355
$$ y = [-20302, 5489, 26064, 25201, -5936, -56047, -93643, -93619, -63342, -29748, -6032, 11075, 18455, 7660, -12329, -20769, -15710, -12520, -11365, 2250, 20234, 10983, -31680, -71194, -76155, -56700, -36778, -20259, -6176, -10787, -47441, -100596, -140820, -153215, -138723, -105601, -72353, -59049, -62696, -60939, -48947, -46374, -57934, -60798, -48166, -49106, -79877, -110253, -109850, -96277, -100381, -112055, -104063, -88447, -101080, -140070, -164842, -154224, -125716, -97107, -67414, -40977, -35034, -51043, -63911, -51785, -19958, 10715, 24306, 16232, -5708, -23701, -24187, -9774, 9776, 30230, 46383, 45704, 25369, 5293, 5296, 17146, 17435, 867, -16790, -21803, -12539, 5277, 19521, 19881, 18145, 41445, 87481, 111040, 83086, 39815, 35548, 64576, 73605, 41871, 1488, -20867]
40297b0867j3832j5105m215J0555M535j4173j7280n741k888q440k090J4015J7410
40284e8116O181m60p0p928k0630j6678K375P989q881k0493n711J6952J7385n283
40270i3368k7348l2079k0636j267J7231K5346J8164J603j2465j6944j1830J669
40258a51924K1848L9122L6682R535k0489k4566m564Q375J446J111K5146L9941
40246a8337M972n3825o4400p025N3893N3803N046l4028l5022j5172R60N289J672
40233a02174p23N013J2193P254o639j0322J076J0788J0790J2914J8984J0695j4046
40220d4197k6207r821Q629K270j2431o214J2770J6095M957M049J5405J6105j95
40207a8785j2263m681J3079K4107K1552Q227n779p901J063K322j5803l7339l8929
$$ y = [-20867, -34699, -49804, -54019, -43464, -38929, -53102, -70382, -76123, -79011, -87451, -89541, -75526, -58116, -51935, -52395, -52465, -60393, -81023, -97701, -95326, -87337, -96218, -116711, -122422, -105470, -88085, -93368, -120716, -152795, -173431, -174698, -157467, -132121, -113957, -112354, -124819, -141763, -153593, -151924, -130076, -90954, -54272, -44737, -65226, -89792, -94356, -85981, -84535, -83424, -58278, -18337, -13365, -67190, -131590, -138615, -84722, -30919, -25873, -59901, -94923, -110095, -109135, -103846, -102174, -102897, -97884, -85691, -78437, -85076, -95398, -94322, -83534, -72744, -59830, -40846, -30151, -44197, -70404, -80225, -71596, -69326, -81757, -87971, -75201, -59106, -54149, -50100, -34695, -18590, -18785, -31048, -35729, -22650, 1457, 23009, 31236, 25457, 17556, 18619, 20941, 5138, -32201, -71130]
40194g1130k1001k393N975N188k509r966j756K4744M4353L1642l638k8468k7275
40181e6234j1977J485P005M016k482j585R271J6019P183p730j2971q828m125J563
40167e9390J1060J6136Q863k997p573n426j109P405J6475J2018n728j2554L716
40154a9104J8681P722j4059j7506n586p97l016L681J4560J1942N36j791m28j2542
40140a7707k5591j0166K5984M0319J8202p768j1027l683j116P062K7231L4716
40128G6456N775m2655p1079o3087l2551K615L1774M2934K5868j0900l9639l8913
40116a13402j6107K294L186J270J4327L3434L5057J8895R110J3429R474j4384
40104c417l3205k3646k972j15p699J739K4051K6203j487k9656k9948m756K5389
$$ y = [-71130, -92131, -94524, -88549, -83361, -85870, -95836, -97592, -72848, -28495, 3147, -491, -28959, -56234, -68211, -66726, -59721, -55705, -58187, -59772, -50501, -34482, -27299, -35029, -48000, -56828, -60953, -59390, -48330, -32194, -23331, -26328, -33901, -39327, -40436, -33031, -16556, -4538, -10266, -22820, -19104, -423, 7299, -6760, -24266, -29852, -30649, -33665, -29984, -15424, -3482, -2946, -4737, -5165, -17707, -43298, -53464, -27480, 12839, 31041, 23273, 12246, 8563, 7447, 14509, 41740, 76456, 82231, 39576, -31503, -94590, -127141, -124526, -92752, -49818, -23950, -34850, -74489, -113402, -129509, -127215, -124029, -122759, -108432, -74998, -39941, -21046, -11936, 1493, 10967, -3417, -36622, -60268, -63240, -63355, -71054, -69315, -45264, -19061, -20548, -50204, -80152, -84908, -59519]
40091e9519M0860K8766o706l7348l5293o959J4529J0458p227j8771j7569q906
40079a03685l133q450j9131j8159k466Q627N095P040L1039N5106M7427J5532n968
40066H874o133l151p791j4982k5101l9670m1182j1851L0694M9692L8113J8816
40054c672J944k0452m0469l6072j0787N198l36q881o817q03O032J9786L2779K6990
40040c5560N663p927n787o53J989O067L731j2942k5224j2474M012j1072m0851
40027a31028l3329J3618M3874K9936P885P959J0368l438j1372M434K1800K0681
40015a8612J7069K2904J6621j2253l2360k0713k204j964j150J8155K7332Q35k6235
40002a2575p101L7783M8839J6101j6044k1353j5905j5018j4515j4994k3214k8475
$$ y = [-59519, -18659, 10107, 3401, -33947, -69240, -76199, -61670, -51212, -58439, -77210, -94779, -103685, -106818, -115268, -134399, -152558, -155024, -146397, -141302, -134262, -103223, -48117, -690, 14842, 8874, 2741, -410, -8201, -23183, -48284, -87954, -129136, -140987, -110293, -60601, -22488, -3672, -1728, -22180, -62649, -98721, -109508, -104310, -104646, -113527, -120344, -121147, -115115, -95329, -62550, -35560, -29897, -37824, -43611, -44264, -42275, -36208, -32477, -45419, -70643, -83117, -79105, -90177, -131028, -164357, -150739, -106865, -76929, -69044, -61085, -50717, -54155, -65527, -61093, -39293, -18612, -1543, 21361, 37982, 25729, -6631, -27344, -29548, -31512, -32662, -14507, 12825, 13660, -12575, -19676, 18107, 66946, 83047, 67003, 45650, 29745, 14727, 212, -14782, -37996, -66471]
39990f6471j3843J0132J7389R313J0157K0794J4602j5336l9052l0180J980K9886
39978e0629L6584K1086n533k2985j6573N249J9651J6710O513P16P23M022R122
39965B4656J2077P721l122j2826j4334q449n452j6034l4194l6115r974K0122K0940
39952e4984l212j6550m178J1469J0903K538j819n127o703L803K0601K0505J312
39939b1442j0398l543J032n306O94K6269L6994J0944j9479j6606M859Q467n024
39926G461r580j14J1733K4358L2095J0840m2121p9919o1262j0400K1516K9370
39914f6023L8965M3864J6961k7896m5610k8030r375n257K450J9076K5945K0081
39902a4849J8586J8671o49l0736l3914l238K1122R902j8100l1340k4775r956M448
$$ y = [-66471, -80314, -70182, -52793, -43480, -33323, -12529, 2073, -13263, -52315, -82495, -80515, -50629, -14045, 7041, 1508, -21477, -38050, -32801, -13150, 3560, 10073, 10789, 11512, 15534, 24656, 36733, 44454, 41332, 28506, 14172, 5723, 271, -15763, -49957, -86072, -96046, -75924, -54984, -58196, -74746, -78924, -67455, -56552, -54014, -55833, -60960, -67663, -63860, -43259, -22754, -21442, -31840, -35383, -34351, -39657, -38963, -12694, 24300, 35244, 15765, -841, 4018, 12485, 7461, -2119, -2233, 9500, 33858, 65953, 76793, 34672, -45247, -106509, -116909, -95393, -66023, -27058, 16806, 33767, 5871, -39739, -67769, -77144, -82401, -79951, -60875, -34930, -14849, 3737, 22408, 21759, -8977, -42891, -46129, -25007, -15105, -33205, -64545, -89320, -99276, -94828]
39889i4828R538p23j3648p772J6182L6071L9525L0426R448k2035m3838l6464j4740
39876i2858o931o887J0840L3405J9452k7621n0293j8874K5098L1746P956q304
39864h3271m295O675J5089J8472J3067K504j292J697j580r394k829J7008J9294
39851h855j0520m1821l7822k536L1455M3885L6637J9108K588k489K043L060l956
39838C0777q973o048j303J700N322L671j1671k7656j9040R791K1718o7k4029j5808
39824d1616J1228J6324j0467l4558k0897K1748M6317K0139l0041m3062l118L2203
39812c5800J0932l3991l1670J7809M2766R363l2756l2745p348L769J933J0069
39800g7669K6074L3116K9423J7982o078l2201l0439J745K3048R255o518Q697K8062
$$ y = [-94828, -85290, -86013, -99661, -107433, -91251, -55180, -15655, 14771, 24219, 2184, -41654, -78118, -92858, -99789, -106676, -95836, -62431, -42979, -70600, -120893, -139767, -114669, -82923, -74967, -83271, -87566, -80891, -65802, -47330, -34263, -31759, -33051, -31354, -32934, -42328, -45157, -28149, -8855, -19375, -61196, -99018, -101554, -70099, -26214, 10423, 29531, 32119, 29630, 31673, 34733, 30777, 21804, 15756, 14453, 16153, 21475, 25146, 13475, -14181, -33221, -23430, -1712, -1779, -25808, -41616, -30388, -14064, -24531, -59089, -79986, -58238, -11921, 8218, -21823, -64885, -68003, -35800, -24868, -58859, -90529, -72720, -29954, -20591, -53347, -86092, -93440, -89671, -87738, -77669, -51595, -18479, 10944, 28926, 22848, -9353, -39792, -38047, -14999, -5744, -12262, -3565, 24497]
39787B4497R772l0287m3855k4854m273J0296L1700M2690J2498l6657m3492O70
39775e1295L3422J4268j9589k0290k018m617k2258j8810N753J4807l506j8954
39763i3087r955O255R153R291K3723L8761K6994p531l0294k3049l358Q508J6103
39750b8486K6842K9434J3129p190r876L25K625n104q428o834j2834k2729j8555
39737d7681j057R231P377R345J6577R988j0225j5645K486J3598N24n294K3225
39724A2449N2198L0153k9743o1982m0385q092n745j5055O10L2655M0369J2927
39712B0359j7264k2993j3373p200k238Q963J2833n704k6922j4893K5155M4889
39700A612K1218j0063j1509J150m304j6759m977K0550K1463k238j2909n74N645
$$ y = [24497, 34269, 3982, -39873, -64727, -69000, -58704, -27004, 15686, 28184, -8473, -51965, -51295, -17873, -3605, -23194, -43484, -45502, -50119, -72377, -91187, -85434, -70627, -74133, -93087, -103042, -96787, -87634, -78343, -54620, -15859, 11135, 3604, -26690, -49739, -53097, -44589, -28486, -1644, 27790, 40919, 33729, 23853, 24178, 26803, 21699, 13271, 6437, -6397, -29126, -47681, -48738, -39507, -32130, -22785, -6208, 3780, -6445, -22090, -19604, -6006, -5482, -10776, 12449, 64647, 94800, 65057, 3075, -37310, -45402, -51147, -66202, -65592, -32937, 7432, 20359, 3095, -19898, -33271, -40471, -42709, -33746, -20913, -26617, -53539, -68432, -43277, 1612, 22830, 12767, 1258, 2408, -1896, -18655, -23632, -3082, 18381, 16143, 3234, 2660, 8305]
39687H305l633k173J5420J4848j7247m1841k6584M320J1747q26m770O799K1704
39674a3931L4520M0112K3451j5561m7025m6937k8672j5871q027J267r65k0840
39662i8479k9992l272L2848L1463l558j9578R426M6785M4957P337j9579m931L0681
39649B4108M0801Q562l4192m9032l7318k5549j7719M408L5838M2280J0721k7360
39637b4452l8423k4287l741J4369K5329K3493J6478J8211K0067P51k9316l4105
39625c5626j1179K170n221q38K2769K2733j7002m3429j4735L1498M1312K4853
39613A7305J7551J0074j7691l5847j0695K2306Q531k8636k0933L0299N4803K5233
39601G2300r940j1832J604O398P274O033q893k5908j4854J6875K1546j8754o2497
$$ y = [8305, 4672, 2499, 17919, 32767, 15520, -26321, -52905, -48585, -36838, -37664, -42434, -35635, -13931, 20589, 60701, 84152, 68591, 21566, -25371, -54043, -69914, -77941, -76674, -77639, -98479, -128471, -131743, -98895, -67432, -70990, -90568, -81142, -34357, 10600, 17937, -1642, -6573, 24108, 64909, 73471, 39279, -9753, -47071, -72620, -90339, -85931, -50093, -7813, 2908, -24452, -62875, -87162, -90903, -76534, -51205, -27712, -11234, 6977, 27044, 27795, -1521, -35626, -46805, -44635, -49856, -50694, -27925, -5192, -22194, -65623, -80358, -48860, -7548, 17305, 34856, 44930, 27239, -8608, -19303, 3003, 11534, -17102, -38035, -7736, 47067, 72300, 62360, 50528, 52132, 58530, 65804, 71837, 62944, 37036, 22182, 39057, 60603, 41849, -20648]
39588b0648o5566l0088J5405M7930N2021K5481o617j4313k958o98r803q807Q52
39575a7809m510k1944k0126O387K4901J6361l08n568m812p950j4782k4132k8852
39562a03144r140L4462N6160J9873l5098m0736k627J1700j5492k8060M129L8189
39550f9784L7619K7751L5417L6282N509l0998m0016l2328l0241k3644K071L0006
39538e2356M0729M3875M7704L2986p702l9944l4157r976K234J0586L2009M5664
39526A11652K3346j6161k9975j4173j528n965r075R07J0388L631j7297l7077l9178
39513b0505j8076J1957K9070K9079K4585J8672K566j8294k4887j7399j6103k2190
39501b1525j2900J3826K7925J5365o0R98Q246J4626L0505M5758K6786k1874m3925
$$ y = [-20648, -86214, -116302, -100897, -52967, -946, 24535, 17918, 3605, 647, -51, -9854, -18661, -17809, -22319, -44263, -64389, -58002, -33101, -16740, -17048, -22616, -27428, -35378, -50160, -74292, -103144, -112284, -77822, -21662, -1789, -36887, -77623, -80250, -68550, -84042, -112102, -107973, -69784, -32165, -4414, 31003, 67285, 72794, 41796, 1780, -30548, -60789, -84433, -82362, -52356, -11627, 32248, 79952, 112938, 105236, 65292, 31135, 21159, 23393, 33979, 65988, 111652, 134998, 118837, 88862, 74689, 73161, 67196, 58121, 59028, 69416, 73047, 55750, 18673, -20505, -38581, -26624, 2446, 31525, 56110, 74782, 77348, 59054, 34167, 16768, 665, -21525, -34425, -20599, 7326, 22691, 22631, 23629, 31875, 46501, 77006, 122764, 149550, 127676, 83751]
39488H3751j3696J8991R075r846J2396N0346M0998j2615m5637k8680K268J2718
39476A20069J0644J2840J5889J3233Q890M738l249j3697k3102l4979m7069m0839
39464B3368p189K8660L3669R423j5541k5743k7217k6160k3677k4409k9194k7016
39452a11026j1849L161M394k264m338K16J0843K8105L8041K0558j2707k2462j169
39439f0497J1074o613j9229p4J6798m103l1902j9591J3167J3470j3346j5239J6727
39426i9358L8385K8761J2877O438k876j3504n511J3143Q092k2511l8644j9725
39414i4433R312K3465K5280J7325p296l4038l1344j152J7797J2341J4922M0719
39402g102N1713J5715l6105m8439j4732K2611K8950O487k1699l3238j9403O855
$$ y = [83751, 70055, 89046, 98121, 88275, 100671, 151017, 192015, 179400, 133763, 105083, 107351, 120069, 130713, 143553, 159442, 172675, 181565, 186303, 183054, 169357, 146255, 111276, 64207, 23368, 16179, 44839, 78508, 87931, 72390, 46647, 19430, -6730, -30407, -54816, -84010, -111026, -122875, -119714, -115320, -117584, -121922, -121706, -110863, -82758, -44717, -24159, -36866, -59328, -60497, -49423, -56036, -75265, -75339, -58541, -62644, -94546, -114137, -100970, -87500, -100846, -116085, -99358, -60973, -32212, -19335, -12897, -15773, -29277, -34788, -21645, -13553, -36064, -74708, -94433, -85121, -61656, -36376, -19051, -26347, -60385, -91729, -92881, -75084, -62743, -47821, -7102, 44611, 60326, 24221, -24218, -38950, -16339, 12611, 19098, -2601, -35839, -55242, -48387]
39390d8387K1432J5897M339m28j597l751k199L927M922l331j1122j1157q644q347
39376d8446o552k733l507p543k083J6724L3766L4283K1782Q910Q87m390q270j0338
39362B2490j0607r224p135o011m267J699Q307O342j887r51J1482J4144m510j9998
39348a26m195K9055M0469K0400l541j1869j4296k0758k0848m287J8846L0949K6924
39335H6723J3071l127j5299j7472o612J4607L4790L5082O147l2429m6845l1515
39323C7121j7268k5525l7584k7748l773R808Q956M912m64q309r453k515m850j8920
39309i5612j3807K6048O1464N1138J8770J6086L8120L5019l91k0451k365K0099
39297A34118J8419Q555P998J439k4152m7455m3185j8570J285L533r682k6840k7032
$$ y = [-48387, -26955, -11058, -6719, -7147, -8744, -12495, -14694, -10767, -5845, -9176, -20298, -31455, -40099, -48446, -54998, -57731, -61238, -68781, -70864, -54140, -20374, 13909, 35691, 44601, 45488, 41098, 32828, 22490, 11883, 2659, -4476, -10487, -14754, -13055, -4748, 1594, -293, -1244, 10238, 24382, 19872, -126, -4321, 24734, 65203, 85603, 82062, 70193, 55897, 35139, 14291, 10004, 28850, 59799, 86723, 99794, 96667, 81368, 63896, 57284, 71891, 106681, 141763, 147910, 115481, 68636, 37121, 19853, -5672, -43256, -71004, -74777, -64969, -56013, -51101, -51565, -59874, -69327, -71842, -76692, -95612, -109419, -83371, -21907, 29231, 48001, 64087, 102207, 137226, 136835, 116384, 114019, 134118, 152537, 161092, 169090, 170529, 146377, 98922, 55737, 37167, 38452, 41985, 32303, 5463, -21569]
39284b1569J269L4714L5028J398k5420j9574j298j46j4325k1783j1543Q512K1395
39271a3342J4055o369j3995R74J0504j1841m3457m1339q871R514j766j1883j771
39258a19587P075k928j3093q20K6826M8905N4236L8564N109k3582k2583r08P721
39245D935m495j0233M764J9150J3534o68m077L747J1023P331j1856l3819k8840
39232b9504J0196M0312J8984k8585l9810n811K2356J8733J3642K8279L7157J7816
39220A03765j2452l3040m8532n9328m7716j5583N463L204L988K3247L8217L0481
39208h286J4728M667q589k3922j8783P440K0270L468j4458q984N086Q015M874
39195a4474J215j0306k1561j0475J3404J2634j3043j8900Q983K8406J5073N39
$$ y = [-21569, -20300, 14414, 49442, 50840, 25420, 5846, 4548, 4402, -9923, -31706, -43249, -34737, -13342, 713, -5656, -19651, -18677, -8173, -20014, -63471, -104810, -113681, -104167, -105933, -117816, -119587, -112512, -115440, -128533, -129353, -102527, -53622, 614, 39178, 44287, 20705, -1878, -2786, 4935, 440, -9793, -5029, 14121, 27655, 26987, 22910, 26657, 37680, 45011, 33155, -664, -29504, -19308, 21004, 39988, 11403, -28407, -34218, -11862, 6871, 20513, 48792, 85949, 103765, 91313, 58273, 9741, -49587, -97303, -112886, -107423, -104219, -100231, -76984, -38767, -8286, 6442, 11109, 2520, -21402, -40185, -32745, -12475, -9007, -23465, -32449, -27363, -19348, -14474, -13259, -23565, -45126, -55601, -42197, -29563, -42606, -61506, -52523, -24117, -9044, -8505]
39183h505P277R285p435r248J8107K9559l583l6970k5769P18n858l2111l6156
39170a00689j8901n488N455K0998K1728P19p269J4782K4574q202l9598k1325J7147
39157i6069K3880J3747K7883M7510K9508p279j4386k908j6068l7772j7570K8669
39145b0855L3362j1354m1715k6068k363k416r748p098m686o754j183Q274M545
39132h8059n968k072J1943J8769K8235N4270O6721K5869m3754p5558n3464k3267
39120h6335j4245r214N780J9071K4962K8148J7666j4958l8741j7706K5412L6041
39108b4119J0692o013L32J758r678j1498k409k229k118K1670M7790L2556q318
39095D8416j4512J7994K7830q081l8836k7787l676K150K774J1819J3256L012N409
$$ y = [-8505, -1228, 8057, 622, -8626, 9481, 39040, 35457, -1513, -27282, -26564, -32422, -64533, -100689, -119590, -125078, -119623, -98625, -76897, -76178, -83447, -68665, -44091, -52293, -91891, -113216, -96069, -72189, -58442, -30559, 16951, 46459, 39180, 24794, 21886, 5818, -31954, -49524, -20855, 12507, 1153, -40562, -66630, -68993, -71409, -81157, -88255, -92941, -99695, -100878, -92604, -88059, -94027, -96099, -84156, -65387, -37152, 17118, 83839, 109708, 65954, -9604, -63068, -86335, -100580, -109794, -104014, -84943, -59981, -31833, -14167, -29125, -67866, -85572, -60160, -24119, -13427, -19440, -19108, -17350, -27028, -38526, -40935, -43164, -45282, -23612, 24178, 56734, 48416, 33904, 51898, 79728, 71647, 32811, 5024, 1348, 3498, 6272, 18091, 31347, 34359, 39768]
39082C9768K3387K5768N348m949O202P708j1742j9150O85J4986R38j9520k6630
39069D2799l1431l6583k4801o801j9753n4965n3103m00L8879K2487o327k23J4806
39056a15416k60j9215J670M2386N1786K9720J5508J7683J1417r504k6647l2262
39044c3134l2119k4465q019K235m760j4670j0280J110M336K185M547R471J1771
39031i1792J3051J1899L970k438M338J2989L607j2687p858J0251O939j5425j7459
39018h0615O377J7120L770J563J9228J7018j5411k9682k859J8297Jj9931o419
39005g1543O404j7166m1134k0340J5507J2981j2064p734K0028K2228n409k0304
38993a18546p026Q695J2057J1480O868o352j1263P978K9215K0629o983j7599n601
$$ y = [39768, 63155, 88923, 94271, 89322, 95524, 103232, 91490, 72340, 73025, 88011, 88949, 69429, 42799, 11368, -25215, -50016, -56817, -76570, -131535, -184638, -185038, -146159, -123672, -129999, -130222, -115416, -115676, -134891, -133221, -90835, -39049, -9329, 6179, 23862, 35279, 25775, -872, -33134, -65253, -89718, -97737, -95502, -100262, -114932, -125212, -124102, -119766, -117581, -113034, -103563, -91792, -78741, -66842, -62872, -65310, -60972, -47983, -44376, -57063, -64921, -54670, -47731, -63156, -80615, -74238, -57118, -53348, -51785, -32557, -15539, -30950, -60632, -63491, -45194, -45193, -65124, -71543, -65139, -82305, -123439, -143779, -128272, -115291, -127355, -135089, -115061, -92833, -98242, -118546, -125572, -116877, -104820, -93340, -86472, -92824, -104087, -96109, -66894, -46265, -53248, -70847, -76448]
38980g6448O810J3149K2576K9563K2998J2975J2746R485j1873l3844l1815j5274
38968c8952o840j002J6793L0782J7598q887j7872j1781j4555k4020j8124J565
38956g5295J2135P722J748p67l687l484J615R29p231m090J6303K8140J3595p270
38942a9637j2363j0392j1059j893J4806Q217k0757j8400L4322O8905K6927m1035
38930A7641m9566p971R806q040q464J8494K3892o740k9611k2303j2261j4014p097
38917i6234J0436J1038o141q726O368L719k3178l4227j0060J8451K6882L0589
38905g1083M0980L8721J4177r615j6616k0560k8757k2888L494K4523J9597L76
38893b7651j5711k8235l6250k8902p900Q025J2069J6779K6015K7603J8913J0544
$$ y = [-76448, -69638, -56489, -33913, -4350, 18648, 31623, 44369, 53854, 41981, 8137, -23678, -38952, -45792, -46794, -30001, 781, 18379, 9492, -8380, -20161, -34716, -58736, -76860, -75295, -63160, -55438, -53690, -54457, -58144, -61628, -60013, -59084, -66315, -70405, -54102, -25962, -12367, -19637, -32000, -42392, -53451, -55344, -40538, -32321, -53078, -71478, -37156, 31749, 58676, 17641, -31925, -39896, -30090, -38130, -46594, -28100, -4208, -10948, -40559, -62862, -75123, -89137, -96234, -85798, -74760, -80901, -89627, -83259, -79540, -102718, -136945, -147005, -128554, -101672, -71083, -30103, 8618, 22795, 13180, -3436, -23996, -52753, -75641, -72147, -47624, -28027, -27651, -43362, -71597, -107847, -136749, -144649, -136624, -124555, -107776, -81761, -54158, -35245, -24701]
38881b4701J607j6769l1195j5980K0360L5870J3731j3844j3409Q188K3804K1435
38869I097O536j0013j6307q740l65l612q063L676K3840K8752J5876M727L427M67
38855D9298j0911k2490k3455p168K4725N0674M1843N222j3363N626K1738N11k6343
38842I5907j5517J0809M691k0899j7127Q705M593l0292m1280j4344J778j4742
38830b7718k1226J0284M0660K6005j7002m2253l4038q303J5835K5021J6699O990
38818i046J0891J4464m578l3771l9428j8431K484J3374K4817L1307J6779o905
38806A957j1834O39R475J6525L1449L2076j560l1210o948M3565M8057L824k2850
38793A13165r039J224p969J299L2816L3912j0343m5570m1891l6165m7546l7275
$$ y = [-24701, -23094, -39863, -71058, -87038, -66678, -30808, -17077, -30921, -44330, -36142, -12338, 9097, 15633, 5620, -10687, -19427, -19792, -23404, -31467, -27791, -3951, 24801, 40677, 45404, 48831, 49298, 38387, 15897, -7558, -14726, 9999, 60673, 102516, 107738, 94375, 100001, 121739, 122250, 95907, 80390, 91199, 95890, 74991, 57864, 66569, 71162, 40870, -410, -14754, -12976, -27718, -48944, -38660, 2000, 28005, 11003, -31250, -65288, -73591, -57756, -32735, -16036, -9046, 1845, 16309, 11731, -22040, -61468, -79899, -77415, -64041, -39224, -7917, 8862, 1957, -9877, -9238, 237, 16762, 48211, 80287, 78727, 47517, 40569, 84134, 132191, 136015, 113165, 104126, 105350, 97381, 98680, 131496, 165408, 155065, 109495, 67604, 31439, -16107, -53382]
38781e3382N891K6054l167k3412R085M5005K7927r830r268J4975J1249j6760k6281
38768a914j0840M059J2144J8168P636k3864m0917j7692J2309M851k4936k9987
38756i0983l833K1057K6245J6491l790k5543k6247J139L0377L8665L5460L2762
38744E1800K0082o150k4072k2594j9303k0526p881J2506Q96m4749o4939k6119
38732a51049K3077K8439Q854O489J0598p740k7954j2425K3484L3882J2717q811
38720f0439j3604m809J4783L1851K0723j3195k4640K817K4187P613j0739N605
38708a9847K5106O753k2884j7634O274N924p648L762K8701K7154L499r015j2837
38695A7308k9052m0040j7228J5424J4396o086O81K7805K6313o610k2063j012K2784
$$ y = [-53382, -47491, -21437, -24604, -48016, -38931, 6074, 34001, 24171, 14903, 29878, 41127, 24367, -1914, -12754, -8695, 3449, 21617, 29253, 5389, -35528, -53220, -40911, -36060, -60996, -90983, -94816, -73759, -47514, -31023, -34813, -60356, -86603, -85464, -55087, -16422, 19038, 51800, 71882, 65732, 41660, 19066, -237, -20763, -28644, -16138, -15242, -59991, -124930, -151049, -127972, -99533, -90679, -84190, -73592, -81332, -109286, -121711, -98227, -64345, -51628, -60439, -74043, -78852, -64069, -32218, -11495, -24690, -49330, -46513, -22326, -14713, -25452, -19847, 5259, 12012, -10872, -28506, -22232, -16308, -23956, -20194, 8507, 35661, 39160, 30145, 17308, -11744, -51784, -69012, -53588, -39192, -45278, -44597, -16792, 9521, 2911, -19152, -20164, 2620]
38682B620K4516J7323J6467K1763L5082N3944N5062K4083j0921j5371J15M140
38670B28823k677l382o650k4422l4480j6273M007l315j5243m97J5601k835k6132
38657A12525n248L4604K9971j0864k0424J5394M2555L4485K0356J4848j121k1485
38645B45596j2082K0945K8866R2k1267q937J3528K5080L3185L7104K1533k711
38633C80932m653J2225J2384j0267k4927k0740j8291k1814j2986M567N585j0685
38621B91330k2987l1816m9746n7965l0294Q788J2808q258m824K3303K6877m138
38609A53078k5184j6510p723j4083j5482q519j4938k9481k2330K07R00j8911k0520
38596c9496k34Q311M498J8776L9031K0129k6400l7043k901J4950o466j7708N369
$$ y = [2620, 27136, 44459, 60926, 82689, 117771, 171715, 226777, 250860, 239939, 224568, 224683, 228823, 226146, 222764, 216114, 191692, 157212, 140939, 144946, 141631, 126388, 125891, 141492, 138657, 112525, 107277, 141881, 171852, 160988, 140564, 155958, 198513, 232998, 253354, 268202, 267081, 245596, 233514, 254459, 283325, 283417, 262150, 253213, 266741, 291821, 325006, 362110, 383643, 380932, 376279, 388504, 400888, 390621, 365694, 344954, 326663, 304849, 291863, 296430, 302015, 291330, 268343, 236527, 186781, 128816, 98522, 107310, 120118, 111860, 107036, 130339, 157216, 153078, 127894, 111384, 103661, 89578, 74096, 65577, 50639, 21158, -1172, -965, -65, -18976, -39496, -39730, -31419, -26921, -8145, 30886, 51015, 24615, -12428, -15329, -379, -6845, -24553, -19184]
38583a9184J9135o83j5396l606k199k7089l4444n736Q145k1230l9514N43N5810
38570h5448O1265K5385l051j4422k5653k9292j1215J1512J6102J0673J1344J2396
38558b0404O605L405N742L673L703K1076L5055P459m3955n5489j6348J3408M304
38545c1766m37K6020M3148K1557l965n600j2426l9864m3839k222K9426O994k3689
38532c6663o068K9901K3324j6000l6015l0223k5395j7398J1831M2660M5479L3526
38520A8959L3524L3682J3825n738j28P985j1586l4915k0495J7656L0066O541j9179
38507G0197k3700j1317O344J4842K311j4854l680K6183K1747k6115n2314j7196
38495g552K2969L267m4617m3485J1276N5352N2765K5187o6j6012k0251j5783j6159
$$ y = [-19184, -49, -732, -16128, -19734, -21933, -49022, -83466, -89202, -81057, -102287, -141801, -141258, -85448, -24183, 1202, -1849, -16271, -41924, -71216, -82431, -70919, -54817, -44144, -32800, -20404, -13799, -10394, -4652, -979, 2724, 23800, 58855, 66314, 22359, -33130, -49478, -36070, -31766, -32203, -6183, 36965, 58522, 54557, 48957, 36531, -3333, -47172, -49394, -19968, -12974, -36663, -42731, -12830, 10494, -5506, -41521, -71744, -97139, -114537, -102706, -60046, -14567, 18959, 52483, 86165, 99990, 94252, 94124, 102109, 90523, 55608, 35113, 52769, 82835, 89376, 70197, 46497, 35180, 41524, 56366, 58677, 43823, 40143, 66326, 88073, 61958, 9644, -7552, 15417, 18684, -25933, -69418, -58142, -2790, 49975, 75162, 75096, 59084, 38833, 23050, 6891]
38482F891k1527j2078J1846J8564j161j3633l820n118l2510m3655j1063K4256
38470h3008K1310N516J3081K5221J5697Q589K6934L7830J3460o731J7443N1285
38458A46627M6424K3912K1911J5665k7522o5772m5421j184l70k7375k0184J2948
38446G9659J3581j7106k8213j8143k6378m3614k7002Q676J0910j1195m062K3774
38434c9113J3116l0564l6051J1150M3735K6014R70L132R078k25l702P463Q153
38421A3156q051j4221l696j022r541n779Q139O091n241N800K8956J9882j9578
38408A4895l6620j2491J2789J1428J588m02k216p53J8128L8876L0098N01j4163
38395F1658j4450k6714l9006j8040J6874J4284j7062j7790J7539L1121O826m067
$$ y = [6891, -14636, -26714, -14868, 3696, 2535, -11098, -14918, -20036, -52546, -96201, -107264, -83008, -61698, -56182, -43101, -17880, -2183, 6406, 33340, 71170, 84630, 77899, 95342, 146627, 193051, 216963, 238874, 254539, 227017, 161245, 115824, 114640, 114270, 86895, 66711, 79659, 93240, 76134, 47921, 29778, 3400, -40214, -67216, -58540, -47630, -58825, -62887, -39113, -25997, -56561, -92612, -81462, -37727, -11713, -10743, -7611, 1467, 1242, -2460, 5003, 13156, 5105, -9116, -12812, -13834, -23375, -29154, -21015, -14924, -20165, -14365, 14591, 34473, 14895, -21725, -34216, -21427, -9999, -8411, -8813, -11029, -11782, 6346, 45222, 75320, 75821, 61658, 47208, 20494, -18512, -36552, -19678, -5394, -22456, -40246, -22707, 8414, 15240, 11173]
38383A1173J8995K8925M30k4946j7458q485k3649l3571j0786K1655L3821K9714
38371B5818J6866j1860m1017l2421J1302L6262J6113j1214j0336J092m203j8737
38359b2335k6044k7082j9821M514L0248K8368R212J2375L5232L1205p240k7920
38347B0712k965K8168K6289O382l719o018o505M498K1001J6191r981k3143j1478
38334E9432l360j3405k0435j3756j0857j5297p965Q302Q226l371M734K7298K5993
38321D5539K632P0K0000J5471j8135k4868J3269L9339J7553r753k226J2361j414
38308A09838k3104k2097j2552j6037j6802K413K1544J7487L0j4648k8209l7153
38296a9290k7102n951J453N93J8292M3089L6488P398L781K3463J4065k6046l5870
$$ y = [11173, 30168, 59093, 59523, 34577, 17119, 8634, -15015, -48586, -59372, -37717, -3896, 25818, 42684, 30824, -10193, -42614, -31312, 4950, 21063, 9849, -487, 605, -3598, -22335, -48379, -75461, -95282, -90768, -60520, -32152, -22940, -10565, 24667, 55872, 48632, 20712, 17747, 45915, 72204, 78586, 74867, 68849, 62344, 66842, 87843, 104034, 94053, 70910, 59432, 56072, 42667, 22232, 8476, -2381, -17678, -25643, -17341, -9115, -12486, -7752, 19546, 45539, 48171, 48241, 68241, 83712, 65577, 40709, 53978, 93317, 110870, 101117, 98891, 111252, 109838, 86734, 64637, 52085, 36048, 19246, 21659, 43203, 60690, 60720, 46072, 17863, -19290, -46392, -52343, -50890, -50297, -32005, 11084, 47572, 54970, 58751, 82214, 96279, 70233, 34363]
38283C4363j978J3114j5697k9154P820M2216K7906r89n127o863k6202k8659L960
38270A4710K4554J085k5276j8592j1284l0801l8686o360K1424N389j6634m283
38258h4754J0002q501k1015J2461M9599L5191l039p660J2137J5153Q981J9346
38246C7901K5297l42k9014k4085o090o119m604J8004K5393q499l3914k422M3982
38233C5488L9896J257j6818j5890k4883k4496J1602M4006K3141k2070l4520k5612
38221h899l6335m5896j1953L5501L5076j272j4128J908R461R475K2893K4183j4764
38208E250m6396j0348N3759N7843P000j5479R660J7634j9898n5723n6341m0325
38196i3364j8444K1717O1653N8731J8049q724j659J0590J0059N798k792k0747
$$ y = [34363, 32385, 45499, 29802, 648, 8468, 50684, 78590, 77601, 72474, 65611, 39409, 10750, 14710, 39264, 40349, 15073, -3519, -14803, -45604, -84290, -90650, -69226, -63837, -80471, -84754, -74752, -83253, -104268, -91807, -42208, -7017, -10056, -17716, -5579, 9574, 18555, 37901, 63198, 62856, 33842, 9757, 3667, -2452, -7056, 10948, 36341, 27842, -6072, -8494, 35488, 75384, 76641, 59823, 43933, 19050, -5446, 6156, 50162, 73303, 51233, 16713, -8899, -45234, -91130, -103083, -67582, -32506, -33778, -47906, -45998, -36537, -27062, -4169, 20014, 5250, -41146, -51494, 2265, 60108, 67108, 51629, 61289, 78923, 59025, 3302, -53039, -93364, -111808, -90091, -28438, 30293, 48342, 39618, 37959, 48549, 58608, 64406, 61614, 40867]
38184D0867k6925n312J1828q395l4284j7956J9896K6787J0576J4051K4842p45
38172E5230m4165m6198r447R155j998l661J0068R133J49J4605L3806J4413k0703
38159B0387j0382L3557M0936O278n232K0366K2963j6613m0395j7819P159L364
38147F4569Q0J4927J5172j2918k9145j0672O837n002j8698l252K4271L1543J6686
38134I4398k019j0780l525J1412J0049j2601k2861N23K3211J0512q244Q687L4773
38121A33535J9807j5972j5597J1159P300k5296l1325m593N501j3525k4684j8652
38109B7658j9964k0778P777M3530L5841o441l0767l1002l6955l5024N171M6115
38097a4839K8697j6402j4398J7654M025l8707k3625L8781M5405j4899l6136J6265
$$ y = [40867, 13942, 8630, 20458, 12063, -22221, -40177, -20281, 6506, 17082, 31133, 55975, 55230, 11065, -35133, -44580, -35425, -37423, -41084, -31016, -21883, -21734, -7129, 26677, 41090, 20387, 10005, 43562, 84498, 90776, 85544, 105910, 128873, 112260, 71865, 54046, 61205, 64569, 64649, 79576, 94748, 81830, 52685, 42013, 48850, 43848, 25150, 21898, 46169, 77712, 94398, 92379, 81599, 78074, 89486, 99535, 86934, 64073, 64596, 87807, 98319, 90075, 98762, 133535, 153342, 137370, 121773, 132932, 140232, 114936, 83611, 79018, 84519, 70994, 46310, 27658, 7694, -13084, -5307, 38223, 74064, 67623, 36856, 5854, -31101, -66125, -60954, -14839, 13858, -2544, -16942, 712, 4737, -33970, -57595, -18814, 26591, 11692, -24444, -8179]
38085h179M6253L106l2744k222L2998J6844k397K0411L6483L604k6372m964K2028
38072A04849M408j8376L418L4402K0555j6074k5175j1003j078J0030K6861K1466
38060A54283j1243k6221l299J4676K070k386K4922L9970R383k9164l5031k4613
38048A13347j7279O407M5644N2275J0965k5181k2722j5777k4791j2586L0722M7151
38036A88175J0111k1587o356R722j4215l6715j5790J4099J3879R573K4880K4502
38024B00278q698k2161J1474L1578m550l7253p026L9137L1051q243j8085n484
38012B02018o706n617K2331M1453J5817j5444l268K3753J5340r845q079N520n328
37999B71945k3107j2971R563J3872J1824K0168J6088j2824l0304j7460j3758l8075
$$ y = [-8179, 38074, 41180, 8436, 6214, 39212, 56056, 53659, 74070, 110553, 114157, 87785, 82821, 104849, 109257, 90881, 94299, 128701, 149256, 133182, 108007, 97004, 95926, 105956, 132817, 154283, 143040, 116819, 113520, 128196, 130266, 127880, 152802, 192772, 202155, 172991, 137960, 113347, 96068, 102475, 148119, 200394, 211359, 186178, 163456, 147679, 122888, 110302, 141024, 188175, 198286, 176699, 170343, 180065, 165850, 129135, 113345, 127444, 141323, 150896, 175776, 200278, 191580, 169419, 180893, 212471, 207921, 170668, 163642, 202779, 233830, 225587, 207502, 202018, 195312, 189695, 212026, 253479, 269296, 253852, 250584, 274337, 289677, 279832, 271753, 277273, 271945, 248838, 235867, 245430, 259302, 271126, 291294, 307382, 294558, 264254, 246794, 233036, 194961]
37987A94961m1854q02K5553n884m1507k4324J1777J7546J6832L8098M0039o508
37975B23927m2972k0531P749j3393l4088M380M9428K8457j5945m122L5168K3630
37963B41688k1101k6524j478n117k4190n847K6981J6285j1280J1974O3768O5977
37951C31136K1357l006j971k2530n2127l8262j797j1003n4529n6220q811J9133
37939A21370N051n812K737J121q815K769J7828p152m9148m3278O554L4173K1592
37926I8990J0765J1548q327m2556m5293j4092O358L364N162J6311J5736J0200
37914F8166K1260L2807J7169p454j0050p062k2364k6497Q679L8974J6442j6758
37902A13312K698M0833K1418l8391n8545l2965k2538l2637j2419L4293M7382J7252
$$ y = [194961, 153107, 152305, 177858, 171974, 130467, 106143, 117920, 135466, 152298, 190396, 230435, 223927, 180955, 160424, 168173, 154780, 120692, 125072, 174500, 202957, 187012, 182890, 218058, 241688, 220587, 194063, 192585, 187468, 163278, 157431, 184412, 200697, 189417, 201391, 265159, 331136, 352493, 349487, 347516, 324986, 272859, 234597, 232800, 221797, 167268, 111048, 102237, 121370, 126421, 120609, 123346, 124467, 115652, 118421, 136249, 129097, 79949, 36671, 43225, 77398, 98990, 109755, 121303, 112976, 70420, 25127, 11035, 17393, 20757, 25919, 42230, 57966, 68166, 89426, 122233, 139402, 131948, 121898, 114836, 92472, 65975, 74654, 113628, 130070, 113312, 116010, 156843, 178261, 139870, 81325, 48360, 25822, -6815, -19234, 15059, 62441, 79693]
37890G9693n377k681j613k030J6916L1076K166l9694l4030O185J9616O060J5550
37877I1837M5255M4928J3456l842l048j6833l5955k5047j195p976k8682j3988
37865E8910K3664L2442J4919Q904J704l9359p7270n0385J2793K9473j533o061
37853H201L1546M7456J4804j6880j0945J0339K1676K8232L3537K8134J3530j200
37841B08430j6050k4710r156K6169N3256O9692R3798J02232N1952k3374l7106
37830D95133J2385L8488J8610K1674O4992Q9339R6114J47653K18170K28277K25535
37819A656370L09470L99046L59405L26421N32797Q50065J016075J305509K207571
37810H962729L201935K785680M11818k319898l334590k495572j386162j028698
$$ y = [79693, 74316, 71635, 70022, 67992, 84908, 115984, 118150, 78456, 44426, 50611, 70227, 76287, 91837, 137092, 182020, 195476, 191634, 188586, 171753, 135798, 110751, 109556, 101580, 72898, 58910, 82574, 115016, 129935, 138839, 140543, 101184, 23914, -26471, -13678, 15795, 14262, 8201, 39747, 87203, 102007, 85127, 74182, 84521, 106197, 134429, 167966, 196100, 209630, 208430, 192380, 167670, 158514, 184683, 237939, 307631, 401429, 503661, 555613, 532239, 495133, 507518, 546006, 564616, 586290, 651282, 740621, 836735, 984388, 1202558, 1430835, 1656370, 1965840, 2364886, 2724291, 3050712, 3583509, 4433574, 5449649, 6755158, 8962729, 12164664, 14950344, 15362162, 13042264, 9707674, 7212102, 5825940, 4797242]
37802D797242r78714o48793l01425l22572m58451l46007j54023j71257k56944
37793A159056j74237n5521j02968j80687r8503J5258j5705o9674J1372R7041K8649
37782F14081o6022k8349K4261m9497j16807l1197O2165o872j03053l7946P5268
37771C36032L9826o2531m8855J9692j0086o3962P998J18046Q9622k0517m3584
37760C61681p813m1634r8057n5091K8334K2374k5845n290K5120l5502j00535m5331
37748B2411M5871L1907k2275J3234O8973J5034p0224l8373M7716L7471k4525n998
37736A21222M3118j342p5343m3535L1858R476n3634j5859O5541M2874l3195j4914
37724G6267N0210J4329p3493n3992L7530M0041l0593l0415K7170J4225m4928k5028
$$ y = [4797242, 3818528, 3169735, 2868310, 2545738, 2087287, 1741280, 1587257, 1416000, 1159056, 984819, 929298, 826330, 645643, 547140, 562398, 546693, 477019, 488391, 585432, 614081, 548059, 519710, 543971, 494474, 377667, 346470, 408635, 401763, 298710, 260764, 336032, 375858, 313327, 264472, 284164, 274078, 210116, 218114, 336160, 425782, 405265, 361681, 353868, 312234, 214177, 159086, 187420, 209794, 183949, 178659, 203779, 168277, 67742, 22411, 68282, 100189, 77914, 91148, 160121, 175155, 104931, 66558, 114274, 151745, 127220, 121222, 164340, 162998, 87655, 44120, 75978, 85454, 31820, 15961, 81502, 124376, 91181, 76267, 126477, 140806, 67313, 13321, 50851, 90892, 60299, 29884, 57054, 71279, 26351, 1323]
37712A323M0393K1028m7213k9018M1346K6248m1955k4884M5756L0679l7150j3369
37700A3184P0854O2221k2922l7822J0485n997o4845l4717N2781N1258j9624j7724
37688E7132L9514J6769n7874l9748M2330L2552m8832m1053M7250N7178j5060k5141
37676F5017K7693J0070o1454m0613N6303P0542K344J976P1556O8207n739q947
37664B56955N2234L5343n1843o7806k1026m1082r4203l8102O9364M4149o7376
37653G6607m9867P9995R4251k5957o2661K7611N0942l7368n8070K5101L3679o2213
37641I2050p3033L8976P6173j8889n6430L5584Q3700R262l8175P876J3051o1357
37629A08788o6806K6443N1651k9014m3532N1130P7979j4788n1657K4097L9849
$$ y = [1323, 41716, 62744, 15531, -13487, 27859, 54107, 12152, -12732, 33024, 63703, 26553, 13184, 84038, 146259, 123337, 85515, 96000, 90003, 25158, -9559, 43222, 94480, 74856, 57132, 96646, 113415, 55541, 15793, 58123, 90675, 41843, 790, 48040, 105218, 90158, 65017, 92710, 102780, 41326, 713, 57016, 127558, 129902, 131878, 203434, 271641, 265902, 256955, 309189, 344532, 292689, 224883, 203857, 162775, 68572, 30470, 99834, 143983, 76607, 26740, 106735, 200986, 175029, 112368, 139979, 190921, 153553, 95483, 120584, 154263, 92050, 19017, 57993, 134166, 115277, 58847, 94431, 178131, 187393, 149218, 157094, 170145, 108788, 41982, 68425, 120076, 91062, 47530, 98660, 176639, 161851, 110194, 134291, 174140]
37618A74140o0401r8273p100M0718k5453m1772N5999R9555J8030k9164K5048L2975
37606A84302m6157m5207O5074Q2034m4722r5552J2228O8475k5786p4629K1925
37595A01985O9961l6378j03901j2253O2135k85l8360M9948R4807k843o2487K3377
37583A45706P2860k6694q9307J0372R0751J2305o4215o441L8373l9383p9108K1195
37571H6414P9028k2160r2452L494Q3193K126o6425K5009J09117L2196n5063p469
37559A77008L8334l3618o7745M1568J09119J0669o0855L6102J11950J5376o7551
37548C10357K5509J22302O3208J3049J28428K56305K49180K24304K35745Q3995
37538A712382k52880m17948k31100k3863p9101j76029o4690N7898l6729j49561
$$ y = [174140, 113739, 15466, 8366, 49084, 23631, -18141, 37858, 137413, 155443, 126279, 151327, 184302, 138145, 92938, 158012, 240046, 195324, 99772, 112000, 180475, 154689, 80060, 101985, 171946, 135568, 31667, 19414, 81549, 81264, 42904, 92852, 187659, 184816, 122329, 145706, 218566, 191872, 102565, 112937, 203688, 215993, 151778, 145337, 183710, 144327, 65219, 86414, 165442, 143282, 50830, 54324, 137517, 139643, 73218, 98227, 207344, 239540, 184477, 177008, 215342, 181724, 113979, 155547, 264666, 275335, 214480, 250582, 362532, 377908, 310357, 335866, 458168, 521376, 534425, 662853, 919158, 1168338, 1392642, 1628387, 1712382, 1459502, 1041554, 810454, 786591, 707490, 531461, 466771, 524669, 487940, 338379]
37528C38379n3258N8274l3429j25686J52J25316J0256j29160l6067R0082l968
37517B40891j20153q022J23006P854j43036m5874J03738J9466j13009j2720J33017
37506A85158M2867r4810j111J28628J7713j21174k577J41474N406j61384j8082
37495A22108J83082N8607j60607o1155J61685Q8642j16004m7692J37297M6897
37485D12860j53513o8363J28603K9483j86358q8047J55664R8309j12183l7699
37475A78756J70834P4656j61920p8273J65842R3978j44434o9290J69341Q5636
37465D85126j60796o6964J99876J10036j71576q8851K02486J24635j76558j03172
37455C54242K09970J46934j68525j05124K20821J59599j81691j34579K06996J63951
$$ y = [338379, 285121, 343395, 309966, 184280, 184432, 309748, 320004, 190844, 154777, 244859, 240891, 120738, 112716, 235722, 243576, 100540, 54666, 158404, 177870, 64861, 52141, 185158, 228025, 133215, 132104, 260732, 278445, 157271, 154694, 296168, 301574, 140190, 122108, 305190, 363797, 203190, 142035, 303720, 392362, 276358, 228666, 365963, 412860, 259347, 190984, 319587, 349070, 162712, 74665, 230329, 328638, 216455, 178756, 349590, 424246, 262326, 184053, 349895, 443873, 299439, 230149, 399490, 485126, 324330, 257366, 457242, 567278, 395702, 306851, 509337, 633972, 457414, 354242, 564212, 711146, 542621, 437497, 658318, 817917, 636226, 501647, 708643, 872594]
37445H72594j74780j19259K36988J83564j80339j16689K68482J97360k25349j74386
37435G68186K63686K28007k10878j60613L17534K93939j80757j40082L68823L31567
37425A879412k10427j85137L82479L70270k01740j49508N06703N00477j57459
37416B735070j08421O53570O73817o0718K7411R64023J023094J59902K91740J526389
37406G885877J768983Q83843J235140L077592L839871L238477M116943O636633
37398C2683359P414605O568924Q828097J4630344J8457734K0887186L1769537
37391A41239786N1445740N8350197L1405771j8217592n4141433n5597880l6958525
37384A17526064k2840161j8811579j5592828r717972o286527o752536o621302
$$ y = [872594, 697814, 578555, 815543, 999107, 818768, 702079, 970561, 1167921, 942572, 768186, 1031872, 1259879, 1049001, 888388, 1205922, 1499861, 1319104, 1179022, 1547845, 1879412, 1668985, 1483848, 1866327, 2236597, 2034857, 1885349, 2392052, 2892529, 2735070, 2626649, 3280219, 3954036, 3893318, 3920729, 4884752, 5907846, 6067748, 6359488, 7885877, 9654860, 10538703, 11773843, 14851435, 18691306, 21929783, 26046726, 32683359, 40097964, 46666888, 55494985, 70125329, 88583063, 109470249, 141239786, 192685526, 251035723, 282441494, 264223902, 210082469, 154484589, 117526064, 94685903, 75874324, 60281496, 50563524, 44276997, 37524461, 30903159]
37377C0903159m311286l024162l728943l603713j863041j034815j843096k017385
37369I476718q38778l02423j066409j323504m34527j4287o52355q82201j66442
37360C795792J38729m60011o84276n8871K16656l11085n05044O7978L03653k50815
37350B252706n40835p3219J98316k06053m12459K1503K59159j29925l47999K7356
37340A048550K36748j33109l53778j1679K04293j11302l04927J4460K15601q5878
37330G18979k78194K2410K24588n8738k60443Q773K06547n7624k63600j2716K08292
37319D58274J46j90555J5063J90289k6364k12666l832J94904J5243j64949J1516
37308B87069J82427j218j85325j3792J83400M8579j26221r495J24184k5950j78338
$$ y = [30903159, 26591873, 23567711, 19838768, 16235055, 14372014, 13337199, 11494103, 9476718, 8637940, 8335517, 7269108, 5945604, 5511077, 5496790, 4844435, 3962234, 3795792, 3934521, 3474510, 2790234, 2731363, 2948019, 2636934, 2131890, 2199868, 2503521, 2252706, 1711871, 1638652, 1836968, 1630915, 1218456, 1239959, 1499118, 1369193, 1021194, 1048550, 1285298, 1152189, 798411, 786732, 991025, 879723, 574796, 589256, 804857, 718979, 440785, 463195, 687783, 629045, 368602, 377375, 583922, 526298, 262698, 249982, 458274, 458420, 267865, 282928, 473217, 446853, 234187, 230355, 425259, 440502, 275553, 287069, 469496, 468278, 282953, 269161, 452561, 501140, 374919, 365424, 489608, 463658, 285320]
37297B85320m1096J02850l2491j60534N781J74009L6488j35374k7964J16734K780
37286C26503j37099k0993J16690n732j58431n5200R2001O652j13503j5657R3012
37275A28243k8572j49252q324J59174O2388r2353j1579J23352L1542j14758m1028
37264E8833R0951J7990j01946j8551J00697M026j32138l9133J14651M5670j00537
37253D0513m2440R4993M8371n6321L3348J71509Q1691r2623l6445J51859J52203
37242E46658J5984M8300K41412L14839K04723P1843n5679k33734l31857k12825
37232F09664m5919o2460j55176r4038L8269J8427q7917p1416J2358j8926q8716
37221E4150j6211R8840M8857p3373m1933P1311L9326q2042o7860M5169M6936l5955
$$ y = [285320, 244224, 347074, 314583, 154049, 159830, 333839, 370327, 234953, 206989, 323723, 326503, 189404, 168411, 285101, 279369, 120938, 65738, 157739, 164391, 50888, 35231, 128243, 99671, -49581, -57905, 101269, 163657, 71304, 59725, 183077, 214619, 99861, 58833, 149784, 167774, 65828, 47277, 147974, 152000, 19862, -19271, 95380, 141050, 40513, -1927, 93066, 141437, 85116, 118464, 289973, 371664, 279041, 242596, 394455, 546658, 562642, 610942, 852354, 1167193, 1371916, 1443759, 1388080, 1154346, 822489, 609664, 563745, 501285, 346109, 252071, 290340, 308767, 220850, 149434, 161792, 142866, 54150, 37939, 136779, 185636, 112263, 70330, 141641, 180967, 98925, 31065, 76234, 123170, 87215]
37209H7215j5788P1210M5403m5631j9626O8846K7488r1261q1579K4938K9699n1243
37197D9671m1878L4208J2541o5965k7741Q1322P0778l1541m0165L0255J4800n9955
37185B6330l2138O0241M7130l2200l026R0644N7990o7535q3024O404J8451m3141
37173D6126j4326P7204M8037p5457q6531J8390L8751n0642o8625J5676L7232l4518
37161d8683m7644K5465M5706p213p527M5307K4611m8979k8352O4573O5096j6141
37149F6219r995P8382P1886l6555o6735O695J7309o1100o7390K4061M9860k5492
37137D7145m6531K7847N5346j485j2263M4425L3875n2474n8984L5064O7568j87
37125A39346k0127M3152M4995m2634o3512J9478M6144l4464o8546L692L9710k0237
$$ y = [87215, 71427, 142637, 188040, 142409, 122783, 191629, 219117, 127856, 46277, 71215, 100914, 49671, 7793, 42001, 54542, -11423, -39164, 42158, 112936, 81395, 41230, 71485, 86285, 26330, -5808, 54433, 101563, 69363, 66337, 156981, 214971, 147436, 64412, 70816, 89267, 46126, 31800, 109004, 157041, 81584, -4947, 13443, 52194, 1552, -67073, -51397, -14165, -48683, -96327, -70862, -25156, -32369, -39896, 5411, 30022, -18957, -47309, 17264, 82360, 66219, 56224, 134606, 206492, 169937, 103202, 109897, 127206, 66106, -1284, 22777, 72637, 47145, 614, 28461, 83807, 82322, 70059, 114484, 148359, 95885, 36901, 71965, 139533, 139346, 119219, 162371, 207366, 164732, 101220, 120698, 166842, 132378, 63832, 67524, 107234, 86997]
37113H6997m1116L1508N9266j7019n9339J551M0018j2157l9852J5686L8769k4379
37101G9933n4083L415K5100m3998p3261N800O6454K3578k2318K636J4197k9846
37089b393k4541O2747R2072O5p0010j9902L8305M956l2864O010L5849j4263n1440
37076B4591j695M1410l097n0696j9984J7122q583k6191K1455N2315O939k6912
37064B6674J8267N8391K1543j7341Q013K5165k3873n6757o469M8296L2010L198
37052A37117J9577K3341k4257m6440j663K3063k1278m4708P379M3144k51l6847
37040G8177k170K5291j0392k7203K4597N1191j901l2849K1894N6930j621m8081
37028A33863L299N2072K197n7104k6150J9226j2551m6850K359N2504R619m2469
$$ y = [86997, 45881, 77389, 136655, 119636, 60297, 61848, 101866, 89709, 49857, 65543, 104312, 79933, 25850, 29265, 54365, 10367, -62894, -57094, 9360, 32938, 10620, 13256, 27453, -2393, -26934, 35813, 127885, 127950, 57940, 38038, 76343, 81299, 48435, 54445, 90294, 76031, 24591, 22896, 64306, 61209, 10513, -9471, 7651, -932, -27123, -5668, 46647, 53586, 26674, 44941, 103332, 124875, 107534, 115547, 140712, 116839, 60082, 53613, 101909, 133919, 137117, 156694, 180035, 155778, 109338, 107675, 130738, 109460, 64752, 72131, 115275, 115024, 78177, 76007, 101298, 90906, 63703, 88300, 139491, 137590, 104741, 126635, 183565, 181944, 133863, 137162, 189234, 191431, 134327, 108177, 127403, 114852, 68002, 70361, 122865, 132484, 90015]
37016I0015L911P5114N1677j9053k9130o864k7097m3218J1137O5073L1864k1853
37004A81576m74L8846M093m2781K520Q6177Q8505K7269l082p423l8770n9188j5715
36991B61553L0040M084l7024j4844J8844q500l6020J2740O5104K3392m8111l4665
36979B36593K7444L5101Q034J8784K9038k4016p1131k3778M6665K6860l1689j3231
36967B64674M3328K4388l8984l3428K3512L0394j512P004K5238k4518q6800n3735
36955A79561K9502L6666j6044j6626K5152J0490m3025l3650K3038K5533j4245
36944B06352j700M2905J8851n1247n4532k016o745o5410o5348m14K1502j5544
36932B6654j8404K4533K7399j3767j3184K7077J6219m1555m5482J0825K8342p482
$$ y = [90015, 93926, 169040, 220717, 201664, 172534, 165670, 138573, 95355, 106492, 171565, 203429, 181576, 181102, 219948, 224041, 181260, 183780, 269957, 358462, 385731, 382649, 375226, 336456, 277268, 261553, 291593, 295677, 258653, 243809, 262653, 254153, 218133, 230873, 295977, 319369, 271258, 236593, 264037, 299138, 307172, 325956, 354994, 330978, 259847, 236069, 282734, 309594, 277905, 264674, 308002, 332390, 293406, 259978, 283490, 313884, 312372, 319376, 344614, 320096, 233296, 179561, 209063, 245729, 229685, 213059, 238211, 248701, 205676, 172026, 195064, 220597, 206352, 204652, 247557, 266408, 215161, 160629, 158613, 151868, 86458, 21110, 20696, 42198, 26654, 8250, 32783, 60182, 46415, 33231, 60308, 76527, 34972, -10510, 315, 28657, 21175]
36920B1175o573M3115N2476P237q734J7302Q679l3687k2393L8749M4374k1093
36908A40627n5017k4478r954l4771k5548K5092K9755k2563l6289J0009K1118l2258
36896a4277n4659q24M8606L9833K4321L3218J9022k7017l9299o099K680k5897
36884c92k1277K4172K9237j8368k9534J8597L5845j1531l7544J219K9032p97k3021
36871d362Q374L8419K4413O743R553o516m0718k5998M2693P7179M0804J614m83
36858A71715j0467m1114l4551J3223K4232j9243m0018j5663j8131n8308m5675
36847g4000L8901Q6046M2812K139L0435N5302J2956l3687j9571P551r040l2382
36835A07462k0818r516k3224j6702K4736L6609m516k8005j613O055l7376n7613
$$ y = [21175, 14602, 57717, 110193, 117430, 108696, 125998, 134677, 100990, 78597, 117346, 161720, 140627, 85610, 61132, 51178, 16407, -9141, 15951, 45706, 23143, -13146, -3137, 17981, -14277, -68936, -69760, -21154, 18679, 43000, 76218, 95240, 68223, 28924, 22825, 25505, -392, -21669, 2503, 31740, 13372, -16162, 2435, 38280, 26749, -10795, -9576, 19456, 18659, -4362, 4012, 42431, 66844, 73587, 83140, 76624, 35906, 9908, 52601, 129780, 170584, 172198, 171715, 161248, 120134, 85583, 98806, 123038, 103795, 63777, 48114, 29983, -28325, -74000, -35099, 50947, 93759, 95898, 126333, 181635, 194591, 160904, 141333, 148884, 139844, 107462, 86644, 77128, 53904, 37202, 61938, 98547, 94031, 66026, 64413, 70468, 33092, -24521]
36823b4521j3346K4061P010l861K8748L7799j1968m1997m521K5852j455j4409
36811G392L2314N2037j4020o9836k6384L7963J6400m3651m0014N321J1810m668
36799c5336J5242M3585K3093j2009Q19L2369K1463r586r504j364k4984m4432j6086
36786a6730K1352K2558K2753N1819N1118j5945o3637j4949N5745M0001k7275m3329
36774H3481j4946j8044m3545k8555P499k543m1411l9497m212L988j0504j361J4900
36761i4750q010m2423k7479J8785L3653K1390K8239M3430K6969j597j098N605
36749B714j9473m1950j5794J9214M679k4038j282M4566M3242R700L670J1065j4837
36736B1476m1079r478L8521K0461l8441m4663M470K9414J2370N260J2635q102
$$ y = [-24521, -37867, -13806, -6796, -10657, 18091, 55890, 43922, 1925, -2596, 23256, 21801, 7392, 39706, 91743, 77723, 7887, -18497, 19466, 35866, -7785, -47799, -42478, -30668, -35336, -20094, 23491, 46584, 34575, 35394, 67763, 89226, 79640, 70136, 68772, 43788, -644, -16730, 4622, 27180, 49933, 101752, 152870, 136925, 73288, 58339, 114084, 154085, 126810, 83481, 68535, 50491, 6946, -21609, -14110, -16653, -58064, -97561, -101773, -97785, -108289, -109650, -94750, -102760, -145183, -172662, -153877, -120224, -98834, -70595, -27165, -196, -1793, -2891, 2714, -16759, -58709, -74503, -55289, -50610, -74648, -75930, -31364, 11878, 21578, 25248, 36313, 21476, -19603, -29081, 9440, 29901, -8540, -53203, -48733, -19319, -6949, -1689, 10946, 2844]
36724B844m2409l4231M485J2626n493M792L5690L2005K619L358K4006O914l5569
36711A1637l7304l00J3071k070L235K2697N989l0830k3805J6945K0945j3300k1802
36698c4892k434j4870n2599m2171J9356N0475K6054J2188L7428M5392O723k8025
36686B2625k1808l622J901J0737K1434M716k8605l0003R34J1950r750k0216j843
36673d1550J4991J8486K6018K8109M94l2663k8039m612j0693k7287o22M6144M0570
36660B9346j0338k9676k993J1305j46O176K5267P119l0362j6103L7752M1838j2904
36647E6281l4419J0178M5235L0155K1784N0208N7572J3448k3371j3038M18j6348
36635A98103k7771j4903j9670n5102o8045l7286j2417j3424N349M8145M5778j6658
$$ y = [2844, -39565, -73796, -69311, -56685, -62178, -57386, -21696, 10309, 12928, 16286, 40292, 47206, 11637, -25667, -25967, -12896, -14966, -11731, 10966, 16955, -13875, -37680, -20735, 210, -13090, -34892, -37326, -52196, -104795, -146966, -127610, -77135, -51081, -38893, -1465, 43927, 50650, 22625, 817, -2805, -904, 9833, 31267, 35983, 7378, -22625, -21691, -9741, -19491, -39707, -41550, -26559, -8073, 17945, 46054, 46548, 13885, -14154, -18766, -29459, -56746, -57368, -11224, 29346, 19008, -10668, -13661, -2356, -2502, 3674, 28941, 36060, 5698, -10405, 27347, 69185, 56281, 21862, 32040, 77275, 107430, 129214, 179422, 236994, 250442, 227071, 214033, 214451, 198103, 170332, 155429, 135759, 80657, 12612, -24674, -37091, -50515, -45166, 2979, 48757, 32099]
36623C2099n1985j2926K7250N592k6013p320J9582k749l5574j5950K9005L3298
36611e691K485j2915q529j2417j8400k522K4554L6839L4256K3545l384l6650l9916
36598a8745q798J1765j71r064Q814K2033N589j4307j3943j1909j9865j3065J5057
36585d6609K8036R246r077p731q785j7534o031K0389J5996j8535k3857J2696K6740
36572b5056j0140l6986r770K6509K4463R593J4099J5558k523o154J8516K6261
36560D4370l209k0685J817J8691J916l712K5466L5087m608l2262m645K0254r950
36547F8530m3049j9927J4502m137m1327l1439M627J1294M664K4634L9698M949
36535C3019l7041j9866K6748K5643j7613l6297k0482j1797r362J7879M6820K6732
$$ y = [32099, -19886, -32812, -5562, 30, -25983, -33303, -13721, -16470, -52044, -67994, -38989, -5691, -3206, -16121, -24650, -37067, -55467, -57989, -33435, 3404, 37660, 61205, 57821, 21171, -18745, -27543, -15778, -15949, -25013, -16199, 5834, 11423, -2884, -16827, -28736, -48601, -61666, -46609, -18573, -9327, -18404, -26135, -34920, -52454, -58485, -38096, -22100, -40635, -64492, -51796, -25056, -35196, -72182, -81952, -55443, -30980, -21387, -7288, 8270, 5747, -407, 18109, 44370, 41161, 20476, 22293, 40984, 42900, 39188, 64654, 99741, 95133, 62871, 58226, 78480, 68530, 25481, 5554, 20056, 15919, -25408, -56847, -52220, -40926, -36262, -11628, 28070, 33019, -4022, -23888, 2860, 28503, 10890, -25407, -45889, -57686, -67048, -49169, -2349, 24383]
36523B4383k3781l7785q042J0532j526q302O732J7423P285j1619k7488l1588r054
36510i2830L1688M8125K4069L598K0059L7721J6571j5687j7117n882j4689k1394
36498A4232K871K4216O39l7989m0806k3261k5832k9819K524M3564M1124R628j171
36485b0080N298m815j9970j1278q00k0795m1666k2472O827r00j7300P758M2602
36472i7591K4894k1216k4970O090J0047q424N007L6986K3639k4570l0702J6173
36460h4637M5780K7916N278l13j3706l1032j5625K1476K8581O496M179K0469O516
36447B1378l0425k6764K3359N2917L5251J5750J5264q3l2654l4643j369J0114
36435D8095j6111k4435Q622K9603L837k6983k3003o922p206r295p33j645j6528
$$ y = [24383, 602, -37183, -45225, -34693, -36219, -44521, -37789, -20366, -13081, -24700, -52188, -83776, -92830, -61142, -13017, 11052, 14650, 34709, 72430, 89001, 73314, 56197, 50315, 35626, 14232, 17103, 41319, 41958, 3969, -36837, -60098, -85930, -115749, -113225, -69661, -28537, -18909, -20080, -14782, -19597, -39567, -50845, -51645, -72440, -114106, -136578, -129751, -130651, -147951, -140193, -97591, -72697, -93913, -118883, -112793, -102746, -111170, -106163, -69177, -45538, -70108, -100810, -84637, -38857, -10941, -5663, -5976, -19682, -50714, -66339, -44863, -16282, -9786, -5607, 14862, 21378, -9047, -35811, -12452, 40465, 75716, 91466, 106730, 106647, 73993, 39350, 37981, 48095, 31984, 7549, 16171, 45774, 49611, 22628, -375, -7297, -14503, -23798, -24531, -26176, -42704]
36422d2704j5352P879J6231m266j7923k981J4424J2112L535l93p961j2616L369
36409d6646K3903J5435r597r270R269N49l0153k9963L648J4916p866j1653K0012
36396e7416L5153R936j0501J71O150j0331r210K5365M2082P879l4472l9399k3874
36383e8467j7242q900J1586K0679O538n139j882n091j5864l991K4894K1759j8661
36370d9781l7376r604J3415j994j5415O445K8410J6764p81L338L038k0382k9196
36357i3119L421L7707L3199J2815R701Q298r586j7877J346J4891J82p127J9100
36344A2951L8156J0730l0033l4956j5683p460n352M563J57l0581m5776j2928K8532
36331h7680K8010M119M164K4653L3229L2011L9034M0899K0534p80j187k423k5880
$$ y = [-42704, -58056, -50177, -33946, -38212, -56135, -59116, -44692, -32580, -29045, -29438, -37399, -50015, -46646, -22743, -7308, -16905, -26175, -16906, -16357, -46510, -76473, -72825, -57909, -65775, -77428, -57416, -22263, -12327, -22828, -22657, -16507, -26838, -36048, -10683, 31399, 39278, 4806, -34593, -58467, -75709, -84609, -73023, -52344, -45806, -50945, -52827, -57918, -73782, -77773, -52879, -31120, -49781, -87157, -96761, -83346, -85340, -100755, -94310, -65900, -49136, -49917, -46579, -43541, -63923, -93119, -89698, -51991, -18792, -5977, 3724, 12022, 2436, -15441, -14095, 796, 978, -6149, 12951, 51107, 61837, 31804, -3152, -18835, -26295, -31647, -27084, -26927, -57508, -103284, -116212, -87680, -59670, -55551, -51387, -26734, 6495, 38506, 77540, 118439, 138973, 138193, 137006, 134583, 108703]
36318A08703m3395k4589N108O535j0640j8136k1642l2334k8786k42J6463k390
36306d5345j7785K600J7432j7358o0171m4324J3258M4823L9956L8567M2612K0461
36294C4726j6169k1751K566J1815k597m289J6220K4856M946j8752k2984j0580
36282a993Q218K3680K2809Q271M966J8873J7177j6223m1460k3029Q009M541j9323
36269A4516k0101k422j422j3626r319O882R633P207K1656L4859J6210j4992j7721
36256C1360j524o753k9683l2989j5992q046n350J7299M2700K9814r941k4614p049
36243b0768O75j2386j2018Q762J2690j2056k7542j0537J1746R917p330j7705j4484
36230i1036j097J3310J1879p904j8503K43K4290K2347P419P804J2808P34n708
$$ y = [108703, 65308, 40719, 45827, 52362, 41722, 23586, 1944, -30390, -59176, -59418, -42955, -45345, -63130, -60530, -43098, -60456, -120627, -164951, -151693, -106870, -66914, -28347, 14265, 34726, 18557, -3194, -628, 11187, 8590, 4301, 20521, 45377, 50323, 31571, 8587, -1993, 6225, 29905, 52714, 60985, 65951, 84824, 102001, 85778, 44318, 21289, 29298, 33839, 14516, -5585, -8007, -9429, -23055, -32374, -25492, -15859, -8652, 13004, 47863, 64073, 49081, 31360, 29836, 23083, -6600, -39589, -55581, -63627, -68977, -51678, -8978, 20836, 10895, -13719, -20768, -20093, -32479, -44497, -35735, -23045, -35101, -62643, -73180, -61434, -51517, -58847, -76552, -91036, -92133, -78823, -66944, -74848, -93351, -93108, -68818, -46471, -39052, -31248, -18440, -17706, -23414]
36217b3414K3491N4767L0764l0764n4619k2443P221j257j6278q889L406M062P056
36204b6897J6726J2607n311p397J1254J6888m320k1649j2495N171J0905J0405
36192E887R757O42j4431j8755j2854j2750j3302M803K8972K3858o959j8755L641
36179b0246K2860J2177o127n084O978J1626Q729J229j5168l1500k5980J585K4088
36166a4833K4969J4448L482r294k1052k2772j4066L443L6815P6986Q3236L4314
36154A95676k3470k9233O826K5592J2422M946J5386J4509l639q089P867J3519
36142B32312J49m903N929P803l902n996J47j0494k6736r314L0395L1746j6469
36129B30667n0733l1423L251J1978J0249J8962J7540q686k9128j8022L401J0562
$$ y = [-23414, 77, 54844, 85608, 54844, 225, -22218, -14997, -16254, -32532, -41421, -38015, -33953, -26897, -10171, 2436, -2875, -10272, 982, 17870, 13550, -8099, -20594, -15423, -4518, 5887, 15644, 16286, 1855, -16900, -29754, -42504, -55806, -51003, -22031, 1827, -5132, -23887, -20246, 2614, 14791, 8664, 3580, 10558, 22184, 30913, 32142, 16974, -14526, -40506, -38921, -14833, 10136, 24584, 28066, 18772, -2280, -25052, -39118, -35675, 1140, 78126, 161362, 195676, 172206, 142973, 149799, 175391, 187813, 192759, 208145, 222654, 219015, 210926, 218793, 232312, 232461, 227558, 233487, 241290, 237388, 231392, 231539, 221045, 194309, 184995, 215390, 247136, 230667, 179934, 148511, 151762, 163740, 173989, 192951, 210491, 201805, 172677, 154655, 158056, 168618]
36117A68618J4023K1822J3990j0725j4095J7563L7914R892l5010m7729k9918j1793
36105A34552k282J26j4125l8583m0438j2444M971j1367k4729j531K7159J6023
36093C7332j9343k9767q508R341N023q713j7257j5800m402N037n251k8466l4038
36080a14812j4151L465N776J6537M4815N5345K2888k2505l9531l1078k2238j5438
36068a10927j452J3467K1960L0155L4399J5790j9626l3162j1080J0096K614j1008
36056e8774n239M187k508j0715o080n246j5742r632K3028L9820J0138k8802k8448
36043i4013k382O846j537q81Q547J0581J2346K5488L2633J5294r979k1472k8292
36030d6821l8926k9871J1638M9824N0942L6176L7482L8156R004l1240m5411l6570
$$ y = [168618, 182641, 204463, 218453, 207728, 193633, 211196, 249110, 259002, 223992, 176263, 146345, 134552, 132270, 132396, 118271, 79688, 39250, 26806, 31777, 20410, -4319, -5850, 21309, 37332, 17989, -11778, -20286, -10945, -5922, -14635, -31892, -47692, -52094, -47057, -52308, -80774, -114812, -128963, -125498, -119722, -103185, -58370, -3025, 19863, -2642, -42173, -73251, -95489, -110927, -112379, -98912, -76952, -46797, -12398, 3392, -16234, -49396, -60476, -50380, -47766, -58774, -64013, -59826, -62334, -73049, -79129, -84375, -100117, -109749, -86721, -46901, -36763, -65565, -94013, -96395, -89549, -91086, -91967, -83420, -72839, -60493, -35005, -2372, 12922, 2943, -18529, -46821, -85747, -115618, -103980, -54156, -3214, 32962, 70444, 108600, 117604, 86364, 40953, 4383]
36018D383k6538j0548J4443J4957k5511n5401k3602L3953M6047J5100o33R836
36006c514N244k1586l1256j1799L845j497j0072j1916j2887l524K7070N2720L9852
35993B0680P839L718K5155K7780K743j4772j1817j0618j4349r69K3625K3949o028
35980G6936l4263m5475n2792n2624k3716K1535L8740J5566j2943k0594j5760o770
35968a12160R981K1814Q127j5969j1545K1628M0988K7143Q026P818J4650R281
35956B9782j0613l9072o0909m8031L160M1625J8682l4181m1297Q674N2189M9276
35944c0715K6770J4587M482r900j0888M194J2759J1859K2781L8604K3484j9461
35932H8556l7954j0643J8410J0924j2909k1144j9337k2162k0710r042l736r821
$$ y = [4383, -22155, -32703, -18260, -3303, -28814, -84215, -107817, -73864, -27817, -12717, -13350, -3514, 1730, -19856, -51112, -62911, -59066, -60563, -70635, -82551, -95438, -98962, -71892, -19172, 20680, 28519, 32237, 57392, 85172, 87915, 73143, 61326, 50708, 36359, 35390, 59015, 82964, 76936, 42673, -2802, -55594, -108218, -131934, -110399, -71659, -56093, -69036, -89630, -105390, -112160, -102179, -80365, -72238, -88207, -99752, -78124, -37136, -9993, -1967, 5851, 20501, 29782, 19169, -19903, -80812, -128843, -125683, -84058, -65376, -99557, -140854, -132180, -79991, -30715, -3945, 10642, 15124, 5224, -5664, -1470, 11289, 23148, 45929, 84533, 108017, 88556, 50602, 39959, 58369, 69293, 56384, 35240, 15903, -6259, -26969, -36011, -39747, -49568]
35920d9568n634J4881K5131J3489M741J0423L886k6646m6217k8383m66L372l613
35907h4604O993K4726K0317l594k0170k0502j6401j4341j1896q855m514L418P647
35894a21776k176j5598r186J5325K9635K2254J1152O660j567j2258p686P428M383
35881g3410j8288k6149p464O387j288m127J2307J8349l263j7519M665L1007J7959
35868f0834j7513k5526J060K5073K3213N149j4183k6421k2492j932J7498K0082
35856g6826J1930N955K650p41o15J396k094m782O956K1360R118k5495m0297j7503
35842a08988J0563J7045J8059L0066L4257J5260m733m625q28j1614k1088j2683
35830c9309k527m674o67J9175K3926n301k9352p580L2598L6113L923j8205j4351
$$ y = [-49568, -55202, -40321, -15190, -1701, 3040, 13463, 17349, -9297, -55514, -83897, -84363, -80991, -84604, -77611, -52885, -32568, -36162, -56332, -76834, -93235, -107576, -119472, -128327, -132841, -129423, -121776, -123952, -139550, -148736, -133411, -103776, -81522, -70370, -63710, -65277, -77535, -85221, -77793, -73410, -91698, -117847, -125311, -118924, -120212, -124339, -112032, -93683, -96946, -114465, -109800, -78793, -60834, -78347, -103873, -102813, -77740, -54527, -49378, -63561, -89982, -112474, -114406, -96908, -76826, -64896, -58941, -56291, -57032, -57647, -56251, -58345, -63127, -56171, -34811, -25693, -51188, -91485, -108988, -98425, -81380, -63321, -33255, 1002, 16262, 11529, 6904, 6076, -5538, -26626, -39309, -41836, -46510, -47177, -28002, -4076, -9377, -38729, -46309, -13711, 22402, 26325, 8120, -6231]
35817f231p941r829p688K1K811M719J5721K5931K0667P458j877j5683l7022m0512
35803d9455j3440Q389p929l2374j6918K2298K8175n763k9723j9445l027j779O7
35790a20924J5400L0153L0904J9691l263l5290n0491k4548J8416K6890o132l4917
35778a34111k9579q530O246K0281L6650L6305J0859j6641k4332j9532j7804j7880
35766a58068j2233j655J2371L0316M2185L4041J3222L762J0807J4531N624j232
35754f329J020l753k3140l5089j9029J1318K6750J9830M747p864j6327j5862j544
35741f5272J6683J8779Q61j4139l277K2200K4296j2878n5268n7153j9190J5780
35729a28578K2577J9248K5992L1757K0875N194L798J0257N640j0367k3998k9090
$$ y = [-6231, -14172, -24001, -31689, -31668, -28857, -24138, -8417, 17514, 38181, 45639, 43762, 28079, -8943, -49455, -62895, -54506, -62435, -94809, -111727, -89429, -61254, -67017, -96740, -116185, -119212, -120991, -120924, -105524, -75371, -44467, -24776, -28039, -63329, -113820, -138368, -119952, -93062, -99194, -134111, -163690, -172220, -165974, -145693, -109043, -72738, -61879, -78520, -102852, -122384, -140188, -158068, -170301, -171956, -159585, -129269, -87084, -53043, -39821, -36059, -25252, -10721, -5097, -6329, -5309, -9062, -32202, -67291, -86320, -75002, -48252, -28422, -23675, -31539, -47866, -63728, -65272, -48589, -29810, -28949, -43088, -46365, -24165, 131, -12747, -68015, -125168, -144358, -128578, -106001, -86753, -60761, -29004, -8129, -2935, 863, 11120, 16760, 6393, -17605, -46695]
35717d6695k4390n858J7683K0433m728k5693j3128J5962K6577J9246K0436L3353
35705C3198L5561J8675l236k0251l1415k8601n318K2702L2963K6633J9029J0148
35693A10088p119k0682j3327N141J1213N109L799O222m79q762j573J0469O31k7428
35679G3302m1230k7908p913o14o912k2893l9370l3784K712L6084K5033j8176m1322
35666a02991k3579O902K4080K9236K4284M985j3326o156J6492J7842p151k3017
35654e2399j1935K755K899J838Q846Q721m106q745M880J5824Q040n054q879r039
35640d6354q325M938K7637L2693R036j7012j8743k368J1646J5074O998j1979k9530
35627b6289l0439k1134j7698j0862J8199M8175L4580j5789m3710k6873j0112k1266
$$ y = [-46695, -71085, -76943, -59260, -38827, -43555, -69248, -82376, -66414, -39837, -20591, -155, 33198, 68759, 87434, 84198, 63947, 32532, 3931, -1387, 21315, 54278, 80911, 99940, 110088, 102969, 82287, 68960, 74101, 85314, 90423, 94222, 100444, 99965, 91203, 89630, 100099, 100730, 73302, 32072, 4164, -3749, -4363, -11275, -34168, -73538, -107322, -104610, -68526, -43493, -61669, -102991, -126570, -119668, -95588, -66352, -42068, -37083, -50409, -56565, -40073, -22231, -29382, -52399, -64334, -61579, -58680, -56842, -47996, -39275, -43381, -52126, -47246, -31422, -23382, -28436, -37315, -46354, -54679, -49741, -22104, 10589, 19625, 2613, -16130, -18498, -6852, 8222, 15220, 3241, -26289, -56728, -77862, -95560, -106422, -88223, -40048, -5468, -21257, -64967, -91840, -101952, -123218]
35615a23218k1775J8052N5924M5187J4893J8270M0310K6804j9580m3479k6012
35604a4624l425J495N322J5696J3295m841j1890K297J2009L77j2469n293J0303
35591H252J2340R53j0615j8043k1680j6910m773K563J342O005K2874K9629M417
35578A6354l3211l8455j225L5546L0189n193k6726j9798j0264j6928k4052j3204
35566a06967M243Q101M139J1542K6798K7815R944q134j3967j2651p292P497K7198
35553b1734L3826J8646p153k8473l7972l1099q401J4416J7621L311o479p95Q301
35540d5985Q016J512l077n494r494j5504j8682r219J7306M2855L7822L806j7044
35527a3182P13K4219J2051j8958k2604n27M906j3241j7178N525K0805Q943p159
$$ y = [-123218, -144993, -126941, -71017, -25830, -10937, 7333, 47643, 74447, 54867, 11388, -14624, -18049, -16554, -11232, 4464, 17759, 12918, 1028, 3325, 15334, 15711, 3242, -2051, 8252, 20592, 21545, 10930, -7113, -28793, -45703, -50476, -47913, -46571, -40566, -17692, 11937, 16354, -16857, -55312, -56537, -20991, 9198, 4005, -22721, -42519, -52783, -69711, -93763, -106967, -102724, -94623, -90484, -78942, -52144, -24329, -14385, -22519, -36486, -49137, -56429, -48932, -21734, 12092, 30738, 23585, -4888, -42860, -73959, -82360, -67944, -50323, -47012, -53491, -54286, -45985, -37969, -36457, -39534, -45028, -54522, -70026, -88708, -97927, -80621, -37766, 56, 3862, -13182, -12469, 11750, 23801, 4843, -17761, -18288, -13382, -26623, -43801, -38276, -17471, -8528, -15687]
35514a5687r674j1336j6963r481P664M521j8801k1197J0236L2624J7274n273l801
35501c9894J565j3710k7227j1459J2980J3240n4J767J4080J6579J4577K1327K5574
35488B9345J5642Q380J6882K0471N709K129L2379O2182N0813J7885L633n301m4771
35475B15378r1324q4318k2785K7134K4532m086j9654j5111J780K3016K9667O871
35463I1100k5680l4135j9767j0608j0737k091Q660l711k8346k2667J8113M5063
35451E194K5874j1911k7290j8065n254L610J2745K0664K2260J5385j061k1698
35439B0453k9357j4479N722J1218J3220L2865N4073L8114j3718n3014m8606k1627
35427e136n594n651j1179j7673j9625p148J4526K3075R376q585j1622j579R594
$$ y = [-15687, -25361, -36697, -53660, -63141, -55477, -50956, -69757, -90954, -80718, -48094, -30820, -36093, -39894, -38329, -52039, -79266, -90725, -77745, -64505, -64559, -62792, -48712, -32133, -17556, 3771, 29345, 44987, 53367, 70249, 90720, 96429, 98558, 130937, 193119, 243932, 261817, 265450, 260149, 215378, 124054, 39736, 16951, 44085, 68617, 64531, 44877, 29766, 31546, 54562, 84229, 91100, 65420, 31285, 11518, 910, -9827, -11918, -3258, -6969, -35315, -57982, -39869, 5194, 31068, 19157, -8133, -26198, -31452, -27842, -15097, 5567, 27827, 43212, 42151, 20453, -8904, -23383, -17661, -6443, 6777, 39642, 93715, 131829, 118111, 65097, 16491, -5136, -10730, -16381, -27560, -45233, -64858, -72006, -57480, -34405, -25029, -33614, -45236, -46815, -37221]
35414c7221J5367J3151L846k572L850J6477J9261R013m208j3697j6770p973Q297
35401F821R814j4287l7777k9008K356K0610J5178L102q092k1599k4628l110K2001
35388e8619J7050q513j4362L861R554r663k3819j6794q529p689N001K7406K3778
35375f1338j1324k7589Q023N6766O4895L7940J7984J7443J6796N972j0018k9465
35363H6085m5642l7962k213K8479K4135J883k623R243Q433r160j8907j2859j1358
35350A7534k3927l0661j4847R101J5894M063n210L29P158l485k5408l1603j1983
35337i3045R464R106j08R037K9914K8915J85k1417j1722R967J5247O306J679M664
35323a808P639J1202J8073J9977R010p000j5384j6016j4669q016J0807L6540N2795
$$ y = [-37221, -21854, -8703, -4857, -7429, -3579, 12898, 32159, 41172, 36964, 23267, 6497, -1476, 6821, 16635, 2348, -35429, -64437, -62081, -41471, -26293, -23191, -31283, -52882, -77510, -80620, -58619, -41569, -50082, -64444, -60583, -51029, -60692, -84511, -101305, -109834, -117523, -112522, -85116, -61338, -72662, -100251, -92228, -35462, 29433, 67373, 85357, 102800, 119596, 125568, 115550, 86085, 40443, 2481, 268, 28747, 52882, 54765, 52142, 61385, 69818, 60658, 41751, 28892, 17534, -6393, -37054, -51901, -42800, -26906, -22843, -28053, -27724, -20566, -24051, -49459, -81062, -93045, -83581, -74475, -74583, -65546, -35632, -6717, -6532, -27949, -39671, -29704, -14457, -8151, -6472, -1808, 5831, 17033, 35106, 55083, 64093, 57093, 41709, 25693, 11024, 3008, 13815, 50355, 103150]
35310A03150M7959K6750P853O735J5028N803k8192n3767l6522Q545L3625K0352
35298A57319n052j6609j4493m874R525J3182j0122m0376l6149J687K3564N599
35286H3201j5096n080J1603R52k0457j8395k852o416k2607j8112O044J7239J0457
35273B0481J4123L3486L6652R700j6819j5835l008m691j4835j0696P829K1209
35261G7596K0355R823r081l3500m4030k2695J3635K6717J1016M375K8542M9452
35249A32205K6791j9724l4522o293K1148J8864O154K010q538l4025m5654k2893
35237C5523L720m090l1754l6612j3495P600J5003K2178K8594J6840j0122k4225
35225I160r474K0395M1075L6817R295j6615j1648J7295K8625M382k5361l5101
$$ y = [103150, 151109, 177859, 185712, 192447, 207475, 213278, 185086, 131319, 94797, 103342, 136967, 157319, 152267, 135658, 121165, 116291, 125816, 138998, 128876, 88500, 52351, 54038, 77602, 83201, 68105, 63025, 74628, 75580, 55123, 36728, 33876, 27460, 4853, -13259, -7215, 10024, 20481, 34604, 68090, 104742, 114442, 97623, 81788, 78780, 74089, 59254, 48558, 56387, 77596, 97951, 107774, 98693, 65193, 21163, -1532, 12103, 38820, 49836, 54211, 82753, 132205, 158996, 139272, 104750, 98457, 119605, 138469, 144623, 146633, 138095, 104070, 58416, 35523, 39243, 35153, 3399, -33213, -46708, -39108, -24105, -1927, 26667, 43507, 33385, 9160, -314, 20081, 61156, 97973, 107268, 90653, 79005, 96300, 124925, 129307, 103946, 68845]
35213F8845l7197l6863q932M2461O2746L5566K5061O7280R6026N8636K3720O7537
35201D64886J33957J37149J25257J87440K78080L26029M36895P16984R24452O36996
35191D368125j33629q07757r03364n84875l33529l02931k89847j83423j00318
35182G28452j08104j13896o5628l5402n4557n4180j6306j6729o9784q4471k6273
35171H3122J9028k628k9717j1143P226j3680k8053m66J9604j0459m5834l4463
35159d7463k333O852Q636L0095M5775K4173j1620k4701k1418k1564j6383J203
35147b8748Q318o543j6118k549J0548M510k415J492l773k1836j9652J2135L2262
35134c2369J7143J442J2686K1340J52k0317n384K1627K2444P543N798Q074p227
$$ y = [68845, 31648, -5215, -14147, 28314, 91060, 126626, 151687, 218967, 314993, 373629, 397349, 464886, 598843, 735992, 861249, 1048689, 1326769, 1652798, 2089693, 2806677, 3731129, 4368125, 4234496, 3426739, 2523375, 1938500, 1604971, 1302040, 1012193, 828770, 728452, 620348, 506452, 440824, 405422, 350865, 296685, 280379, 263650, 193866, 109395, 83122, 102150, 99522, 69805, 58662, 65888, 52208, 24155, 23689, 43293, 32834, -13000, -47463, -49796, -42944, -34308, -4213, 41562, 65735, 54115, 29414, 7996, -13568, -29951, -28748, -20430, -26973, -43091, -45640, -35092, -30582, -32997, -31505, -35278, -57114, -76766, -64631, -32369, -15226, -13784, -1098, 20242, 20394, 77, -5307, 16320, 38764, 46307, 52105, 60179, 52952]
35121E2952k4827j9596n508r779k2021j4405P629J5896L461j6079l4353m4002
35109a10632l1512k022J3920M221l554R708K0894R140l853O125K2254K2507K2273
35096b0531L7186L9192J670m0492l2455J6746M5933K7343p661k2354j1081J4556
35084D8052L9095M6237L9020M8243R0139J27298J06518K8577n1982r1245r0341
35073C39611p1181m8712k9502j6586j1786j9269l7519m5780k2804J2753J3676
35062F2901k7087n5847l2175J3686L1270K1457J4545Q595j7472m8559m5867q872
35050h3425K1888K3246J1275M800K481j559p643j6778k5608k1454k311J1212N922
35037g7954l06Q810J4462l427k1216m548K9015K9461r204m0410l5060j4818o669
$$ y = [52952, 28125, 8529, 3021, -6758, -28779, -43184, -35555, -19659, -16198, -32277, -66630, -110632, -142144, -144166, -130246, -126025, -129579, -119871, -98977, -89837, -93690, -87565, -65311, -42804, -20531, 16655, 55847, 57517, 17025, -15430, 1316, 47249, 74592, 66931, 44577, 33496, 48052, 87147, 133384, 172404, 220647, 310786, 438084, 544602, 573179, 521197, 429952, 339611, 268430, 219718, 190216, 173630, 161844, 142575, 105056, 59276, 36472, 49225, 62901, 35814, -20033, -52208, -38522, -7252, 14205, 28750, 37345, 19873, -28686, -74553, -83425, -61537, -38291, -27016, -22216, -19735, -21294, -28937, -45715, -71323, -92777, -95088, -83876, -77954, -78260, -69450, -54988, -58415, -79631, -84179, -55164, -25703, -34907, -75317, -110377, -125195, -131864]
35024a31864m704P628K7732M1259L8187J4055k4561n2219m4643j1423J1559O726
35012a22268o997m565J3519K5343J2749j8759l9676k3875J6456L7980J9893q844
35000i9044j3165l45J148r056q738M663J2219Q405O245R677Q417l07p472p279
34986i4632J485K0336L9437L6280Q742r117P141L0258K0243j2666k6149j3389
34974G969m581p463J912K5389L0345M349k2280k6002k1763k4307j6017J6866M5528
34961I945L2503j0111l0999p679K3214J4720k7417m9984k1181K6012L6729O561
34949B313k0012j9941j8522l3436l7094n649L2512L8380K3182K2022L0777K0156
34937C4688m353j1522m153j3428l5085k8846J0632L6659K0522q993j5849m708
$$ y = [-131864, -136568, -128940, -101208, -59949, -21762, -7707, -32268, -84487, -129130, -140553, -128994, -122268, -129265, -133830, -120311, -94968, -82219, -100978, -140654, -164529, -148073, -110093, -90200, -99044, -112209, -112554, -111406, -120462, -129200, -124537, -112318, -103913, -97668, -87991, -79574, -79881, -87353, -94632, -93147, -72811, -33374, 2906, 11648, 2531, 9672, 39930, 60173, 47507, 21358, 7969, 3388, -4075, -2163, 23226, 53571, 57920, 35640, 9638, -12125, -36432, -52449, -35583, 9945, 42448, 32337, 1338, -6341, 16873, 31593, 4176, -45808, -66989, -40977, -4248, 2313, -17699, -37640, -56162, -89598, -126692, -132341, -99829, -61449, -38267, -16245, 14532, 34688, 30335, 18813, 14660, 1232, -33853, -62699, -52067, -15408, 5114, -3879, -19728, -24436]
34925b4436L154N485P435L876n484p643J058O959M691M742O301o453k8766k9263
34911e8344K114L0472K2434q813k6627j7756M171K2262K3803J947l0385m2911
34899g7633k1673J1930K8860K4919J3392J765q788j3887j1283o937n123j669N146
34886f0981P986K465m626n594q59N984J1378Q401p013k4316k5538o317K0519L9616
34872c8895M0002J5972k0913l9448k1573R198J7338N346L411J5558J4497p795
34860g302k4356j7854m182K148J1194K8190L2849J0871j8413k7924j7450m111
34848c6340L672N511j268j4559k2496j8104q089j3O133R826R726J3072K5778L2996
34834E845J4610j8135l0726j5641k895j0851j9458q188J0059J3494M847p08j051
$$ y = [-24436, -21282, -15797, -8362, -4486, -9970, -17613, -16555, -9596, -4905, -163, 6138, -315, -29081, -58344, -56230, -25758, -3324, -12137, -38764, -56520, -52349, -30087, -6284, -4337, -34722, -77633, -99306, -87376, -58516, -33597, -20205, -18440, -27228, -41115, -52398, -59335, -64458, -66127, -60981, -52995, -50530, -55156, -60750, -61609, -55625, -44247, -35846, -42859, -67175, -92713, -99030, -78511, -38895, 1107, 17079, -3834, -43282, -64855, -55657, -38319, -32973, -29562, -14004, 493, -7302, -31658, -49512, -53694, -51546, -40352, -12162, 20687, 31558, 13145, -14779, -32229, -36340, -32668, -27157, -28425, -42984, -65480, -83584, -91673, -91686, -85553, -75727, -66001, -52929, -27151, 5845, 20455, 2320, -28406, -44047, -46942, -57793, -77251, -85439, -75380, -61886, -57039, -57747, -58798]
34821e8798k122m660j0663k5447m0722l4680k201L2640M5319L5675J7410K557
34809d5692J305J4812K4532J3279l319J940J6943L747l2294l8754J595L8002K9324
34796B5420K876j470K729j3302l0835j6660J0428P109j8226j8254J1123K2161
34784a6901n401l1649k0281R993K1995J4532J2670K4581L4828L1311J7246j628
34772I1296k4643m6436n1685l1163L82J6809J4694J7824L6531M3140J1998l2676
34760D6071m3986j9921m041j8040l5470l1349j6111m535R174K4466K0260o902
34748h0384k4039q814J4618J5400L182M333J5489J4007k781j7842k0519j0588
34736i7938P902K0292R975j1685j1262J5397L1491J7798K324N253n9l2666n4530
$$ y = [-58798, -60920, -65580, -76243, -101690, -142412, -177092, -179293, -146653, -101334, -65659, -48249, -45692, -44387, -29575, -5043, 8236, 4917, 6857, 23800, 27547, -4747, -43501, -41906, -3904, 25420, 28296, 26826, 29555, 16253, -14582, -31242, -20814, -13705, -31931, -50185, -39062, -16901, -22302, -53951, -74232, -64239, -42244, -27712, -15042, 9539, 44367, 75678, 92924, 91296, 66653, 20217, -31468, -62631, -62249, -45440, -30746, -12922, 23609, 66749, 78747, 46071, 2085, -17836, -21877, -39917, -75387, -106736, -122847, -127382, -118208, -93742, -73482, -80384, -104423, -113237, -98619, -83219, -80037, -75704, -60215, -46208, -48989, -66831, -87350, -97938, -90036, -69744, -59769, -71454, -82716, -67319, -35828, -18030, -15706, -10453, -10512, -43178, -97708]
34723i7708k5590K6453M5898L1002K0221J9704N092j8825k1683o340p467k9925
34711e9168l9096j7234J4351L2596L2935J3542k0544m0292k1283J3351K0940N036
34699f4866N219K4769K4319o159k5981j0614J2198J4616Q772Q637k424l2629m9344
34686i3487k5538J0102J1762j3188j5739J8953M8728L6053N62j0617J1835K9847
34674I273J3946j5890k2213o458l828k4711l6081j3650J9070K5781O788j1206
34662e9179j4111l954J7350M0738M3238J5360j9371l4922l3868k6443o667K1091
34650f0738K4030r856l4573p539L7814L8172j127j9210j236M398k4769m8210l3905
34637a36749p669l891j3818j0963P368K7019L7189K9409M014j5345n182J7430
$$ y = [-97708, -123298, -96845, -50947, -19945, 276, 19980, 25072, 6247, -15436, -21776, -29243, -59168, -98264, -115498, -101147, -68551, -35616, -22074, -42618, -82910, -104193, -90842, -69902, -64866, -59647, -34878, -10559, -16718, -42699, -53313, -41115, -26499, -17727, -9090, -11514, -44143, -93487, -119025, -108923, -97161, -110349, -126088, -107135, -58407, -22354, -21792, -32409, -20574, 9273, 23219, 7329, -14884, -21342, -25170, -49881, -85962, -99612, -80542, -54761, -47973, -59179, -73290, -77244, -59894, -19156, 24082, 39442, 20071, -14851, -48719, -75162, -81829, -60738, -36708, -46564, -81137, -88676, -50862, -12690, -13817, -33027, -34263, -29865, -54634, -102844, -136749, -144418, -148309, -162127, -173090, -165722, -138703, -101514, -72105, -68091, -83436, -88618, -71188]
34625g1188J5664n110l275K4988L1608o097m6432m7437k2797m010R116K5295K8234
34612g1441O395j3552l090K0521K0828m86r599N421J9612R531j6621l0894j6769
34599h0144J2491K6595J5153M278J9350M1547L1864n665k4072l681J8257N666
34587F1639k4419l3027j5688m77n262j9210k0147R11K7758L2796J2481k561Q082
34574B2876J8651j032k7307j5625J9427J8282k6900n4678k9463Q987J7412J1026
34562c8344J8333K6415J2738j0045k0353k3010k4679j1509J5381K1838o000k9821
34550f9056j8003M449N191R72J7308L2747J8118l920K626J9199N586k4014k4084
34537c2881j23R55k4330k9396Q03K5659J8410K533J313J969p878j1470L590J7572
$$ y = [-71188, -55524, -60634, -63909, -38921, -7313, -13410, -59842, -107279, -130076, -134086, -124970, -99675, -71441, -65046, -78598, -81688, -61167, -40339, -40825, -50424, -45003, -25391, -15860, -32481, -63375, -80144, -67653, -41058, -25905, -21627, -2277, 39270, 71134, 65469, 41397, 37716, 55973, 61639, 37220, 4193, -11495, -11972, -17234, -36444, -56591, -55680, -27922, 4874, 17355, 14794, 22876, 41527, 40495, 13188, -2437, 16990, 35272, 8372, -46306, -75769, -66782, -49370, -38344, -20011, 6404, 19142, 9097, -11256, -34266, -58945, -70454, -55073, -33235, -39235, -69056, -87059, -82610, -77419, -76447, -59139, -26392, -8274, -12194, -9568, 9631, 15217, -8797, -32881, -33004, -32049, -56379, -85775, -84972, -59313, -40903, -38370, -37057, -35088, -42966, -54436, -50846, -33274]
34523c3274J0093o862j0721k223L923N897J1458J7641J2259o454k3760k4474j0887
34510e7384q83n786j4719j0390L212O115m137p491L237Q305l599j2943l532N712
34496i4283q557l0311k3149J6117N1523N2523K3248r219j9333j260K4457K9847
34484A1603J2998j808l968j2088l5684m9460k9474Q510L2991L8853L9207L4866
34472D6546K0500N425J093J713m00J363O165p668m5186o8660m4804K085K2536
34459e9292J0727J34L216n79j9782l3914k6302m900J3102J7047O021o726j538
34446a02786J9610K8859J4124K470J7420L7398K7960n709l1514l6291k6729n539
34434f0727J9100K2128l968k5425j4720L898k443j5861j844K4117K2566K164K631
$$ y = [-33274, -23181, -30043, -40764, -42987, -39064, -33167, -21709, -4068, 8191, 1737, -22023, -46497, -57384, -58267, -64053, -78772, -89162, -85950, -79835, -83972, -91463, -88226, -79921, -83520, -96463, -99995, -94283, -102840, -133151, -156300, -140183, -88660, -36137, -12889, -22108, -41441, -42701, -18244, 11603, 24601, 22793, 18825, 6737, -28947, -78407, -107881, -99371, -66380, -27527, 11680, 46546, 67046, 72471, 73564, 75277, 74877, 76240, 82405, 74737, 29551, -39109, -83913, -81828, -59292, -48565, -48431, -45215, -45794, -65576, -99490, -125792, -130692, -117590, -100543, -94522, -101248, -102786, -83176, -54317, -40193, -37723, -20303, 17095, 45055, 39346, 7832, -28459, -55188, -60727, -41627, -19499, -23467, -48892, -63612, -59714, -62157, -78018, -79862, -55745, -33179, -31015, -28384]
34421b8384J9540J2340j8548k8935o436J3813J3756J2117J3014m194l2800l5508
34409g0225p789J1551P882J2127L6352M5438J9022j0254j0355K917K263p169r668
34396B2092j0502j7821k1899j5343p922m695K837J1170J763k4318m1126l7494
34384a43258k7643j4837J3943M6483M4750L853l2494l5284k4515j8489K313M8163
34372a37015Q0484O0381O900l0378l3777k0968p427M226J3010K1131L3358M1315
34360C1240K8038j328j8367j1569J66L259N673P159q135l4181l8483j4348K434
34347d8442q863k0860q145J0977J2924R302J5158J4087p951k7469k0395l822k707
34334h6206m514J2045L0278K2014n61m366Q868R700o570j5336n539Q201J4002
$$ y = [-28384, -8844, 3496, -15052, -43987, -50423, -36610, -22854, -10737, 2277, -1917, -34717, -70225, -78014, -66463, -58581, -46454, -10102, 35336, 54358, 44104, 33749, 36666, 38929, 31760, 22092, 11590, -6231, -28130, -43473, -51395, -56090, -53253, -42083, -40320, -64638, -105764, -143258, -170901, -185738, -171795, -125312, -80562, -76709, -109203, -144487, -169002, -187491, -185178, -137015, -56531, 3850, 10750, -19628, -53405, -74373, -81800, -77574, -64564, -43433, -10075, 31240, 59278, 57950, 39583, 28014, 28180, 31439, 37112, 44271, 36136, 1955, -36528, -50876, -48442, -57305, -78165, -86310, -75333, -62409, -53107, -37949, -23862, -31813, -59282, -79677, -83499, -86206, -90720, -78675, -48397, -26383, -26944, -31310, -22442, -12742, -19312, -34648, -40187, -31986, -17984]
34321a7984J4159J0519K327m723o106q502j6583k0900j4166n385k117M536J9805
34308d5120K7747J3583j0996k2748j4709L106J6252J1589j0143k3688p795J3928
34296d8994j850m6444o0196k1087K0011J9637M266J4104L3828K8495Q080K501
34284d7649M290r062k1829n320K3105K2483k775j0588Q298J8486p85k8549l8723
34271h8618k9076j0340O409J1995R461J4543K8493K7929K786j9393j3934K206
34259e7539L220k280K362J730k0384l5805r825L4805M5396J8073m230l415j438
34246b9330p153k110J5689K1879Q335m857p562j2994k6218l2586k4164r437O048
34233a04460K2617L1449K2769N630n076j3164k6681l1513j0978J9647L1540K5089
$$ y = [-17984, -3825, 6694, 9021, 4298, -1808, -10310, -26893, -47793, -61959, -67344, -69461, -64925, -45120, -17373, -3790, -14786, -37534, -52243, -49137, -32885, -21296, -31439, -55127, -62922, -48994, -50844, -97288, -157484, -178571, -158560, -138923, -134657, -120553, -86725, -58230, -50150, -47649, -43359, -52421, -74250, -79570, -56465, -33982, -36757, -47345, -39047, -20561, -21346, -49895, -88618, -117694, -128034, -121625, -109630, -100169, -85626, -57133, -29204, -26418, -45811, -59745, -57539, -54319, -56599, -54237, -52507, -72891, -108696, -118521, -83716, -38320, -20247, -24477, -27892, -29330, -36483, -38593, -22904, -1025, 7310, 2453, -5109, -18103, -44321, -76907, -101071, -110508, -104460, -81843, -50394, -27625, -21995, -27071, -40235, -66916, -98429, -109407, -89760, -58220, -33131]
34221c3131K0869J9245N005j6637k4680j6922q681n374m008p826j2180K480L2802
34208d9038L6871m171m0825k1165K8009M3180K0188M033N199k528j5637o852R861
34195G125m833l6794l1064J3335L7212J8529L10P577J1245n589j7249j3791k0320
34182c4307l4935j8714K5324L7006k279k9093o47L2171J0384l5209l7305J502
34170h6102K3414R025o147L600K3150K7915J3049o935j0650R153K9929K3963L61
34157E3725q005j220j3421m8028o0739k7997J3041K0503M894J203J5822K9044
34145b1178K7267J3103J180R161L1912L4389L042j5795K0377P0817O5611K1203
34133B61089J6618O5062J07649J30506J74248K26350K43445K93739M93489P33646
$$ y = [-33131, -12262, 6983, 11988, -4649, -29329, -46251, -54932, -60306, -64314, -72140, -84320, -81840, -49038, -12167, -16338, -57163, -78328, -50319, -7139, 13049, 17082, 22281, 19753, 4116, -2736, 7125, 2292, -34502, -65566, -52231, -15019, 3510, 3820, 11397, 22642, 17053, -196, -13987, -34307, -69242, -87956, -62632, -25626, -27905, -56998, -57645, -25474, -15090, -50299, -87604, -86102, -62688, -53663, -59810, -56210, -33060, -5145, 7904, 969, -9681, -528, 29401, 53364, 53725, 45720, 44500, 31079, -16949, -77688, -105685, -92644, -72141, -67247, -66044, -50222, -21178, 6089, 19192, 20372, 29533, 61445, 95834, 98876, 83081, 103458, 174275, 239886, 261089, 277707, 342769, 450418, 580924, 755172, 981522, 1224967, 1518706, 2012195, 2745841]
34123B745841O74214J68614m57253p43027o15432l80615k74921k52357k01979
34114F63085j38215j06588p7109k5302N4k9765n7051l3611j034j1904m3994n3622
34102H4944m9091n1950m3404p922J9906Q535j3434n942J5497J3241n519p198P847
34089c4490J1836o98j1406j3622j4565j2858l084O644M991l917r261r005l767
34076i3202Q442J9328J2149j0393k1314o924J2525J5397R273J0392J3469M423
34064b6435j1602j6649o002Q274J4084R310N86l196k605j0848l3558n1415m2174
34051a72230j5221m57n713j1747p260J260J3112L1707L8279Q507l6833m2789O07
34038a98778L4108J0652l8800n4985l2636j2627j4720k0879j5301l675N766J2522
$$ y = [2745841, 3420055, 3588669, 3131416, 2388389, 1772957, 1392342, 1117421, 865064, 663085, 524870, 418282, 341173, 315871, 315925, 286160, 229109, 195498, 194464, 182560, 138566, 84944, 35853, -16097, -59501, -67423, -47517, -38982, -52416, -58358, -42861, -29620, -35139, -42337, -34490, -22654, -23352, -34758, -48380, -62945, -75803, -78887, -72243, -67252, -71169, -80430, -89435, -93202, -84760, -65432, -53283, -63676, -84990, -91914, -79389, -63992, -54719, -44327, -30858, -26435, -38037, -54686, -60688, -52414, -38330, -29020, -28434, -31630, -34235, -45083, -78641, -130056, -172230, -187451, -187908, -193621, -205368, -212628, -211368, -198256, -166549, -128270, -119763, -156596, -199385, -198778, -164670, -154018, -192818, -247803, -280439, -293066, -307786, -328665, -343966, -347641, -341875, -329353]
34026c29353J5460J3955J4015J7843J5317J283r488j704J7616L2959M3244N1066
34014a17787M4820J7549q739p287J2602J9410Q793N513J6504J8992L550p425p31
34001E764J759j6960l2115j3548K1189K9337R069J327K4328M8489M9247M4068
33989A71954N1539M8374M919n8124r0079p7886n3309l6108j2256K4209M7688L7196
33977E8117P160j4910j8405n513J6656K7020K819m2129o1147l6972r781j7683
33965i4768m0317l4981k126K4734L4457M0718M1353J9492j6688l4376k0505M385
33953g8622J8971K0967J3493j740j4493j1229O875K6449L8056L5727J3207j9618
33941D8043l2815j4530L815q929l2142k3188J4799L8104K8670J1056M416Q23n266
$$ y = [-329353, -313893, -299938, -285923, -268080, -252763, -251480, -260968, -262672, -245056, -212097, -168853, -117787, -72967, -55418, -64157, -71444, -58842, -39432, -30639, -25126, -8622, 10370, 13920, 6495, 5764, 7523, -9437, -41552, -55100, -33911, -4574, 4495, 5822, 30150, 78639, 127886, 171954, 223493, 271867, 276786, 218662, 128583, 50697, -2612, -38720, -50976, -26767, 20921, 58117, 65277, 50367, 31962, 26449, 43105, 70125, 72944, 30815, -30332, -67304, -77085, -94768, -135085, -170066, -172192, -147458, -113001, -72283, -30930, -11438, -28126, -62502, -83007, -78622, -59651, -38684, -25191, -26931, -41424, -52653, -45778, -19329, 18727, 54454, 67661, 48043, 15228, 698, 4513, -4416, -36558, -59746, -44947, -6843, 21827, 32883, 37299, 38122, 32856]
33928C2856o399o069j5863k5447j3511R280J0022j0014j4489M681J2323o267j6557
33915d5454N070K7388J4055j7724k4859j179K0919J7333n576k6513k9091j3943
33903g9574K20k363j2375j1470m890r982j6959L10L2374L7599Q207j2843R99K1015
33889d9732J6526M052J0602K4776K1455O538K24j691j4487l0245k9520j4619l973
33876f0094l926p093o980J220J9056L2659K3400N10n347P737N075k5390m7143
$$ y = [32856, 26457, 20388, 4525, -20922, -34433, -25153, -15131, -25145, -39634, -34953, -22630, -28897, -45454, -40384, -12996, 1059, -16665, -41524, -42703, -21784, -4451, -10027, -36540, -65631, -79574, -79354, -81717, -94092, -105562, -110452, -120434, -137393, -137083, -104709, -67110, -58903, -71746, -70747, -49732, -33206, -29154, -18552, 6224, 27679, 34217, 34441, 32750, 18263, -11982, -41502, -56121, -60094, -64020, -71113, -78093, -76873, -57817, -25158, -1758, -1248, -6595, 1142, 6217, -19173, -66316]
$$ [...]
##END NTUPLES=NMR SPECTRUM
##END=
