##TITLE=31Pdec_LR-723-R4-C1
 CDCl3, 24 sc
 2.10.2024
##JCAMPDX= 6.0         $$ Bruker NMR JCAMP-DX V2.0
##DATA TYPE= NMR SPECTRUM
##DATA CLASS= NTUPLES
##ORIGIN= UXNMR, Bruker Analytische Messtechnik GmbH
##OWNER= root
$$ XWIN-NMR		Version 3.5
$$ Wed Oct  2 16:42:48 2024 Russian Standard Time (UT+4h)  she@DPX200
##.OBSERVE FREQUENCY= 81.013821
##.OBSERVE NUCLEUS= ^31P
##.ACQUISITION MODE= SIMULTANEOUS
##.ACQUISITION SCHEME= undefined
##.AVERAGES= 24
##.DIGITISER RES= 17
##SPECTROMETER/DATA SYSTEM= spect
##.PULSE SEQUENCE= zgpg30
##.SOLVENT NAME= CDCl3
##.SHIFT REFERENCE= (INTERNAL, CDCl3, 0, 198.062)
##AUDIT TRAIL= $$ (NUMBER, WHEN, WHO, WHERE, WHAT)
$$ ##TITLE= Audit trail, XWIN-NMR		Version 3.5
$$ ##JCAMPDX= 5.01
$$ ##ORIGIN= Bruker BioSpin GmbH
$$ ##OWNER= she
$$ F:/spectra/data/she/nmr/P31/2/pdata/1/auditp.txt
$$ ##AUDIT TRAIL=  $$ (NUMBER, WHEN, WHO, WHERE, WHAT)
(   1,<2024-10-02 16:41:42.50 +0400>,<she>,<DPX200>,
      <created by zg, POWCHK disabled, PULCHK disabled
       configuration hash MD5:
       00 E9 B6 7A A2 85 ED C7 34 08 36 98 17 FE 4E 26
       data hash MD5: 32K
       1A CD 27 EF F6 EA 24 69 CB CE 66 5C 0D 0C 65 69>)
(   2,<2024-10-02 16:41:45.00 +0400>,<she>,<DPX200>,
      <Start of raw data processing
       efp BC_mod = 2 LB = 1.5 FT_mod = 6 PKNL = 1 PHC0 = 2693.475 PHC1 = 107.8875 SI = 64K 
       data hash MD5: 64K
       F4 F8 29 BC 8C 35 CB 43 2D 8A B7 D2 18 E4 D6 C8>)
(   3,<2024-10-02 16:42:06.87 +0400>,<she>,<DPX200>,
      <pk PHC0 = 5.261692 PHC1 = 0 
       data hash MD5: 64K
       52 EB F4 29 FB FB 57 71 81 B0 62 79 92 36 65 48>)
(   4,<2024-10-02 16:42:17.65 +0400>,<she>,<DPX200>,
      <abs ABSG = 5 
       data hash MD5: 64K
       74 0D 10 60 42 DB 18 C9 AD 20 6F E7 69 40 DB 22>)
$$ ##END=
$$ 
$$ hash MD5
$$ 72 0B 0B 1D 5E A5 EF 6D 2B D1 AB 17 A5 A6 47 69
##$RELAX= 
##$RELAX= 
##$RELAX= 
##$RELAX= 
##$RELAX= 
##$RELAX= 
##$RELAX= 
##$RELAX= 
$$ Bruker specific parameters
$$ --------------------------
##$DU= <F:/spectra>
##$EXPNO= 2
##$NAME= <P31>
##$PROCNO= 1
##$TYPE= <nmr>
##$USER= <she>
##$AMP= (0..31)
100 100 100 100 100 100 100 100 100 100 100 100 100 100 100 100 100 100 
100 100 100 100 100 100 100 100 100 100 100 100 100 100 
##$AQSEQ= 0
##$AQ_mod= 1
##$AUNM= <au_zg>
##$AUTOPOS= <>
##$BF1= 81.014009
##$BF2= 200.13
##$BF3= 200.13
##$BF4= 200.13
##$BF5= 200.13
##$BF6= 200.13
##$BF7= 200.13
##$BF8= 200.13
##$BYTORDA= 1
##$CFDGTYP= 0
##$CFRGTYP= 5
##$CHEMSTR= <none>
##$CNST= (0..31)
1 1 145 1 1 1 1 1 1 1 1 1 1 1 1 1 1 1 1 1 1 1 1 1 1 1 1 1 1 1 1 1 
##$CPDPRG= <waltz16>
##$CPDPRG1= <>
##$CPDPRG2= <waltz16>
##$CPDPRG3= <>
##$CPDPRG4= <mlev>
##$CPDPRG5= <mlev>
##$CPDPRG6= <mlev>
##$CPDPRG7= <mlev>
##$CPDPRG8= <mlev>
##$CPDPRGB= <>
##$CPDPRGT= <>
##$D= (0..31)
0 1 0 0 0 0 0 0 0 0.06 0 0.03 2e-05 3e-06 0 0 0.0002 0 0 0 0 0 0 0 0 0 
0 0 0 0 0 0 
##$DATE= 1727872901
##$DBL= (0..7)
120 120 120 11 120 120 24 19 
##$DBP= (0..7)
150 150 150 150 150 150 150 150 
##$DBP07= 0
##$DBPNAM0= <>
##$DBPNAM1= <>
$$ [...]
##$SUBNAM3= <"">
##$SUBNAM4= <"">
##$SUBNAM5= <"">
##$SUBNAM6= <"">
##$SUBNAM7= <"">
##$SUBNAM8= <"">
##$SUBNAM9= <"">
##$SW= 400.765351723535
##$SWIBOX= (0..15)
0 1 3 0 0 0 0 0 0 0 0 0 0 0 0 0 
##$SW_h= 32467.5324675325
##$TD= 32768
##$TD0= 1
##$TE= 0
##$TE2= 300
##$TE3= 300
##$TEG= 300
##$TL= (0..7)
0 120 53 12 22 120 120 120 
##$TP= (0..7)
150 150 150 150 150 150 150 150 
##$TP07= 0
##$TPNAME0= <>
##$TPNAME1= <>
##$TPNAME2= <>
##$TPNAME3= <>
##$TPNAME4= <>
##$TPNAME5= <>
##$TPNAME6= <>
##$TPNAME7= <>
##$TPOAL= (0..7)
0.5 0.5 0.5 0.5 0.5 0.5 0.5 0.5 
##$TPOFFS= (0..7)
0 0 0 0 0 0 0 0 
##$TUNHIN= 0
##$TUNHOUT= 0
##$TUNXOUT= 0
##$USERA1= <user>
##$USERA2= <user>
##$USERA3= <user>
##$USERA4= <user>
##$USERA5= <user>
##$V9= 5
##$VALIST= <valist>
##$VCLIST= <CCCCCCCCCCCCCCC>
##$VD= 0
##$VDLIST= <DDDDDDDDDDDDDDD>
##$VPLIST= <PPPPPPPPPPPPPPP>
##$VTLIST= <TTTTTTTTTTTTTTT>
##$WBST= 1024
##$WBSW= 4
##$XGAIN= (0..3)
0 0 0 0 
##$XL= 0
##$YL= 0
##$YMAX_a= 31901
##$YMIN_a= -27924
##$ZGOPTNS= <>
##$ZL1= 120
##$ZL2= 120
##$ZL3= 120
##$ZL4= 120
##$ABSF1= 198.0616
##$ABSF2= -202.7028
##$ABSG= 5
##$ABSL= 3
##$ALPHA= 0
##$AQORDER= 0
##$ASSFAC= 0
##$ASSFACI= 0
##$ASSFACX= 0
##$ASSWID= 0
##$AUNMP= <proc_1d>
##$AZFE= 0.1
##$AZFW= 0.5
##$BCFW= 0
##$BC_mod= 2
##$BYTORDP= 0
##$COROFFS= 0
##$CY= -3
##$DATMOD= 1
##$DC= 0
##$DFILT= <>
##$DTYPP= 0
##$F1P= 0
##$F2P= 0
##$FCOR= 1
##$FTSIZE= 65536
##$FT_mod= 6
##$GAMMA= 0
##$GB= 0
##$INTBC= 1
##$INTSCL= 9.790993e-09
##$ISEN= 30
##$LB= 1.5
##$LEV0= 0
##$LPBIN= 0
##$MAXI= 10000
##$MC2= 0
##$MEAN= 0
##$ME_mod= 0
##$MI= 50
##$NCOEF= 0
##$NC_proc= -4
##$NLEV= 6
##$NOISF1= 182.463
##$NOISF2= 159.3651
##$NSP= 0
##$NTH_PI= 0
##$NZP= 0
##$OFFSET= 198.0616
##$PC= 4
##$PHC0= 2698.737
##$PHC1= 107.8875
##$PH_mod= 1
##$PKNL= yes
##$PPARMOD= 0
##$PSCAL= 0
##$PSIGN= 0
##$REVERSE= no
##$SF= 81.0140089999434
##$SI= 65536
##$SIGF1= 159.3651
##$SIGF2= -187.1042
##$SINO= 113.3802
##$SIOLD= 16384
##$SREGLST= <1H.CDCl3>
##$SSB= 0
##$STSI= 65536
##$STSR= 0
##$SW_p= 32467.5324675325
##$SYMM= 0
##$S_DEV= 0
##$TDeff= 32768
##$TDoff= 0
##$TI= <>
##$TILT= no
##$TM1= 0
##$TM2= 0
##$TOPLEV= 0
##$USERP1= <user>
##$USERP2= <user>
##$USERP3= <user>
##$USERP4= <user>
##$USERP5= <user>
##$WDW= 1
##$XDIM= 65536
##$YMAX_p= 509926556
##$YMIN_p= -3742582
$$ End of Bruker specific parameters
$$ ---------------------------------
##NTUPLES= NMR SPECTRUM
##VAR_NAME=  FREQUENCY,     SPECTRUM/REAL,   SPECTRUM/IMAG
##SYMBOL=    X,             R,               I
##VAR_TYPE=  INDEPENDENT,   DEPENDENT,       DEPENDENT
##VAR_FORM=  AFFN,          ASDF,            ASDF
##VAR_DIM=   65536,         65536,           65536
##UNITS=     HZ,            ARBITRARY UNITS, ARBITRARY UNITS
##FACTOR=    0.49542278885378, 1,            1
##FIRST=     16045.7642231865, 0,            0
##LAST=      -16421.768244346, 0,            0
##MIN=       -16421.768244346, -3742582,     0
##MAX=       16045.7642231865, 509926556,    0
$$ Real data points
##PAGE= N=1
##DATA TABLE= (X++(R..R)), XYDATA
$$ [...]
43623 -62591 27502 69446 82423 62040 15501 14552 125472 297354 398804 370417 278546
43612 278546 216972 217618 261408 310044 311547 237607 141770 125584 211230 290899 247334 102732
43600 102732 5187 65384 231937 343234 300546 173181 110752 159631 212076 156584 28944
43589 28944 -35452 28264 144533 184794 84305 -108884 -258185 -236560 -55008 126326
43579 126326 169757 114580 91632 119993 98237 -5402 -81815 -43958 49513 104346 130634
43568 130634 176272 189817 75233 -131002 -254699 -189052 -26947 56790 3400 -100443
43558 -100443 -158543 -167202 -177966 -213792 -258455 -301366 -345606 -375669 -365019 -327329 -312677 -327657
43546 -327657 -307251 -209556 -99661 -83049 -178175 -308470 -400608 -433921 -410382 -340508 -252676
43535 -252676 -159108 -26937 150102 270750 212292 9378 -143575 -101962 84499 259411
43525 259411 319858 263211 151064 68980 64735 94181 78132 19101 -14788 -24926 -88854
43514 -88854 -201610 -239507 -149584 -51138 -54638 -96866 -77390 -52220 -134845 -276884 -322003
43503 -322003 -247443 -180338 -174163 -136177 -11031 112181 136460 84532 27441 -17800 -54933
43492 -54933 -53587 5357 87110 157176 225187 292749 315055 262029 170655 95511 51103 34789
43480 34789 52837 84258 71893 -3334 -82978 -109956 -104580 -115756 -136084 -118892 -56083 5695
43468 5695 13321 -51060 -149819 -195225 -119950 30825 126556 103592 35553 10597 6426 -39906
43456 -39906 -93307 -53369 88210 216031 229966 147265 52631 8204 31320 105193 182287
43445 182287 214163 198606 166729 118179 20413 -105674 -157381 -63347 102266 179715 98198
43434 98198 -59305 -176703 -237258 -294553 -347711 -319295 -174395 -2025 73970 40947 2508
43423 2508 44568 147381 236744 271389 257003 215910 176638 166533 181195 177257 122822 42281
43411 42281 -13249 -29609 -40307 -76130 -118878 -109321 -8382 138862 219475 170797 72911
43400 72911 68146 181516 286327 275540 198585 173789 221557 261573 248805 233453 281965
43389 281965 394053 508013 553561 499489 378888 263240 190573 135836 71461 21310 18184
43378 18184 44548 62381 66896 59523 9102 -93356 -180515 -190064 -167024 -192054 -236120 -199254
43366 -199254 -82621 5623 28254 66595 150556 180353 96219 5911 36728 149186 211948
43355 211948 197145 182272 199699 205390 185527 187580 234942 288563 303064 265320 185145 100985
43343 100985 72682 105591 109002 4874 -148172 -225533 -208211 -182395 -180130 -139867 -40920
43332 -40920 42905 64237 67287 78290 34524 -104316 -262677 -350240 -380009 -393894 -341891
43321 -341891 -154524 99988 252540 228237 109019 -649 -72714 -102088 -54366 76681
43311 76681 220815 298868 308123 299944 298359 279267 216310 115461 5805 -87697 -161970 -227910
43299 -227910 -279587 -282052 -209542 -86435 37324 144068 248705 348716 416674 442203 434090
43288 434090 379157 259932 127405 81410 134828 166385 78439 -51130 -66680 39793 104357
43277 104357 8042 -170647 -262566 -204258 -77209 4739 -8967 -99532 -211669 -285612 -286964
43266 -286964 -219644 -112362 -4684 57038 44007 -17498 -61691 -58585 -48358 -78899 -140731
43255 -140731 -195963 -240978 -295382 -347032 -353659 -290820 -163576 9660 181361 268710 228427
43244 228427 129269 82867 105047 120126 104089 125122 207871 258536 198868 98757 81801
43233 81801 144348 165051 75042 -69082 -176263 -206510 -166046 -92095 -49167 -70784 -96984
43222 -96984 -40471 75905 128240 61237 -35471 -62400 -39050 -32461 -27994 35561 137408 179371
43210 179371 122162 40987 26991 89492 176549 244390 276373 265804 214691 140211 65108
43199 65108 9897 -242 55135 153956 221278 192401 90785 14127 28656 102132 162976
43188 162976 195986 232671 262298 222858 101660 -18954 -60458 -42519 -26929 -15950 23722
43177 23722 73882 86486 71418 75022 85181 55313 17907 59903 166331 207143 122164 5572
43165 5572 -50023 -77381 -124772 -138190 -64092 22768 22015 -28489 -21599 38123 58783 29591
43153 29591 18481 13547 -84179 -288343 -474213 -531385 -467929 -342050 -197516 -93799 -88970
43142 -88970 -145093 -141532 -27966 113017 186385 182199 124406 21227 -87809 -129821 -100112
43131 -100112 -83412 -120782 -139341 -72669 32282 94410 107385 101400 70065 8309 -43366
43120 -43366 -63478 -94283 -154667 -178707 -115701 -22075 24552 31854 31878 -4868 -92117 -141218
43108 -141218 -74072 37578 76754 76020 161626 328422 424012 366264 239564 148426 95230
43097 95230 39016 -27614 -100494 -178733 -226106 -194509 -111577 -70292 -106454 -154418 -143401 -72993
43085 -72993 16807 82922 84731 28078 621 74777 177316 160299 12040 -117626 -129440
43074 -129440 -93042 -106451 -151090 -153810 -98568 -6756 110467 212771 223180 130229 25920
43063 25920 -22272 -59546 -134901 -189711 -146633 -40831 35763 68433 103541 146488 174259
43052 174259 211722 293478 372372 362983 266315 166330 110299 70953 20216 -35841 -93305 -153095
43040 -153095 -190477 -183385 -161040 -161541 -157058 -92828 13237 89643 121785 155095 184851 141588
43028 141588 18016 -77164 -47011 70574 161309 175556 160247 175584 227529 277836 290617
43017 290617 265091 230748 206781 169635 78414 -64861 -199001 -256292 -222123 -139025 -60127
43006 -60127 -4673 37547 60654 27092 -73235 -168433 -166028 -75120 -9802 -52643 -171983
42995 -171983 -295624 -395552 -459798 -454445 -376608 -287629 -231714 -178300 -105960 -71045 -109151
42984 -109151 -139858 -77559 19249 28980 -47454 -111826 -144860 -211365 -301069 -315917 -229642 -120258
42972 -120258 -27343 78743 165175 140128 39691 43005 212542 369225 337189 185116 102237
42961 102237 145996 246137 364024 498912 598786 607470 561094 516947 432415 240211 3029
42950 3029 -138896 -147744 -92978 -11560 97391 165627 105918 -23635 -61320 26640 106994
42939 106994 108213 125970 227158 303127 235956 97490 47795 104279 140747 79277 -32552
42928 -32552 -122268 -172440 -196877 -210392 -228888 -248826 -231403 -150862 -45377 21739 32981
42917 32981 12432 -13939 -6428 91901 271965 408549 384546 246491 141921 115582 80000
42906 80000 -7977 -76141 -87977 -132360 -270254 -394268 -359820 -193005 -48043 339 -1733
42895 -1733 -26973 -106424 -214787 -250151 -178929 -94745 -72087 -54913 33412 147303 178616
42884 178616 112266 34716 11885 29647 35304 -21595 -161997 -328198 -393393 -293313 -124960
42873 -124960 -39967 -61620 -86963 -47490 26637 88753 115350 64000 -89250 -247745 -254018
42862 -254018 -103832 14723 -31394 -140252 -137619 -25796 56073 61489 83494 179854 278913
42851 278913 291949 228683 157270 109346 69629 27313 -674 5380 31399 25005 -52603 -163997
42839 -163997 -217097 -167778 -63972 35356 132586 237384 293609 234541 86651 -51376 -121625
42828 -121625 -141282 -142555 -143455 -166416 -219187 -261576 -252251 -221699 -235728 -294069 -333139 -324265
42816 -324265 -296021 -260340 -197581 -126575 -108764 -156704 -205183 -197109 -138656 -55302 38518 109459
42804 109459 118971 90294 89712 119954 112696 52021 12331 33320 55065 33902 22439 55792
42792 55792 54316 -54203 -188414 -209208 -117518 -40338 -45715 -83164 -95539 -81945 -46768 15628
42780 15628 72906 76423 43487 41251 81031 108083 104583 115123 149440 148661 86041 24297 26383
42767 26383 71377 103964 112122 109106 85770 29741 -40096 -95428 -127993 -137420 -128622 -136967 -201090
42754 -201090 -284705 -287766 -176702 -45833 -1838 -44424 -114723 -195268 -280242 -299429 -180714
42743 -180714 21266 154281 139228 40056 -45741 -92980 -122903 -136952 -116767 -58377 16490
42732 16490 63776 36851 -60430 -151158 -168332 -151765 -193581 -287181 -317995 -230013 -111124
42721 -111124 -63224 -73404 -85182 -115249 -193569 -243107 -152467 35998 132984 26796 -194818
42710 -194818 -380656 -477087 -499381 -437487 -288647 -136211 -93208 -169114 -262291 -283048 -223085
42699 -223085 -108784 38305 174853 236663 205028 129554 54770 -30295 -131717 -189629 -142113
42688 -142113 -25363 60996 87061 122235 214381 305868 313753 245714 177663 143212 114967
42677 114967 95574 152863 321355 510574 569809 443355 224555 50525 -25126 -41698
42667 -41698 -44570 -25640 47603 168892 279402 318852 283725 229361 211801 228485 222026 147023
42655 147023 28510 -55347 -49546 27529 110376 147385 128158 71024 7663 -33372 -62333
42644 -62333 -140979 -310093 -492396 -530128 -367952 -150796 -66636 -117373 -135783 -31554 83432
42633 83432 60641 -84103 -214610 -259451 -257935 -251368 -232584 -210017 -228365 -291122 -332086 -306313
42621 -306313 -256876 -246953 -267745 -262703 -213488 -151329 -99931 -55510 -16924 10205 41664 100609
42609 100609 156867 121143 -57077 -298750 -451287 -453138 -403394 -427541 -501366 -475948 -282908
42598 -282908 -37691 103750 124408 115023 119010 105826 74699 74530 106276 102615 37655 -25816
42586 -25816 -37465 -31302 -49865 -65235 -27427 66262 194545 340216 448262 431289 281909
42575 281909 112292 14672 -43097 -105397 -104182 30669 202391 236997 117549 -10626 -59318
42564 -59318 -80080 -119710 -140789 -126051 -128677 -159263 -137701 -26887 85006 110037 80296
42553 80296 62240 29614 -82679 -245370 -343776 -302551 -150792 8714 61409 -35973 -189914
42542 -189914 -241833 -151864 -51006 -61509 -141982 -182917 -176027 -181734 -183504 -101500 61554 200850
42530 200850 245092 221204 173858 107998 34780 -771 25295 79388 110196 88429 3879
42519 3879 -127453 -242958 -267502 -186907 -60487 39702 74842 43740 -10361 -12149 68421
42508 68421 158935 166126 107396 88410 150244 225848 266355 312424 387594 408670 291236 97659
42496 97659 -13440 22371 107954 113552 14240 -117071 -204609 -226862 -206736 -179338 -166700
42485 -166700 -164209 -147664 -102855 -50995 -36681 -83933 -168292 -239015 -264090 -244524 -193016 -119408
42473 -119408 -38760 26562 61012 62361 39483 20960 50369 135220 209819 199967 122471 56761
42461 56761 14358 -73864 -208823 -266189 -166395 -17669 14587 -76883 -168398 -203058 -232395
42450 -232395 -279625 -298743 -283910 -292794 -327128 -304299 -193945 -79801 -30978 -5955 53091
42439 53091 117113 134294 125289 137891 162966 167045 159410 159911 147439 107064 81757 106691 133325
42426 133325 91329 -7984 -96837 -140996 -134837 -52975 100039 219855 184635 8571 -168533
42415 -168533 -244311 -229293 -167386 -77106 12339 59039 78248 137563 242101 295662 228834
42404 228834 106962 48185 75185 114483 118368 115738 137730 153979 115865 35828 -12680 21685
42392 21685 104703 152261 124137 60361 17683 -2932 -40530 -106501 -171749 -217602 -258448 -300064
42380 -300064 -306514 -234101 -90276 54719 116780 67184 -31337 -63551 37791 220990 357715
42369 357715 361451 256513 135846 69618 56001 42432 -12759 -90037 -117802 -42127 111738
42358 111738 256509 320421 301005 247770 202717 157499 69568 -68397 -182255 -177067 -59594
42347 -59594 43082 27018 -60746 -92799 -36659 12905 -20699 -93682 -118077 -83102 -52022
42336 -52022 -70914 -128617 -191407 -234394 -241835 -211281 -162672 -119321 -73708 8325 138884 275323
42324 275323 350404 336119 269460 208458 168061 114471 26259 -61192 -94671 -75438 -61635
42313 -61635 -93229 -141240 -148412 -103590 -53675 -45865 -78842 -118233 -143693 -161105 -174659 -178289
42301 -178289 -187686 -243713 -341807 -382134 -258329 -5649 205411 254113 188883 122395 76258
42290 76258 4111 -84585 -129147 -132221 -164056 -235515 -262132 -193263 -96029 -58058 -72847 -83594
42278 -83594 -86045 -110838 -134154 -88129 36882 161846 205859 163333 83438 9670 -38259
42267 -38259 -43833 14302 134466 255828 274427 136494 -76150 -198910 -155071 -40677 406
42256 406 -48438 -88763 -75158 -83930 -186706 -329421 -398294 -365165 -297985 -244923 -185770 -109951
42244 -109951 -65248 -82377 -109215 -88336 -62126 -112445 -205900 -204805 -65880 72551 76367
42233 76367 9497 35045 168600 260875 228404 169586 197846 264642 237802 99193 -25762
42222 -25762 -20211 105103 237704 265003 161431 10973 -69043 -52942 -30483 -76080 -133972
42211 -133972 -88519 76893 255706 345440 339038 286419 222414 152709 75487 1150 -32501
42200 -32501 24521 171954 327278 401198 394672 371802 352610 304224 236010 212861 242349
42189 242349 232171 116919 -36341 -115344 -107072 -83647 -81384 -75996 -61516 -69326 -100887 -113601
42177 -113601 -93314 -80021 -95232 -97094 -42967 44698 113565 151839 182786 208761 203818 160529
42165 160529 112668 102572 137909 182253 185941 136099 77530 62722 74382 30592 -108775
42154 -108775 -273025 -359695 -360700 -352521 -364392 -328157 -195552 -48177 -19624 -122537 -226693
42143 -226693 -230167 -186901 -206291 -267254 -226743 -31052 172048 204900 90511 12018 54416
42132 54416 100966 24430 -124560 -204874 -186916 -155363 -144253 -95144 6532 68579 20650
42121 20650 -73542 -99165 -35505 44831 88529 110630 144035 191817 231772 238233 201411 143911
42109 143911 107239 104662 101144 55360 -32280 -120219 -153513 -95519 24845 96043 19440 -153479
42097 -153479 -248046 -171784 -24045 52384 49262 39006 19489 -60883 -160832 -171450 -92415
42086 -92415 -54154 -126878 -215964 -200251 -86869 29625 91248 101828 87433 86971 133214 195197
42074 195197 188459 87633 -25858 -80096 -117742 -214825 -341447 -389503 -321582 -213709 -147926
42063 -147926 -125881 -101595 -53026 -1833 16520 -3128 -14417 36894 130258 165653 82372
42052 82372 -42159 -66410 44726 170738 172014 47954 -61876 -33143 96532 159467 57409
42041 57409 -102411 -133357 -18530 63496 -8209 -126163 -117176 14183 124285 157443 191239
42030 191239 264749 307552 276335 234559 227296 179459 13050 -199744 -301703 -240379 -106319
42019 -106319 4116 80065 145539 197603 227729 250288 271370 265457 220004 175470 182118 236926
42007 236926 302395 366079 425937 429009 306434 98718 -30524 26077 171034 209711 84825
41996 84825 -75457 -134324 -81120 27330 168551 341684 507920 602024 582466 446761
41986 446761 235526 43695 -26652 31815 117090 144039 141666 180209 249184 272695 219612
41975 219612 135071 71245 36867 13323 -15179 -47516 -65659 -59995 -53856 -66715 -56804 33289
41963 33289 161572 203558 121496 25144 8166 23640 4495 5454 105095 244470 300801 270555
41951 270555 242443 231832 189753 144825 171717 224293 169788 10991 -89162 -47816 26543
41940 26543 21505 -26363 -42506 -45000 -68643 -67804 1089 80886 92638 50819 21013 21482 35451
41927 35451 60704 80637 45029 -55857 -151240 -177660 -150962 -107636 -45515 28308 67550
41916 67550 59773 53978 65299 39616 -31895 -63630 -11334 46155 43011 37772 91983 145259
41904 145259 127476 95213 124586 156356 89448 -46261 -151952 -219132 -278353 -270892 -148554
41893 -148554 -33462 -76699 -197773 -176903 7699 152459 145950 87664 51554 -35345 -191288
41882 -191288 -270215 -181721 -53600 -41699 -112627 -142128 -106975 -48435 48286 202470 347926
41871 347926 416100 435706 444429 390277 239797 94877 62384 81750 31695 -54946 -50792
41860 -50792 32082 51865 -19035 -41224 59077 167286 166017 111102 120851 181244 175670 67112
41848 67112 -50679 -81606 -34930 13530 26746 45289 126478 260632 364235 362975 266650
41837 266650 149334 73560 51912 60199 59197 21438 -32417 -40869 24661 116133 174066 205126
41825 205126 242770 261297 205539 97095 25226 15876 -6564 -88111 -152649 -106930 13016
41814 13016 81046 47655 -10357 -14268 12514 -2713 -77098 -170622 -259400 -346674 -400248 -346987
41802 -346987 -171148 22460 101373 51961 -16937 -16846 26548 38412 4455 -20081 14608 99197
41790 99197 172764 168114 69051 -64539 -150575 -170349 -169455 -172834 -155739 -120344 -132457 -227853
41778 -227853 -334866 -358673 -307620 -265198 -262379 -254093 -209899 -152379 -107252 -85412 -112795 -202034
41766 -202034 -288437 -277513 -180216 -122683 -184510 -297375 -349005 -323073 -281504 -266487 -287426
41755 -287426 -357890 -461770 -503117 -376704 -104562 156639 266931 224362 122989 34068
41745 34068 -37234 -100228 -129320 -85588 24457 136405 188434 181919 159956 135159 76706
41734 76706 -22332 -105569 -110334 -39900 49340 112549 138224 123277 64896 -23737 -116359 -191687
41722 -191687 -231181 -212003 -133008 -42403 -4191 -28526 -61383 -54555 -25308 -31241 -96064 -173534
41710 -173534 -186892 -105393 16455 83514 51563 -32912 -92211 -104021 -113273 -167578 -260892
41699 -260892 -338513 -342240 -254815 -116648 2887 65311 94158 137810 208131 267070 266324 190676
41687 190676 74762 -13233 -25474 11051 18744 -29084 -62853 -10231 97557 168652 177093
41676 177093 176787 196497 200820 172210 155857 187678 240580 282810 330411 389669 397707 286077
41664 286077 79983 -117132 -222521 -226995 -183029 -176305 -265434 -401043 -448570 -349443 -214149
41653 -214149 -185355 -256128 -314100 -322822 -338871 -364896 -325475 -217262 -153153 -196064 -254664
41642 -254664 -219419 -115539 -37719 -4474 30579 73961 92942 92252 109475 152947 207082 268267
41630 268267 310163 257086 81215 -105125 -158224 -93688 -62403 -130562 -195766 -154731 -50112
41619 -50112 7741 -17798 -94815 -202115 -321529 -391623 -353386 -234573 -127795 -85729 -82263
41608 -82263 -69927 -29595 33380 94565 105761 29932 -101482 -201271 -218589 -189098 -166027
41597 -166027 -132041 -32386 109841 179351 109042 -13906 -50655 882 5913 -106417 -237548
41586 -237548 -270991 -243712 -266231 -323310 -282501 -100577 102833 214026 257530 298980 316523
41575 316523 264547 193613 186942 207955 136404 -34703 -158826 -143206 -98542 -195356 -427618
41564 -427618 -617677 -637459 -525677 -372604 -192068 26703 212762 261745 176951 72856
41554 72856 25854 589 -48878 -86919 -63853 -13925 -8421 -42779 -46658 4183 52977 41293
41542 41293 -26555 -98060 -113522 -49618 33302 16801 -138149 -305967 -330851 -227999 -151674
41531 -151674 -168246 -183678 -126985 -77033 -127524 -222496 -228657 -118726 8356 57902 13202
41520 13202 -95252 -220426 -308925 -337432 -332266 -318331 -278209 -204582 -152218 -170955 -210027
41509 -210027 -162365 -7772 142444 157594 17716 -167902 -256708 -203578 -109657 -112374 -213762
41498 -213762 -264548 -144962 90813 285637 339176 257391 111092 6026 29526 150810
41488 150810 228206 190345 145707 218400 344078 359570 252754 173114 199097 243173 214342
41477 214342 141689 89783 63855 52659 67973 84987 30101 -111065 -244600 -282127 -241434
41466 -241434 -188383 -145175 -104433 -68896 -24820 64110 185047 256673 234081 176186 153653
41455 153653 144402 81136 -43973 -182132 -294987 -361997 -357530 -277114 -161672 -57189 17905
41444 17905 42750 -7340 -94424 -123246 -71017 -39208 -104398 -194065 -206024 -179500 -221289 -309520
41432 -309520 -319261 -232754 -169201 -175905 -139373 21076 192902 212427 92939 -5231 1931
41421 1931 42557 36004 15434 56242 148445 205935 177000 86490 -24408 -137242 -218491 -207598
41409 -207598 -96517 18152 31412 -36655 -72649 -29015 29678 50380 66703 106074 109910
41398 109910 21532 -108869 -190448 -217801 -245015 -269527 -238687 -156896 -89039 -54513 -10196
41387 -10196 45565 43920 -40128 -116222 -73512 93027 285180 395989 380741 275991 174945
41376 174945 150943 185932 203270 170491 118712 61941 -22023 -105077 -96276 19556 107633
41365 107633 38827 -129387 -226500 -193497 -124868 -92937 -51892 45928 144028 163472 120738
41354 120738 88531 88780 102209 144430 239479 332087 324802 219474 135448 151667 206025 202089
41342 202089 149899 128683 150342 141302 53653 -68761 -142305 -122073 -30535 61421 95928
41331 95928 99864 162057 294183 363355 246729 20770 -112129 -80535 -8147 -2841 -15976
41320 -15976 24769 67017 25203 -64914 -103199 -85975 -93776 -147515 -188559 -190182 -182867 -168508
41308 -168508 -112288 -33097 -1828 -20182 6525 130044 270346 321584 284524 231543 188869
41297 188869 126963 44350 -13461 -26379 -35434 -80928 -138480 -152298 -123014 -123021 -203408 -312987
41285 -312987 -355198 -322859 -320981 -430583 -599932 -716573 -749340 -759210 -789202 -807980 -764922
41274 -764922 -651392 -500885 -365770 -294374 -297536 -341411 -398339 -479514 -577842 -617940 -536235
41263 -536235 -390021 -301878 -298877 -295225 -242080 -196250 -209716 -248016 -271857 -312899 -394393 -445445
41251 -445445 -384122 -245322 -136918 -87977 -26279 91126 203378 230823 184623 152291 189497
41240 189497 254215 257523 174719 84952 74624 113922 80875 -75337 -246745 -282803 -160432
41229 -160432 7472 110308 136640 140852 160786 180753 153562 53537 -83326 -183040 -209603
41218 -209603 -196412 -182214 -147116 -56280 50422 72881 -29246 -174121 -244318 -212585 -153003
41207 -153003 -140538 -173554 -202158 -203385 -199103 -206664 -206955 -179320 -145367 -149206 -200586 -261974 -290582
41194 -290582 -273902 -227730 -180527 -158203 -165570 -184776 -202342 -218589 -210933 -123171 58588 241177
41182 241177 301421 228657 130022 90065 93349 101248 126432 185643 240378 245816 224319 235197
41170 235197 287885 324743 280243 138555 -44380 -162751 -143869 -33920 35708 -9111 -114972
41159 -114972 -188504 -195024 -140159 -25439 117246 203005 177330 86505 6615 -52949 -111538
41148 -111538 -139313 -107675 -74257 -110227 -166836 -130673 -6855 76837 67101 58054 116853 158105
41136 158105 81740 -52661 -97994 -16717 98422 174095 220628 245493 207518 100002 4924
41125 4924 255 49026 42091 -58680 -173991 -212482 -177611 -144815 -164678 -224522 -286637 -319300
41113 -319300 -291204 -182555 -22308 116823 183538 189118 172879 156935 151814 168987 195414
41102 195414 187202 129088 76401 92489 159593 198679 171558 120129 107721 164132 286305
41091 286305 441246 551344 521327 319130 24563 -220271 -316849 -278561 -204422 -177004
41081 -177004 -182253 -150725 -80428 -69601 -191700 -380841 -498662 -489623 -410291 -326355 -254557
41070 -254557 -202763 -189190 -202157 -202232 -184448 -182184 -191458 -155448 -56952 31400 32964 -39418 -116594
41057 -116594 -163616 -199061 -257409 -367245 -528578 -669994 -669792 -482474 -225251 -77787 -98708
41046 -98708 -191316 -246405 -258060 -279182 -316358 -316780 -245361 -135583 -52414 -21270 -9265 25869
41034 25869 85357 135828 147244 103558 -3555 -146496 -231631 -161707 38124 207728 220143
41023 220143 130458 91293 136040 129836 -39614 -294903 -449482 -417003 -279394 -163991 -119618
41012 -119618 -123531 -146104 -163257 -137068 -38264 107861 227808 259238 190886 53745 -98145
41001 -98145 -199384 -203738 -126855 -44108 -27221 -83983 -161521 -199136 -178129 -132144 -107101 -100960
40989 -100960 -57825 54301 177853 218605 154144 41331 -73461 -181415 -245227 -198976
40979 -198976 -57279 57831 66260 40719 91323 196868 246201 210054 166767 169199 186145
40968 186145 180349 152897 97050 -4671 -114357 -149300 -88777 -4492 36142 26017 -38867
40957 -38867 -178518 -343976 -403155 -291118 -119573 -57317 -132834 -224071 -222719 -144986 -87305
40946 -87305 -122514 -237602 -340028 -334382 -219158 -90070 -24534 2661 50235 96984 65314
40935 65314 -53678 -169152 -199110 -154268 -88675 -15984 81385 190002 269617 318377 378160
40924 378160 451338 464319 369047 247749 234805 333963 405547 369091 321797 381008 493190
40913 493190 514040 429282 362304 372562 381862 326586 260049 250174 272666 266536 219713 145184
40901 145184 42425 -64354 -115589 -95879 -63276 -56481 -43814 -8876 -1971 -45034 -71894
40890 -71894 -38899 -9499 -37455 -49171 43833 182731 239978 212073 197873 215688 189988
40879 189988 118197 100761 171082 225458 178418 83805 37242 39935 27031 -26937 -91823 -130722
40867 -130722 -120311 -60055 2411 -5264 -92600 -175021 -167687 -87519 -31670 -71255 -185292 -282662
40855 -282662 -279250 -174313 -56513 -14218 -46311 -90712 -120424 -152730 -172073 -126089 -24125
40844 -24125 35473 -14795 -120485 -187010 -203707 -222431 -251844 -256024 -247080 -288663 -377997 -398066
40832 -398066 -251779 -11384 137431 106801 2986 -17673 60262 121227 94479 42796 57588
40821 57588 131892 186734 186004 167724 170263 175316 136821 45945 -42446 -50486 42892 164209
40809 164209 211715 159625 64138 -28813 -123841 -212472 -241426 -185456 -93311 -17355 43855
40798 43855 89020 77277 16881 11152 116423 219071 176342 36936 -15910 74406 175710
40787 175710 176864 119355 79899 50122 -500 -42204 -39598 -16847 -5960 7705 35182 42226
40775 42226 12554 -7018 17040 35328 -18047 -129666 -230006 -277151 -272559 -229889 -172876
40764 -172876 -135156 -129204 -145842 -199475 -315723 -446064 -468906 -334846 -153736 -69512 -91415
40753 -91415 -118235 -94127 -61678 -71366 -107201 -113064 -55993 40514 110708 110511 76475 82295 121182
40740 121182 92241 -55222 -226691 -297295 -272549 -254341 -279382 -283395 -220446 -129491 -62892
40729 -62892 -19879 17775 40584 44521 72175 168044 296384 344271 229371 -5515 -224679
40718 -224679 -325831 -314965 -256506 -191949 -136786 -113481 -126013 -124662 -66719 -1759 -17441
40707 -17441 -100316 -141223 -96971 -49027 -61383 -77097 -21223 76370 141837 177529 235602 315159
40695 315159 365732 362832 313867 222432 108445 24220 -14339 -69311 -183066 -286572 -291041
40684 -291041 -231369 -219323 -275824 -311711 -273345 -213085 -199476 -230073 -250330 -210522 -109779
40673 -109779 -30749 -98167 -326789 -537810 -524873 -299146 -72071 11607 19514 83050 203850
40662 203850 269393 201132 32156 -129269 -181915 -108826 5671 60660 42106 10396 1812
40651 1812 2020 10595 55572 125489 154085 104727 23196 -19263 325 52411 87543 67511
40639 67511 642 -56128 -66606 -68330 -107402 -150584 -134962 -78618 -49954 -45011 -5787 43328
40627 43328 7528 -105059 -155988 -78037 19000 19610 -33465 -43127 -28396 -70377 -149421 -160554
40615 -160554 -69984 43208 95271 74279 18684 -19108 463 63392 104152 86604 54442
40604 54442 68331 137193 244192 372658 457670 400302 213432 67209 75879 116165 3245
40593 3245 -209206 -285290 -150559 16073 72351 99353 203196 303556 271768 160237 115659
40582 115659 128133 56861 -100892 -156457 -10191 163157 123694 -122249 -341495 -371020
40572 -371020 -279062 -221965 -246859 -290730 -305521 -305184 -310115 -313470 -307032 -288972 -237041 -125836
40560 -125836 7275 64624 1098 -98740 -111382 -28080 40582 17400 -45370 -50962 13178
40549 13178 83593 124282 148697 138847 27472 -185616 -355647 -318901 -94418 115031 145376
40538 145376 33536 -71864 -96307 -79397 -80390 -121151 -200919 -291625 -323661 -248056 -118836
40527 -118836 -47165 -61485 -76498 -17102 90407 173098 196021 166623 115469 100090 161920
40516 161920 243843 221205 63742 -103417 -162224 -156424 -204247 -317107 -406428 -432996 -437022
40505 -437022 -429314 -364296 -241627 -141332 -120900 -145019 -148639 -109759 -30953 88992 222232
40494 222232 298363 273031 187569 128089 141834 209652 274392 278903 203454 86850 -6057
40483 -6057 -44931 -42222 -9757 49137 102834 102462 49386 2080 -7137 -10688 -33057 -37371 10369
40470 10369 74960 106808 122334 166354 224303 237545 184567 83792 -57351 -216305 -298749
40459 -298749 -214370 -26765 72526 -16194 -189619 -298510 -327315 -340831 -334178 -255134 -139623
40448 -139623 -97381 -153730 -214044 -213131 -200453 -229546 -252450 -196364 -82413 9606 51144 62452
40436 62452 36588 -43726 -126524 -122051 -30559 38730 5877 -84925 -142336 -144053 -132739 -138847
40424 -138847 -156878 -171872 -163325 -100370 21401 144862 194089 155714 87059 41167 17351
40413 17351 -2098 -1855 41986 97690 85762 -21862 -140703 -160994 -90562 -50108 -105067 -169625
40401 -169625 -136453 -46850 -36757 -132185 -208783 -179415 -118166 -135341 -209419 -231641 -172020
40390 -172020 -104571 -79522 -64700 -37423 -56688 -183209 -357653 -423010 -289708 -50765 100804
40379 100804 69878 -54828 -122967 -90175 -26630 1624 -11920 -61585 -139968 -182782 -99113
40368 -99113 88085 210402 141000 -38730 -140518 -98614 -10715 25212 15047 1858 -15206
40357 -15206 -59139 -128220 -203965 -269198 -297380 -259812 -167896 -85062 -76248 -152687 -266359 -347487
40345 -347487 -358663 -330215 -327280 -364628 -383938 -344385 -293845 -297127 -331736 -329828 -299107 -309471
40333 -309471 -359969 -358285 -262791 -159788 -151406 -230045 -310646 -332191 -280666 -165553 -31065
40322 -31065 49473 48604 28307 63411 152443 250472 350963 468370 562312 553608 419850 221095
40310 221095 29179 -119611 -207591 -235437 -248848 -301017 -363804 -337453 -189210 -28975 10525
40299 10525 -67350 -149452 -174777 -188799 -228219 -234884 -135198 42843 190024 233632 190594
40288 190594 121358 78889 93191 155062 212253 224089 219372 253900 313538 322219 258043 190056
40276 190056 166243 135206 36502 -86626 -136954 -92054 -12268 57963 123747 182810 205229
40265 205229 178038 118426 41190 -39212 -83211 -63753 -27963 -54815 -142575 -204287 -190076
40254 -190076 -145589 -124874 -117194 -102319 -111883 -171507 -224711 -187227 -66899 27980 8870 -95657
40242 -95657 -169755 -123561 21393 152913 179718 117112 43461 -11301 -83353 -179308 -230177
40231 -230177 -179039 -65826 22833 52160 37340 -24019 -149994 -309996 -422769 -434558 -363538
40220 -363538 -259426 -155839 -73812 -33226 -31284 -29493 7237 61917 79641 35593 -31395
40209 -31395 -68737 -77302 -96537 -122752 -88867 40455 187521 232976 162141 81657 78546 119685
40197 119685 120443 61722 -9991 -65928 -119495 -174179 -197262 -158061 -65165 41284 114831 121643
40185 121643 61826 -18753 -58012 -33212 19530 44934 18942 -40561 -97539 -123829 -114199 -90606
40173 -90606 -88430 -125272 -180371 -212427 -199563 -155450 -108779 -80517 -80416 -102545 -116407 -92982
40161 -92982 -59709 -92709 -213553 -327863 -330126 -248244 -201896 -221637 -212502 -125819 -54157 -79610
40149 -79610 -120532 -41755 132072 231407 161170 7678 -82314 -53731 37236 96471 74775
40138 74775 15198 6168 56373 62761 -39242 -154470 -152504 -65540 -40767 -119773 -198411 -204900
40126 -204900 -180459 -162010 -119411 -49829 -11491 -16678 -8720 6556 -66944 -245806 -391377
40115 -391377 -384475 -266383 -128254 16568 149334 162952 5955 -180662 -221255 -138442
40105 -138442 -84340 -94022 -66636 36120 137630 199062 271599 358728 355553 189794 -58034
40094 -58034 -229207 -234646 -111263 14096 10599 -140743 -303151 -313342 -160993 16976 110906
40083 110906 124369 83230 -34036 -221923 -381673 -405016 -292040 -131003 14179 141239
40073 141239 246067 284839 229152 127232 65765 70397 85842 72255 71300 126248 178865 129617
40061 129617 -12500 -132295 -165213 -152740 -124032 -40295 91479 165882 125384 67608 113176
40050 113176 239824 335944 347146 282891 158985 34154 19568 132484 218591 154219 51633
40039 51633 105062 289283 390838 315717 185681 123658 114899 108955 104969 94113 46082 -15439
40027 -15439 -42491 -79989 -217234 -407243 -485987 -403856 -285111 -215831 -135419 -2390 94917
40016 94917 85773 37072 31465 51386 74626 151470 278771 328292 233207 135537 200728 369330
40004 369330 443269 359673 232018 156284 116063 67675 555 -87559 -183335 -229773 -180028
39993 -180028 -65300 54119 173391 309090 421180 453281 421502 382420 341394 273822
39983 273822 206717 188645 196919 160808 64296 -52104 -171467 -295521 -375002 -340833 -210242
39972 -210242 -80999 -15224 -4067 -43468 -149174 -274881 -308320 -202134 -51279 10589
39962 10589 -43289 -130208 -172197 -169627 -167157 -180241 -174805 -119580 -41253 -1218 -15139 -27056
39950 -27056 21041 121983 223792 287447 300488 260767 176656 69383 -40935 -136360 -188044
39939 -188044 -174613 -114397 -39478 55698 181041 274932 251263 136708 58782 61488 45514
39928 45514 -47238 -111586 -43850 75986 100256 38094 17996 72287 112289 101234 98092 115761
39916 115761 79704 -31733 -129524 -151385 -152268 -193793 -234895 -212962 -167107 -189239 -282993 -353798
39904 -353798 -336838 -269650 -221541 -200860 -170005 -129201 -131795 -197700 -254673 -215276 -93833
39893 -93833 12966 58768 90884 147008 185717 158000 81036 -4957 -90628 -159982 -167195 -113432
39881 -113432 -83888 -137714 -218730 -247953 -240343 -239297 -196283 -31735 214281 404674 470902
39870 470902 464725 456163 467062 494111 512333 467317 345937 237164 235153 299777 306229 217633
39858 217633 111076 45734 10498 -1253 27352 71477 76081 40452 4779 -38809 -121120
39847 -121120 -193290 -169124 -73434 -23942 -52424 -73134 -50884 -59616 -128651 -169569 -125561 -71715
39835 -71715 -86317 -127650 -121504 -76412 -26794 51265 175968 284083 309454 279210 253932
39824 253932 232944 198617 192123 250289 308123 255534 73422 -149629 -310466 -352153 -278045
39813 -278045 -166957 -129700 -183983 -215178 -130468 -4272 16913 -80812 -169365 -161427 -99664
39802 -99664 -48993 2798 87913 169775 178801 109915 24619 -39302 -102263 -168155 -174856 -82241
39790 -82241 22701 3952 -126625 -191108 -76903 108297 194777 173618 145396 125105 55258
39779 55258 -28630 -23600 49957 58049 -23408 -72903 -55263 -96856 -239746 -306351 -151057 95304
39767 95304 193337 108050 -3036 -40824 -45493 -66742 -95109 -110061 -93809 -20816 81761
39756 81761 109996 14054 -98727 -95828 -3718 51862 38133 18506 3343 -56632 -137121 -140640
39744 -140640 -46765 51953 79260 40703 -41260 -146652 -204221 -136368 14696 111175 99524
39733 99524 63163 63565 42439 -56305 -164657 -174309 -81904 24184 80553 88746 73535 64381
39721 64381 96738 170684 213014 136792 -41453 -179218 -139965 52739 223849 228964 101610
39710 101610 -17965 -71159 -121554 -208960 -266900 -236491 -172681 -155688 -163172 -122846 -40433
39699 -40433 26883 86791 188121 295021 298006 164153 -11868 -117816 -110100 2379 164765
39688 164765 260072 189777 3618 -132088 -124285 -36238 37843 86084 122212 106119 -1982
39677 -1982 -156508 -263066 -278407 -234372 -188564 -184202 -233138 -307397 -361518 -374638 -350239 -279665
39665 -279665 -151358 -3817 81770 65847 -6425 -59840 -52884 16259 117673 189336 180153
39654 180153 119582 102877 178558 283200 313915 239444 118049 28313 2270 13284 17722
39643 17722 9815 20494 50005 38515 -51691 -152286 -149376 -21044 142100 249969 290361
39632 290361 295660 292357 291812 283140 233466 136781 45405 -2360 -57814 -183774 -321105 -338585
39620 -338585 -223072 -112261 -108497 -159630 -166142 -111849 -33904 49588 113053 95427 -23762
39609 -23762 -164131 -224307 -191363 -127321 -84737 -75203 -82691 -74211 -35712 -15008 -70134 -157589
39597 -157589 -155391 -36020 73507 61469 -29404 -106339 -175831 -283414 -379965 -375943 -287744
39586 -287744 -207561 -154961 -82152 -9887 -21601 -109858 -160646 -128261 -105541 -163677 -233200
39575 -233200 -225526 -181410 -194948 -251966 -262460 -228868 -258307 -385544 -489603 -447123 -299656
39564 -299656 -191532 -176447 -170684 -100388 -14658 -10843 -97938 -189571 -210349 -157058 -63316 42174
39552 42174 131828 178215 178281 151458 102608 20019 -74930 -116943 -69945 15644 58042 41606
39540 41606 19226 24337 27701 -3872 -46784 -54347 -31419 -31331 -74854 -113961 -99411 -51023 -22603
39527 -22603 -18980 3111 60622 125933 185316 254236 317875 320828 248680 160242 98798 33539
39515 33539 -57825 -112478 -64587 42935 111039 114734 98921 77094 28692 -20662 -13398 49232
39503 49232 117972 187104 275623 321818 217921 -18865 -218106 -249891 -162657 -81283 -50905
39492 -50905 -40366 -30228 -27794 -35482 -55642 -95133 -134080 -130943 -86262 -57619 -85787 -148537
39480 -148537 -203091 -222328 -177769 -55636 85244 140738 80315 -21839 -99682 -165986 -234924
39469 -234924 -253451 -169265 -12883 139141 238081 264266 209964 102598 -5172 -105196
39459 -105196 -242117 -418224 -544298 -523265 -344515 -86526 116432 120802 -105627 -384947
39449 -384947 -463351 -291550 -68904 33022 61475 127339 201024 186237 92297 -5617 -106694
39438 -106694 -249516 -386870 -426839 -373144 -313782 -291428 -282125 -276090 -280769 -262086 -175786 -49066
39426 -49066 43106 69646 52689 15710 -19492 -25146 -16096 -53659 -137668 -161273 -52605 106952
39414 106952 196691 219239 246618 272743 241566 171327 128165 114118 91558 70532 57638
39403 57638 -19925 -200977 -356499 -327102 -156924 -26404 18999 91654 222123 294698 257316
39392 257316 212402 231044 230468 119482 -52453 -169207 -182126 -115837 -21727 37006 33587
39381 33587 30566 99292 187652 180374 92463 67293 163146 283278 346732 376150 372738 271179
39369 271179 96648 10880 99756 244707 304724 301049 317659 346540 353226 375434 418587
39358 418587 365222 150461 -61024 -54995 125885 235742 165089 49685 29171 67775 69074
39347 69074 30485 2771 -10297 -30251 -41253 -20789 3198 -13172 -56938 -70931 -36138 -2652
39335 -2652 -26720 -97135 -142118 -107981 -16586 64726 98418 101891 103480 103658 91615 78111 91533
39322 91533 144683 213240 249131 222857 158144 113111 120105 161351 209764 261070 306812 312774
39310 312774 256020 154126 32690 -96178 -198006 -219810 -175124 -158603 -213010 -251544 -194004
39299 -194004 -107902 -105439 -159988 -153889 -68890 7356 39224 64996 73666 9740 -93217 -132470
39287 -132470 -108655 -132367 -229362 -286708 -239985 -176230 -190551 -258401 -304745 -292688 -203711
39276 -203711 -44234 92996 95576 -8161 -81821 -92422 -134119 -217632 -228508 -154748 -150445
39265 -150445 -272916 -354877 -267896 -127672 -85226 -86108 -12169 87419 95275 31507 -23196 -92837
39253 -92837 -206879 -252115 -132959 15164 -7467 -154861 -210643 -119661 -23443 791 14955
39242 14955 44232 36331 4651 24760 81558 94461 86718 143755 214033 160103 14600 -38876
39230 -38876 26205 24368 -116445 -204143 -81374 112680 129975 -66688 -305555 -426742 -387392
39219 -387392 -237640 -99516 -96552 -213986 -293394 -230547 -95625 3248 67275 129909 140408
39208 140408 47503 -71596 -92232 -15963 43259 21576 -41380 -95545 -137075 -168241 -168716 -120517
39196 -120517 -25706 97178 207573 252082 213556 140898 106671 143746 227986 297005 284879
39185 284879 181847 69825 50162 120550 174586 140186 58298 -77 -22507 -12581 71075
39174 71075 251164 440632 503533 417145 314039 336848 482770 620253 649222 613618 634370
39163 634370 746373 848789 836402 733236 647092 623728 612766 568202 511247 478202 462809
39152 462809 436005 385794 319608 257694 234685 275287 354863 408213 386924 293796 166455
39141 166455 46349 -46303 -125930 -213598 -280786 -256713 -120739 52592 177470 239224 249239
39130 249239 180917 26955 -128949 -191015 -175756 -171656 -199347 -201274 -150732 -78799 -6486
39119 -6486 59309 77134 14528 -69673 -82536 -26260 26508 67501 146980 243096 268273 218777
39107 218777 192262 233817 283709 299280 303214 285392 193866 65341 24720 93922 134518
39096 134518 54031 -58082 -85935 -58124 -62944 -97059 -106573 -93619 -77292 -22449 92388
39085 92388 202960 247564 258320 274175 245087 135702 49833 112812 269079 332442 226331
39074 226331 57494 -44603 -51300 7097 98171 172639 176136 115782 65325 80640 148323
39063 148323 225533 286354 316163 298708 227740 113356 -27009 -167412 -267390 -288926 -226434
39052 -226434 -117689 -26475 -725 -24301 -21540 55291 154078 185776 149877 132090 172996
39041 172996 214160 198212 150253 122509 119825 120261 115539 94347 40400 -17078 -11382 60300
39029 60300 105555 61482 -5775 5543 78913 93182 -20909 -196136 -306231 -292441 -201949
39018 -201949 -115024 -52039 24850 120352 172880 150522 118873 142766 176799 149193 102609
39007 102609 125641 180046 147968 42056 2198 62869 93876 20131 -64432 -69570 -39266
38996 -39266 -31715 -21178 -8552 -76631 -227730 -312200 -241008 -132735 -116633 -124161 -31193 112338
38984 112338 170752 151093 164976 222470 233020 174998 117064 100339 123208 199959 313173
38973 313173 360734 279536 173180 188336 312223 416354 441935 408995 309028 144913 24412
38962 24412 48403 142041 156074 97349 88123 129797 99683 -18708 -91242 -45112 42039 97405
38950 97405 141817 183926 170896 95545 32013 21433 26863 27593 51986 97894 125442 135849
38938 135849 147429 103396 -57673 -240523 -265157 -128973 -34868 -105328 -223401 -230847 -139769
38927 -139769 -51056 16165 98861 174539 181747 119428 52231 38475 86966 151560 154788 65405
38915 65405 -42911 -68960 -15519 28317 24998 17180 24186 16815 4981 41077 115279 153240
38903 153240 141538 148500 193276 205495 152351 97396 88533 91174 80431 96217 148650 164902
38891 164902 97792 7821 -27624 -17195 -7161 5410 44689 85053 67214 -31700 -170434
38880 -170434 -270793 -276983 -216960 -182935 -209303 -210011 -99623 73961 202852 270048 318757
38869 318757 327100 252754 164157 170159 234050 214847 88407 -29257 -72100 -69266 -7426 160411
38857 160411 356987 436222 427855 514606 716547 823398 719961 553758 473286 422434 329798
38846 329798 286028 360735 430264 379460 318120 395711 529770 525809 372962 224660 158072
38835 158072 133873 134957 174608 212364 209525 218285 281593 311802 214619 67095 15133 50560
38823 50560 53365 10502 19129 90064 116170 51886 -12416 14838 110627 173111 117337 -43366
38811 -43366 -166873 -101178 99308 172787 -27941 -307707 -361641 -156741 77485 180099
38801 180099 202539 241400 298420 328324 301285 201422 54928 -54444 -87612 -128325 -255102
38790 -255102 -390700 -411967 -358407 -371371 -454905 -472671 -385321 -316529 -347625 -400564 -379118
38779 -379118 -299404 -222242 -159129 -98216 -40573 27256 122146 204466 207529 141872 90008 87641
38767 87641 95640 99047 141633 242552 359600 447453 475316 394138 191769 -10481 -34358
38756 -34358 141180 336587 383039 291318 172890 88355 37922 26541 57516 96605 106419
38745 106419 102314 132424 210582 297013 343098 339559 315243 289659 242093 151448 51222 -6816
38733 -6816 -39670 -109263 -197375 -198828 -84690 24057 17683 -52972 -72280 -25509 25657 59556
38721 59556 82284 65205 3971 -22478 33207 74540 -10169 -162583 -233929 -203329 -172832
38710 -172832 -181632 -178743 -161250 -184112 -230193 -212038 -114395 -14746 36167 39747 -19826 -133929
38698 -133929 -184480 -61669 139914 210615 118287 38433 73148 127782 118144 112727 175571
38687 175571 221153 137750 -49929 -229768 -325303 -308527 -190314 -60059 -34054 -102069 -122930
38676 -122930 -27326 84801 110748 87742 84481 65867 -20778 -110311 -93186 22981 129421
38665 129421 164615 160078 155662 141202 81471 -39392 -189195 -288481 -271227 -158901 -36070
38654 -36070 54825 142658 244009 317450 328742 306936 306675 355049 447003 546277 586518 529006
38642 529006 428726 386776 427404 474858 457997 387026 324190 323318 390807 465884 463189 376395
38630 376395 296748 283411 287747 273362 310592 437733 529520 462769 333564 324833 418068
38619 418068 444990 385937 379797 439186 409370 259728 172592 249742 344743 303786 192543
38608 192543 157941 210756 264248 273178 243687 210208 254029 414579 551259 470582 240529
38597 240529 169003 380942 632993 669929 546557 437022 340741 192918 93378 175743
38587 175743 355402 441088 425800 451491 539505 571185 515804 479465 514157 538857 476810
38576 476810 352497 236242 183671 225879 335225 411673 377741 272418 195340 191080 237144
38565 237144 294170 316832 276674 220727 231574 290582 288530 222794 242778 409032 554837
38554 554837 518146 379831 316056 328028 296336 215459 180060 189079 154997 90227 106791
38543 106791 219737 302741 268746 178699 143978 210437 354421 516628 627078 654168 635060
38532 635060 626794 648177 689887 731456 725146 636365 530801 528354 626881 678282 597431 479288
38520 479288 437407 449154 447795 442662 447842 416507 353926 366372 480484 552643 493740 438663
38508 438663 526721 651625 627379 491430 428374 470749 491539 444898 406529 397124 353217
38497 353217 269340 213157 204586 204814 197729 171326 77195 -70818 -136747 -41624 81101 64680
38485 64680 -41074 -69878 -7702 27032 8000 14843 71423 149092 277671 473943 618687
38474 618687 591910 473608 424073 434990 404098 380547 493623 682071 744033 642948 531002
38463 531002 477453 403954 288298 204603 153816 72788 14980 98375 264305 314220 208421
38452 208421 113795 135604 213338 296270 401881 478240 426974 291162 215491 209105 160496
38441 160496 81533 92938 163506 130218 3681 -21780 92656 162052 112207 95966 184385
38430 184385 223913 122167 14539 11149 20255 -35566 -59066 12846 52433 -44876 -173686
38419 -173686 -199820 -165066 -169748 -199573 -197116 -172806 -142050 -80230 -11962 -5379 -33367 -5778
38407 -5778 35117 -43675 -200760 -236605 -119149 -28073 -11726 104175 362229 532099 470520
38396 470520 339109 301882 282350 198765 166544 262980 342713 297226 261166 353088 445666
38385 445666 404923 323491 299148 221780 16854 -132953 -63472 86257 113625 68142 82905
38374 82905 109632 81412 120306 305352 443417 355835 188792 152288 167206 79969 5791
38363 5791 113920 273187 273731 218641 322811 495149 509521 433044 480384 582323 515171
38352 515171 340756 301472 384496 403161 399606 542583 743245 814921 886729 1187804 1564867
38341 1564867 1734895 1862209 2292804 2871231 3211980 3518524 4320932 5469892 6339775
38332 6339775 7062622 8463735 10619546 12843855 15583154 20618854 27976072 33875815
38324 33875815 33839801 27680688 19759132 14207182 11452760 9722617 8120566 6988236
38316 6988236 6362907 5662489 4709376 3958257 3635287 3410588 3020483 2610106 2329199
38307 2329199 2076896 1799167 1643937 1659302 1652973 1501089 1331703 1265566 1216810 1094279
38297 1094279 983666 971408 967934 866591 729833 661793 623738 532047 431772 415814 456945
38286 456945 471004 475304 533464 597674 556033 408576 268986 214619 240381 323098 424654
38275 424654 474361 453267 442043 479515 454786 279606 84884 69061 211793 328958 360843
38264 360843 392021 422488 367135 286385 355855 555920 641579 501389 308540 215673 137520
38253 137520 -28121 -184584 -209855 -163050 -144112 -104992 23011 151049 163265 117176 143538
38242 143538 235177 289843 284645 269336 259054 252255 276440 315287 288182 198403 180627 292529
38230 292529 392731 351904 248814 215529 224707 190414 152229 182457 216298 150256 22382
38219 22382 -64610 -110773 -158787 -165218 -88482 -10150 -12843 -29192 40367 158083 237426 286680
38207 286680 322180 272326 127021 41052 114372 214348 199314 156937 209545 252458 141443
38196 141443 -5218 27386 195335 287956 280881 309973 368703 328278 219625 215972 351260
38185 351260 500018 607732 707694 752409 667359 532186 480485 473846 399526 309050 309213
38174 309213 309818 163581 -28595 -60183 9573 -36765 -151468 -74395 197364 363690 286920
38163 286920 156246 122130 98167 21149 3009 100750 186233 160280 91865 63728 65893
38152 65893 90819 154032 201304 173168 142285 193098 221475 89376 -87311 -80577 76782
38141 76782 159446 142317 199042 337224 380423 315532 317342 410505 438046 380817 377604 421623
38129 421623 378801 304492 374783 504891 435668 215269 166972 334192 406159 274769 202622
38118 202622 310769 356001 191659 26814 32296 76980 47963 61957 168583 201805 110121
38107 110121 84045 186054 216920 119526 133931 357617 527893 449758 280197 187763 96798
38096 96798 -27606 -19347 144533 211702 88061 29210 176094 290017 196108 97746 179374
38085 179374 281585 261097 298891 538250 764809 763958 676939 702806 761240 738387 748647
38074 748647 868577 930121 853143 853642 1051191 1220271 1217868 1299782 1702326 2244859 2637827
38063 2637827 2839809 2837947 2472715 1801943 1253219 1080507 1036914 883839 791263 891182
38053 891182 902127 619521 346412 382954 489187 324376 43300 -23825 66064 99425
38043 99425 156793 358772 490533 351954 170618 217868 338862 301418 254468 381806
38033 381806 472410 319240 173185 299506 457660 341971 162920 246260 421776 371790
38023 371790 231809 276591 359362 236991 103537 221786 377047 281164 156476 322478
38013 322478 574606 580787 506146 618977 690194 449419 217702 383057 660634 600863
38003 600863 410197 504717 679326 535078 314449 454554 707983 597496 359575 505705
37993 505705 809128 700668 349875 360154 673088 768316 682757 829188 1060176 928229
37983 928229 635614 712629 996747 946821 701327 778866 1016590 896810 633462 797637
37973 797637 1158410 1075953 748426 837039 1152625 1010095 602041 666881 1057101 1035477
37963 1035477 735622 876333 1281057 1200979 862951 1105043 1705277 1734459 1348401 1488587
37953 1488587 2018013 1994943 1600935 1847565 2533119 2545830 2062496 2278484 3064428 3196656
37943 3196656 2840055 3333427 4515807 4891590 4522605 4982810 6313562 6981307 7046758
37934 7046758 8195753 10354775 11708898 12436627 14688503 18400219 21269922 23550372
37926 23550372 28303969 36008216 43910938 51791355 62668671 76548883 90320978 105755816
37918 105755816 129455968 162337612 200105339 249151656 326301983 427321365 506398043
37911 506398043 509926556 432890509 325307903 239680438 187587432 151972132 122021011
37904 122021011 100361770 87200832 75948700 63704000 53883075 47711918 41844959
37897 41844959 35055638 29990609 27375876 24545027 20620093 17887511 17103837 16081694
37889 16081694 13878350 12234729 11899550 11267965 9639765 8451928 8321229 7929202 6754659
37880 6754659 6078196 6377891 6354664 5428260 4766342 4971684 5019585 4341135 3839932 4005534
37870 4005534 3995336 3397199 3050647 3342766 3433050 2906971 2543371 2745263 2803935 2388280
37860 2388280 2214897 2581340 2737227 2363568 2210321 2607566 2778551 2315465 1948960
37851 1948960 2137444 2224017 1744185 1315275 1451337 1653360 1445605 1243953 1448854 1669042
37841 1669042 1551221 1446201 1598079 1580772 1161537 839368 931118 987485 683725 432457
37831 432457 557421 704515 612426 625749 913261 1024076 755954 619251 895449 1083822
37821 1083822 848335 664861 918633 1178484 1014755 771171 864238 1031960 936395 838361
37811 838361 1019794 1166321 962101 707117 738212 815257 664434 548822 716644 859099
37801 859099 704391 584158 810678 1040719 875150 578785 585853 760592 751823 643201
37791 643201 669099 695675 536011 387358 445138 485433 311944 187317 341136 500180
37781 500180 398741 294417 466927 665054 580940 424460 486879 577148 446217 336510
37771 336510 533253 781732 739336 619341 789786 1097145 1195046 1218215 1529028 2074693
37761 2074693 2544067 2868847 3048841 2826235 2109190 1398021 1195806 1282951 1154798 871895
37751 871895 848068 1064839 1160029 1104419 1152769 1268757 1200150 1005914 947743 974388 848324
37740 848324 662701 704818 918063 1009557 979878 1045337 1148300 1049968 817147 729697 783531
37729 783531 740995 582381 464837 342223 74772 -191690 -203327 -48063 8191 11743
37719 11743 195075 476740 553583 409025 291619 274109 253326 279310 452897 605328
37709 605328 512586 316136 302564 401526 355605 241301 324137 520767 530223 409466 481018
37698 481018 722785 788463 616083 488635 483523 383872 176478 129759 294435 388288 273335
37687 273335 135388 107708 101491 78790 129316 219305 203948 119117 132951 212806 179315
37676 179315 65237 65281 166106 195388 190081 322633 507685 496953 332176 282749 364010
37665 364010 352364 252092 287759 434989 425731 241892 143364 175727 116627 -44259 -45837
37654 -45837 155955 303529 320771 421158 640527 721761 585160 475461 512609 518238 416636
37643 416636 389391 491238 517577 404370 378882 567066 807264 972286 1116979 1205997
37633 1205997 1074731 771451 567085 525798 438054 255533 185194 264201 268285 150808
37623 150808 146307 322250 454869 463101 528348 676122 705572 652851 823556 1211177 1400431
37612 1400431 1242838 1113283 1271105 1480426 1521816 1571653 1775685 1926752 1887720 1895114
37602 1895114 2132423 2423916 2642698 2991312 3588484 4215895 4764273 5493500 6586517
37593 6586517 7910576 9451967 11448828 13872514 16431782 19355399 23407728 28849394
37585 28849394 35403812 43667538 54951027 68221226 78301856 79381229 70637258 57055235
37577 57055235 44510492 35303125 28587938 23278680 19194122 16254861 14023435 12128419
37569 12128419 10476825 9029462 7759289 6750232 6027853 5399153 4697979 4036465 3585314
37560 3585314 3269061 2915050 2558514 2356353 2297925 2225323 2084355 1965759 1920253 1885488
37550 1885488 1809340 1745480 1785233 1918274 1995384 1876912 1619446 1421956 1349988 1251340
37540 1251340 1035598 866715 907377 1027018 996628 859741 842838 967901 1040641 1000684
37530 1000684 994274 1074099 1099642 1002140 913299 946028 1040414 1103858 1134445 1139860 1091235 1016849
37518 1016849 997943 1023490 985727 855982 727537 653519 582906 490559 432290 431360 435611
37507 435611 423466 438926 493141 536675 550341 569807 614657 678900 772297 876869 899994
37496 899994 782831 617167 538848 550321 565486 564047 564133 520672 418949 393290 553587
37485 553587 751394 741543 550231 451754 571552 734340 743057 609317 455759 361486 356215
37474 356215 422349 464180 400482 298697 291862 377651 442651 457926 484955 514434 482429
37463 482429 426897 434928 452176 353832 193438 150219 221287 213820 79875 3194 78441
37452 78441 150720 86014 -15115 -4125 96698 191626 272640 359058 408455 400516 396263 423425
37440 423425 415702 342665 283067 299604 360500 444206 585331 749641 810170 736611 675996
37429 675996 749367 883396 933246 866275 743249 622865 562370 610049 722333 784056 770633
37418 770633 783539 868168 919031 841567 694672 589907 548473 534779 537735 545282 524186
37407 524186 487867 500993 567930 606629 573063 512449 455588 381341 315085 327139 382863
37396 382863 338742 158268 -5714 -22953 52736 117246 175308 263201 334379 337537 314983
37385 314983 322823 341033 352139 415486 567462 730378 809291 804157 754862 665653 559269
37374 559269 509418 535879 557590 526078 503868 528046 510418 381077 227166 163469 150501
37363 150501 77634 -33068 -46994 81073 242679 316550 294902 266214 320276 461940 591598
37352 591598 592760 451154 255064 90663 306 21719 162014 329432 405528 400319 419924
37341 419924 472884 452567 336287 240260 226596 218345 170627 156260 196373 178970 57766
37330 57766 -29175 34015 165278 247562 316338 430762 500389 421918 278094 216554 220584
37319 220584 183558 133412 187832 331424 422525 402158 336854 273252 203128 160992 207731
37308 207731 309984 359635 321493 260933 230602 224066 228888 237037 222410 188336 199139 276271
37296 276271 314803 214658 54782 15470 148174 333093 445796 456249 380060 249195
37286 249195 136983 113525 161842 206037 213478 202885 177630 132883 109806 160319 266770
37275 266770 361855 409913 411881 366561 294117 258516 294470 350027 368234 373955 403019 405608
37263 405608 319147 191929 130689 154822 195680 211412 214277 215024 225142 278592 366288 392410
37251 392410 291112 146673 96253 145277 180172 137219 59405 6688 2680 52112 129784
37240 129784 177855 186887 234629 362166 469000 434553 293675 178068 125842 69663 -17824
37229 -17824 -90703 -124530 -131234 -94918 -705 87314 81856 -4738 -84416 -115562 -109557 -54353
37217 -54353 58992 164967 192123 178072 208064 269178 277796 220142 149669 80107 3253
37206 3253 -27705 29483 86177 25406 -100101 -128045 -28118 77993 127919 175659 230367
37195 230367 220479 153554 139452 202141 228506 166645 122300 178984 256630 238631 132026
37184 132026 20428 -48192 -54914 17818 132558 190959 150212 86419 91946 167780 256088
37173 256088 318557 347197 350953 353532 357098 315323 209261 125151 154032 227530 180954 -4719
37161 -4719 -149599 -99773 101018 296443 373308 309127 174503 117522 234955 425080 474331
37150 474331 317301 99502 -36574 -92588 -110975 -86815 -50908 -95227 -221188 -281846 -174190
37139 -174190 9409 113024 109003 71073 46555 50592 110269 217505 295184 290919 253306
37128 253306 252847 287754 323647 354469 365353 313894 214332 162302 206489 273046 287633 288491
37116 288491 335477 388160 372893 307513 260936 239959 210670 187203 202763 225138 195872
37105 195872 138263 142757 242881 363327 395166 292995 110883 -38529 -85467 -72564 -85374
37094 -85374 -120390 -94961 7111 99351 135086 182974 300893 425187 458272 394190 289861
37083 289861 180429 87572 41486 28215 -16308 -97855 -128165 -65529 -1631 -19011 -46727
37072 -46727 31922 192596 305260 307873 233460 107454 -59196 -195973 -214497 -131370 -50682
37061 -50682 -13861 42944 163142 283696 312787 241970 146174 99033 110240 133576 124175
37050 124175 84396 47260 26604 10511 -6832 -28593 -79927 -170009 -233767 -187041 -50070
37039 -50070 64961 108246 145117 224850 295061 300028 274760 275388 292439 299282 312419 331941
37027 331941 293748 164983 31184 2640 71265 135911 142514 134811 182445 301904 433932
37016 433932 485157 424921 335391 306239 298838 217314 104870 121020 286025 404242 322440
37005 322440 128078 -3887 -33059 -14872 35852 110196 129459 37171 -101446 -197579 -257973
36994 -257973 -309733 -305042 -212508 -102624 -24612 90389 270471 372001 276835 110512 71196
36983 71196 133362 133569 75335 105870 221272 246836 132436 39002 77464 160985 186368 187345
36971 187345 224188 266443 272039 267522 273691 249087 172142 93518 51900 14883 -51537 -126188
36959 -126188 -181509 -221400 -239996 -204321 -103884 29265 155479 239050 243731 172489 84316
36948 84316 14773 -71582 -182042 -226499 -153735 -77905 -125088 -214815 -163392 29672 176458
36937 176458 171264 92191 30319 -8358 -16010 30584 72870 22961 -69077 -71996 -11350 -51850
36925 -51850 -204951 -270196 -144915 15532 52118 23937 49486 101965 109999 113577 163905
36914 163905 189469 114566 10676 -10987 35355 81930 141943 232369 265646 180236 93233
36903 93233 145611 256312 217487 8190 -168229 -165286 -49403 49249 92813 93399 40055
36892 40055 -57232 -127823 -111671 -29438 57189 118263 159689 188905 207592 219911 223577 198851
36880 198851 123577 7625 -91799 -111062 -55467 -14879 -70960 -200761 -306494 -321303 -242440
36869 -242440 -92712 78080 176543 144416 52406 22549 56424 46654 -32001 -70296 -1908
36858 -1908 92608 123901 123638 156526 197410 181832 104670 -3332 -119852 -185951 -110744 93104
36846 93104 266295 291629 245693 260298 314022 286479 159700 30578 -44302 -88866 -110851
36835 -110851 -88294 -53769 -80588 -166309 -218389 -177938 -90445 -39761 -69069 -171637 -299960
36824 -299960 -372944 -325565 -171586 6497 130620 175135 161274 127257 86854 8651 -128448
36813 -128448 -256554 -261977 -131500 18507 97474 144067 222683 309361 361680 414806 498629
36802 498629 526538 395618 164002 4770 -3231 73567 168214 282199 392817 413893 306805
36791 306805 154365 70979 88174 162846 246072 300192 287864 199883 88950 36922 71766
36780 71766 129812 120299 29108 -67007 -103623 -107332 -130508 -150711 -113648 -52548 -61082 -141288
36768 -141288 -188208 -154589 -118734 -138372 -147547 -72258 47563 134996 190381 240666 251240
36757 251240 183278 78585 2534 -37745 -44485 21035 148349 219673 153798 41241 22060
36746 22060 89929 134689 120712 96862 78829 50976 44520 87681 119462 80894 42647 95153
36734 95153 157174 67717 -147616 -284019 -246990 -161497 -152021 -175207 -138746 -53135 17003
36723 17003 58676 97151 141284 183599 199857 141826 5448 -99191 -45454 136854 289019
36712 289019 328483 312113 287745 220254 103619 13214 -17165 -57679 -151254 -218078 -170185
36701 -170185 -48626 26347 -7094 -111661 -199728 -194150 -93673 6849 19866 -17178 -10177
36690 -10177 21456 -33546 -176492 -260008 -195297 -64991 29227 100080 181572 232149 227618
36679 227618 237600 302937 338391 273340 198760 245007 383668 482965 504220 505911 494214 421097
36667 421097 322791 310108 390588 428780 341202 230218 245432 376958 475360 451677 369123
36656 369123 319815 288380 203643 88425 63567 184086 357757 478397 559864 655046 716397
36645 716397 664353 556689 541913 639368 709060 669417 602705 589083 574198 488902 385736
36634 385736 351282 366724 356737 310827 263708 216441 167389 163040 224905 278359 248598 179244
36622 179244 158039 170333 135834 59488 27636 60892 83448 54264 30640 67656 128922
36611 128922 139039 79598 1180 -33453 -1213 67517 121956 148811 185163 261040 356839
36600 356839 441243 516365 587327 619150 573695 471828 373581 308069 261003 218214 183716
36589 183716 163759 163763 190847 235369 264776 255303 209680 131496 20612 -83336 -101799 -7518
36577 -7518 118093 163469 101906 -6341 -98926 -157479 -190054 -208394 -216381 -203335 -165701 -138895
36565 -138895 -166415 -226499 -244812 -203411 -175576 -216743 -284292 -313056 -308841 -310296 -317325 -322343
36553 -322343 -353748 -409905 -404142 -272233 -98507 -28534 -71288 -99396 -55792 -45799 -171595
36542 -171595 -361984 -449386 -379730 -266404 -233319 -270559 -282385 -234379 -183123 -161302 -116257
36531 -116257 -10747 85833 92470 56631 89639 179041 188749 61550 -98901 -183137 -194553
36520 -194553 -164841 -77640 42571 82028 -9065 -98509 -26976 173208 324737 332418 262918
36509 262918 226314 270242 372633 461852 461567 376378 303999 310237 339085 304829 213547 123868
36497 123868 53958 10560 38913 138852 192774 98914 -62731 -117063 -20709 108973 166471
36486 166471 145252 70862 -33322 -111451 -110697 -61225 -40653 -66164 -98670 -130162 -177793 -215813
36474 -215813 -208819 -189949 -210351 -238161 -207876 -136723 -81777 -19718 102603 232170 271171
36463 271171 253766 302503 413293 455236 403289 392131 484368 549829 457154 252528 65266
36452 65266 -49611 -94574 -60793 37701 139695 211077 267878 283468 176656 -46145 -240577
36441 -240577 -294481 -259389 -233418 -202503 -99005 43681 103232 19972 -131443 -215732 -154110
36430 -154110 6195 122832 92361 -45587 -178880 -265100 -317574 -285715 -93179 191790
36420 191790 374766 370614 282298 195040 53327 -166096 -317086 -262533 -84507 21669
36410 21669 -15590 -134390 -280543 -417476 -459898 -349401 -170131 -63469 -48557 -38570 -6965
36399 -6965 -16845 -95888 -194226 -267839 -309164 -299802 -227704 -150896 -150759 -212220 -232219 -159190 -52822
36386 -52822 4495 -8375 -60594 -100937 -78105 8490 73799 21516 -139374 -300583 -373712
36375 -373712 -352270 -265858 -142885 -28841 23803 12559 -8893 -2059 12147 -2527 -39477
36364 -39477 -58102 -37737 -4763 -2098 -35448 -65651 -70033 -87583 -157745 -229671 -207536 -101296
36352 -101296 -49614 -145596 -309732 -399704 -388870 -358120 -349829 -317638 -214974 -63840 74991
36341 74991 160105 195196 220689 270037 320969 317644 254090 190583 165353 146416 105673 78325
36329 78325 98017 131873 140742 149326 187463 211719 163274 64308 -21599 -88226 -161024 -204637
36317 -204637 -155672 -42721 18122 -35017 -137299 -180261 -118161 13858 142987 214559 234857
36306 234857 252478 280836 275228 217864 172517 195361 235737 199803 85282 -19826 -52712
36295 -52712 -21078 47488 129582 190079 207396 206337 211674 191108 107157 -79 -57240 -66120
36283 -66120 -85013 -109201 -59827 89471 247317 298733 223534 100407 18543 -6767 -41819
36272 -41819 -145989 -275227 -321631 -265187 -215178 -259925 -356019 -429853 -498431 -589862 -624572
36261 -624572 -510679 -314434 -198260 -205467 -232550 -205030 -151255 -97380 -20616 62765 72691
36250 72691 -32569 -209312 -399860 -570308 -673917 -672601 -606632 -550472 -491854 -355530 -158031
36239 -158031 -27406 -39960 -136237 -224253 -264056 -224554 -73206 139123 281124 284185 203466
36228 203466 102303 -24579 -165378 -236431 -189764 -94827 -38116 -7391 55164 145634 215835
36217 215835 252146 274888 296069 325900 382270 450590 471984 409391 292608 174693 84499
36206 84499 38245 46328 88617 130758 173242 229536 262025 221227 151319 157506 246744 302161
36194 302161 250264 153262 91982 58902 24210 10793 32318 36992 -15782 -87677 -127470 -138343
36182 -138343 -131095 -88352 -30454 -36810 -136864 -247611 -275620 -214542 -99663 48769 188346
36171 188346 254707 255370 269104 301658 258871 127775 46933 96816 154302 85404 -37273
36160 -37273 -63458 -14440 -32630 -144529 -240241 -252641 -207505 -125171 -14094 61409 40646
36149 40646 -26632 -53157 -58504 -110656 -163364 -102143 68740 232994 338236 413900 432485
36138 432485 328487 165559 106826 179597 232180 174357 102193 116786 170169 181125 173331
36127 173331 192497 188470 91617 -59212 -157508 -151371 -62295 61240 151669 146892 69386 25420
36115 25420 69328 125530 99428 3082 -90800 -156774 -204137 -209725 -149668 -70596 -50067 -94635
36103 -94635 -138087 -135173 -105481 -84592 -73599 -45666 15469 82614 89241 -8923 -167289 -279589
36091 -279589 -289768 -247673 -235547 -269830 -297430 -262719 -158145 -31634 41902 22616 -47258
36080 -47258 -84539 -62455 -35578 -56813 -104882 -113638 -47374 68171 167583 189575 122162 13094
36068 13094 -76678 -120579 -114702 -55518 27519 54817 -17722 -117363 -137957 -91163 -81216 -128821
36056 -128821 -130868 -29984 79456 79147 -13708 -82669 -56276 41600 139461 160820 60476
36045 60476 -121733 -265978 -279334 -187187 -93209 -67103 -88310 -78504 16068 148922 194142
36034 194142 89585 -66817 -141354 -157756 -246474 -403269 -454695 -317575 -139899 -88007
36024 -88007 -129624 -150226 -158143 -212839 -245586 -143332 36288 127964 126355 198206 399609
36013 399609 565485 550540 424644 334101 296141 244817 185489 174604 195873 175473 106168
36002 106168 63183 97123 182983 276900 359623 413995 413797 357055 279017 214973 167077 114843
35990 114843 47478 -14368 -27244 24670 77523 23670 -161014 -352809 -400458 -301494 -193819
35979 -193819 -163913 -142751 -38053 102660 151726 93801 53168 112493 201429 219176 191261
35968 191261 221835 332040 435773 464308 432081 375449 309247 266406 300944 405509 487685
35957 487685 485248 459781 510807 623276 671552 580252 427509 361652 433018 526757 471240
35946 471240 223132 -63321 -180940 -86175 65190 104262 16438 -100628 -175798 -194167
35936 -194167 -137594 5532 167961 224128 117816 -75247 -235295 -310407 -321783 -301664
35926 -301664 -263685 -212120 -145706 -60681 27373 76123 58089 7120 -3607 59928 152813
35915 152813 202503 188053 150800 132562 126817 95943 14898 -110419 -242125 -314199 -275045
35904 -275045 -162223 -104019 -194108 -378926 -519500 -546903 -493033 -388895 -233522 -78738
35894 -78738 -30931 -104703 -163835 -92938 37483 69883 -28777 -160273 -263854 -363480 -441341
35883 -441341 -394906 -181119 82420 236291 256510 250694 302378 378653 392706 314481 199614
35872 199614 124132 111153 130406 156587 197409 255023 296432 294416 272247 267642 270690 243084
35860 243084 187979 151635 157657 184913 209470 221358 201072 134932 62046 47626 90691 115704
35848 115704 84415 58011 102574 181838 207199 167735 140587 170856 204618 171544 96974
35837 96974 88595 212907 413804 569586 618320 604974 607007 645794 690448 717516 723666 692774
35825 692774 607046 505221 478559 569299 700488 751483 696578 628223 637037 710938 783166
35814 783166 849107 975501 1187459 1416829 1620563 1899258 2387993 3011456 3451549 3433080
35804 3433080 2989899 2386279 1835539 1387841 1045546 842235 768397 723062 612181 450110
35794 450110 316577 251165 232946 234280 250424 284495 326909 347666 314575 242371 208252
35783 208252 267525 356915 349186 221670 100589 100324 180416 210737 125119 -44999 -239058
35772 -239058 -397166 -453702 -381962 -245697 -148835 -129123 -140352 -131297 -97787 -62341 -48563
35761 -48563 -78031 -152911 -234504 -266320 -221240 -112863 19579 114785 113745 29486 -32467
35750 -32467 17461 137068 205554 182318 141699 148595 181302 201246 216906 228931 182036 45966
35738 45966 -98149 -136819 -79654 -56793 -143169 -249781 -230999 -61125 145428 272703 306849
35727 306849 294701 257874 194488 133445 119419 139104 122353 39903 -51025 -88485 -79828 -51617
35715 -51617 15977 134455 231509 222581 139603 92146 100698 71386 -40392 -144350 -146371 -83258
35703 -83258 -61232 -118834 -209858 -268744 -236204 -79554 139428 265097 198178 16795 -122999
35692 -122999 -173936 -207084 -268568 -325261 -346963 -348060 -333494 -283074 -211330 -176208 -202018 -242195
35680 -242195 -234811 -156797 -26785 96545 129124 38579 -93726 -148395 -102176 -25900 36458
35669 36458 108304 208593 324276 451214 581340 667085 696529 776008 1012651 1344443
35659 1344443 1642803 1948627 2399736 2963785 3557773 4455686 6110917 8287155 9762572
35650 9762572 9414190 7481705 5317932 3940459 3267844 2765911 2277227 1949834 1765547
35641 1765547 1545357 1259818 1023724 859417 691936 518385 397680 324070 260935 238580
35631 238580 281967 314326 272491 241303 321001 429116 400216 240044 120544 145138 260615
35620 260615 378358 444002 405411 249178 65258 -39559 -76574 -118679 -152757 -119490 -58912
35609 -58912 -63217 -108799 -95539 -41005 -65562 -177335 -244086 -205909 -150593 -139091 -117606 -53833
35597 -53833 -6104 620 18073 36127 -39303 -193801 -251928 -121003 55391 99231 21248
35586 21248 -72758 -161412 -250425 -256508 -117126 64107 138858 112951 75872 12411 -132748
35575 -132748 -260166 -200926 870 94951 -37979 -231464 -287124 -226660 -187044 -188480 -142101
35564 -142101 -26585 71850 88966 62947 72882 149458 255892 322225 294022 176483 38417
35553 38417 -47475 -76582 -110155 -190976 -275025 -272080 -158477 -22425 25228 -33110 -122381
35542 -122381 -171131 -165704 -122811 -63858 -18538 -618 23836 88981 152968 144657 90399 93612
35530 93612 159088 157177 34937 -53206 54756 280015 398695 345050 267359 281702 318184
35519 318184 259336 116460 -4502 -42808 -20964 16640 47438 69329 89049 106521 105671
35508 105671 78064 50277 58116 99030 146067 203325 301163 429385 518672 506983 399661
35497 399661 256547 142644 91193 87063 82091 46849 4825 -1812 31505 70537 82581 58566
35485 58566 16901 4133 55199 124181 103410 -38522 -184067 -197356 -89339 20642 70571
35474 70571 91439 102469 79812 34537 19282 34414 17269 -48054 -96108 -88026 -69955 -81918
35462 -81918 -89978 -64414 -52439 -103170 -172978 -177843 -106333 -15060 64516 149894 243527 298776
35450 298776 265339 150075 28424 -7790 63545 158684 172048 103501 55666 85001 111656
35439 111656 28547 -132490 -206397 -73270 203265 428994 458764 317294 144206 33867
35429 33867 -37357 -115345 -161140 -110590 -9957 12314 -68875 -113465 1057 203023 309194
35418 309194 247930 123397 67299 98706 152300 195791 269859 407922 549787 579081 459637
35407 459637 293405 202080 184426 153096 87760 57091 76334 46140 -106132 -296383 -373830
35396 -373830 -304696 -194721 -147388 -166344 -198252 -214040 -222298 -225506 -187085 -56663 157103
35385 157103 349212 394266 276615 114369 34326 49169 75619 42608 -46423 -137335 -182276
35374 -182276 -178943 -166529 -180939 -220731 -267389 -314407 -346482 -324754 -250445 -212191 -284137 -388867
35362 -388867 -366569 -197292 -47607 -57231 -181538 -298426 -364978 -390308 -354567 -265860 -226179
35351 -226179 -317601 -460502 -497013 -391711 -245712 -134410 -48090 7174 -27223 -156768
35341 -156768 -280269 -296466 -215744 -131522 -119975 -190879 -298305 -375260 -385245 -355693 -338286
35330 -338286 -331999 -276644 -135656 38478 141631 121355 37591 3607 47486 58260 -72853
35319 -72853 -269535 -322584 -156465 55286 111204 30098 -24266 1124 3446 -82736 -178261
35308 -178261 -174214 -63165 78136 173689 188935 132765 40155 -64422 -169595 -225981 -155886
35297 -155886 22167 143200 71022 -118506 -238971 -239266 -215931 -206987 -140300 -9852 60587
35286 60587 -4042 -118723 -178086 -193624 -217191 -236403 -231028 -236899 -266708 -259265 -198721 -189590
35274 -189590 -303171 -434276 -438277 -343401 -286810 -289043 -250232 -156517 -126787 -219417 -327204
35263 -327204 -323797 -214402 -81055 35541 127206 156232 88399 -33989 -120245 -136504 -142853
35252 -142853 -214951 -346142 -438040 -394428 -230261 -74778 -46842 -137813 -242475 -289582 -298114
35241 -298114 -308169 -312255 -279354 -207306 -118695 -28220 57193 123032 158988 173760 173236 136139
35229 136139 43566 -69088 -125779 -93649 -31334 -27510 -97376 -165246 -155411 -79531 -18067 -25172
35217 -25172 -70090 -74296 3285 121770 197777 191480 149135 146217 190329 208244 141998 26826
35205 26826 -55620 -76847 -73724 -76186 -72427 -49169 -21392 -6681 -2273 -522 690 11139 39688
35192 39688 61662 29931 -62546 -160919 -208791 -201942 -160033 -76117 66987 240145 362979
35181 362979 367866 263687 136795 86403 143078 240645 274353 193928 43571 -78751 -98549
35170 -98549 -22841 63541 78423 30706 -2699 27 -32406 -134001 -205300 -140959 -5087
35159 -5087 42798 -18084 -43937 47670 163104 195553 173949 166580 145371 54385 -61757 -109057
35147 -109057 -77163 -25119 24488 83000 122494 102784 53225 41780 76799 115191 146934
35136 146934 190786 224109 201395 134998 82881 66680 71662 106152 179855 243522 239747 199189
35124 199189 194936 218403 203386 158412 154956 186003 170200 112851 116361 187521 187997 58968
35112 58968 -46266 26014 192457 243292 120297 -51369 -162595 -212480 -216996 -160239 -60260
35101 -60260 16813 42716 59694 106007 166331 209755 220411 176756 56847 -113622 -262539
35090 -262539 -341892 -366026 -370369 -364753 -334146 -255421 -115276 53180 160413 138637 32650
35079 32650 -41996 -41773 -38214 -98967 -189916 -237896 -238220 -241020 -260325 -255667 -192980 -77076 64631
35066 64631 182188 198727 71185 -130885 -265712 -268855 -215809 -200181 -199973 -128851 8701
35055 8701 96667 52364 -78295 -198911 -273915 -316925 -322122 -276190 -212692 -183924 -184402 -165886
35043 -165886 -128043 -124595 -164660 -179598 -123723 -46680 -17429 -28947 -39846 -68192 -161895 -286678
35031 -286678 -326140 -217651 -34120 97116 117064 50187 -64212 -208625 -362549 -480875
35021 -480875 -518328 -471100 -384326 -312940 -277021 -261686 -254654 -261653 -277723 -271436 -222821 -159464
35009 -159464 -125954 -129600 -146825 -170387 -208460 -238366 -208053 -100145 40179 159949 251324
34998 251324 329233 383510 382929 316293 210217 113047 68347 87156 135039 162047 153105 130602
34986 130602 107339 73756 44147 69476 169304 284067 333449 295146 189916 28171 -167704
34975 -167704 -315684 -330915 -238092 -159704 -173585 -237967 -274595 -262836 -218320 -138349 -24496
34964 -24496 73468 90343 12712 -116204 -241196 -319185 -325202 -270258 -198267 -137378 -70413
34953 -70413 24231 125939 191604 198807 149311 64267 18 19984 108988 164656 129006 78962
34941 78962 114442 203364 232898 185613 154281 185088 219861 216343 220297 276038 353469 409709
34929 409709 444539 450372 389202 275106 202249 223310 264134 227158 122093 27455 -19347
34918 -19347 -22302 23178 98560 132747 91305 46520 64814 74006 -41273 -242637 -364388
34907 -364388 -332940 -236125 -161712 -92441 318 73818 87903 75575 75696 64643 18404 -14472
34895 -14472 30249 135112 210428 179011 29497 -170797 -292338 -233166 -37475 124686
34885 124686 142199 80573 69356 127351 165497 119836 4191 -143018 -283258 -358514 -328314
34874 -328314 -238826 -189274 -209185 -224432 -169492 -80270 -36439 -51393 -70784 -63093 -58412 -90279
34862 -90279 -142890 -180867 -201441 -220935 -226785 -191962 -140087 -140720 -210168 -264591 -222088 -119218
34850 -119218 -64022 -89432 -122986 -104822 -64829 -57890 -80439 -88015 -58160 -6643 28718 3775
34838 3775 -91780 -189990 -188478 -71332 55885 86681 26905 -51146 -117632 -184841 -231351 -206151
34826 -206151 -110693 -12637 39899 69728 112744 147367 118393 15697 -107368 -199328 -263294
34815 -263294 -318572 -331218 -238947 -62405 67389 50396 -46283 -62719 57585 219001 316332
34804 316332 340857 328541 289727 227320 150368 31065 -173217 -406492 -508195 -396477
34794 -396477 -191295 -73015 -73739 -93801 -70886 -28775 7986 37722 30291 -45279 -136502 -141273
34782 -141273 -40641 76465 130340 121999 83167 30677 -16598 -44748 -79913 -149095 -201492
34771 -201492 -149299 -2703 118643 137057 102964 97003 120901 127365 91947 10594 -115664
34760 -115664 -251527 -336527 -356202 -344425 -292751 -149882 40087 108968 -26924 -214012
34750 -214012 -242749 -128384 -72097 -165904 -287251 -305764 -248630 -198688 -150394 -62507 28438
34739 28438 53583 25693 10096 9148 -26742 -83809 -84731 -20669 16781 -19210 -43973 23942
34727 23942 108934 64095 -114224 -267042 -283065 -229594 -224474 -256266 -214668 -67716 76854
34716 76854 102807 25137 -33885 9930 110352 151829 87588 -12331 -59619 -54458 -52518 -59250
34704 -59250 -32181 16799 11771 -65292 -126395 -102224 -41123 -17535 -8424 52947 147938 195266
34692 195266 181660 177194 221595 271817 268053 194158 78109 -16036 -19475 55512 90450 -3037
34680 -3037 -152829 -220703 -194003 -171621 -182402 -154855 -74614 -28945 -58426 -97290 -108345 -142625
34668 -142625 -201893 -183420 -58334 24232 -59528 -197426 -177083 28175 246576 341467 323591
34657 323591 249959 145243 40314 -16045 -15191 6586 30043 61171 82875 65729 28729
34646 28729 29285 89495 178589 255802 280542 205536 30446 -150134 -224663 -190758 -144718 -153742
34634 -153742 -200643 -244037 -261052 -230615 -144426 -43753 11659 15992 11257 20358 40399 80662
34622 80662 136542 145735 55928 -71945 -117400 -58054 14128 33991 22863 420 -53186 -119473
34610 -119473 -131396 -82031 -48537 -65963 -71528 -18276 54685 114013 185980 256929 238011 117781
34598 117781 36650 96024 194668 188697 123672 143890 233834 238854 126556 36420 40920 33362
34586 33362 -82452 -240863 -336135 -368789 -373272 -309246 -144871 25110 68320 -15555 -118529
34575 -118529 -187378 -256655 -331438 -345211 -256527 -111830 10241 62582 32933 -51801 -112622
34564 -112622 -74281 45306 158722 242072 384656 677102 1101844 1561354 1967927 2302160
34554 2302160 2671947 3332552 4491533 5951337 7036944 7088697 6078484 4631101 3417256
34545 3417256 2637673 2108396 1655080 1272579 996018 801401 655695 561918 522673 511897
34535 511897 494125 439185 333628 215726 166436 208806 249420 192544 85392 60830 147596
34524 147596 236093 239247 184112 117237 24793 -96691 -179889 -175701 -143518 -173534 -256516 -304137
34512 -304137 -277332 -229712 -229969 -286089 -340083 -312779 -179607 -28018 2574 -119368 -258612
34501 -258612 -265159 -143965 -10850 77768 161201 257673 312620 289150 236219 227279 274677
34490 274677 336223 379936 423516 523989 721601 968333 1131942 1117481 972533 822432
34480 822432 719678 623346 508800 402349 298545 149092 -24242 -103309 -27675 101070
34470 101070 144072 90288 16616 -54280 -148913 -227918 -192333 -16370 209486 380348 454134
34459 454134 427267 315236 175931 80788 38709 6847 -16471 9996 60951 32835 -102461
34448 -102461 -218121 -187448 -58326 14420 -30689 -120089 -177537 -198925 -191091 -125158 17297
34437 17297 205067 386032 515976 555093 487471 356501 234242 143457 53894 -39660 -94102
34426 -94102 -90151 -69440 -72004 -89715 -111636 -158919 -233071 -282872 -274747 -248671 -243631 -211366
34414 -211366 -81911 112218 265416 347051 428472 542849 609590 555171 444778 414119
34404 414119 491881 561817 507224 336072 142052 -9706 -115482 -180471 -193670 -164049 -133509
34393 -133509 -125133 -110446 -60159 1852 36581 54132 83135 96890 47516 -26786 -20546 82177
34381 82177 159286 117053 27238 18113 89723 135892 113557 82546 84212 83793 52283 20421
34369 20421 20048 35633 41531 34730 11502 -35772 -83170 -92390 -77671 -93626 -138430 -140027 -70242
34356 -70242 605 13285 19324 102641 241745 320574 263776 111808 -28165 -69663 -1730
34345 -1730 104365 149391 94084 -7672 -64960 -18947 133458 330899 453018 400611 203613
34334 203613 -4428 -145965 -263966 -391527 -451925 -371745 -219175 -121751 -90972 -38750
34324 -38750 60505 140291 164809 166801 157691 112923 63501 85133 159561 161150 39639 -88683
34312 -88683 -108189 -67871 -81272 -137779 -131841 -40864 45724 69325 69579 96858 148773 218721
34300 218721 325303 450915 514575 457335 314807 162268 25471 -105445 -205487 -225453
34290 -225453 -175321 -142179 -198456 -316798 -398334 -376843 -283659 -215035 -240378 -336467 -408991
34279 -408991 -383770 -275926 -164304 -107505 -102881 -121358 -149971 -185467 -210348 -200760 -152011
34268 -152011 -84030 -31580 -34894 -114068 -232081 -308024 -296782 -234614 -175178 -114003 -31833
34257 -31833 17177 -48794 -197160 -280142 -222210 -129675 -146188 -261137 -347284 -348999 -334300
34246 -334300 -368851 -434265 -487885 -518729 -511714 -433237 -303745 -222525 -251332 -310668 -267029
34235 -267029 -110658 27615 45913 -12575 -45918 -33808 -26675 -27011 32195 173718 312738
34224 312738 354680 309390 250149 194368 102848 -11498 -62764 -8054 86430 139969 163373
34213 163373 217644 306738 369557 358276 278893 173306 100157 106280 169554 192884 105000
34202 105000 -50472 -171742 -219061 -225300 -216258 -191933 -172082 -184482 -209739 -208629 -202950 -253770
34190 -253770 -357615 -448764 -514927 -613061 -736834 -768122 -625997 -389221 -197751 -90864
34180 -90864 -19796 26696 609 -115308 -269000 -392005 -442925 -407573 -304407 -185654 -94419
34169 -94419 -27372 32362 70276 68508 51614 51636 46878 -6320 -91291 -140263 -123577 -73480 -21231
34156 -21231 26549 44411 -5402 -95995 -132018 -66798 28483 62109 43082 43956 78370 96665
34144 96665 95387 140436 249398 328523 292475 198821 180274 260439 329605 318958 299585 345724
34132 345724 381599 274528 51648 -96171 -50141 94151 167376 130043 70242 58279 86370
34121 86370 124485 154305 148740 84279 -13807 -88004 -123020 -161335 -228279 -278087 -239818 -100991
34109 -100991 69666 176753 177310 118649 92219 136275 197679 210163 187591 198508 260127
34098 260127 311460 301343 254287 225501 229414 243342 252897 258010 249748 214832 157913 94130
34086 94130 24946 -53744 -123711 -154641 -148182 -141755 -149732 -125336 -15233 154073 281762 297222
34074 297222 229858 155096 101189 45854 -17584 -67075 -106387 -173357 -266828 -314274 -257741
34063 -257741 -143778 -78397 -102329 -153996 -155520 -96670 -24692 18377 30885 38808 62414 95916
34051 95916 119711 129007 137471 152279 166500 178912 187821 152869 10831 -230263 -450975 -532969
34039 -532969 -494174 -453934 -475127 -508481 -497103 -459809 -436285 -410866 -345949 -258095 -204456
34028 -204456 -201858 -204771 -169854 -109850 -67307 -52042 -27381 36714 113483 145690 122423 98960
34016 98960 123271 174596 206678 220169 240695 246715 188585 80792 4426 -1878 10474 -13894
34004 -13894 -69131 -145522 -274327 -447473 -558205 -518546 -401577 -362341 -425868 -462318 -389869
33993 -389869 -289241 -259769 -259911 -188238 -66190 -23583 -105359 -196136 -173810 -64651 11385
33982 11385 7124 -6680 43391 130432 166571 120119 59138 71199 158775 237324 238999 192847
33970 192847 179962 224624 265099 235364 143961 60293 49074 128373 258739 353513 335772
33959 335772 220868 118758 118108 187972 228396 189746 94455 -26897 -146703 -201669 -134965
33948 -134965 2942 78116 36350 -28246 -14408 45542 52068 -8347 -56078 -35815 33360
33937 33360 110065 164428 168785 121647 81030 109243 173198 157688 2055 -214928 -348761
33926 -348761 -327244 -208972 -122450 -141600 -204594 -177727 -25982 117723 105868 -34714 -142225
33915 -142225 -131331 -75127 -67189 -95859 -98961 -71411 -55800 -61038 -43571 37094 165694 268407
33903 268407 270707 184090 116828 152311 238375 264238 223814 202555 207420 142927 -3245 -88950
33891 -88950 -20609 87881 78569 -16443 -44916 18409 51006 -5326 -63637 -47887 -364 13636
33879 13636 4129 5016 10072 18164 70246 179119 278912 305459 282055 269500 274657 270749 272007
33866 272007 314960 379384 395469 333814 236895 155260 99428 66758 69889 106710 124580 51461
33854 51461 -124436 -312906 -377331 -256059 -34398 128171 157549 126664 137803 183915 183138
33843 183138 129207 122475 223428 345841 357513 252370 155698 163980 235878 253794 154253
33832 154253 -16938 -152442 -179408 -131952 -124795 -222394 -343593 -348789 -223309 -105396 -107536
33821 -107536 -183206 -221128 -203377 -191626 -203819 -201144 -182529 -197849 -254768 -286194 -228963 -81796
33809 -81796 113792 285876 334165 213184 31685 -26516 78752 191916 178416 103609
33799 103609 119511 247967 372246 398127 328912 209927 93033 45649 106589 223493
33789 223493 299056 303990 287392 278583 243412 146280 -99 -156183 -279076 -322210 -264502
33778 -264502 -149560 -51539 2777 35345 46880 6497 -78172 -138658 -117698 -25133 88326
33767 88326 170261 174487 87145 -33521 -93200 -64039 -11178 2796 -7481 574 20204 10467
33755 10467 -36936 -80871 -65846 41428 220246 379914 411825 293939 125423 31733 51516
33744 51516 131108 197988 213113 182421 152854 174214 229403 226098 103333 -67304 -139822
33733 -139822 -59026 78050 142488 112568 58582 22285 -25474 -98742 -131475 -54597 86345
33722 86345 157858 91968 -46186 -166246 -262184 -362871 -429803 -387564 -238844 -71889 48421
33711 48421 130807 193289 216453 184274 121737 68637 49028 69972 108037 99820 2192 -133989
33699 -133989 -209339 -198943 -163111 -131560 -63895 48405 130698 125938 73165 32065 -3265
33688 -3265 -58915 -113662 -136879 -134671 -102229 102 155180 248062 204858 107368 70432 67426
33676 67426 -2042 -117721 -152988 -70778 30699 76530 90456 88910 27620 -96804 -199076
33665 -199076 -218828 -198271 -194367 -192427 -159000 -104959 -41792 52048 164083 217730 171158 80742
33653 80742 7048 -65859 -141972 -127779 49120 281937 368099 243378 34787 -112855 -162884
33642 -162884 -136468 -46318 76970 169300 193956 177576 163414 172876 222043 313905 394197
33631 394197 383361 289117 225217 271617 371354 420533 406809 384401 350519 243687 68579
33620 68579 -65020 -67692 16127 61809 3692 -114196 -207269 -232153 -200670 -145556 -93765
33609 -93765 -66221 -80695 -135759 -193976 -203356 -150972 -83401 -56397 -72573 -89323 -82058 -70027
33597 -70027 -71905 -64825 -14435 63086 98397 43413 -62403 -121205 -79093 16479 76936 74679
33585 74679 54830 52622 46523 10405 -33709 -50207 -39650 -10489 61565 183011 277194 250316
33573 250316 122475 12504 -22328 -48305 -125472 -202915 -206257 -161049 -146876 -169028 -160324
33562 -160324 -95061 -26723 -12195 -55568 -128589 -200869 -250590 -279016 -300178 -287886 -176692
33551 -176692 26384 177300 133718 -60426 -223041 -257412 -223813 -186895 -121266 -16769
33541 -16769 41117 -15787 -122201 -164566 -128722 -80316 -44176 5711 60506 71348 32341
33530 32341 -865 11983 47528 55307 8001 -83035 -168004 -176620 -70131 114972 286068
33519 286068 355681 294408 162064 91202 179102 361098 446403 331120 130036 39063 108180
33508 108180 218009 247102 184342 92458 36466 46756 91883 91337 5872 -102801 -158212
33497 -158212 -183352 -249947 -339986 -359432 -287472 -206100 -163171 -110212 -12491 78393 117586
33486 117586 148626 224272 308166 321740 243011 105488 -50434 -168675 -172997 -42836 137399
33475 137399 263033 312853 322098 304632 271471 274730 336817 367520 263761 87347 23185
33464 23185 129972 246530 212377 87864 56727 165926 278223 276548 207751 186075 231187
33453 231187 263732 224508 139065 73438 68697 117715 173232 178211 116462 34692 -7387 -35
33441 -35 32214 90671 191421 294471 311733 213063 68562 -46091 -127105 -183381 -168127
33430 -168127 -44574 123938 230791 246811 212004 143274 45237 -12601 50849 186282 236653
33419 236653 133781 -23890 -120594 -144257 -111858 8237 207738 358772 332601 155031
33409 155031 -41406 -175025 -241029 -232554 -145348 -38896 12009 22301 61863 123680 128316
33398 128316 65979 26214 56848 95520 89627 88847 145926 202823 169536 71534 21573 61231
33386 61231 122353 149453 167699 193903 161084 6199 -203824 -315690 -265925 -149995 -89335
33375 -89335 -82811 -41678 59488 140369 134631 87482 87859 140299 167068 134699 114953 186105
33363 186105 314693 391228 373638 332317 330366 320672 224104 73084 -14100 -7019 -14292 -116053
33351 -116053 -230495 -224664 -96587 45180 138352 195610 204997 131247 26571 11702 102308
33340 102308 164436 101696 -13073 -65784 -68366 -102592 -164159 -169212 -82732 51277 186856
33329 186856 303764 374496 376500 329713 267535 189319 91535 12291 -16689 -25958 -44891 -20439
33317 -20439 111313 295812 399057 371879 286671 211476 141914 73901 52783 109183 202791
33306 202791 259341 225965 89606 -105764 -260404 -297202 -244390 -191653 -177956 -183705 -205700
33295 -205700 -246909 -245958 -129550 52013 151414 114834 45266 47403 117776 226112 383279
33284 383279 560751 655195 622890 558318 547271 527633 402163 217969 113557 129602 183211
33273 183211 201528 178595 122328 45546 -1438 20945 69663 74218 42942 27401 6584 -84075
33261 -84075 -213776 -262544 -186052 -70693 2438 46105 81084 66337 -18695 -104107 -118536
33250 -118536 -88704 -76608 -70203 -21452 41237 33163 -55416 -128817 -107937 -26375 19886 -23343
33238 -23343 -139051 -276579 -383893 -423675 -395970 -344986 -318076 -314465 -294489 -242021 -190228
33227 -190228 -168879 -151242 -86147 27176 132832 188148 203266 201939 182963 143734 106945
33216 106945 89011 65841 7419 -69639 -121470 -136820 -136008 -113500 -26400 143344 340627
33205 340627 467198 454322 314147 139237 42343 65219 141924 172006 125918 53352 -1554
33194 -1554 -46440 -92464 -110486 -75023 -24710 -27649 -82057 -93821 16024 197088 300779
33183 300779 237735 76373 -40170 -50128 -1374 60405 154480 284344 366906 321984 204697
33172 204697 161814 246700 352924 364208 306424 291807 348921 383712 316173 191869 117332
33161 117332 120677 133778 108429 86677 123999 193249 222783 200894 171599 139320 63637 -40076
33149 -40076 -90878 -74340 -87792 -179012 -227624 -102301 115080 195244 44347 -199045 -359894
33138 -359894 -398283 -349877 -216925 -2065 222358 362814 387902 314244 160431 -26470
33128 -26470 -149682 -146845 -74080 -41461 -80301 -131617 -147692 -138970 -125192 -105913 -91627 -109928
33116 -109928 -157899 -183890 -137768 -20312 123772 242313 305170 320606 323026 326773 302641
33105 302641 225387 126049 52975 -9616 -125511 -297261 -432046 -451431 -391745 -350318 -360391
33094 -360391 -369551 -328841 -250075 -168071 -91376 -13487 54980 92347 92794 68895 35235 3726
33082 3726 -13973 -16420 -19616 -39265 -71678 -107883 -154543 -210432 -226891 -138124 45717 212159
33070 212159 253375 183513 111749 110030 151964 180581 180750 158827 96511 -24334 -163670 -236565
33058 -236565 -196987 -84241 26293 101944 167343 251259 341503 399352 402121 353737 261252
33047 261252 128525 -18177 -124567 -152394 -118306 -69199 -30117 2241 29423 49913 85260
33036 85260 169004 294918 401140 423012 351580 236890 147684 124162 146465 149302 92838
33025 92838 17283 -5127 29450 50269 17155 -22308 -13517 15776 -880 -66643 -124756 -153157
33013 -153157 -191713 -261426 -309261 -266619 -135420 15401 126472 193601 239078 262222 234230
33002 234230 138813 6955 -96823 -125395 -87621 -39290 -35316 -82780 -136289 -146693 -116995
32991 -116995 -94232 -97641 -81968 -952 114277 185547 190759 187499 225752 285648 320545 315750
32979 315750 276289 199130 96901 18006 1072 29137 63246 97077 137297 152202 94372
32968 94372 -25921 -133663 -164662 -121235 -51360 168 15780 3739 -17348 -37160 -52240
32957 -52240 -49295 -18258 9610 -20560 -102875 -149270 -102069 -30229 -43941 -130629 -154155 -29222
32945 -29222 166946 282053 244960 114292 4961 -16444 14913 9023 -61243 -111287 -55796
32934 -55796 55841 83952 -26608 -191271 -312677 -379351 -410581 -388284 -299582 -186764 -97429
32923 -97429 -28873 33267 71667 79941 91629 109485 68016 -55928 -152627 -102642 42950
32912 42950 120659 85811 65163 153299 270916 287083 196610 96717 41615 4288 -38450
32901 -38450 -58714 -24766 51079 128364 180729 212461 239997 259310 238025 155695 46963
32890 46963 -23879 -34930 -21852 -16209 -9874 4980 10111 7722 44963 140281 218936 186489
32878 186489 56368 -54817 -61459 13624 102579 179423 259909 354877 454109 533681 556786
32867 556786 488042 331848 146882 4225 -67673 -95374 -129498 -199270 -279016 -302794 -238838
32856 -238838 -147882 -129993 -204125 -279874 -266408 -169710 -59718 11156 18364 -54543 -177646
32845 -177646 -244866 -165964 4554 101454 35696 -109466 -197793 -198892 -179026 -174671 -145725
32834 -145725 -55960 54505 104416 57051 -51275 -157455 -220603 -220535 -139908 9511 145375
32823 145375 158311 38693 -77714 -50054 98615 214909 208290 134838 80702 50667 11455
32812 11455 -36642 -94349 -199396 -345215 -417545 -315895 -116432 -8379 -61722 -153857 -151174
32801 -151174 -74847 -39971 -98500 -200526 -269207 -261185 -177633 -58359 46587 120494 177364
32790 177364 211899 197477 151145 139699 174969 156545 -9278 -257398 -403524 -339319 -136633
32779 -136633 44717 105101 57292 -17231 -42435 -11875 620 -84102 -252805 -397602 -422099
32768 -422099 -333689 -224028 -173450 -179396 -169254 -87778 21485 46892 -52642 -171887 -177737
32757 -177737 -84332 -32989 -93168 -174386 -175041 -128731 -124565 -150181 -123384 -51670 -39771 -121593
32745 -121593 -192678 -159870 -70764 -19785 11401 120056 305816 426104 361331 166698 14245
32734 14245 7827 92289 137695 79888 -33111 -110654 -105475 -30495 72624 148817 135429 7958
32722 7958 -169310 -284018 -286797 -222298 -137192 -22909 109607 173976 114035 17880 18373 96047
32710 96047 95697 -49525 -225751 -305271 -293736 -251871 -178836 -66102 17091 5352 -46834
32699 -46834 -40141 15330 33687 14802 42709 116205 111690 -37264 -224423 -298465 -235277 -122757
32687 -122757 -31667 31712 79198 111704 131365 145894 160074 171873 163885 101543 -29756
32676 -29756 -184846 -290071 -313844 -272909 -187219 -86643 -43198 -106515 -201007 -188285 -63446
32665 -63446 12826 -68515 -214215 -270200 -224437 -172900 -157666 -155400 -180411 -272911 -392925
32654 -392925 -434182 -357307 -232641 -146326 -128082 -160896 -190755 -142002 -4443 107103 71026
32643 71026 -67477 -138629 -70309 36530 77217 77882 108489 156364 163095 128412 104325 117122
32631 117122 148282 171224 172713 159257 159003 185801 195291 125878 -6201 -110756 -137953 -126717
32619 -126717 -123452 -126411 -135571 -175474 -230557 -241145 -208846 -215348 -278201 -287457 -170014 -22905
32607 -22905 25085 3851 26949 90784 97631 47051 48399 137116 219072 223587 189519 167790
32595 167790 153661 155644 220879 337342 405250 363005 261221 165148 73375 -11072 -24799
32584 -24799 61396 170149 223764 254057 315511 351319 255122 33968 -190635 -325793 -362882
32573 -362882 -314127 -199518 -98597 -110076 -224442 -309737 -261207 -114166 18680 74986
32563 74986 78796 84973 117852 152305 147909 110079 98284 147769 211225 221198 180890 135127
32551 135127 83206 3318 -56348 -17651 86163 120440 39516 -37372 -1907 87431 110537
32540 110537 69104 59024 105837 137003 102336 26482 -55290 -126634 -150130 -81403 53622
32529 53622 158503 166113 93628 -5194 -85272 -104472 -44236 42223 66977 20948 -8886 36061
32517 36061 110375 152580 176523 209959 203415 93422 -67713 -138491 -53600 107858 233973
32506 233973 293852 312481 294342 230235 155050 138940 207046 297696 319698 240879 106113
32495 106113 -23082 -121066 -183683 -194868 -146703 -82914 -72679 -123262 -156501 -99979 24790
32484 24790 132670 170335 153920 135408 163754 255496 364091 398594 320395 208416 175415
32473 175415 225057 251001 183509 73081 6040 -421 22674 66968 130787 159405 78280
32462 78280 -97464 -237086 -211753 -24003 195699 309899 280829 173020 77037 39417
32452 39417 50939 76766 84233 52204 -23336 -120432 -192708 -191941 -102413 36667 147929 175566
32440 175566 138003 105580 115808 131377 100033 32206 -14138 -12893 4903 5751 -511 20754
32428 20754 86239 176122 244476 254521 221033 203742 234681 272186 259635 202340 137609 60312
32416 60312 -45634 -120968 -79090 44977 99138 11170 -115207 -160329 -147799 -156870 -162107
32405 -162107 -82088 58888 143902 123438 49074 -46253 -181287 -323361 -374522 -312707 -248187
32394 -248187 -269510 -307550 -233336 -43806 133123 201696 194116 195326 223948 216420 113938
32383 113938 -59683 -222527 -332278 -426121 -540964 -634254 -640763 -584321 -554846 -570078 -539810
32372 -539810 -394447 -180635 4826 112392 133340 65038 -58303 -152632 -167129 -147602
32362 -147602 -165307 -220138 -266396 -289046 -287954 -230052 -104627 -4143 -55253 -260380 -480875
32351 -480875 -588445 -569930 -477352 -351332 -224075 -136854 -110338 -125204 -151859 -170519 -156112
32340 -156112 -87513 13307 93851 139581 187211 251062 283405 238803 138210 33765 -56660
32329 -56660 -139463 -195612 -189053 -120850 -37926 19792 58716 108243 170646 210501 200310 162998
32317 162998 141503 125641 54598 -80300 -185334 -177090 -111636 -119235 -218220 -282969 -214874
32306 -214874 -61783 67847 135915 174110 216223 282095 375192 447185 419263 291019 170738
32295 170738 136040 124620 42713 -71661 -93518 13112 168946 313535 452881 564060
32285 564060 566186 432164 247338 108596 29163 -15859 -19258 23472 63749 55357 30587
32274 30587 54865 122120 162721 156949 171657 251271 324530 284838 153701 89928 194809
32263 194809 361255 393876 260469 129207 139708 241420 314326 346791 394160 441395 439033
32252 439033 429980 493433 574439 521471 315495 117603 44009 29460 -22215 -80630 -68502
32241 -68502 7615 95743 174140 206071 123448 -46741 -148668 -109975 -78757 -198876 -351423
$$ [...]
##END NTUPLES=NMR SPECTRUM
##END=
