##TITLE=31Pdec_LR-723-R2-RM
 , 24 sc
 20.10.2020
##JCAMPDX= 6.0         $$ Bruker NMR JCAMP-DX V2.0
##DATA TYPE= NMR SPECTRUM
##DATA CLASS= NTUPLES
##ORIGIN= UXNMR, Bruker Analytische Messtechnik GmbH
##OWNER= root
$$ XWIN-NMR		Version 3.5
$$ Tue Oct 20 12:43:35 2020 Russian Standard Time (UT+4h)  she@DPX200
##.OBSERVE FREQUENCY= 81.013821
##.OBSERVE NUCLEUS= ^31P
##.ACQUISITION MODE= SIMULTANEOUS
##.ACQUISITION SCHEME= undefined
##.AVERAGES= 24
##.DIGITISER RES= 17
##SPECTROMETER/DATA SYSTEM= spect
##.PULSE SEQUENCE= zgpg30
##.SOLVENT NAME= DMSO
##.SHIFT REFERENCE= (INTERNAL, DMSO, 0, 256.543)
##AUDIT TRAIL= $$ (NUMBER, WHEN, WHO, WHERE, WHAT)
$$ ##TITLE= Audit trail, XWIN-NMR		Version 3.5
$$ ##JCAMPDX= 5.01
$$ ##ORIGIN= Bruker BioSpin GmbH
$$ ##OWNER= she
$$ F:/spectra/data/she/nmr/P31/1/pdata/1/auditp.txt
$$ ##AUDIT TRAIL=  $$ (NUMBER, WHEN, WHO, WHERE, WHAT)
(   1,<2020-10-20 12:41:13.71 +0400>,<she>,<DPX200>,
      <created by zg, POWCHK disabled, PULCHK disabled
       configuration hash MD5:
       00 E9 B6 7A A2 85 ED C7 34 08 36 98 17 FE 4E 26
       data hash MD5: 32K
       0A C4 08 30 80 AD 13 80 59 96 99 E3 A5 B1 31 B5>)
(   2,<2020-10-20 12:41:16.37 +0400>,<she>,<DPX200>,
      <Start of raw data processing
       efp BC_mod = 2 LB = 1 FT_mod = 6 PKNL = 1 PHC0 = -2755.422 PHC1 = 86.20139 SI = 64K 
       data hash MD5: 64K
       47 DB AF 50 66 F5 5F 4C BC 98 CB F8 F6 22 8B 6D>)
(   3,<2020-10-20 12:41:39.75 +0400>,<she>,<DPX200>,
      <abs ABSG = 5 
       data hash MD5: 64K
       E9 76 B6 AB DF 30 98 7D 70 62 10 98 15 9A FC 60>)
(   4,<2020-10-20 12:42:03.32 +0400>,<she>,<DPX200>,
      <pk PHC0 = 5.389221 PHC1 = -13 
       data hash MD5: 64K
       D4 F0 D6 27 51 16 00 E3 75 C8 DD 3C 9C 92 90 44>)
(   5,<2020-10-20 12:42:06.34 +0400>,<she>,<DPX200>,
      <abs ABSG = 5 
       data hash MD5: 64K
       00 C0 22 FD 5A B2 A1 70 6B 93 54 57 2A F8 27 6C>)
$$ ##END=
$$ 
$$ hash MD5
$$ 8E 36 56 90 31 FA 4D 16 51 7E B4 27 FF D3 7F E6
##$RELAX= 
##$RELAX= 
##$RELAX= 
##$RELAX= 
##$RELAX= 
##$RELAX= 
##$RELAX= 
##$RELAX= 
$$ Bruker specific parameters
$$ --------------------------
##$DU= <F:/spectra>
##$EXPNO= 1
##$NAME= <P31>
##$PROCNO= 1
##$TYPE= <nmr>
##$USER= <she>
##$AMP= (0..31)
100 100 100 100 100 100 100 100 100 100 100 100 100 100 100 100 100 100 
100 100 100 100 100 100 100 100 100 100 100 100 100 100 
##$AQSEQ= 0
##$AQ_mod= 1
##$AUNM= <au_zg>
##$AUTOPOS= <>
##$BF1= 81.014009
##$BF2= 200.13
##$BF3= 200.13
##$BF4= 200.13
##$BF5= 200.13
##$BF6= 200.13
##$BF7= 200.13
##$BF8= 200.13
##$BYTORDA= 1
##$CFDGTYP= 0
##$CFRGTYP= 5
##$CHEMSTR= <none>
##$CNST= (0..31)
1 1 145 1 1 1 1 1 1 1 1 1 1 1 1 1 1 1 1 1 1 1 1 1 1 1 1 1 1 1 1 1 
##$CPDPRG= <waltz16>
##$CPDPRG1= <>
##$CPDPRG2= <waltz16>
##$CPDPRG3= <>
##$CPDPRG4= <mlev>
##$CPDPRG5= <mlev>
##$CPDPRG6= <mlev>
##$CPDPRG7= <mlev>
##$CPDPRG8= <mlev>
##$CPDPRGB= <>
##$CPDPRGT= <>
##$D= (0..31)
0 1 0 0 0 0 0 0 0 0 0 0.03 2e-05 3e-06 0 0 0 0 0 0 0 0 0 0 0 0 0 0 0 0 
0 0 
##$DATE= 1603183273
$$ [...]
##$SUBNAM3= <"">
##$SUBNAM4= <"">
##$SUBNAM5= <"">
##$SUBNAM6= <"">
##$SUBNAM7= <"">
##$SUBNAM8= <"">
##$SUBNAM9= <"">
##$SW= 369.568048894756
##$SWIBOX= (0..15)
0 1 3 0 0 0 0 0 0 0 0 0 0 0 0 0 
##$SW_h= 29940.119760479
##$TD= 32768
##$TD0= 1
##$TE= 0
##$TE2= 300
##$TE3= 300
##$TEG= 300
##$TL= (0..7)
0 120 53 12 22 120 120 120 
##$TP= (0..7)
150 150 150 150 150 150 150 150 
##$TP07= 0
##$TPNAME0= <>
##$TPNAME1= <>
##$TPNAME2= <>
##$TPNAME3= <>
##$TPNAME4= <>
##$TPNAME5= <>
##$TPNAME6= <>
##$TPNAME7= <>
##$TPOAL= (0..7)
0.5 0.5 0.5 0.5 0.5 0.5 0.5 0.5 
##$TPOFFS= (0..7)
0 0 0 0 0 0 0 0 
##$TUNHIN= 0
##$TUNHOUT= 0
##$TUNXOUT= 0
##$USERA1= <user>
##$USERA2= <user>
##$USERA3= <user>
##$USERA4= <user>
##$USERA5= <user>
##$V9= 5
##$VALIST= <valist>
##$VCLIST= <CCCCCCCCCCCCCCC>
##$VD= 0
##$VDLIST= <DDDDDDDDDDDDDDD>
##$VPLIST= <PPPPPPPPPPPPPPP>
##$VTLIST= <TTTTTTTTTTTTTTT>
##$WBST= 1024
##$WBSW= 4
##$XGAIN= (0..3)
0 0 0 0 
##$XL= 0
##$YL= 0
##$YMAX_a= 295132
##$YMIN_a= -253035
##$ZGOPTNS= <>
##$ZL1= 120
##$ZL2= 120
##$ZL3= 120
##$ZL4= 120
##$ABSF1= 256.5433
##$ABSF2= -113.0513
##$ABSG= 5
##$ABSL= 3
##$ALPHA= 0
##$AQORDER= 0
##$ASSFAC= 0
##$ASSFACI= 0
##$ASSFACX= 0
##$ASSWID= 0
##$AUNMP= <proc_1d>
##$AZFE= 0.1
##$AZFW= 0.5
##$BCFW= 0
##$BC_mod= 2
##$BYTORDP= 0
##$COROFFS= 0
##$CY= -3
##$DATMOD= 1
##$DC= 0
##$DFILT= <>
##$DTYPP= 0
##$F1P= 0
##$F2P= 0
##$FCOR= 1
##$FTSIZE= 65536
##$FT_mod= 6
##$GAMMA= 0
##$GB= 0
##$INTBC= 1
##$INTSCL= 5.30512e-09
##$ISEN= 30
##$LB= 1
##$LEV0= 0
##$LPBIN= 0
##$MAXI= 10000
##$MC2= 0
##$MEAN= 0
##$ME_mod= 0
##$MI= 50
##$NCOEF= 0
##$NC_proc= -1
##$NLEV= 6
##$NOISF1= 182.463
##$NOISF2= 159.3651
##$NSP= 0
##$NTH_PI= 0
##$NZP= 0
##$OFFSET= 256.5433
##$PC= 4
##$PHC0= -2750.033
##$PHC1= 73.20139
##$PH_mod= 1
##$PKNL= yes
##$PPARMOD= 0
##$PSCAL= 0
##$PSIGN= 0
##$REVERSE= no
##$SF= 81.008009
##$SI= 65536
##$SIGF1= 159.3651
##$SIGF2= -187.1042
##$SINO= 113.3802
##$SIOLD= 16384
##$SREGLST= <1H.CDCl3>
##$SSB= 0
##$STSI= 65536
##$STSR= 0
##$SW_p= 29940.119760479
##$SYMM= 0
##$S_DEV= 0
##$TDeff= 32768
##$TDoff= 0
##$TI= <>
##$TILT= no
##$TM1= 0
##$TM2= 0
##$TOPLEV= 0
##$USERP1= <user>
##$USERP2= <user>
##$USERP3= <user>
##$USERP4= <user>
##$USERP5= <user>
##$WDW= 1
##$XDIM= 65536
##$YMAX_p= 424983669
##$YMIN_p= -2259623
$$ End of Bruker specific parameters
$$ ---------------------------------
##NTUPLES= NMR SPECTRUM
##VAR_NAME=  FREQUENCY,     SPECTRUM/REAL,   SPECTRUM/IMAG
##SYMBOL=    X,             R,               I
##VAR_TYPE=  INDEPENDENT,   DEPENDENT,       DEPENDENT
##VAR_FORM=  AFFN,          ASDF,            ASDF
##VAR_DIM=   65536,         65536,           65536
##UNITS=     HZ,            ARBITRARY UNITS, ARBITRARY UNITS
##FACTOR=    0.456856943014862, 1,           1
##FIRST=     20782.0623152374, 0,            0
##LAST=      -9158.0574452416, 0,            0
##MIN=       -9158.0574452416, -2259623,     0
##MAX=       20782.0623152374, 424983669,    0
$$ Real data points
##PAGE= N=1
##DATA TABLE= (X++(R..R)), XYDATA
$$ [...]
41547a11211k1681j8066j6510j8949k3561j5123J8700N9850P4940N7670L0338
$$ -111211 -132892 -150958 -167468 -186417 -209978 -225101 -206401 -146551 -71611 -13941 16397
41536A6397O802j6908l7716m1674k6545n025J2769K1915J7770P017Q094K1374
$$ 16397 23199 6291 -31425 -73099 -99644 -104669 -91900 -69985 -52215 -45198 -37104 -15730
41524a5730K1597J668p292J0642J8989j4682o0206p0141n0341l3494j6242J7598
$$ -15730 5867 7535 243 10885 29874 15192 -45014 -115155 -165496 -198990 -215232 -197634
41512a97634M3009L0249Q124J9466L8953J4022l3351l3545J3371L8517K0477Q233
$$ -197634 -154625 -124376 -116252 -96786 -57833 -43811 -77162 -110707 -97336 -58819 -38342 -30109
41500c0109K1700K2630l66r596j894k2521o7612o5742L094N8188L7095j5536l1495
$$ -30109 -8409 14221 13855 4259 2365 -20156 -87768 -153510 -150416 -92228 -55133 -70669 -102164
41487a02164j7631j1786o813J5794K9792O518k7565l1776j3270o23O402J6427
$$ -102164 -119795 -131581 -138394 -122600 -92808 -86290 -113855 -145631 -158901 -159524 -153122 -136695
41475a36695J5583k21k648J9180L0174J0239o028N602Q775k5488n3697k5204L1863
$$ -136695 -121112 -121333 -123981 -104801 -74627 -64388 -70416 -64814 -56039 -81527 -135224 -160428 -128565
41462a28565N3477K9914o738m3936p3753n9455J0310P0249N7126P282l362J6617
$$ -128565 -75088 -45174 -51912 -95848 -169601 -229056 -218746 -148497 -91371 -84089 -87451 -70834
41450g0834K859l5641k4096L9405O1396j587o9065n5390J1395M6190K8541O354
$$ -70834 -67975 -103616 -127712 -88307 -26911 -28498 -97563 -152953 -141558 -95368 -66827 -60473
41438f0473R640J9725J5352K307r163k3917m3756m7953j4566L9105O0865K5589
$$ -60473 -50833 -31108 -15756 -13449 -22612 -46529 -90285 -138238 -152804 -113699 -52834 -27245
41426b7245k4965l3065l092J1682n880j8389o784N87o203J0644O1048Q4290L5607
$$ -27245 -52210 -85275 -88367 -76685 -82565 -100954 -107738 -107151 -113354 -102710 -41662 42628 78235
41413G8235l7270o4342n3526n4721o5692m8722j1374M856l252q649j3888l4647
$$ 78235 40965 -23377 -76903 -131624 -197316 -246038 -257412 -252556 -255808 -264457 -278345 -312992
41401c12992m5331j3269L2948M2882K9105L2454K8509l3814j15431j18170l6868
$$ -312992 -358323 -371592 -338644 -295762 -266657 -234203 -205694 -239508 -354939 -473109 -509977
41390e09977K6620J6221j7587l0966m8627p4500n1573L1313R0646P2735L9065
$$ -509977 -483357 -467136 -484723 -515689 -564316 -638816 -690389 -659076 -568430 -495695 -456630
41379d56630N5913Q2950N6247Q851J1061M4399L6723j0856l1066p711P301o259
$$ -456630 -400717 -317767 -261520 -252669 -241608 -197209 -160486 -171342 -202408 -210119 -202818 -209077
41367b09077m387L7186P3089N0757j7304o8077n6595m01L7329J5144l4011m0636
$$ -209077 -213464 -176278 -103189 -52432 -69736 -137813 -194408 -194809 -157480 -142336 -176347 -216983
41355b16983O786M5480L2356M200J1478M1034M9969L5519K1253Q336r318j3287
$$ -216983 -210197 -164717 -132361 -128161 -116683 -75649 -25680 9839 31092 39428 30110 16823
41343A6823O974K2439J2805P793K8297L3402q054m1921q007M7255L6287k1948
$$ 16823 23797 46236 59041 66834 95131 128533 120479 78558 70551 117806 154093 132145
41331A32145l2584J0413J4102m7663q3992l9633J8302K2285Q906K9921M9693J7586
$$ 132145 99561 109974 124076 76413 -7579 -47212 -28910 -6625 2281 32202 81895 99481
41319I9481k8489k3983Q462P69m0436m8619j3167R039n305j4779O108K4322P434
$$ 99481 70992 47009 55471 56240 15804 -32815 -45982 -36943 -42248 -57027 -50919 -26597 -19163
41306a9163k6175l7576j2395L6290P9678Q3303L6406k5372n4147m3915k3099m714
$$ -19163 -45338 -82914 -95309 -59019 20659 103962 140368 114996 60849 16934 -6165 -10879
41294a0879J7537L2930K0448q015j6560j035P448j778o078J469q63j6689k0946
$$ -10879 6658 39588 60036 52021 35461 34426 41874 40096 34018 35487 34624 17935 -3011
41281c011r041n646j0625O182L6930K9681j7540k9880K4852O2684O072p9771p2332
$$ -3011 -12052 -17698 -28323 -22141 14789 44470 26930 -2950 21902 84586 90658 10887 -61445
41268f1445K0911P0515J5746n9526o3118j2088K5894L0596J7309j1907m7919m8835
$$ -61445 -40534 29981 45727 -13799 -76917 -89005 -63111 -32515 -15206 -27113 -75032 -123867
41256a23867Q468P7263Q9533L8937k1082m4541k7168P224K4092K35m3598n2206
$$ -123867 -115399 -38136 51397 90334 69252 24711 -2457 4767 28859 29094 -14504 -66710
41244f6710n302M5086L7056k2665p4042p6466l4136K8906Q1103Q8510M6185p213
$$ -66710 -72012 -26926 10130 -12535 -86577 -163043 -197179 -168273 -87170 1340 47525 40312
41232D0312l5825m7121n5666m1292O830L7784M21o0899n2393K7265P5494L5913
$$ 40312 4487 -42634 -98300 -139592 -132762 -94978 -94557 -155456 -207849 -180584 -105090 -69177
41220f9177k2873j8995K5510L8755J4749L700J9157K7334J6289Q754N379k1585
$$ -69177 -92050 -111045 -85535 -46780 -32031 -28331 -9174 18160 34449 43203 48582 26997
41208B6997o3493o3017J301O3718N0459j6804m9198j3544K9375K2326q069p107
$$ 26997 -36496 -99513 -98212 -34494 15965 -839 -50037 -63581 -34206 -11880 -19949 -27056
41196b7056J4876O114k9186k9252K0904N4115K2202k8107k8804Q268K3658P858
$$ -27056 -12180 -6066 -35252 -64504 -43600 10515 32717 4610 -24194 -15926 7732 15590
41184A5590k207l112k6374o2250n5333O923O2455N6831J0039k4157k4596k008
$$ 15590 13383 10271 -16103 -78353 -133686 -126763 -64308 -7477 2562 -21595 -46191 -48199
41172d8199L1716O1986O2961K0366m5321r2689r0814l9306K6348N5278L0333q244
$$ -48199 -16483 45503 108464 128830 83509 -9180 -99994 -139300 -112952 -57674 -27341 -35585
41160c5585j1410J7729M0078M0606L3423K3265P387M37P350p809o3925r8387m4312
$$ -35585 -46995 -29266 10812 51418 84841 108106 115493 115930 123280 115471 51546 -46841 -91153
41147i1153M3221M2708m6451q8503j5213P2069O2701q094m2545k6579k445K7297
$$ -91153 -47932 -5224 -51675 -140178 -155391 -83322 -20621 -28715 -71260 -97839 -100284 -72987
41135g2987O9846P8408K0983l5384j1359N2015N1208j7646o0356l4073P268J5555
$$ -72987 -3141 75267 96250 60866 49507 101522 152730 135084 74728 40655 47923 63478
41123F3478L143j1116k7534k9686K640L9819L1326j2273l6832l6909m9805o2791
$$ 63478 66621 55505 27971 -1715 925 40744 72070 59797 22965 -13944 -63749 -126540
41111a26540k1025O0813R1784L8667k1499k1507M314k320k5024j3299K6369M0900
$$ -126540 -147565 -86752 5032 43699 22200 693 5007 2687 -22337 -35636 -9267 31633
41099C1633P990m1219o2563l5812K3661P4263Q3375N7073J9574k2731o6773q3759
$$ 31633 39623 -1596 -64159 -99971 -76310 -2047 81328 138401 157975 135244 68471 -15288
41087a5288n2613o984M816p548k700J2111n84k4567r694K9837K9412j1510k7962
$$ -15288 -67901 -74885 -70069 -77617 -80317 -68206 -68790 -93357 -103051 -73214 -43802 -55312 -83274
41074h3274j1421k2810o1698m4328M2544Q7875K5735n3404m6798N449J0467j7469
$$ -83274 -94695 -117505 -179203 -223531 -180987 -93112 -67377 -120781 -167579 -162130 -151663 -169132
41062a69132k575M7451N9347K1610j0948j6706j9585k1691o038J1982R015N559
$$ -169132 -171707 -124256 -64909 -43299 -54247 -70953 -90538 -112229 -118267 -106285 -97270 -91711
41050i1711K4423L1100q866n0715l4290Q799O657k5727j6515K7449L0528j1275
$$ -91711 -67288 -36188 -45054 -95769 -130059 -121260 -114603 -140330 -156845 -129396 -98868 -110143
41038a10143j7891L3578O7762L8313p536k6396m1560o3825m3916L5173R5860O5314
$$ -110143 -128034 -94456 -26694 11619 4083 -22313 -63873 -127698 -171614 -136441 -40581 24733
41026B4733j8476o3617m3979l951K1223L3096L8713L7776L1500J7970o583k8638
$$ 24733 6257 -57360 -101339 -105290 -84067 -50971 -12258 25518 57018 74988 68405 39767
41014C9767k5977o924n983k6530k9814j065J8330n701m3983m5868o564L7984N7157
$$ 39767 13790 6866 883 -25647 -55461 -56526 -38196 -43897 -87880 -133748 -140312 -102328 -45171
41001d5171M1780K201k7546j4383K4624L3434j023k2223Q820M6394K7164l2725
$$ -45171 -3391 -1190 -28736 -43119 -18495 14939 13916 -8307 513 46907 74071 41346
40989D1346o4635m8544k7075k6005j9139J6058N2748M8505K314m2370m4534n421
$$ 41346 -23289 -71833 -98908 -124913 -144052 -127994 -75246 -26741 -24427 -66797 -111331 -116752
40977a16752L7362N0563L4240Q057j6732l4964l1412J800L6486L2833m506l0633
$$ -116752 -79390 -28827 5413 13470 -3262 -38226 -69638 -67838 -31352 1481 -3025 -33658
40965c3658k4687r866k235J2328L3777L1144k626k6276j3547M632q21l104K5857
$$ -33658 -58345 -68211 -70446 -58118 -24341 6803 4177 -22099 -35646 -31014 -31835 -34939 -9082
40952i082M9686J9436l7913n1005j0598K1461P873k0789k6295j2307J407J0040
$$ -9082 40604 60040 22127 -28878 -39476 -18015 -10142 -30931 -57226 -69533 -68126 -58086
40940e8086J1874P20j4085j0098J2517K4513Q796j6481k7255k3343j7330j3037
$$ -58086 -46212 -45492 -59577 -69675 -57158 -32645 -23849 -40330 -67585 -90928 -108258 -121295
40928a21295p114R73Q620J1428M863o351p330N793J5009P875K73P811J3154k453
$$ -121295 -128409 -127436 -118816 -107388 -102525 -108876 -116206 -110413 -95404 -87529 -87256 -79445 -66291 -68744
40914f8744j1598K4999P9835P3513j2667r1948p7378N002N3838K4525k4778k1831
$$ -68744 -80342 -55343 24492 98005 85338 -6610 -83988 -78986 -25148 -623 -25401 -47232
40902d7232K5585M7529O448n4940o7392j8376L9527N8229M2946K2393K978j9279
$$ -47232 -21647 25882 32330 -22610 -90002 -108378 -68851 -10622 32324 54717 57695 38416
40890C8416k6358J154M0487M5380R326k6600l2869k2444j6324j5238j7152k7508
$$ 38416 12058 13212 53699 99079 108405 81805 48936 26492 10168 -5070 -22222 -49730
40878d9730l7033k2663J1983K9195R491j9844k8967k4803k0810k788L8740O9992
$$ -49730 -86763 -109426 -97443 -68248 -58757 -78601 -107568 -132371 -153181 -155969 -117229 -47237
40866d7237N1287k328l7846l2415q874Q115J4133P052j5394l7128l4785j1597
$$ -47237 4050 1722 -36124 -68539 -77413 -69298 -55165 -48113 -63507 -100635 -135420 -147017
40854a47017P693J7747L7177O5547O8516K3455m1565p3277m8453N973M0581K8429
$$ -147017 -139324 -121577 -84400 -18853 49663 73118 31553 -41724 -90177 -84204 -43623 -15194
40842a5194r532k6136l862K1473R650k6481m2158k7849j4306j2513K144L2869
$$ -15194 -24726 -50862 -54724 -33251 -23601 -50082 -92240 -120089 -134395 -146908 -144764 -111895
40830a11895L9130J022l6492k4723J3994J9226j8572m9615l7799K198M0018N9592
$$ -111895 -72765 -71743 -108235 -132958 -118964 -99738 -118310 -167925 -205724 -203526 -163508 -103916
40818a03916M9386M454m7839o0242k3760J5095J6163j087Q063M6527P4188O3984
$$ -103916 -54530 -50076 -97915 -158157 -181917 -166822 -150659 -151746 -143683 -97156 -22968 41016
40806D1016K8558p402l2152l8268j6572K3592M5965K3636k2258m4030k9581j6841
$$ 41016 69574 62172 30020 -8248 -24820 -1228 44737 68373 46115 2085 -27496 -44337
40794d4337l3494m9861k3234K7584L8052p164m2779j2459M9103O4572K0195k4400
$$ -44337 -77831 -127692 -150926 -123342 -85290 -92454 -135233 -147692 -98589 -34017 -13822 -38222
40782c8222k4339R29J2950P372L133O186M896j0141l1996l7858r453L5370M7606
$$ -38222 -62561 -61632 -48682 -41310 -38177 -31991 -27095 -37236 -69232 -107090 -116543 -81173 -33567
40769c3567P961l6722l4880p899j2605l9849k3715M1960P8244M2226n407k622
$$ -33567 -25606 -62328 -97208 -105107 -117712 -157561 -181276 -139316 -61072 -18846 -24253 -26875
40757b6875J6903m663m2954l8423m304K128j3753q0L4220K6619k3097m1909o689
$$ -26875 -9972 -14635 -57589 -96012 -100316 -98188 -111941 -112021 -77801 -51182 -74279 -116188 -122877
40744a22877J6049j2321l3778M949N6758M7145j0186m1397k2896L543P892K322
$$ -122877 -106828 -119149 -152927 -147978 -91220 -44075 -54261 -95658 -118554 -115011 -107119 -104797
40732a04797j407j2611l2128l9239j9423J5961M3279M7135K8912N474m968l174
$$ -104797 -106204 -118815 -150943 -190182 -209605 -193644 -150365 -103230 -74318 -68844 -73812 -76986
40720g6986o738k1666k9056r894K6462M7558K9225j6101m0725r098M5775M5769
$$ -76986 -83724 -105390 -134446 -144340 -117878 -70320 -41095 -57196 -97921 -107019 -61244 -15475
40708a5475k4009p2382k3247O0558O0535j4003l8300K5492O5964Q449o1427m2802
$$ -15475 -39484 -111866 -135113 -74555 -14020 -28023 -66323 -40831 25133 33582 -27845 -70647
40696g0647J8154K0351j9562j2900L5564M0375j0012l7879j2950R703k777j8976
$$ -70647 -52493 -32142 -51704 -64604 -29040 11335 1323 -36556 -49506 -39803 -42580 -61556
40684f1556k1396k9477l0911J1633O7767N6367j7524m8719M373M8679P872n6176
$$ -61556 -82952 -112429 -143340 -131707 -63940 -7573 -25097 -73816 -69443 -20764 -12892 -69068
40672f9068n1686n88J8862O859J8549M8556L9442j2792m9124l9142j2132K374
$$ -69068 -120754 -121342 -102480 -95621 -77072 -28516 10926 -1866 -50990 -90132 -102264 -99890
40660i9890P160J2008K2670M7188P3225N9725k665n0572k6395K7626K5426k8833
$$ -99890 -92730 -80722 -58052 -10864 62361 122086 119421 68849 42454 70080 95506 66673
40648F6673m5067J2045P0420O2148J5214l928J5600L4737K6722l619l7997n4892
$$ 66673 21606 33651 104071 166219 181433 177505 193105 227842 254564 250945 212948 158056
40636A58056m2243j7299j2062k8418l5184j8192k3L18r216k1760m1031m9424j7067
$$ 158056 115813 98514 86452 58034 22850 4658 4635 4953 -4263 -26023 -67054 -116478 -133545
40623a33545L4499L5064k9167p0744j9174O5042P0459k841m9194j7513K7037K0166
$$ -133545 -99046 -63982 -93149 -163893 -183067 -118025 -47566 -50407 -99601 -117114 -90077 -69911
40611f9911r028o708J2929M484k3442k5701p58R224p244j3525R514K8505R288
$$ -69911 -78939 -85647 -72718 -68234 -91676 -117377 -118135 -108911 -116155 -129680 -120166 -91661 -82373
40598h2373l0745m8338l2042p864L755J1827L1394N2764M8603J1426k8876l6680
$$ -82373 -113118 -161456 -193498 -201362 -197607 -185780 -154386 -101622 -53019 -41593 -70469 -107149
40586a07149j4179L528l465j8925k4059k4585k6857j4751J9905M6170L1334n305
$$ -107149 -121328 -117800 -121265 -140190 -164249 -188834 -215691 -230442 -210537 -164367 -133033 -138338
40574a38338j8553p565j0670l1738k8309J3697M8664L9995J0394p830k4086m9696
$$ -138338 -156891 -164456 -175126 -206864 -235173 -221476 -172812 -132817 -122423 -130253 -154339 -204035
40562b04035n2034m054N1827N0905J202k8286q424J8519J2673j0876j8759p529
$$ -204035 -256069 -260123 -208296 -157391 -156189 -184475 -192899 -174380 -161707 -172583 -191342 -198871
40550a98871M084L717p988k0539j8613j029R731k164j6773q059R764K655k4946
$$ -198871 -194787 -191070 -199058 -219597 -238210 -239239 -229508 -231672 -248445 -256504 -246740 -244085 -269031
40537b69031l4453j3797Q514J2511R884J3707K1189K8324K8697N632l5648m5569
$$ -269031 -303484 -317281 -308767 -296256 -286372 -272665 -251476 -223152 -194455 -188823 -224471 -270040
40525b70040N143N6308K7500n2368p4569j6699K3122j2209n0927k3479J9786M860
$$ -270040 -264897 -208589 -181089 -233457 -308026 -324725 -301603 -313812 -364739 -388218 -368432 -363572
40513c63572l5669k7297J4182K0115n981p511J1719N87l0163j9476K7328L8611
$$ -363572 -399241 -426538 -412356 -392241 -398222 -405733 -394014 -393427 -423590 -443066 -415738 -377127
40501c77127Q84j8656Q343K8410J1117R44K3513K9952j1665m9011l3089n881k9520
$$ -377127 -376243 -394899 -386556 -358146 -347029 -346085 -322572 -292620 -304285 -353296 -386385 -392266 -421786
40488d21786q0061q6639m1568J62J0118J1620K7122N2948P8447Q9260O5804J7079
$$ -421786 -501847 -588486 -630054 -629892 -619774 -608154 -581032 -528084 -449637 -360377 -294573 -277494
40476b77494m425L5121R4838J11574Q6013O3297N0627K1226j2134m767L3616L7427
$$ -277494 -281919 -246798 -151960 -40386 45627 108924 159551 180777 168643 163876 197492 234919
40464B34919j0180m5259k7160j602j2574j9531L0212R8860J07939N8805K1332
$$ 234919 224739 179480 152320 150718 138144 118613 148825 247685 355624 414429 435761
40453D35761K0498J9583J1190L3695Q2390R4116N3366L0215O6159J01837Q0273
$$ 435761 456259 475842 487032 520727 603117 697233 750599 780814 846973 948810 1029083
40442A029083M7424O8301J05455Q1257J8806Q671N4900P1245L2736J1167L3815
$$ 1029083 1076507 1144808 1250263 1331520 1350326 1358997 1413897 1485142 1517878 1529045 1562860
40431A562860K4003o4442j55021j61197j10653q1950q3622p5277n5147m6161l5842
$$ 1562860 1586863 1522421 1367400 1206203 1095550 1013600 929978 854701 799554 753393 717551
40420G17551o230J1942j2486m3286l0044N962J5050J0767L1073M2048j6617j07340
$$ 717551 711321 723263 710777 667491 637447 643409 658459 669226 700299 742347 725730 618390
40408F18390j25719n8233l448k0154n5045m8702j9002j620Q601J5940q71l1714
$$ 618390 492671 434438 430990 410836 355791 307089 288087 286467 295068 311008 310137 278423
40396B78423k6124J9166L7917K548k3106P923M2573J9616k5562k6144M666J2210
$$ 278423 252299 271465 309382 311930 288824 296747 339320 358936 333374 307230 311896 324106
40384C24106K865J6585L1290p429p5596q6666k4332K7169P319l9623m1370J574
$$ 324106 326971 343556 374846 367417 291821 205155 180823 207992 215311 175688 134318 135892
40372A35892L3614K6597L030q216o737q853j6920j1511J9750N1042L7283k6266
$$ 135892 169506 196103 199133 190917 184180 175327 158407 146896 166646 217688 254971 228705
40360B28705q5028q4694l4021J1624J6200p320k2730q480K3766M0133K4825Q199
$$ 228705 143677 58983 24962 36586 52786 45466 22736 14256 38022 78155 102980 111179
40348A11179K8952O8006O1495o090o7842o2176j2605J7362J1200l629j4835k9682
$$ 111179 140131 208137 269632 263542 195700 133524 120919 138281 149481 145852 131017 101335
40336A01335l8208k1192J2347L3586L2154J6803o307k6195j9796J3043L0639M751
$$ 101335 63127 41935 54282 87868 120022 136825 130518 104323 84527 97570 128209 132960
40324A32960k9347k3115P773R426k2188l6751j0023K4710L1513J5012R89N374
$$ 132960 103613 80498 88271 97697 75509 38758 28735 53445 84958 99970 100959 106333
40312A06333K4857L5504J1232l3241m2162N559N2206L9634j009M10M0376N4760
$$ 106333 131190 166694 177926 144685 102523 108082 160288 199922 198913 199323 239699 294459
40300B94459K9686J6181L3698M3579L3145M3156Q2130R0114L1243m0136n4546
$$ 294459 324145 340326 374024 417603 450748 493904 576034 666148 697391 657255 602709
40289F02709j9796Q807R193n433l1830p1445r7839p7461k0609K2215J8206j3958
$$ 602709 582913 591720 600913 595480 563650 492205 394366 316905 296296 318511 336717 322759
40277C22759l1794j9003q95p209k6242j8706J6742K9231n859l5123l173N4055
$$ 322759 290965 271962 271067 263858 237616 218910 235652 264883 259024 223901 220728 274783
40265B74783N8493R611k2638j4188r330k1174k041N9354R6430O3263L873k2016
$$ 274783 333276 342887 320249 306061 296731 275557 273516 332870 429300 492563 496436 474420
40253D74420j9065j6091p020J5494K0992q857l5667k1955O692N930k0078m2788
$$ 474420 455355 439264 432244 447738 468730 459873 424206 402251 408943 414873 394795 352007
40241C52007o0258p6223o9338l3758j0462k5991l9729o851M5580O3569M9290L8056
$$ 352007 291749 215526 146188 112430 101968 75977 36248 29397 74977 138546 187836 225892
40229B25892K8867L878j6307o361M609k0313m8253k3554L0291L9558k105l0123
$$ 225892 254759 258637 242330 235969 240578 220265 172012 148458 178749 218307 216202 186079
40217A86079j7913m289q723k805K1373L1388J9035J3743J7352k561l8988m0915
$$ 186079 168166 163877 155154 152349 173722 205110 224145 237888 255240 252679 213691 172776
40205A72776l760J2326j7702m2242k5825o508j6750k1971P254L1220J3366n718
$$ 172776 169016 181342 163640 121398 95573 89065 72315 50344 57598 88818 102184 96466
40193I6466K0541N3229K9698k4361l3442L353J8082o821j8201K463M253l6370
$$ 96466 117007 170236 199934 175573 142131 145484 163566 156745 138544 141007 145260 108890
40181A08890o4709l6732O175M536k4666j9087L2174P8899Q2821N1211M514m3270
$$ 108890 44181 7449 13624 18160 -6506 -25593 6581 85480 168301 219512 224026 180756
40169A80756p0162n4616r462K4147K7233K0066K1017J9506L467j6398k7457l1749
$$ 180756 110594 55978 46516 70663 97896 117962 138979 158485 161952 145554 118097 86348
40157H6348k3727J3702O3114O2125j3296q5653n9851M1757R7867M7913l6246o1723
$$ 86348 62621 76323 139437 201562 188266 102613 42762 84519 182386 230299 194053 132330
40145A32330l1844r988j8947l1182k7752j4289M431K2514J9690j1408l8471k7053
$$ 132330 100486 90498 71551 40369 12617 -1672 2759 25273 44963 33555 -4916 -31969
40133c1969P907K4221J3747M778J4175L4111N6934P5177O5633J4488m5305o2566
$$ -31969 -24062 159 13906 18684 32859 66970 123904 199081 264714 279202 233897 171331
40121A71331l4574p491q352j5256k502K1059L2716K7618J5453L868m952j3045
$$ 171331 136757 129266 120914 105658 103156 124215 156931 184549 200002 203870 198918 185873
40109A85873k4556l5821l3481j3535Q118J5979J1189k222k2898l1982m018M0837
$$ 185873 161317 125496 92015 78480 86598 102577 113766 111544 88646 56664 52646 93483
40097I3483M1430j3220m8967j3246L7508K7356j3083k937M3413L9430j8075l8131
$$ 93483 134913 121693 72726 59480 96988 124344 111261 108324 151737 191167 173092 134961
40085A34961N827K7566k1927o7349l4611K9041L7262j774j4152K2077N9518N4771
$$ 134961 140788 168354 146427 79078 44467 73508 110770 108996 94844 116921 176439 231210
40073B31210O891n2683p3665k5558M7793N9812j701m8495k2577J7323j064m3835
$$ 231210 238101 185418 111753 86195 133988 193800 192099 143604 121027 138350 137286 93451
40061I3451l5686J0566K3637k162j0357O547l920n0257o9367k4699L5489M5918
$$ 93451 57765 68331 91968 89806 79449 85996 82076 31819 -37548 -62247 -26758 19160
40049A9160M212l9522m1198K083N2959O8057M6558K9665L5241K8019j2521l9442
$$ 19160 23372 -16150 -57348 -55265 -2306 65751 112309 141974 177215 205234 192713 153271
40037A53271q746L6609K4550l0888n2101k1290M178j309K535L3327M6779J6275
$$ 153271 144525 181134 205684 174796 122695 101405 105583 104274 106809 140136 186915 203190
40025B03190k0242k8445k8851m1217l8646n145J3583k4927q0919q0041k1345K0592
$$ 203190 182948 154503 125652 84435 45789 40644 54227 29300 -51619 -131660 -153005 -132413
40013a32413q3m4311n0968k1220j2944o1826j34950j75051j74871j79430k14389
$$ -132413 -132496 -176807 -227775 -248995 -261939 -323765 -458715 -633766 -808637 -988067 -1202456
40002a202456k47830k40246j96577j38283n8871M7376J39488J68388J47226J28602
$$ -1202456 -1450286 -1690532 -1887109 -2025392 -2084263 -2036887 -1897399 -1729011 -1581785 -1453183
39992a453183J22967R9469O0809M8560O7708P3844N1196L7829N0911N2652K3157
$$ -1453183 -1330216 -1230747 -1169938 -1121378 -1053670 -979826 -928630 -890801 -839890 -787238 -764081
39981g64081N589L6107Q0783Q9539O9904N7993N2482L0316L010M773L5922O0987
$$ -764081 -758492 -722385 -641602 -552063 -482159 -424166 -371684 -341368 -338358 -333585 -297663 -236676
39969b36676N8420M0831K9945L3241L9076K3801k0737o0548m9936Q6K3082j1013
$$ -236676 -178256 -137425 -107480 -74239 -35163 -11362 -32099 -92647 -142583 -142497 -119415 -130428
39957a30428m7895k7850K5741M3196P095l5247m2861j9382J1857L1134K4841j765
$$ -130428 -178323 -206173 -180432 -137236 -130141 -165388 -208249 -227631 -215774 -184640 -159799 -161564
39945a61564j8541n598J3872N759j9575j9218J7408M9590L8017p449m0917k9047
$$ -161564 -180105 -185703 -171831 -166072 -185647 -204865 -187457 -137867 -99850 -107299 -148216 -177263
39933a77263J5534M3890K1219k8788m7652j6107K2764K7761J2197O133J736k1759
$$ -177263 -161729 -117839 -96620 -125408 -173060 -189167 -166403 -138642 -126445 -120312 -118576 -140335
39921a40335m4565k8935J5636L9430K3852P70m226m854j7282k7066j3945J4323
$$ -140335 -184900 -213835 -198199 -158769 -134917 -134147 -138373 -143227 -160509 -187575 -201520 -187197
39909a87197L3029L1721J9950J0316N497j863j8741l8409m2858k5618l326O950
$$ -187197 -154168 -122447 -102497 -92181 -86684 -88547 -107288 -145697 -188555 -214173 -217499 -210549
39897b10549J1917K6178L9531K3538k5180o6696n5828O034O6881P6843M1362J0234
$$ -210549 -198632 -172454 -132923 -109385 -134565 -201261 -257089 -251055 -184174 -107331 -65969 -55735
39885e5735J1973K0945O233j3105O70L3935L4984j942k1260Q962M7608M2469j578
$$ -55735 -43762 -22817 -16584 -29689 -29019 4916 39900 37958 16698 25660 73268 115737 114159
39872A14159m5232o7562o7066m5339j7315n145j484K1645N2148M2072m604j8333
$$ 114159 68927 1365 -65701 -111040 -128355 -133500 -134984 -113339 -61191 -19119 -23723 -42056
39860d2056K3457M7561N625l7266j3776K3120p710o4783n0098J6184K5808k8824
$$ -42056 -18599 28962 34587 -2679 -16455 6665 -1045 -65828 -115926 -99742 -73934 -102758
39848a02758m0468K5397O9378K5531l5640l2180O477J2763p448j1302k545p681
$$ -102758 -143226 -117829 -48451 -22920 -58560 -90740 -84263 -71500 -78948 -90250 -92795 -100476
39836a00476j6170m565J7267K9391L2968K4974j0133n3058n2432r883M616l2727
$$ -100476 -116646 -121211 -103944 -74553 -41585 -16611 -26744 -79802 -132234 -142117 -137501 -170228
39824a70228m2978L3369J23824J15268J3464p1101o9529j2774L7416M7369J2326
$$ -170228 -213206 -179837 -56013 59255 72719 1618 -67911 -80685 -43269 4100 16426
39813A6426m2244o5023k9275K9785O0465N4667L1128m081l7369k9084K9203P4038
$$ 16426 -25818 -90841 -120116 -90331 -29866 24801 55929 51848 14479 -14605 14598 88636
39801H8636M6426k1506n6315m7490l4969k3407J2438N5375O0165L3701K4438L4218
$$ 88636 135062 113556 57241 9751 -25218 -48625 -36187 19188 79353 113054 137492 171710
39789A71710J7343k8354m6818j5424J8834J6726n21N08J7436L5367N1699N8372
$$ 171710 189053 160699 113881 98457 117291 134017 133496 134004 151440 186807 238506 296878
39777B96878M2189J8014J8691L9667M0143J2736J042K5792M1979K250p1794j14451
$$ 296878 339067 357081 375772 415439 455582 468318 469360 495152 537131 539381 467587 353136
39765C53136r2754l6306k349k0244o1032o7306k5578J2651O704j0439Q860L9741
$$ 353136 260382 224076 221727 201483 140451 73145 47567 60218 66922 56483 65343 105084
39753A05084K5117j9964k7458P093J7449j4312k4215K1205O6350O0468L1780K1632
$$ 105084 130201 110237 82779 89872 107321 93009 68794 89999 156349 216817 248597 270229
39741B70229J6762j502p925J0148R777l2060n7880j4501N0628N3329l299m4174
$$ 270229 286991 285489 277564 287712 297489 265429 207549 193048 243676 297005 293706 249532
39729B49532l5459r614N718J4113J2505j1373m3878n5898m4438k4176P223N0091
$$ 249532 214073 204459 210177 224290 236795 225422 181544 125646 81208 57032 64255 114346
39717A14346O7653K5634m1076n6243J333P4013R8881O6235P794l3822k6032K5411
$$ 114346 181999 207633 166557 110314 111647 185660 284541 350776 358570 324748 298716 324127
39705C24127O8960N8810R148k9667l4406j7924L949J5858m109m9096o4007j5705
$$ 324127 393087 451897 461045 431378 396972 379048 382997 398855 394746 345650 281643 265938
39693B65938L8138J6190o2324r4809l9907L0920M5203K0028N064k522l2519o8374
$$ 265938 304076 320266 257942 163133 123226 154146 199349 219377 224441 221919 189400 121026
39681A21026n7283J1640P8006P1485p471p8811o6977P244M8245J2329l2036j0308
$$ 121026 63743 75383 153389 224874 217403 138592 71615 78859 127104 139433 107397 97089
39669I7089M0853L5364j6197k1370L4246N0067l0024j18051j07555k6129J9457
$$ 97089 137942 173306 157109 135739 169985 220052 190028 71977 -35578 -61707 -42250
39658d2250M612K513N1096R0592N7714j6418m5425k192M7183L1843l0485n9940
$$ -42250 -37638 -35125 15971 106563 164277 147859 102434 100242 147425 179268 148783 88843
39646H8843k5984J4787J1016n343J7358N1579L0889l1009m9311q41L9506J8178
$$ 88843 62859 77646 88662 83319 100677 152256 183145 152136 102825 101984 141490 159668
39634A59668k3624l3114k5828l2317l2230j380K9014K2012P13N127K1438J3257
$$ 159668 136044 102930 77102 44785 12555 11175 40189 62201 62914 68041 89479 102736
39622A02736r662j1899O234K0018K4621K0095j2093o5938q5604m3339J255j0155
$$ 102736 93074 81175 87409 107427 132048 152143 140050 74112 -11492 -54831 -53576 -63731
39610f3731l2628O795O9994N2756m4910j06847o9842M91K7842K0849J3123j381
$$ -63731 -96359 -89564 -19570 33186 -11724 -118571 -188413 -187922 -160080 -139231 -126108 -127489
39598a27489k2226r272M5532P6193L3712l1001l6104J8358O4688O4195L4370J256
$$ -127489 -149715 -158987 -113455 -37262 -3550 -34551 -70655 -52297 12391 76586 110956 112212
39586A12212k4850l8402m1489m5335m2944n469O4304J07649Q1179K5105J1669
$$ 112212 87362 48960 7471 -37864 -80808 -86277 -21973 85676 166855 191960 203629
39575B03629M4976O4664L9834N654K949K8158N6714Q0038J01245J16495J16827
$$ 203629 248605 313269 353103 358757 361706 389864 446578 526616 627861 744356 861183
39564H61183R8937O9282M4685M3167O1223O7951L9870m222k3330o752J4362J0510
$$ 861183 960120 1029402 1074087 1117254 1178477 1246428 1286298 1282076 1258746 1251994 1266356 1276866
39552A276866r396j3824Q334L1185K2187j3436l1189j444M8394P0045O1530N9256
$$ 1276866 1267470 1253646 1261980 1293165 1315352 1301916 1270727 1269283 1317677 1387722 1449252 1508508
39540A508508O5688M0314j7794l8580K0354R0378P3036k0103p9911m7822J6566
$$ 1508508 1574196 1614510 1596716 1558136 1578490 1668868 1741904 1721801 1641890 1594068 1610634
39529A610634K8663k0048p8783j07621j00083p0338m8464o3633j06850j31995
$$ 1610634 1639297 1619249 1540466 1432845 1332762 1262424 1213960 1150327 1043477 911482
39519I11482j15117q8304r0303j07984r9468n9456k5975k6016m4970n3304m0763
$$ 911482 796365 708061 617758 509774 410306 350850 324875 298859 253889 200585 159822
39508A59822j7847L95N135k566j4376k4171l2222l6805l0041j0390Q777J4140
$$ 159822 141975 142370 147505 144939 130563 106392 74170 37365 7324 -3066 5711 19851
39496A9851R741Q887J4924K1472K5234K5775J7961j548k3805l5785l4822k4235
$$ 19851 29592 38479 53403 74875 100109 125884 143845 142297 118492 82707 47885 23650
39484B3650l773K0372K7853R169j1395o596O924r610m7974n1710q45M7554L4997
$$ 23650 19877 40249 68102 77271 65876 59280 66204 56594 8620 -43090 -43935 3619 38616
39471C8616j8888n1657m2533j5758J5523N2630P1548M1788j2032k6475J0822M4080
$$ 38616 19728 -31929 -74462 -90220 -74697 -22067 49481 91269 79237 52762 63584 107664
39459A07664L9743L2542M8920M5486k0939j05024j20492n6536J3196L0922J0364
$$ 107664 147407 179949 228869 274355 253416 148392 27900 -28636 -15440 15482 25846
39448B5846q918j3957j3133j3323j5439j3401L609L0781M0232J7424j0244j2341
$$ 25846 16928 2971 -10162 -23485 -38924 -52325 -48716 -17935 22297 39721 29477 17136
39436A7136n869k6001n9186n4799k268N0320N9170K5674k5982o8694p0092j9822
$$ 17136 11267 -14734 -73920 -128719 -130987 -80667 -21497 4177 -21805 -90499 -160591 -180413
39424a80413L6806M2357R078K549L8430O0330L5510J705q907k0033m4796m0317
$$ -180413 -143607 -101250 -92172 -89623 -51193 9137 44647 46352 37445 17412 -27384 -67701
39412f7701J4394N6943K6410l8185n6274k4802m455j4806k0786q480K45L565K0647
$$ -67701 -53307 3636 30046 -8139 -64413 -89215 -93670 -108476 -129262 -137742 -137497 -133932 -113285
39399a13285L6596J3265l7188n2283q300M4151N2650K5474K070l13J0010J8826
$$ -113285 -76689 -63424 -100612 -152895 -161195 -117044 -64394 -38920 -36850 -37163 -27153 -8327
39387h327J1566j7346m8000m7589r127L6247M9353J7977l0409m5127k156N3723
$$ -8327 3239 -14107 -62107 -109696 -118823 -82576 -33223 -15246 -45655 -90782 -92938 -39215
39375c9215N0775r555m3170n469L6892J2771l4636j9912L8295M5992j1664n2627
$$ -39215 11560 2005 -41165 -46634 -9742 3029 -31607 -51519 -13224 32768 21104 -31523
39363c1523l4510l997L312J0525K2768K008m6793n8254j7012N142k9319n5413
$$ -31523 -66033 -70030 -66718 -56193 -33425 -31417 -78210 -136464 -153476 -148334 -177653 -233066
39351b33066j7789L5073L9392K1407L4643N8570M5357J4150J2896L0097K7523
$$ -233066 -250855 -215782 -176390 -154983 -120340 -61770 -16413 -2263 10633 40730 68253
39340F8253K0972M3933O6140L6252k1088l8729j7605j6285m3084m6051p691L1358
$$ 68253 89225 133158 199298 235550 214462 175733 158128 141843 98759 52708 45017 76375
39328G6375M4775M3592K8634p195l3009j2700K0422M463l8585k6871L6223M8900
$$ 76375 121150 164742 193376 186181 153172 140472 160894 165357 126772 99901 136124 185024
39316A85024k4931q5708n0271K1298K8956j3691k2274J3499K8680M360o437K0717
$$ 185024 160093 74385 24114 45412 74368 60677 38403 51902 80582 84942 78505 99222
39304I9222L6867J233n0679n5260l957N1399N9640J6866l7335n6553k6516K3801
$$ 99222 136089 137322 86643 31383 27426 78825 138465 155331 117996 61443 34927 58728
39292E8728N1795M2869J7718O95p006j7490l0530l2144j8656o440p059m304K3779
$$ 58728 110523 153392 171110 171805 164799 147309 116779 84635 65979 59539 52480 48176 71955
39279G1955O2578O5530J1587n9397q3310l6724M0337P9156M3665k7479n0198O440
$$ 71955 134533 200063 211650 152253 68943 32219 72556 151712 195377 167898 117700 124140
39267A24140O5754L5372n6290q8249k2555L8570J4146l1407n342N3233M2105k7461
$$ 124140 189894 225266 168976 80727 58172 96742 110888 79481 74139 127372 169477 142016
39255A42016n1022p515J5024k2094m8894j6528K5616K7895J7185K3055J5909k1493
$$ 142016 90994 83479 98503 76409 27515 10987 36603 64498 81683 104738 120647 99154
39243I9154l9906n941L0220J5487k0123k5614j7823l4156m8936j8179L1433M0037
$$ 99154 59248 53307 83527 99014 78891 53277 35454 1298 -47638 -65817 -34384 5653
39231E653J3336N134K0904J5990j8774m0848k6357J557J6480J2705j1358m9641
$$ 5653 18989 24123 45027 61017 42243 1395 -24962 -23405 -6925 5780 -5578 -55219
39219e5219p3751o1743l1242q229J6068N4310P6154M7792j984j5779N967J3893
$$ -55219 -128970 -190713 -221955 -230184 -214116 -159806 -83652 -35860 -37844 -53623 -47656 -33763
39207c3763m577j2416N926K2859K1779J6992J3899J977o876J5464O0694Q3982
$$ -33763 -38340 -50756 -44830 -21971 -192 16800 30699 32676 25800 41264 101958 185940
39195A85940O3343J8923k4962n4144m9914j0990J9396N000j6721J3767P0380O7190
$$ 185940 249283 268206 243244 189100 139186 128196 147592 152592 135871 149638 220018 287208
39183B87208o176o3848n5157k6924k5005k3508L094K0401L272p935J7776L5750
$$ 287208 281032 217184 162027 135103 110098 86590 89684 110085 113357 105422 123198 158948
39171A58948J427m5042m2807j1079r149l2347k6617J5503M6877M1837J8534m974
$$ 158948 160375 115333 72526 61447 52298 19951 -6666 8837 55714 97551 116085 111111
39159A11111k3247k4323o451K432j2894j8736J0743L3201r68n6355n7133n006
$$ 111111 87864 63541 57090 59522 46628 27892 38635 71836 70868 14513 -42620 -47626
39147d7626K9208K2759K3369N0655O1987L4412J200j7266m3693p6614o8474r722
$$ -47626 -18418 4341 27710 78365 140352 174764 175964 158698 115005 38391 -30083 -39805
39135c9805L4630J9524j0595J657L6001L8326R671r171p181K44J4202L5476L2730
$$ -39805 -5175 14349 3754 5411 41412 79738 89409 80238 73057 73301 87503 122979 155709
39122A55709j3057n5042l4095K8487N4950K1189j9637k5462j5732j9331k5787
$$ 155709 142652 87610 53515 82002 136952 158141 138504 113042 97310 77979 52192
39111E2192j3001J3188L0183K6573O984j2234j1263Q408J5626o673k4893k353
$$ 52192 39191 52379 82562 109135 116119 103885 92622 101030 116656 109983 85090 82737
39099H2737L2707K2302k5904m5188j6157P796M5N204M5145O0230P181n1138l3478
$$ 82737 115444 137746 111842 66654 50497 58293 58338 63542 108687 168917 176098 124960 91482
39086I1482L0507M6886K217l2052k6043k4571m5600m0443J3077N7436M0938m494
$$ 91482 121989 168875 171092 139040 112997 88426 42826 2383 15460 72896 113834 109340
39074A09340k0214q032r216l0183l9325j9627J4630M0689M0701J1031j9676p826
$$ 109340 89126 81094 71878 41695 2370 -17257 -2627 38062 78763 89794 70118 62292
39062F2292M4614P7123M8750k949j9289m771m353k1349j8286R183K0844J552j2605
$$ 62292 106906 184029 232779 229830 210541 205770 201417 180068 161782 170965 191809 193361 180756
39049A80756L521K0489J72m4456o3858l2932K1151M7201K1048k6038l5627R547
$$ 180756 184277 204766 204938 160482 96624 63692 84843 132044 153092 127054 91427 100974
39037A00974N8733N6034J4122r553R03M580k1757m4739l1342k849K10k1323l3981
$$ 100974 159707 215741 229863 220310 221213 225793 204036 159297 127955 125106 125316 103993 70012
39024G0012k4052q516J23J1644L5841N8221M8386m225o4173p3876j8423M7175
$$ 70012 45960 37444 37567 49211 85052 143273 191659 187434 123261 49385 30962 78137
39012G8137O1218L3602K2256L6906K2122m5343r8499o4739K6770P6438L9968k6881
$$ 78137 139355 172957 195213 232119 254241 208898 110399 45660 72430 148868 188836 161955
39000A61955n0393k2334J3490K6789K6645L0828L2347R268l6401o9032o2798l8845
$$ 161955 111562 89228 102718 129507 156152 186980 219327 228595 192194 123162 60364 21519
38988B1519l1656k9928N747O4304P7960J9617m3894l9434J0521K7828n502l3613
$$ 21519 -10137 -40065 -34318 29986 107946 127563 83669 44235 54756 82584 77082 43469
38976D3469k0338O645J4760J5881L4021O1370P0803M9416N152l9630n4411k5718
$$ 43469 23131 29776 44536 60417 94438 155808 226611 276027 281179 241549 187138 161420
38964A61420J6614K6149Q80j3717O297K7858J6036j0493j2666N789Q595j2234
$$ 161420 178034 204183 205063 191346 197643 225501 241537 231044 218378 224167 232762 220528
38952B20528k5921j3172P215R551o683k5479l4914k9378q292J6294K4814J4039
$$ 220528 194607 181435 188650 198201 191518 166039 131125 101747 93455 109749 134563 148602
38940A48602L916R290J7518J0351l007K080K3911L1718J2517m831R370L9148M2169
$$ 148602 152518 161808 179326 189677 186670 188750 212661 244379 256896 252065 261435 300583 342752
38927C42752O564l6488n3981m1272j1502J9841L4909K2060n778k0156j1901J869
$$ 342752 349316 312828 258847 217575 206073 225914 260823 282883 277105 256949 245048 246917
38915B46917R212J5938J9781N056k0403j7846K5349O2783M9521R697l22K1602
$$ 246917 256129 272067 291848 296904 276501 258655 284004 346787 396308 406005 405683 427285
38903D27285K5004j0036m4008m2267k2715j9317l2173l7195k2678L136K4309K4411
$$ 427285 452289 442253 398245 355978 333263 313946 281773 244578 221900 225036 249345 273756
38891B73756p72k7074j8882K4067N6105L8697j1174m3776l7041j4869q480j6892
$$ 273756 272984 245910 227028 251095 307200 345897 334723 290947 253906 239037 230557 213665
38879B13665j3624J2686L6200K4029j5036l3675p334L1302L8295J4923r724k7539
$$ 213665 200041 212727 248927 272956 257920 224245 216911 248213 286508 301431 291707 264168
38867B64168m2911l7260L892L9642J3173n4273p6449k6170K2706R290k6587k1322
$$ 264168 221257 183997 187889 227531 240704 186431 109982 83812 106518 115808 89221 67899
38855F7899P437J624l1408l0954J5369N3927M9893K8909K3953L0114K7862J4842
$$ 67899 75336 76960 45552 14598 29967 83894 133787 162696 186649 216763 244625 259467
38843B59467j03j0169j1484r471j9264l9018l7084M565N0838N5071K4631J701
$$ 259467 259364 249195 237711 228240 208976 169958 132874 137439 188277 243348 267979 269680
38831B69680m811j4499j5803K1456P3350P4396J8992k0225k186K3511M888l1068
$$ 269680 264869 250370 234567 256023 329373 403769 422761 402536 400350 423861 428749 397681
38819C97681l4919j3865L668K9974P7279R9830N4774j0166j3539L2328L7462k3828
$$ 397681 362762 348897 352565 382539 459818 559648 614422 604256 590717 623045 660507 636679
38807F36679p4487n4148K916L8034M5479M1732J9291k1831m4714k6201K66k516
$$ 636679 562192 508044 510960 548994 594473 636205 655496 633665 588951 562750 563016 560500
38795E60500j4801l11K2816O441m8772r0533q3906m0606J2200N0203M7298j064
$$ 560500 545699 545388 568204 574645 525873 435340 351434 310828 323028 373231 420529 419465
38783D19465n0590m8947p438J1492j5304m0607k2164J6345K8371J2455N23J297
$$ 419465 368875 319928 312490 323982 308678 268071 245907 262252 290623 303078 303601 304898
38771C04898m490j9920j9472J1370M8086N4004K6173m15K312J7934Q142k9325
$$ 304898 300408 280488 261016 272386 320472 374476 400649 400234 402546 420480 428622 399297
38759C99297m9375j8995L4781N9659M2160P270k8009n9763o6984k8447K6081L4757
$$ 399297 349922 330927 365708 425367 467527 474797 446788 387025 320041 291594 317675 352432
38747C52432r256l9044p387M7776O4295L8916P983j6574m1198m9271k2850R784
$$ 352432 343176 304132 296745 344521 408816 447732 455715 439141 397943 348672 325822 335606
38735C35606M586k6553k9385O521L0290R897k1661k2321L25J5440J9845K7292
$$ 335606 340192 313639 284254 290775 321065 330962 309301 286980 287305 302745 322590 349882
38723C49882K9480O524l0423m1884j2601K2851K2296r432k8093j0254J7407K0714
$$ 349882 379362 385886 355463 313579 300978 323829 346125 336693 308600 298346 315753 336467
38711C36467O888L617N668j5393n0630n3339j3443J8146O326j6007r569N874k526
$$ 336467 343355 346972 352640 337247 286617 233278 219835 237981 244307 228300 218731 224605 222079
38698B22079j3878M650K6124P089k5115j1011L1235K5946l0871n8308k3266Q577
$$ 222079 208201 212851 238975 246064 220949 209938 241173 267119 236248 177940 154674 163251
38686A63251j1204l5783j1004L5294N0649M0758L3701J7548k0957m2215o361N4370
$$ 163251 152047 116264 105260 140554 191203 231961 265662 283210 262253 220038 213677 268047
38674B68047P7468N3825J4687k7978o6788o2418N933Q0240Q7046M1206J4703K2041
$$ 268047 345515 399340 414027 386049 319261 256843 262776 343016 430062 471268 485971 508012
38662E08012J7104p340m808L4519O1285N2193M4115O0948P3982O1019M3450L7543
$$ 508012 525116 517776 512968 547487 608772 660965 705080 766028 840010 901029 944479 982022
38650I82022K6864J0557K0704O0017P8368M7398N856o721q198k2999k6810M204
$$ 982022 1008886 1019443 1040147 1100164 1178532 1225930 1231786 1225065 1216867 1193868 1167058 1171262
38638A171262L4940K2858q090p838J5013J5487k532M869L7172M6410K1760Q279
$$ 1171262 1206202 1229060 1220970 1213132 1228145 1243632 1241100 1245969 1283141 1329551 1351311 1359590
38626A359590K8217M8517M7662N1789P2549O8715J6115l3161j9447K9479L5187
$$ 1359590 1387807 1436324 1483986 1535775 1608324 1677039 1693154 1659993 1640546 1670025 1705212
38615A705212j6635o2455o0372m1140m6220p0217r0219j06197j19949j11544p3554
$$ 1705212 1688577 1626122 1565750 1524610 1478390 1408173 1317954 1211757 1091808 980264 906710
38604I06710l8502l3968l7881k0547l970k5875o4595o3820k5415q112k6940k7245
$$ 906710 868208 834240 796359 775812 771842 745967 681372 617552 592137 584025 557085 529840
38592E29840J7174N1229K4773k8939n0828m0481k8154q687L2972O6442N4353K2177
$$ 529840 547014 598243 623016 594077 543249 502768 474614 465927 498899 565341 619694 641871
38580F41871K5147O4307R5503J00883R0476N9250J1917J151N9254J20185J06316
$$ 641871 667018 731325 826828 927711 1018187 1077437 1089354 1090505 1149759 1269944 1376260
38569A376260O6010J05938K03200K30575J77038J78775K97085M53614O53271J032431
$$ 1376260 1442270 1548208 1751408 1981983 2159021 2337796 2634881 3088495 3741766 4774197
38559D774197J508143J599711R12822k67892j174148j367119j102350q45823p19281
$$ 4774197 6282340 7882051 8794873 8526981 7352833 5985714 4883364 4037541 3318260
38550C318260n75944l77599k38518j99568j89013j78568k00332k22413j68762
$$ 3318260 2742316 2364717 2126199 1926631 1737618 1559050 1358718 1136305 967543
38541I67543o7903l6178r3061j26856p5395j2832q376j9643L583J4990l8379j01209
$$ 967543 899640 863462 770401 643545 568150 555318 546942 527299 530882 545872 507493 406284
38529D06284q4720o075M2147L0092Q490O371j724k5846l4726j4630M757J043r016
$$ 406284 321564 315489 357636 387728 396218 402589 400865 375019 340293 325663 330420 331463 322447
38516C22447l822J0788J3928r749n9385j03439r0864j1874O9247Q4266M6563J7762
$$ 322447 318625 329413 343341 333592 274207 170768 79904 68030 137277 221543 268106 285868
38504B85868R885j4173n4494o4460l1413O464L2509O4804Q5263M3122m3187p8354
$$ 285868 295753 281580 227086 162626 131213 137677 170186 234990 320253 363375 320188 241834
38492B41834k8653J9482l748m3028k1316K8001K7225q750p436K9613L7345O975
$$ 241834 213181 232663 228915 185887 164571 192572 219797 211047 203611 233224 270569 277544
38480B77544q439J416o144l1693k5309J3906K1473k4471n9712l1677K6436N4278
$$ 277544 269105 270521 264377 232684 207375 221281 242754 218283 158571 126894 153330 207608
38468B07608M2782K1959J4515K7715N4247O4008L0716k3287m5355j9994J8705
$$ 207608 250390 272349 286864 314579 368826 432834 463550 440263 394908 374914 393619
38457C93619L8306L0147q442o2776q4776m7561j366p891l8412k1207K7898K9010
$$ 393619 431925 462072 453630 390854 306078 258517 257151 249260 210848 189641 217539 246549
38445B46549j1742j169P0038Q9112P178o4352k4882N8289O5111P737j2146K9323
$$ 246549 234807 233638 303676 392788 399966 335614 310732 369021 434132 441869 429723 459046
38433D59046O5353N8820L6699K2399J3570J3363K1021J1116k5284m8634k9898
$$ 459046 524399 583219 619918 642317 655887 669250 690271 701387 676103 627469 597571
38422E97571k243j961o014J2374J9529j6401n1217l3113J367j3987o1275p2793
$$ 597571 595328 593367 587353 599727 619256 602855 551638 518525 519892 505905 444630 371837
38410C71837m2885j4745R211M7829O5947K3201k8989r441N4081O3336J1882j5074
$$ 371837 328952 314207 323418 371247 437194 460395 431406 421965 476046 539382 551264 536190
38398E36190K216m090m2174l2112L8679O7874M859n8970m0893L254j1117n3023
$$ 536190 538406 534316 492142 460030 498709 566583 571442 512472 471579 474833 463716 410693
38386D10693m4320k4R136j2972k810M1378N3803J5075j4632P236M1589K7957l3045
$$ 410693 366373 366349 375485 362513 359703 401081 454884 469959 455327 462563 504152 532109 499064
38373D99064q4103p7490k0210L8279N5348L3046O008k360K166P472J4562K8797
$$ 499064 414961 337471 317261 355540 410888 443934 449942 447582 449748 457220 471782 500579
38361E00579M7804O2276N8435K6511j8050l5514p000L6504N7460O3703Q1072R7728
$$ 500579 548383 610659 669094 695605 677555 642041 635041 671545 729005 792708 873780 971508
38349I71508Q5745O1487O7320J02291J30200J50150J93480K49347K61340K07542
$$ 971508 1057253 1118740 1186060 1288351 1418551 1568701 1762181 2011528 2272868 2480410
38339B480410J19655J5386j15273k41091k87375k37494j67669j40435j26554p8728
$$ 2480410 2600065 2615451 2500178 2259087 1971712 1734218 1566549 1426114 1299560 1220832
38329A220832k4175k4650q1057j31822j26452o4724J6580O7561N6499P74m8413
$$ 1220832 1196657 1172007 1090950 959128 832676 767952 784532 852093 908592 909366 860953
38318H60953n9274l6323P784N6365P1283K6537l8110n5475k7000j5274l4885l0133
$$ 860953 801679 765356 773140 829505 900788 927325 889215 833740 806740 791466 756581 726448
38306G26448J7691M5731J2610l0577k4510P499R830j5864k7836j2119J5152M1726
$$ 726448 744139 789870 802480 771903 747393 754892 764722 748858 721022 708903 724055 765781
38294G65781N8194N2766L2564J8191O200j8180k9565R824O5135N6385j0794l7813
$$ 765781 823975 876741 909305 927496 933696 915516 885951 895775 960910 1017295 1006501 968688
38282I68688J1044N0259K0798j3591Q833L2722o729n1437j2254P2157R0284L0916
$$ 968688 979732 1029991 1050789 1037198 1046031 1078753 1072024 1020587 1008333 1080490 1170774 1201690
38270A201690j5952q811N725k131j488K4712M1346K0969j1050j2442K3678O1976
$$ 1201690 1185738 1176927 1182652 1180521 1179033 1203745 1245091 1266060 1255010 1242568 1266246 1328222
38258A328222O0422K0033m650K7232P8050Q6649P1154R2991J26948Q4251j6285
$$ 1328222 1388644 1408677 1404027 1431259 1509309 1595958 1667112 1760103 1887051 1971302 1955017
38247A955017l7027O5687J55432J23212M7886M5417Q4153P8869N8568R2461J35533
$$ 1955017 1917990 1983677 2139109 2262321 2310207 2355624 2439777 2518646 2577214 2669675 2805208
38236B805208J03701L9551M8857J17592J40949J02832Q4818J16412J47082J54612
$$ 2805208 2908909 2948460 2997317 3114909 3255858 3358690 3443508 3559920 3707002 3861614
38226C861614J64368J72588J54978J36523J59546K04727K26519K31502K44368
$$ 3861614 4025982 4198570 4353548 4490071 4649617 4854344 5080863 5312365 5556733
38217E556733K48551K39124K65739L38561L75628L38299L22020M04956N13069
$$ 5556733 5805284 6044408 6310147 6648708 7024336 7362635 7684655 8089611 8602680
38208H602680N56081N82043O63242P52464Q00512Q84921J061942J234405J339971
$$ 8602680 9158761 9740804 10404046 11156510 11957022 12841943 13903885 15138290 16478261
38199A6478261J506619J823699K143554K345455K599840L096821L718419M297323
$$ 16478261 17984880 19808579 21952133 24297588 26897428 29994249 33712668 38009991
38191C8009991M985125N990949P165656Q268969R449131J1010427J2954986J5290712
$$ 38009991 42995116 48986065 56151721 64420690 73869821 84880248 97835234 113125946
38183A13125946J8504217K3069256K8806380L5459286M3139007N0420483N2147502
$$ 113125946 131630163 154699419 183505799 218965085 262104092 312524575 364672077
38176C64672077M1858703J8452889j0489206l3840027m5388783m6620050m2451694
$$ 364672077 406530780 424983669 414494463 380654436 335265653 288645603 246193909
38169B46193909l6460823l0183920k4525322k0088424j6770191j4138461j2066990
$$ 246193909 209733086 179549166 155023844 134935420 118165229 104026768 91959778
38162I1959778j0554497r322140q088910o946795o064775n309986m512161l807769
$$ 91959778 81405281 72083141 63994231 57047436 50982661 45672675 41160514 37352745
38154C7352745l368269l049233k645243k250725k041012j919611j708041j484211
$$ 37352745 33984476 30935243 28290000 26039275 23998263 22078652 20370611 18886400
38146A8886400j407137j380227j211714r67530q53005q57023q07270o85175o08273
$$ 18886400 17479263 16099036 14887322 13919792 13066787 12209764 11402494 10717319 10109046
38137A0109046n77012n01019m11877m02939m16779l32173k11858k26132l62020
$$ 10109046 9532034 9031015 8619138 8216199 7799420 7467247 7255389 7029257 6667237
38128F667237m35056l75062k91093k59114k40854k17007k22312k38166k07256
$$ 6667237 6232181 5857119 5566026 5306912 5066058 4849051 4626739 4388573 4181317
38119D181317j59002j75445k35367k34086j55456q7651p0869o2049m9326p1340
$$ 4181317 4022315 3846870 3611503 3377417 3221961 3134310 3063441 3001392 2952066 2880726
38109B880726j16584j22639q4378n9306o4085o1183m0645k3647j431L8320N0885
$$ 2880726 2764142 2641503 2557125 2497819 2433734 2372551 2331906 2308259 2306828 2345148 2396033
38098B396033l150o6177n6977l141P612k6444m0536l6457o8439j18165j15013
$$ 2396033 2392883 2326706 2269729 2266588 2274200 2247756 2207220 2170763 2102324 1984159 1869146
38087A869146o9685n8809q3214p1748k4606j8329n8525o2007p636K4082o253l6702
$$ 1869146 1799461 1740652 1657438 1585690 1561084 1542755 1484230 1422223 1414587 1438669 1432416 1395714
38075A395714k5800k0019n2272p6875n7586k8985k0183l102L2842L7021j4471
$$ 1395714 1369914 1349895 1297623 1220748 1163162 1134177 1113994 1110892 1143734 1180755 1166284
38064A166284n9462l9578Q034Q488m4405r2943r6226o2307k0994K921J964j0957
$$ 1166284 1106822 1067244 1075278 1083766 1039361 946418 850192 787885 766891 769812 771776 760819
38052G60819j9703k2127j6477R025M4872M7451J288l5869p833M6850M5957j0594
$$ 760819 741116 718989 702512 711537 756409 803860 805148 769279 761446 808296 854253 843659
38040H43659m3594j7368J8760J8128o346k7223m2171n0965m2006j5480J5514M5249
$$ 843659 800065 782697 801457 819585 813239 786016 743845 692880 650874 635394 650908 696157
38028F96157O5623N6544K4549J7507N1428O6510K1139k0064K2822J11717J49586
$$ 696157 761780 818324 842873 860380 911808 978318 999457 979393 1002215 1113932 1263518
38017A263518J35365J45833J89562K03640J82651J79929J80263J06290l3114j33378
$$ 1263518 1398883 1544716 1734278 1937918 2120569 2300498 2480761 2587051 2553937 2420559
38007B420559j57383j77141k21938k21874j50782r2443j00567j14178q1423n1552
$$ 2420559 2263176 2086035 1864097 1642223 1491441 1398998 1298431 1184253 1102830 1051278
37997A051278o6857p3928k9779L878l3275q6387p3930j7891N636j6435m7985p3308
$$ 1051278 984421 910493 880714 884592 851317 764930 691000 673109 678745 662310 614325 541017
37985E41017p8538l0613M9772O6561j7822r9937p7285j242J3628l2069m9221j5934
$$ 541017 462479 431866 481638 548199 530377 430440 353155 351913 365541 333472 284251 268317
37973B68317J2524J9155L6259N6558L7736j0246l3385k3397j7397j8834r74K1411
$$ 268317 280841 299996 336255 392813 430549 420303 386918 363521 346124 327290 326316 347727
37961C47727Q089k4385j8977K3434M1385J3801j0370N828M0433N9046N3136K3761
$$ 347727 355816 331431 312454 335888 377273 391074 380704 386532 426965 486011 539147 562908
37949E62908k4013o5129p2908n1577k0436J3481L3538M449o3440q6789j6652O9036
$$ 562908 538895 473766 400858 349281 328845 342326 375864 380313 316873 230084 213432 282468
37937B82468O5365k758k2541L1587P4585N7152K3805J2687L888q128R477M7132
$$ 282468 347833 345075 322534 354121 428706 485858 509663 522350 526238 518110 527587 574719
37925E74719M1702j5886n0578k3411M688k0022n5652m3520k376K1448L3043M9416
$$ 574719 616421 600535 549957 526546 531234 511212 455560 412040 409664 431112 464155 513571
37913E13571M0372j5743o6676n5610j5606j3862l6081j6515L7347M7722l844m3395
$$ 513571 553943 538200 471524 415914 400308 386446 350365 333850 371197 418919 415075 371680
37901C71680k2874J2172J0080n140Q828L2656K7379J4444L8950P3446M0619o0070
$$ 371680 348806 360978 371058 365918 374746 407402 434781 449225 488175 561621 602240 542170
37889E42170j25814q4649N438M1762J4353o150J0548K1721j295k6058k0801n441
$$ 542170 416356 331707 337145 378907 393260 387110 397658 419379 418084 392026 371225 365784
37877C65784r588k3253k1883o769P231J4153O353k2905m7864k7218K3236L0301
$$ 365784 356196 332943 311060 304291 311522 325675 332028 309123 261259 234041 257277 287578
37865B87578k7809p2606l7774K9008M5670K3154K6181M7503K3821m0270o8767
$$ 287578 259769 187163 149389 178397 224067 247221 273402 320905 344726 304456 235689
37854B35689l7254j655Q568K8961O6129O0555j0911p5207o1380K325M2610M0006
$$ 235689 198435 196780 205348 234309 300438 360993 350082 274875 213495 215820 258430 298436
37842B98436K1098k143k9122l9355j6763J5283K3295R636j441k419p55j174j0919
$$ 298436 319534 317391 288269 248914 232151 247434 270729 280365 278924 276505 275750 274576 263657
37829B63657l6737o0095m8553p298K1242K4455L4375N4701L8894k0217m9276l564
$$ 263657 226920 166825 118272 110974 132216 156671 191046 245747 284641 264424 215148 211584
37817B11584M6430J7188m9452m5457L4798Q7584N6830n33k1359j8488k4998l3069
$$ 211584 258014 275202 225750 180293 215091 302675 359505 358972 337613 319125 294127 261058
37805B61058k9961l3063m5436k9780K6269O5988L8591j8447l1476l42Q111l2319
$$ 261058 231097 198034 152598 122818 149087 215075 253666 235219 203743 203401 211512 179193
37793A79193p0441n9846k2491l740n035K732K3009K9365J0547j2276j6576l460
$$ 179193 108752 48906 26415 22675 17640 20372 43381 72746 83293 71017 54441 50981
37781E0981J4160K8988L6137K9037J0904j007M260J4659J1369m160j2420j350
$$ 50981 65141 94129 130266 159303 170207 169200 173460 188119 199488 195328 182908 181558
37769A81558K2429M5001N5313M5670J5409k3174n0865n5338l6156k399K8073L7233
$$ 181558 203987 248988 304301 349971 365380 342206 291341 236003 199847 197448 225521 262754
37757B62754K7481K4320M2431N8734M1547J252j5263J5163O1323P7020N3884K4428
$$ 262754 290235 314555 356986 415720 457267 458519 443256 458419 519742 596762 650646 675074
37745F75074K3367N3495Q4704Q6962O8174O7556R8649J17771P8305L614l4567
$$ 675074 698441 751936 836640 923602 991776 1059332 1157981 1275752 1354057 1357671 1323104
37734A323104j0059K8411L1764J1006J012K610m929j8752j6746M231K4487L0101
$$ 1323104 1313045 1341456 1373220 1384226 1385238 1387848 1382919 1364167 1347421 1351652 1376139 1406240
37722A406240K2213M520j5842j9728Q108N2464P5150N4896J0285k0207j5542J0199
$$ 1406240 1428453 1432973 1417131 1397403 1405511 1457975 1533125 1588021 1598306 1578099 1562557 1572756
37710A572756K2681J286l8136n6402l0045K3108N7401L9322k0107p1210p3776
$$ 1572756 1595437 1596723 1558587 1502185 1472140 1495248 1552649 1591971 1571864 1500654 1426878
37699A426878m3159l3368o7143j06159j08217q5994p5864p2714m4644j612P123
$$ 1426878 1383719 1350351 1283208 1177049 1068832 982838 906974 834260 789616 788004 795127
37688G95127k9582o3021n7369l6075l1684l3458j7526O613J6788J8626K7684L0691
$$ 795127 765545 702524 645155 609080 577396 543938 526412 533025 549813 568439 596123 626814
37676F26814M075l7570m8573j1601L5875M4483R567k5579k2905K229Q53l9387
$$ 626814 630889 593319 544746 533145 569020 613503 623070 597491 574586 576815 577668 538281
37664E38281o9910m7347L516L0011L2273N0961Q4117P8742J5861n1996o9555m1501
$$ 538281 468371 421024 424540 454551 486824 537785 621902 700644 716505 664509 594954 553453
37652E53453q299J945j5534m1223l5686J2775M8578J4092n0935n1557J7635O2861
$$ 553453 545154 547099 531565 490342 454656 467431 516009 530101 479166 427609 445244 508105
37640E08105M4122L0063N8842N9981j2121p4332m3207K1561J4670m5015o3117
$$ 508105 552227 582290 641132 701113 688992 614660 571453 593014 607684 562669 499552
37629D99552l2688k0932l1802j2167K6838K2976j2197o437L6648L8768q193k4836
$$ 499552 466864 445932 414130 401963 428801 451777 439580 433143 469791 508559 500366 475530
37617D75530R225J8708k3428l9712J2900O1721M0970l125j106L0476M1614L6796
$$ 475530 484755 503463 480035 440323 453223 514944 555914 552789 551683 582159 623773 660569
37605F60569L6544J6136m0663p9794m5309K9462O7253N1479K5596J7289J9010
$$ 660569 697113 713249 672586 592792 547483 576945 644198 695677 721273 738562 757572
37594G57572K0291J2300j7108n6069o5162l3503k258l57n94K2763M0850K1125
$$ 757572 777863 790163 773055 716986 651824 618321 616063 615706 615112 637875 678725 699850
37582F99850j2340j9251n143M030J0053J8215O541l0901n1480k6388P405J0718
$$ 699850 687510 668259 663116 667146 677199 695414 701955 671054 619574 593186 600591 611309
37570F11309R062L4198M9376R299m7509n0831j1760L010j4845j7610j540r571
$$ 611309 620371 654569 703945 713244 665735 614904 603144 606154 591309 573699 572159 562588
37558E62588l7863l3477O792K4362J298j0289J4851K8719o045n4262o6251m1393
$$ 562588 524725 491248 498040 522402 523700 513411 528262 556981 550936 496674 430423 389030
37546C89030l215L5905N8020M0517M1j6268n369j5290n3883o0850r794L3750J3574
$$ 389030 385815 421720 479740 520257 520298 504030 498661 483371 429488 368638 358844 392594 406168
37533D06168k2169k50N2841N0729j6386p2483p5063o0041n8084m5081n679J9379
$$ 406168 383999 383749 436590 487319 470933 398450 323387 263346 205262 160181 154502 173881
37521A73881m583m1247l2552J2359L0590n3l2850l0005k0578m6308q1688o1414
$$ 173881 169298 128051 95499 107858 138448 138395 105545 75540 54962 8654 -73034 -134448
37509a34448J5591O5692L0692l4608l2257M3031R5527O0380j0985k6924K0957
$$ -134448 -118857 -53165 -22473 -57081 -89338 -46307 49220 109600 98615 71691 92648
37498I2648N5945K6506k7302l3819J2088M2965R726n1312o4310j2216M3891M6634
$$ 92648 148593 175099 147797 113978 126066 169031 178757 127445 63135 50919 94810 141444
37486A41444Q561k1652k7410k6067k4370j3324k04m747j9805j1958K7816O3640
$$ 141444 150005 128353 100943 74876 50506 37182 36978 32231 12426 468 28284 91924
37474I1924N8894J9075k1905m0149l5042j8841m100N639J5750K6414K7703K0338
$$ 91924 150818 169893 147988 107839 72797 53956 49856 55495 71245 97659 125362 145700
37462A45700K5248M9464O0189K8292j5932j7371J7344K3223k2417o0901m2245
$$ 145700 170948 220412 280601 308893 292961 275590 292934 316157 293740 232839 190594
37451A90594j914l371m2083n9496l2409L356J3396M795J743J4655M0047O5193
$$ 190594 188680 185309 143226 83730 51321 54677 68073 72868 74611 89266 129313 194506
37439A94506O7778L3953j6966m5270l4683p575P404N233m347j6303k6763k4057
$$ 194506 262284 296237 279271 234001 199318 191743 199147 204380 200033 183730 156967 132910
37427A32910l435J4315J552l3635m5626r206L7671L7474p596l6232j4399J9271
$$ 132910 129475 143790 145342 111707 66081 56875 94546 132020 124424 88192 73793 93064
37415I3064J6633r418j5593r02K39j6635j9523K344K1864K0467Q375o644k6876
$$ 93064 109697 100279 84686 83784 84023 67388 47865 50209 72073 92540 100915 94271 67395
37402F7395l4757m671M2563M9085N418k5289J149M3579M0656j58k4710r967K5163
$$ 67395 32638 27967 70530 119615 125033 99744 100893 144472 185128 184970 160260 150293 175456
37389A75456N6982O0652R397p7371j15728n1626M6284O0601j4099o2347j2789
$$ 175456 232438 293090 302487 225116 109388 57762 104046 164647 150548 88201 75412
37378G5412O5059O6293r529p8202r0012o7594m0952n491M4016Q1017P4848L2296
$$ 75412 140471 206764 197235 119033 29021 -38573 -79525 -85016 -41000 40017 114865 147161
37366A47161r613k5007j8077n995J68k329p485J328L2842N9841L7288l0177o8622
$$ 147161 137548 112541 94464 88469 88637 86308 78823 80151 112993 172834 210122 179945 111323
37353A11323k2293O0576Q2938L0898j3797n49K2995J469l8110l8621l540K4793
$$ 111323 89030 149606 232544 263442 249645 249096 272091 273560 235450 196829 193289 218082
37341B18082L9129N5923N8102J6424m5948p1899m7504q963J7812L3178L2414J4431
$$ 218082 257211 313134 371236 387660 341712 269813 222309 213346 231158 264336 296750 311181
37329C11181R412L7804N5180Q036o4515o7780M408N1259J4297m1703l8158M668
$$ 311181 320593 358397 413577 421613 357098 289318 293726 344985 359282 317579 279421 284089
37317B84089K0110j477k2531k6106j7335O243L5129L2790j2202n3222n1231l5514
$$ 284089 304199 302722 280191 254085 236750 242993 278122 310912 298710 245488 194257 158743
37305A58743m6537n7788k0478M2448O0731K3454r185r50J8146J3912n680k3534
$$ 158743 112206 54418 33940 76388 137119 160573 151388 150438 168584 182496 176816 153282
37293A53282m4029o6887o7110k7315K9865O0515M2250n640l6204j5410L8901P0378
$$ 153282 109253 42366 -24744 -52059 -22194 38321 80571 74931 38727 23317 62218 132596
37281A32596N0846J3990J985N358r746l8455m6079k6060l916P793J5311J3526
$$ 132596 183442 197432 199417 204775 195029 156574 110495 84435 80519 88312 103623 117149
37269A17149n581k3465k0765k0818n3253q5608n8277J4267N2617L3352K0014M7248
$$ 117149 111568 88103 67338 46520 -6733 -92341 -150618 -136351 -83734 -50382 -30368 16880
37257A6880N8087N964n5049m9804L577L3721L0299L7291N4355L0754l7253p7934
$$ 16880 74967 80931 25882 -23922 -20345 13376 43675 80966 135321 166075 128822 50888
37245E0888m0172L2651N7893J4813l8367l8139J2501M9231K1676m3478p1870l4975
$$ 50888 10716 43367 101260 116073 77706 39567 52068 101299 122975 79497 7627 -27348
37233b7348J5462K1974k699o193K2350M3879L2090M921o926O184L0180L6854L934
$$ -27348 -11886 10088 7389 1196 23546 67425 99515 104436 97510 103694 133874 170728 174662
37220A74662n1605p4367l4383K4398L6492M123j0575K0486N4199M4278M021j9045
$$ 174662 123057 48690 14307 38705 75197 79320 68745 89231 143430 187708 191729 172684
37208A72684k336L4988N3636K4898l6883p0048k5455O2667J01865N2065k4187
$$ 172684 170348 205336 258972 283870 246987 176939 151484 214151 316016 368081 343894
37197C43894m3876m228K8183O248n2153r6354r2517m4584J3135M2812L4143R422
$$ 343894 300018 295790 323973 330221 278068 181714 89197 44613 57748 100560 134703 144125
37185A44125m562k112N668P841N03j2057j7786q565O102Q745k614j4364j8698
$$ 144125 139563 137451 143119 150960 151463 139406 121620 113055 119157 127902 125288 110924 92226
37172I2226j7350o294K0174M8133N0234J8776k5865n9580o7199l8482J6879N5307
$$ 92226 74876 68582 88756 136889 187123 205899 180034 120454 53255 14773 31652 86959
37160H6959M0303k012j2750J1084J2562k7071m9785j4399L0319J8087l3532n3499
$$ 86959 127262 125250 112500 123584 136146 109075 59290 44891 75210 93297 59765 6266
37148F266k0793K0245L0697J0936k3840n3983n1782j2522K1045R719j8322l280
$$ 6266 -14527 5718 36415 47351 23511 -30472 -82254 -94776 -73731 -64012 -82334 -85614
37136h5614N4835R2661P0507J2999l9021o6632n7166m559N7144O9024K1412k5857
$$ -85614 -30779 61882 132389 145388 106367 39735 -17431 -21990 35154 104178 125590 99733
37124I9733k3549J976l290l5638l8997R755N8923M3102k9878p8433m1789M4502
$$ 99733 76184 78160 74870 39232 235 9990 68913 112015 82137 3704 -38085 6417
37112F417R1560O4296R024k3969l5519m0330k9344k760Q366n827p514J8842K4476
$$ 6417 97977 162273 171297 147328 111809 71479 42135 39375 47741 41914 34400 53242 77718
37099G7718j8761n0740j6226L1519J5216k9082j3308M3336M9086J0026J6854O4787
$$ 77718 58957 8217 -8009 23510 38726 9644 -3664 39672 88758 98784 115638 180425
37087A80425N0737k7635m5002K7372N1083l8602j01011k6282O3077J4586q9475
$$ 180425 231162 203527 158525 185897 236980 198378 97367 71085 134162 148748 59273
37076E9273p1460L7593N8502k4809m8881L6848Q8942K6808l4472P472P2049M3837
$$ 59273 -12187 25406 83908 59099 10218 47066 136008 162816 128344 135816 207865 251702
37064B51702l9253o4820k3209O246j1788m4331o1241n6972k9878P276K5003K0336
$$ 251702 212449 147629 124420 130666 118878 74547 13306 -43666 -73544 -66268 -41265 -20929
37052b0929K3809L9498L2597J363p064J5319J1444l5523n5667r365L5491J7810
$$ -20929 2880 42378 74975 76338 69274 84593 96037 60514 4847 -4518 30973 48783
37040D8783j0271J5629M4332o84o5218l6088O3605R5868K3014m0108j5920K6842
$$ 48783 38512 54141 98473 97789 32571 -3517 60088 155956 178970 138862 122942 149784
37028A49784P951l5431l1857J4j519k8321k4471J2956L5899L1596L4553N3944
$$ 149784 157735 122304 90447 90461 88942 60621 36150 49106 85005 116601 151154 205098
37016B05098N1462M343n4501p6957n2712r944J7020J2568j2842l4374l9070l7341
$$ 205098 256560 260903 206402 129445 76733 66789 83809 96377 83535 49161 10091 -27250
37004b7250m1325m4049l4897k1431j4175k561K5219M8081L4408k994j6413L806
$$ -27250 -68575 -112624 -147521 -168952 -183127 -185688 -160469 -112388 -77980 -80974 -97387 -93581
36992i3581J1730j6727l6253k983M6573M5556J757j6309P170J1920l0932o2759
$$ -93581 -81851 -98578 -134831 -137814 -91241 -45685 -43928 -60237 -53067 -41147 -72079 -134838
36980a34838l0459K6305L8469J2336M554K2393K0905j2128l7588l4373k6592l1223
$$ -134838 -165297 -138992 -100523 -88187 -83633 -61240 -40335 -52463 -90051 -124424 -151016 -182239
36968a82239l1409j5433L274J7063L2679M0872K2323q215j2167R550J6616L774
$$ -182239 -213648 -229081 -225807 -208744 -176065 -135193 -112870 -121085 -133252 -123702 -107086 -103312
36956a03312J3284N1988O2744J5135l7325l6928l722J3872J8257L2137L4338m032
$$ -103312 -90028 -38040 24704 39839 2514 -34414 -38136 -24264 -6007 26130 60468 56436
36944E6436n1250n3903k2377q947j7241m818L1509M4882J7620j3371k1409k2185
$$ 56436 5186 -48717 -71094 -80041 -97282 -102100 -70591 -25709 -8089 -21460 -42869 -65054
36932f5054k6955j7779J0403K9341K1788Q484R450J0985p021l5729m9032l4890
$$ -65054 -92009 -109788 -99385 -70044 -48256 -39772 -30322 -19337 -26358 -62087 -111119 -146009
36920a46009l994K0956K2735P852Q34Q391Q157p782q317K2620M0725L850m6224
$$ -146009 -150003 -129047 -106312 -98460 -97626 -89235 -81078 -88860 -97177 -74557 -33832 -29982 -76206
36907g6206l3518L2328O2319J8969l4597l4156Q116N1127Q1300Q6624L9614m6428
$$ -76206 -109724 -77396 -15077 3892 -30705 -64861 -56745 -5618 75682 162306 201920 155492
36895A55492r7714o8643r410M688k4379l6328n405L6900N3877L4992r627m9642
$$ 155492 57778 -10865 -20275 -15587 -39966 -76294 -81699 -44799 9078 44070 34443 -15199
36883a5199m6578J377M5565M8244L1459K9556K5816j2827o2688o6850k4366M357
$$ -15199 -61777 -60400 -14835 33409 64868 94424 120240 107413 44725 -22125 -46491 -42134
36871d2134j2273l5318k0605J8818M0633L2253J4442L540m887j8584l0000k0167
$$ -42134 -54407 -89725 -110330 -91512 -50879 -18626 -4184 -644 -5531 -24115 -54115 -74282
36859g4282J7641N8740O2688J8317l5885n0752k0756J4930K2695J1280J4893M7295
$$ -74282 -56641 2099 64787 83104 47219 -3533 -24289 -9359 13336 24616 39509 86804
36847H6804P8998O6341P002m5287l8080J6576O0081O0876L7777J4252o180j2053
$$ 86804 165802 232143 239145 193858 155778 172354 232435 293311 331088 345340 339160 327107
36835C27107J8622P1977R6158P3949N3125P1259R7334R1625P7106R3333J17313
$$ 327107 345729 417706 513864 587813 640938 712197 809531 901156 978262 1071595 1188908
36824A188908R9075N2158L6531O1622P6209N3757K1659Q67j9118l4704k0583J5220
$$ 1188908 1287983 1340141 1376672 1438294 1514503 1568260 1589919 1590786 1571668 1536964 1516381 1531601
36812A531601K7293M700q751J0375K5861Q264j3232m815J2939N454j4252j2397
$$ 1531601 1558894 1563594 1554843 1565218 1591079 1599343 1586111 1581296 1594235 1599689 1585437 1573040
36800A573040O297J3965J1382J6563J8760o958m8103o5498n3865m6645n6412n5542
$$ 1573040 1579337 1593302 1604684 1621247 1640007 1633049 1584946 1519448 1465583 1418938 1362526 1306984
36788A306984l0612j4961l9974q2705r5873p6077o6182q8565j09699q9723m4352
$$ 1306984 1276372 1261411 1221437 1138732 1042859 966782 900600 812035 702336 612613 568261
36777E68261k6447n2302q0908p5550n2261m3498m2214j9896J5371K3143p434m1144
$$ 568261 541814 489512 408604 333054 280793 237295 195081 175185 190556 213699 206265 165121
36765A65121m9943m4422l8272j8589K4083O3897O6000K9305j7191m6722m7645
$$ 165121 115178 70756 32484 13895 37978 101875 167875 197180 179989 133267 85622
36754H5622k2148Q896J5282q860l2943k7544p08J9372K3008K1590K3825K8774
$$ 85622 63474 72370 87652 78792 45849 18305 17597 36969 59977 81567 105392 134166
36742A34166L4013L4650K1232q218l9886n4896m1499k13M4226M3621k2774r5188
$$ 134166 168179 202829 224061 215843 175957 121061 79562 79349 123575 167196 144422 49234
36730D9234q2335J5646Q7494N2546k9479m7038P781M6509K3318j5446k0335m01
$$ 49234 -33101 -17455 70039 122585 93106 46068 53849 100358 123676 108230 87895 87494
36718H7494J9781L7786M4831J8902k5619l4285J0018N3115M4854L160l0749n3280
$$ 87494 107275 145061 189892 208794 183175 148890 158908 212023 256877 260037 229288 176008
36706A76008p1693o1757p748M7228M9137J1041j0835j734O904M513J2328K8711
$$ 176008 104315 42558 34810 82038 131175 142216 131381 129647 136551 141064 153392 182103
36694A82103K1980j3963m6585n4863m5647j7154L7798Q3461O1055j8485o4973
$$ 182103 204083 190120 143535 88672 43025 25871 63669 147130 208185 189700 124727
36683A24727k9314K5357K1239j9712k2638J9919M8457L5515J0393p314k8194m4383
$$ 124727 95413 120770 142009 122297 99659 119578 168035 203550 213943 206629 178435 134052
36671A34052k8160Q726J7677o533j0073K9099N6130K5106k3958k6295R520K3338
$$ 134052 105892 114618 132295 125762 115689 144788 200918 226024 202066 175771 185291 208629
36659B08629j443k3631j5615M381J3209J2747J1937J1222J0235P412n034k1725
$$ 208629 207186 183555 167940 172321 185530 198277 210214 221436 231671 239083 234049 212324
36647B12324j1533M0368Q7905O8421o150n2657k6983J7233R959l5932n1336j4685
$$ 212324 200791 241159 329064 397485 391335 338678 311695 328928 338887 302955 251619 236934
36635B36934K1082O965l6788n2149j8272K7768M1018K0330J89J027P706K032m722
$$ 236934 258016 264981 228193 176044 157772 185540 226558 246888 247077 248104 255810 257842 253120
36622B53120Q264L1589L3485P156j6075r534J4048K3893J2686P75M822J6042J3412
$$ 253120 261384 292973 326458 333614 317539 308005 322053 345946 358632 359407 364229 380271 393683
36609C93683o124j9447q221P547j0802o1763r3803p4342l8681l6567n6659n2180
$$ 393683 387559 368112 359891 367438 356636 294873 201070 126728 88047 51480 -5179 -57359
36597e7359k3275j3137k4787r412M5826Q2513N5768Jk9162l0647l0062j9871J5343
$$ -57359 -80634 -93771 -118558 -127970 -82144 369 56137 56138 26976 -3671 -33733 -53604 -38261
36584c8261M4851K5698k4086m4501j9991P102Q651L169Q754J3553R372J2287K7921
$$ -38261 6590 32288 8202 -36299 -56290 -49188 -40537 -37368 -28614 -15061 -5689 6598 34519
36571C4519L0303L69l8991n0827l0883n498O010P542R182R942K104j2608j8547
$$ 34519 64822 65191 26200 -24627 -55510 -61008 -54998 -47456 -38274 -28332 -26228 -38836 -57383
36558e7383m743J5080J5809l085j5316r781q033k1345k1180J3903M8022L1985
$$ -57383 -62126 -47046 -31237 -34322 -49638 -59419 -67452 -88797 -109977 -96074 -48052 -16067
36546a6067j6539l1366L409K9711O939k5834j3170K9671L8342o725n0137l2067
$$ -16067 -32606 -63972 -60563 -30852 -23913 -49747 -62917 -33246 5096 -1629 -51766 -83833
36534h3833L5495P9971N3044r672l0078J3029N5136L3372k9909o7562o4031n5886
$$ -83833 -48338 31633 84677 75005 44927 57956 113092 146464 116555 48993 -15038 -70924
36522g0924n0652j6185L9709N2716j024n4108m2000L449J3686l824J4076P1395
$$ -70924 -121576 -137761 -98052 -45336 -46360 -100468 -142468 -139019 -125333 -129157 -115081 -43686
36510d3686R6409M9593j7515l8927k0956j4748l2876l7273m192L5207L3359j0932
$$ -43686 52723 102316 84801 45874 24918 10170 -22706 -59979 -64171 -28964 4395 -6537
36498f537m6747k9661K6011O4199N0702N577k7609k7807n799J6079K1805R539
$$ -6537 -53284 -82945 -56934 7265 57967 63544 35935 8128 2329 18408 40213 49752
36486D9752p664j4767j2088j0706j1103l303R555J0162l071q788L024J3190M775
$$ 49752 42088 27321 15233 4527 -6576 -9879 -324 9838 6767 -2021 1003 14193 18968
36473A8968j0775j6036j3024p458P920L1317L6827Q577k9511m4082l3667j6091
$$ 18968 8193 -7843 -20867 -28325 -20405 10912 47739 56316 26805 -17277 -50944 -67035
36461f7035J240J1822l65k8299k9549J2900M9659L4696K630J1697L8477J2817
$$ -67035 -65795 -53973 -54338 -82637 -112186 -99286 -49627 -14931 -12301 -604 37873 50690
36449E0690n4529p4086j8546L3084K3379j258J5048M2991L4499J6144L6174O6456
$$ 50690 -3839 -77925 -96471 -63387 -40008 -41266 -26218 16773 51272 67416 103590 170046
36437A70046M4451j4484l3591M635L4237R591l5950n3098m1100k4507r220J0767
$$ 170046 214497 200013 166422 171057 205294 214885 178935 125837 84737 60230 51010 61777
36425F1777L0333L8122K8680K189l1510n0093m0982k1540j3223n820K0379M7461
$$ 61777 92110 130232 158912 161101 129591 79498 38516 16976 3753 -2067 18312 65773
36413F5773L8222l50j9143k47J7627K619k3309k3725q85J4203J594l4239o9643
$$ 65773 103995 103645 84502 84255 101882 104501 81192 57467 56582 70785 72379 38140 -31503
36400c1503p2038l1016J5311J6561k3536n4368n4209m9167m8749k4805K1401L6562
$$ -31503 -103541 -134557 -119246 -102685 -126221 -180589 -234798 -283965 -332714 -357519 -336118 -299556
36388b99556m2l0174n691L2681K6244n511j2561j0594m1948p5279m4857K5347
$$ -299556 -299598 -329772 -335463 -302782 -276538 -282049 -294610 -305204 -347152 -422431 -467288 -441941
36376d41941M2143q620l9660r616J2426k5997o5952l7537K0430K3009k8071n8335
$$ -441941 -399798 -408418 -448078 -457694 -445268 -471265 -537217 -574754 -554324 -531315 -559386 -617721
36364f17721m2123l1291o5074j16238j41392j40917j47213j73597j93811j75435
$$ -617721 -659844 -691135 -756209 -872447 -1013839 -1154756 -1301969 -1475566 -1669377 -1844812
36354a844812j28819j01801j06358p7833M3328K04611K85653K53229J94142J75779
$$ -1844812 -1973631 -2075432 -2181790 -2259623 -2216295 -2011684 -1726031 -1472802 -1278660 -1102881
36344a102881J64378J23659R8507J25854J44458Q9671J6663K2416Q8083J10970
$$ -1102881 -938503 -814844 -716337 -590483 -446025 -356354 -339691 -317275 -229192 -118222
36334a18222O7014K7470K5904K3439Q266J6795M1764K8452j5772j6250L5631N4388
$$ -118222 -51208 -23738 2166 25605 33871 50666 92430 120882 105110 88860 124491 178879
36322A78879O044l0434k543K6386M56k2584J7789O1043K4583m6291m9816J769
$$ 178879 184923 154489 151946 178332 178788 156204 173993 235036 259619 213328 163512 165281
36310A65281J0968l4245m6865N277N1558M1057R400l267j0881k5416k1615M462
$$ 165281 176249 142004 95139 100416 151974 193031 202431 199164 188283 162867 141252 145714
36298A45714R182k6667n6253l6003J1086L7050L1250Q742k2012m5519l2137J7015
$$ 145714 154896 128229 71976 35973 47059 84109 115359 124101 102089 56570 24433 41448
36286D1448M9141K3544k5982l1185K0420O9622N8841j640m7372l3620J1150J9802
$$ 41448 90589 114133 88151 56966 77386 147008 205849 204209 156837 123217 134367 154169
36274A54169k0473m1518Q622P5824O7274r284n2760k1211J1045j6502m9785j6536
$$ 154169 133696 92178 100800 176624 243898 234614 181854 160643 171688 155186 105401 88865
36262H8865M3038L2414m7184r2495m6867K8280M9896J6062j8468k1174J227L3666
$$ 88865 131903 164317 117133 24638 -22229 6051 55947 72009 53541 32367 33594 67260
36250F7260O2840P0567M7629J0676j4243k1440k3149k2389r044J3696K0017n573
$$ 67260 130100 200667 248296 258972 244729 223289 200140 177751 168707 182403 202420 196847
36238A96847l8319l8143j781L4092M5047M4478M3419K0539l4130p4978n1596Q660
$$ 196847 158528 120385 118604 152696 197743 242221 285640 306179 272049 197071 145475 154135
36226A54135K6828j5693n0633k6048K2211L5192J5976M518O495j70j3288j3743
$$ 154135 180963 165270 114637 88589 110800 145992 161968 166486 172981 172811 159523 145780
36214A45780r497k1899l7192k1264J9481L9360J9698r073j8788j6066j1977J659
$$ 145780 136283 114384 77192 55928 75409 114769 134467 125394 106606 90540 78563 80222
36202H0222K6605L9760K2281j2899l8040l8320j4190K2464M5425L1309p637k9742
$$ 80222 106827 146587 168868 155969 117929 79609 65419 87883 133308 164617 156980 127238
36190A27238j5586R034J4925Q067O247L046j4644l0317j4794K4355M3034J7205
$$ 127238 111652 120686 135611 143678 149925 152971 138327 108010 93216 117571 160605 177810
36178A77810k5113l9937j8940Q970J8026J1397N267Q90j3792l6269m1057j1631
$$ 177810 152697 112760 93820 102790 120816 132213 137480 138370 124578 88309 47252 35621
36166C5621L2052N7201O0037N7372M3516k897o0545o4452K763O1599L1715m9771
$$ 35621 67673 124874 184911 242283 285799 282902 222357 157905 160668 222267 253982 204211
36154B04211p3321j1949M5521L2493k629J2211N4204M9947j498l1325j3388O336
$$ 204211 130890 118941 164462 196955 194326 206537 260741 310688 309190 277865 264477 270813
36142B70813o20j996K4103M1753K0006j0696j1015J600r701l2774l0824r624j796
$$ 270813 270193 268197 292300 334053 354059 343363 332348 333948 324247 291473 260649 251025 249229
36129B49229r86K5132O1898N3686p075n7217n0497j5828m44j957O037J8003J0302
$$ 249229 248243 273375 335273 388959 381884 324667 274170 258342 257898 255941 261978 279981 290283
36116B90283j1238k0290j5499j8056k6819j2593L4278P9213Q3702N3917K8794
$$ 290283 279045 258755 243256 225200 198381 185788 220066 299279 382981 436898 465692
36105D65692K5613K1553k124k1779m615L3681M5575K6119J9931L7730K6144l9244
$$ 465692 491305 512858 510734 488955 484340 518021 563596 589715 609646 647376 673520 634276
36093F34276r1172o6510j3499j6270n0149k1589O1798Q5927J2521n7948m9730
$$ 634276 543104 476594 463095 446825 396676 375087 436885 522812 535333 477385 427655
36082D27655j8710k9452l9215K669L8580M50n2296k0909N8484O4177j4030o2068
$$ 427655 408945 379493 340278 342947 381527 381977 329681 308772 367256 431433 417403 355335
36070C55335k3388L4112M8842M5469N3094M8289K1626J1683K8353K0569l4532
$$ 355335 331947 366059 414901 460370 513464 561753 583379 595062 623415 643984 609452
36059F09452q0857o7507k1443O663J0738L041k1873n3872n2865j1597J8573O285
$$ 609452 528595 461088 439645 446308 457046 460087 438214 384342 331477 319880 338453 344738
36047C44738q721J2155L7567K2113j6987l4511k7504j6834L282M2207P1969O1862
$$ 344738 336017 348172 385739 407852 390865 356354 328850 312016 315298 357505 429474 491336
36035D91336K5659r086m2216o7054m3220L7078R9641P5652M218k4977n58J8051
$$ 491336 516995 507909 465693 398639 355419 392497 492138 567790 572008 547031 546473 564524
36023E64524J1851J7467M0947M5006K6032K1243K9423N632m7348o2119j0233M9359
$$ 564524 576375 593842 634789 679795 705827 727070 756493 762125 714777 652658 642425 691784
36011F91784O1061M7150N1122O4982O0495M5545M0763L7743K6239K9052O3561
$$ 691784 752845 799995 851117 916099 976594 1022139 1062902 1100645 1126884 1155936 1219497
36000A219497R8145R5249P3903P9551J09139J18938R9732R1939J19959J56011
$$ 1219497 1317642 1412891 1486794 1566345 1675484 1794422 1894154 1986093 2106052 2262063
35990B262063J64498J49995J43938J66212K14616K75051L28861L63307L85419
$$ 2262063 2426561 2576556 2720494 2886706 3101322 3376373 3705234 4068541 4453960
35981D453960M14651M55648M94790N33751O04908P29371Q73527R81694J052161
$$ 4453960 4868611 5324259 5819049 6352800 6957708 7687079 8560606 9542300 10594461
35972A0594461J142880J285265J427668J495800J480261J417060J296847J055783
$$ 10594461 11737341 13022606 14450274 15946074 17426335 18843395 20140242 21196025
35964B1196025O70088K06879k45420o52390j005505j263537j379651j371648j314201
$$ 21196025 21866113 22072992 21827572 21175182 20169677 18906140 17526489 16154841 14840640
35955A4840640j260665j207640j133429j034272r18223p94154o76059n79829n12624
$$ 14840640 13579975 12372335 11238906 10204634 9286411 8492257 7816198 7236369 6723745
35946F723745m75853m67601m66573m33442l56202k77649k44984k46529k34746
$$ 6723745 6247892 5780291 5313718 4880276 4524074 4246425 4001441 3754912 3520166
35937C520166j98216j67206j55036j40760j11857q1977o2102n1813n9273q9210
$$ 3520166 3321950 3154744 2999708 2858948 2747091 2665114 2603012 2551199 2491926 2402716
35927B402716j11076q4669k2340J8471J0349j9332l9651m2611j9230L0039N6340
$$ 2402716 2291640 2206971 2184631 2203102 2213451 2194119 2154468 2111857 2092627 2122666 2179006
35916B179006N712q2865j02692l3474J5217l4198j07401r7151k9722j1960n8889
$$ 2179006 2184718 2101853 1999161 1965687 1980904 1946706 1839305 1742154 1712432 1700472 1641583
35905A641583q6105n8105l4925n9303r1609q5436n3148k4956n777l051l6951q7346
$$ 1641583 1555478 1497373 1462448 1403145 1311536 1226100 1172952 1147996 1142219 1139168 1102217 1014871
35893A014871q7713j7059N0473M0094j7858l6095Q58K2685j5528p1759q5558n9880
$$ 1014871 927158 910099 960572 1000666 982808 946713 947571 970256 954728 882969 797411 737531
35881G37531m2607n5282p5465p9123o9989o5140p2451q7581r8528q9029n2881
$$ 737531 694924 639642 564177 485054 415065 349925 277474 189893 91365 2336 -50545
35870e0545j1722k005l1484o3581o2326l8317k5179k2842j526L7325M8108Q525
$$ -50545 -62267 -64272 -95756 -159337 -221663 -259980 -285159 -308001 -309527 -272202 -224094 -215569
35858b15569l7185l5524Q69J4951r778k8883n380L8912N6931L6166L990j2576
$$ -215569 -252754 -288278 -287409 -272458 -282236 -311119 -316499 -277587 -220656 -184490 -180500 -193076
35846a93076j1016j529R443J8311J9382J1559N781J4719L3836M2384K7259k392
$$ -193076 -204092 -205621 -196178 -177867 -158485 -146926 -141145 -126426 -92590 -50206 -22947 -25339
35834b5339k7825l7438k7879n160Q094j0554m3587l7626K4785Q3430P1354Q373
$$ -25339 -53164 -90602 -118481 -123641 -115547 -126101 -169688 -207314 -182529 -99099 -27745 -19372
35822a9372k7285j0737N936j3837l8267k8900qJ5784J7479J8408J5410O429O120
$$ -19372 -46657 -57394 -51458 -65295 -103562 -132462 -132470 -116686 -99207 -80799 -65389 -58960 -52840
35809e2840J6263J3780o895j6885l767L514r842j1902J5296L1735L876l2094k5196
$$ -52840 -36577 -22797 -29692 -46577 -50344 -46830 -56672 -68574 -53278 -21543 -17667 -49761 -74957
35796g4957J1861L3831L3503K4216o622o1472q9480n0860J1277L6959M5784Q0387
$$ -74957 -63096 -29265 4238 28454 21832 -39640 -129120 -179980 -168703 -131744 -85960 -5573
35784e573R7161K6877q0112r8180j9168K9634j3533n3767k633Q0944Q8487J6241
$$ -5573 91588 118465 38353 -59827 -78995 -49361 -62894 -116661 -119294 -38350 50137 66378
35772F6378n5872p7602n2743j511M1352L5911n676j7470K2632N0677J8877k4179
$$ 66378 10506 -67096 -119839 -121350 -79998 -44087 -49763 -67233 -44601 6076 24953 774
35760G74j5843J8586J7862j1453k0371q297j0755k4188j6885M550P716k520L821
$$ 774 -15069 3517 21379 9926 -10445 -18742 -29497 -53685 -70570 -66020 -58304 -60824 -57003
35747e7003K1578K1795Q652Q000J3464l17k4733l0752j9656r120R391M3945N9267
$$ -57003 -35425 -13630 -4978 3022 16486 16169 -8564 -39316 -58972 -68092 -58701 -14756 44511
35734D4511K5650j3607K320M7462M2445j6563n0011k0988J7148J6318l755j3487
$$ 44511 70161 56554 58874 106336 148781 132218 82207 61219 78367 94685 90930 77443
35722G7443j9081k0781L239L6988K1087m8918q5080k4801O8575Q8559K9520k2219
$$ 77443 58362 37581 40820 77808 98895 49977 -35103 -59904 8671 97230 126750 104531
35710A04531j7891O603J1483J1678L0828M6677K2986k5916m3700p602L6076K9889
$$ 104531 86640 93243 104726 116404 147232 193909 216895 190979 147279 139677 175753 205642
35698B05642k0583n6477m1269K384L0559K2594j4418n1754m6037J8329Q6117Q1175
$$ 205642 185059 128582 87313 89697 120256 142850 128432 76678 30641 48970 135087 216262
35686B16262J3258k5933L456L4027J1691j1472K4936P5151O3660J6157R857L9584
$$ 216262 229520 203587 207043 241070 252761 241289 266225 341376 405036 421193 431050 470634
35674D70634M4622L3129O2347J19524J41855J36739J61555K02797K04787K00570
$$ 470634 515256 548385 610732 730256 872111 1008850 1170405 1373202 1577989 1778559
35664A778559K72340L97002M85589N57995P03457R01309J113453J516401K273070
$$ 1778559 2050899 2447901 2933490 3491485 4194942 5096251 6209704 7726105 9999175
35655I999175K974010K732104J172134r20986k307559k519642k073212j615605
$$ 9999175 12973185 15705289 16877423 15956437 13648878 11129236 9056024 7440419
35647G440419j301123j013182p51736n88220m92536m06818l50455l29340k76440
$$ 7440419 6139296 5126114 4374378 3786158 3293622 2886804 2536349 2207009 1930569
35638A930569j81013j40785j93433k31157j74576r6683p7682p2207k9251j2206
$$ 1930569 1749556 1608771 1415338 1184181 1009605 912922 835240 763033 733782 721576
35628G21576p3653j27300q1316o62L054m1761l4701J3537J6024k4599l3330j0502
$$ 721576 647923 520623 439307 438645 441699 399938 365237 378774 394798 370199 336869 326367
35616C26367j9171m8176k7409L0499L8245j4374m3232j5536O147j5573l9108l5697
$$ 326367 307196 259020 231611 262110 300355 285981 242749 227213 233360 217787 178679 142982
35604A42982l2988l8721j7257K5730K6696l0085p3387n1480k415K1032K4853L1472
$$ 142982 109994 71273 54016 79746 106442 76357 2970 -48510 -50925 -29893 -5040 26432
35592B6432L0991J7705J5802K9102K2007j4158l5871k4040j9860m1164l3677L4618
$$ 26432 57423 75128 90930 120032 142039 127881 92010 67970 48110 6946 -26731 7887
35580G887R4056O3099k6920p4488m7243m082O492j468j273M587N077K155M85J007
$$ 7887 101943 165042 138122 63634 16391 12309 18801 17333 16060 20647 25724 27879 28364 29371
35566B9371O918J6654J7493M711m854K714J6119K0335K0152K1026J1414j0107
$$ 29371 36289 52943 70436 75147 70293 73007 89126 109461 129613 150639 162053 151946
35554A51946j7630L06J0006j7513n2438m7495j1503R294O152P319J2899n942l9692
$$ 151946 134316 134622 144628 127115 74677 27182 15679 24973 31125 38444 51343 45401 5709
35541E709l8026O498L2866L014l1722k289P2878J07653O3033n852k6672J450J9129
$$ 5709 -32317 -25819 7047 10061 -21661 -23950 48928 156581 219614 213762 187090 188540 207669
35528B07669j0028n5788o6856l7459n050R352K3715M8803N7163K7642p894n022
$$ 207669 197641 141853 74997 37538 32488 41840 65555 114358 171521 199163 191269 186247
35516A86247K1600J6128l0916o4236m5811p083P440P540K7610N5820M3498j6403
$$ 186247 207847 223975 193059 128823 83012 75929 83369 90909 118519 174339 217837 201434
35504B01434o4539m6954J5344N3699L6660L33q506O757P787j8845m6071m8781
$$ 201434 136895 89941 105285 158984 195644 195977 187471 194228 202015 183170 137099 88318
35492H8318l2266j1573Q452J9665P513j8083j8761J7470M5914K5549j6166k3301
$$ 88318 56052 44479 52931 72596 80109 62026 43265 60735 106649 132198 116032 92731
35480I2731M287J9204O344m536l701j5829l9495l5270K980K3301n581m2186l7392
$$ 92731 97018 116222 122566 118030 114329 98500 59005 23735 26715 50016 44435 2249 -35143
35467c5143n799J1906J6916L0725L7690Q623l5006m0168m170J5905j2759m8260
$$ -35143 -40942 -29036 -12120 18605 56295 64918 29912 -10256 -14426 1479 -11280 -59540
35455e9540l0774L4083P4765L6682m7132q3787k8691N2649O2824M67m2934j8363
$$ -59540 -90314 -56231 18534 55216 8084 -75703 -104394 -51745 11079 11546 -31388 -49751
35443d9751J8111R733o812K4293O7839M9272j5473l7361M732L3848N55m5789m2925
$$ -49751 -31640 -21907 -28719 -4426 63413 112685 97212 59851 64583 98431 98986 53197 10272
35430A0272k652K7561L4031K7511J0540o633K052L2685L5792j2506n9182m1651
$$ 10272 7620 35181 69212 96723 107263 100630 102682 135367 171159 158653 99471 57820
35418E7820J9590M6779J0659l7796m1399k935L1905L0967J839k5872l3221k4779
$$ 57820 77410 124189 134848 97052 55653 52718 84623 115590 117429 91557 58336 33557
35406C3557j1326P294K8905L3140N853k9088l6116k1106j8842l1531k9591j5205
$$ 33557 22231 29525 58430 91570 97423 68335 32219 11113 -7729 -39260 -68851 -84056
35394h4056k3150m4446j9820N8008J05875O4686r976l4090j6953k2689n4090n8920
$$ -84056 -107206 -151652 -171472 -113464 -7589 57097 47121 13031 -3922 -26611 -80701 -139621
35382a39621k5183J2230M1635P0228O6528k319q0895p0518K2744P9515L4578l6637
$$ -139621 -164804 -152574 -110939 -40711 25817 23498 -57397 -127915 -105171 -25656 8922 -27715
35370b7715m1002N302K9979J7988M634J344o703j6824j6110j1109r367L611L1923
$$ -27715 -68717 -63415 -33436 -15448 -10814 -9470 -16173 -32997 -49107 -60216 -69583 -65972 -34049
35357c4049M3942J9926o222K274K1038K181m5909o9728m9511j7113l95O072J5599
$$ -34049 9893 29819 23597 25871 46909 49090 3181 -66547 -116058 -133171 -133566 -127494 -111895
35344a11895L0059M4296M4283J3469l3296m5682l280M1519L1760r108j7239R170
$$ -111895 -81836 -37540 6743 20212 -13084 -58766 -62046 -20527 11233 2125 -15114 -5944
35332e944J6787n363j4460l250j6281n5372n4142R739N4626J1108o2632n9974
$$ -5944 10843 5480 -8980 -12230 -28511 -83883 -138025 -128286 -73660 -62552 -125184 -185158
35320a85158J8679P4016N5493J6611J4801L1746K3140q719l2219l9960m4185l9579
$$ -185158 -166479 -92463 -36970 -20359 -5558 26188 49328 40609 8390 -31570 -75755 -115334
35308a15334j0199L2391N0233K4110k1093m2772k3586J3326K6027o172n6608p1315
$$ -115334 -125533 -93142 -42909 -18799 -39892 -82664 -106250 -92924 -66897 -73069 -129677 -200992
35296b00992k7342L4516N3524K3469j911J4118L9393K4060j9125k8436J5953O0215
$$ -200992 -228334 -193818 -140294 -116825 -118736 -104618 -65225 -41165 -60290 -88726 -72773 -12558
35284a2558N2306J0316j4331j2838j7717l9270m7601k2590J3782K8981J9398M202
$$ -12558 39748 50064 35733 22895 5178 -34092 -81693 -104283 -90501 -61520 -42122 -37920
35272c7920k080L078J5864K5263J6812j0005l4835l7292j9573j4J0751J8008K9209
$$ -37920 -40000 -36922 -21058 4205 21017 11012 -23823 -61115 -80688 -80702 -69951 -51943 -22734
35259b2734L9694L4790O124l3583n5540m1086k812K6619K7875J1648J108M559
$$ -22734 16960 51750 57874 24291 -31249 -72335 -75147 -48528 -20653 -9005 -7897 -3338
35247c338J0701Q695N204J3732K8164K1741j5574n1954m9087j5264P736Q527J5428
$$ -3338 7363 16058 21262 34994 63158 84899 69325 17371 -31716 -46980 -39244 -30717 -15289
35234a5289L3561K4786k0736m5153n493M6627L3590k7793n0495j0153K7911J9778
$$ -15289 18272 43058 22322 -22831 -28324 18303 51893 24100 -26395 -36548 -8637 11141
35222A1141j493k814l749j6161n902L5508M8183m427n8007l5407L0799M6417K44
$$ 11141 9648 6834 3085 -13076 -18978 16530 64713 60286 2279 -33128 -2329 44088 44332
35209D4332k6668Q351N2755M7571L799l5370n3586n3387l2602k12J4779j129k2062
$$ 44332 17664 26015 78770 126341 130140 94770 41184 -12203 -44805 -45017 -30238 -31367 -53429
35196e3429j5972J4195L8693L7532J7815M230J5350L8743L5475j1319o0345n3726
$$ -53429 -69401 -55206 -16513 21019 38834 43064 58414 97157 132632 121313 60968 7242
35184G242O108N3528M1050n311k5622J73L3229K2674l3516p4550l9706M6380Q3761
$$ 7242 13350 66878 107928 102617 76995 77168 110397 133071 99555 25005 -14701 31679 115440
35171A15440K1284o6708p9082k9254j1230m2735m1881K4219P2162L5082k5747
$$ 115440 136724 70016 -9066 -38320 -49550 -92285 -134166 -109947 -37785 -2703 -28450
35160b8450j8055L7731M9377l235n4477o2723m8536k7978J2426O3716Q5167O4684
$$ -28450 -46505 -8774 40603 37368 -17109 -79832 -128368 -156346 -143920 -80204 4963 69647
35148F9647L4467J2979j5613m9129n0479q827L0614K9079O530o91J294j4723m2316
$$ 69647 104114 117093 101480 52351 1872 -6955 23659 52738 59268 58577 59871 45148 2832
35135B832m7506j8104K2312M2713K8166j2850m8048m3580m182K5496J6922n648
$$ 2832 -44674 -62778 -40466 2247 30413 17563 -30485 -74065 -78247 -52751 -35829 -41477
35123d1477o783M719n198l6130n0057k5349J7889M8180N1507K9028o327k6957
$$ -41477 -48260 -43541 -48739 -84869 -134926 -160275 -142386 -94206 -42699 -13671 -19998 -46955
35111d6955j1439K4024L8687J8917p898j8453k2717l2636l2964r880J6324K0843
$$ -46955 -58394 -34370 4317 23234 15336 -3117 -25834 -58470 -91434 -101314 -84990 -64147
35099f4147J8211L6304N7604L5511k5862n9349k5708K6828L0872o178k5430j2948
$$ -64147 -45936 -9632 47972 83483 57621 -1728 -27436 -608 30264 24086 -1344 -14292
35087a4292j2397l9612m6544J523O0536O3375J3375k6041k3348j0173j5061j4752
$$ -14292 -26689 -66301 -112845 -111322 -50786 12589 25964 -77 -23425 -33598 -48659 -63411
35075f3411K0164O3580O0193O234l6497k1013K0537K2160k0904m2770k594M9122
$$ -63411 -43247 20333 80526 86760 50263 29250 49787 71947 51043 8273 5679 54801
35063E4801L5202l7513q0435l9671L6595O8887M5761J6106R276Q877k627j7842
$$ 54801 90003 52490 -27945 -67616 -31021 37866 83627 99733 109009 117886 115259 97417
35051I7417k7419l2476k6102L224L8434L9078r33l3032j8757J2788Q447k6337
$$ 97417 69998 37522 11420 14644 53078 92156 91223 58191 39434 52222 60669 34332
35039C4332l2805J4606O9144P3544L0223j1193j7125J005J1217l913l2723m3794
$$ 34332 1527 16133 85277 158821 189044 177851 160726 161731 172948 169035 136312 92518
35027I2518j5842L2312N3027K5646j1892j0284K2301L2313K114k3034p921J3722
$$ 92518 76676 108988 162015 187661 175769 165485 187786 220099 222213 199179 191258 204980
35015B04980p045m9697m7793R207N4505L8400o456k2656r320n260j9770k8143
$$ 204980 197935 148238 100445 109652 164157 202557 196101 173445 164125 158865 139095 110952
35003A10952k3125k2745k7057j2733J7902K3424j7303o2297n4279L783N1659M7242
$$ 110952 87827 65082 38025 25292 43194 66618 49315 -12982 -67261 -63478 -11819 35423
34991C5423J1511q516O38J4382J4091J0430J5997J6703p476m3333n4925l5700
$$ 35423 46934 38418 39056 53438 67529 77959 93956 110659 103183 59850 4925 -30775
34979c0775k0759l5030n7301n7083m2275l9988m7248l6578l729K4264K8101J3014
$$ -30775 -51534 -86564 -143865 -200948 -243223 -283211 -330459 -367037 -370766 -346502 -318401 -305387
34967c05387j3388m8134p3627o3836k1602J6043K2096Q420J926J3763M0271P0630
$$ -305387 -318775 -366909 -440536 -504372 -525974 -509931 -487835 -479415 -477489 -463726 -423455 -352825
34955c52825Q2754N5273j450m4933m4475j0411K6753M5759L6403j379m5893o3390
$$ -352825 -270071 -214798 -216248 -261181 -305656 -316067 -289314 -243555 -207152 -208531 -254424 -317814
34943c17814m4077j0129J9501M6085O4586N5615K2832L489J5560K7065Q894j4525
$$ -317814 -361891 -372020 -352519 -306434 -241848 -186233 -163401 -159912 -144352 -117287 -108393 -122918
34931a22918o454J8758K0425k18p775J804l921l3145n2967m1410j3755J2675L9067
$$ -122918 -129372 -110614 -90189 -90407 -98182 -96378 -100299 -133444 -186411 -227821 -241576 -228901 -189834
34918a89834N7312M2828l285l9256l5246j3453r523j8871j2881Q925J8797P405
$$ -189834 -132522 -89694 -92979 -132235 -167481 -180934 -190457 -209328 -222209 -213284 -194487 -187082
34906a87082l057K698R744J629q968N97K3521K8586P126r063Q902M3744N4342
$$ -187082 -190139 -187441 -177697 -176068 -185036 -184439 -160918 -132332 -125206 -134269 -125367 -81623 -27281
34893b7281K9834n760l6137o4364p8637m8366K4071Q2422P9465L7061J0269J1303
$$ -27281 2553 -3207 -39344 -103708 -182345 -230711 -206640 -124218 -44753 -7692 2577 13880
34881A3880Q279j1613k1425j420K8796L8324K2850J319j2667k5324m9584p8747
$$ 13880 22159 10546 -10879 -12299 16497 54821 77671 78990 66323 40999 -8585 -87332
34869h7332q0743l5847K2434L5580r29k4264P694N4878N7422K1663m768j2199
$$ -87332 -168075 -203922 -181488 -145908 -146837 -171101 -163407 -108529 -51107 -29444 -34212 -46411
34857d6411k3345k9639j594M2404M5129l344m8198n1107l3371k2501j0580J0434
$$ -46411 -69756 -99395 -100989 -58585 -13456 -16800 -64998 -116105 -149476 -171977 -182557 -172123
34845a72123K0457P537m246J0145M0542N8262M5753L421m5717n9858k2261K3678
$$ -172123 -151666 -144129 -148375 -138230 -97688 -39426 6327 9748 -35969 -95827 -118088 -94410
34833i4410K5603j401l986J4537M19m8285o7285l0078J4151K9465L7955M9098
$$ -94410 -68807 -70208 -74194 -59657 -59238 -107523 -174808 -204886 -190735 -161270 -123315 -74217
34821g4217L3873M345K0997P3050N8849m5400j08736l4627P5216O8920k7242p0517
$$ -74217 -40344 -35999 -15002 58048 116897 71497 -37239 -71866 3350 72270 45028 -25489
$$ [...]
##END NTUPLES=NMR SPECTRUM
##END=
