##TITLE=31Pdec_LR-723-R2-C
 CDCl3, 24 sc
 20.10.2020
##JCAMPDX= 6.0         $$ Bruker NMR JCAMP-DX V2.0
##DATA TYPE= NMR SPECTRUM
##DATA CLASS= NTUPLES
##ORIGIN= UXNMR, Bruker Analytische Messtechnik GmbH
##OWNER= root
$$ XWIN-NMR		Version 3.5
$$ Tue Oct 20 12:28:03 2020 Russian Standard Time (UT+4h)  she@DPX200
##.OBSERVE FREQUENCY= 81.013821
##.OBSERVE NUCLEUS= ^31P
##.ACQUISITION MODE= SIMULTANEOUS
##.ACQUISITION SCHEME= undefined
##.AVERAGES= 24
##.DIGITISER RES= 17
##SPECTROMETER/DATA SYSTEM= spect
##.PULSE SEQUENCE= zgpg30
##.SOLVENT NAME= DMSO
##.SHIFT REFERENCE= (INTERNAL, DMSO, 0, 182.463)
##AUDIT TRAIL= $$ (NUMBER, WHEN, WHO, WHERE, WHAT)
$$ ##TITLE= Audit trail, XWIN-NMR		Version 3.5
$$ ##JCAMPDX= 5.01
$$ ##ORIGIN= Bruker BioSpin GmbH
$$ ##OWNER= she
$$ F:/spectra/data/she/nmr/P31/1/pdata/1/auditp.txt
$$ ##AUDIT TRAIL=  $$ (NUMBER, WHEN, WHO, WHERE, WHAT)
(   1,<2020-10-20 12:27:11.71 +0400>,<she>,<DPX200>,
      <created by zg, POWCHK disabled, PULCHK disabled
       configuration hash MD5:
       00 E9 B6 7A A2 85 ED C7 34 08 36 98 17 FE 4E 26
       data hash MD5: 32K
       3C CE 35 17 63 93 21 5B 46 95 C5 34 59 2C 1D BF>)
(   2,<2020-10-20 12:27:13.67 +0400>,<she>,<DPX200>,
      <Start of raw data processing
       efp BC_mod = 2 LB = 1 FT_mod = 6 PKNL = 1 PHC0 = -2774.029 PHC1 = 125.0014 SI = 64K 
       data hash MD5: 64K
       EE 68 CD 31 E1 2E 93 75 F0 8E DA F2 DF 1C 1B 62>)
(   3,<2020-10-20 12:27:28.14 +0400>,<she>,<DPX200>,
      <pk PHC0 = 17.72355 PHC1 = 0 
       data hash MD5: 64K
       8D 47 1B E2 5F 04 F4 F6 53 5B 7D DA 5D 04 D6 E4>)
(   4,<2020-10-20 12:27:30.51 +0400>,<she>,<DPX200>,
      <abs ABSG = 5 
       data hash MD5: 64K
       89 D0 07 CA D8 BD 50 74 E5 B6 A5 10 4F 24 28 86>)
$$ ##END=
$$ 
$$ hash MD5
$$ E7 50 54 B4 E4 62 00 F2 BD CC 39 0A 86 1C 89 C9
##$RELAX= 
##$RELAX= 
##$RELAX= 
##$RELAX= 
##$RELAX= 
##$RELAX= 
##$RELAX= 
##$RELAX= 
$$ Bruker specific parameters
$$ --------------------------
##$DU= <F:/spectra>
##$EXPNO= 1
##$NAME= <P31>
##$PROCNO= 1
##$TYPE= <nmr>
##$USER= <she>
##$AMP= (0..31)
100 100 100 100 100 100 100 100 100 100 100 100 100 100 100 100 100 100 
100 100 100 100 100 100 100 100 100 100 100 100 100 100 
##$AQSEQ= 0
##$AQ_mod= 1
##$AUNM= <au_zg>
##$AUTOPOS= <>
##$BF1= 81.014009
##$BF2= 200.13
##$BF3= 200.13
##$BF4= 200.13
##$BF5= 200.13
##$BF6= 200.13
##$BF7= 200.13
##$BF8= 200.13
##$BYTORDA= 1
##$CFDGTYP= 0
##$CFRGTYP= 5
##$CHEMSTR= <none>
##$CNST= (0..31)
1 1 145 1 1 1 1 1 1 1 1 1 1 1 1 1 1 1 1 1 1 1 1 1 1 1 1 1 1 1 1 1 
##$CPDPRG= <waltz16>
##$CPDPRG1= <>
##$CPDPRG2= <waltz16>
##$CPDPRG3= <>
##$CPDPRG4= <mlev>
##$CPDPRG5= <mlev>
##$CPDPRG6= <mlev>
##$CPDPRG7= <mlev>
##$CPDPRG8= <mlev>
##$CPDPRGB= <>
##$CPDPRGT= <>
##$D= (0..31)
0 1 0 0 0 0 0 0 0 0 0 0.03 2e-05 3e-06 0 0 0 0 0 0 0 0 0 0 0 0 0 0 0 0 
0 0 
##$DATE= 1603182431
##$DBL= (0..7)
120 120 120 11 120 120 24 19 
##$DBP= (0..7)
150 150 150 150 150 150 150 150 
##$DBP07= 0
##$DBPNAM0= <>
##$DBPNAM1= <>
##$DBPNAM2= <>
$$ [...]
##$SUBNAM3= <"">
##$SUBNAM4= <"">
##$SUBNAM5= <"">
##$SUBNAM6= <"">
##$SUBNAM7= <"">
##$SUBNAM8= <"">
##$SUBNAM9= <"">
##$SW= 369.568048894756
##$SWIBOX= (0..15)
0 1 3 0 0 0 0 0 0 0 0 0 0 0 0 0 
##$SW_h= 29940.119760479
##$TD= 32768
##$TD0= 1
##$TE= 0
##$TE2= 300
##$TE3= 300
##$TEG= 300
##$TL= (0..7)
0 120 53 12 22 120 120 120 
##$TP= (0..7)
150 150 150 150 150 150 150 150 
##$TP07= 0
##$TPNAME0= <>
##$TPNAME1= <>
##$TPNAME2= <>
##$TPNAME3= <>
##$TPNAME4= <>
##$TPNAME5= <>
##$TPNAME6= <>
##$TPNAME7= <>
##$TPOAL= (0..7)
0.5 0.5 0.5 0.5 0.5 0.5 0.5 0.5 
##$TPOFFS= (0..7)
0 0 0 0 0 0 0 0 
##$TUNHIN= 0
##$TUNHOUT= 0
##$TUNXOUT= 0
##$USERA1= <user>
##$USERA2= <user>
##$USERA3= <user>
##$USERA4= <user>
##$USERA5= <user>
##$V9= 5
##$VALIST= <valist>
##$VCLIST= <CCCCCCCCCCCCCCC>
##$VD= 0
##$VDLIST= <DDDDDDDDDDDDDDD>
##$VPLIST= <PPPPPPPPPPPPPPP>
##$VTLIST= <TTTTTTTTTTTTTTT>
##$WBST= 1024
##$WBSW= 4
##$XGAIN= (0..3)
0 0 0 0 
##$XL= 0
##$YL= 0
##$YMAX_a= 88782
##$YMIN_a= -78736
##$ZGOPTNS= <>
##$ZL1= 120
##$ZL2= 120
##$ZL3= 120
##$ZL4= 120
##$ABSF1= 182.463
##$ABSF2= -187.1042
##$ABSG= 5
##$ABSL= 3
##$ALPHA= 0
##$AQORDER= 0
##$ASSFAC= 0
##$ASSFACI= 0
##$ASSFACX= 0
##$ASSWID= 0
##$AUNMP= <proc_1d>
##$AZFE= 0.1
##$AZFW= 0.5
##$BCFW= 0
##$BC_mod= 2
##$BYTORDP= 0
##$COROFFS= 0
##$CY= -3
##$DATMOD= 1
##$DC= 0
##$DFILT= <>
##$DTYPP= 0
##$F1P= 0
##$F2P= 0
##$FCOR= 1
##$FTSIZE= 65536
##$FT_mod= 6
##$GAMMA= 0
##$GB= 0
##$INTBC= 1
##$INTSCL= 5.30512e-09
##$ISEN= 30
##$LB= 1
##$LEV0= 0
##$LPBIN= 0
##$MAXI= 10000
##$MC2= 0
##$MEAN= 0
##$ME_mod= 0
##$MI= 50
##$NCOEF= 0
##$NC_proc= -2
##$NLEV= 6
##$NOISF1= 182.463
##$NOISF2= 159.3651
##$NSP= 0
##$NTH_PI= 0
##$NZP= 0
##$OFFSET= 182.463
##$PC= 4
##$PHC0= -2756.305
##$PHC1= 125.0014
##$PH_mod= 1
##$PKNL= yes
##$PPARMOD= 0
##$PSCAL= 0
##$PSIGN= 0
##$REVERSE= no
##$SF= 81.0140089999434
##$SI= 65536
##$SIGF1= 159.3651
##$SIGF2= -187.1042
##$SINO= 113.3802
##$SIOLD= 16384
##$SREGLST= <1H.CDCl3>
##$SSB= 0
##$STSI= 65536
##$STSR= 0
##$SW_p= 29940.119760479
##$SYMM= 0
##$S_DEV= 0
##$TDeff= 32768
##$TDoff= 0
##$TI= <>
##$TILT= no
##$TM1= 0
##$TM2= 0
##$TOPLEV= 0
##$USERP1= <user>
##$USERP2= <user>
##$USERP3= <user>
##$USERP4= <user>
##$USERP5= <user>
##$WDW= 1
##$XDIM= 65536
##$YMAX_p= 322889223
##$YMIN_p= -1692737
$$ End of Bruker specific parameters
$$ ---------------------------------
##NTUPLES= NMR SPECTRUM
##VAR_NAME=  FREQUENCY,     SPECTRUM/REAL,   SPECTRUM/IMAG
##SYMBOL=    X,             R,               I
##VAR_TYPE=  INDEPENDENT,   DEPENDENT,       DEPENDENT
##VAR_FORM=  AFFN,          ASDF,            ASDF
##VAR_DIM=   65536,         65536,           65536
##UNITS=     HZ,            ARBITRARY UNITS, ARBITRARY UNITS
##FACTOR=    0.456856943014862, 1,           1
##FIRST=     14782.0589164792, 0,            0
##LAST=      -15158.0608439998, 0,           0
##MIN=       -15158.0608439998, -1692737,    0
##MAX=       14782.0589164792, 322889223,    0
$$ Real data points
##PAGE= N=1
##DATA TABLE= (X++(R..R)), XYDATA
$$ [...]
41627a18893K4412l380l5366n44P8912Q7206L714m3448J1397N1310k0120r4975
41615e9775l4760Q5067Q9163j3233n7456k450K3056l8715q1697l1203L4834L0331
41603e6838r492k0777j9724l7953m2790k346M4961N7404N8190P0250N1958k7278
41591F5565j06305j08281n5482l0961n4791p0445l7017K7440Q4565J07096Q2072
41580i6544K7390m164K2371P4091Q5186L4049m0440q7685q6504n1556k0603k2132
41568a66541m2116m3974k7833k9400m4521j2909Q1143J48571J04809J436l5074
41557f6409J7715N1360o615q5880p9909M985P2753P3449M3959K2166o672n4894
41545a3992q1433m3205L0695O5520L3468k2575n5157n7695l8816j38M0960N0049
$$ y = [-118893, -94481, -97861, -133227, -133771, -54859, 32347, 36061, -7387, 4010, 55320, 35200, -59775, -94535, -9468, 79695, 66462, 9006, 6556, 29612, -9103, -90800, -122003, -87169, -56838, -66330, -87107, -106831, -144784, -187574, -189920, -144959, -87555, -29365, 40885, 92843, 65565, -40740, -149021, -204503, -235464, -290255, -360700, -397717, -370277, -285712, -178616, -96544, -69154, -73318, -50947, 23144, 108330, 142379, 101939, 14254, -72250, -123806, -144409, -166541, -208657, -252631, -280464, -309864, -354385, -367294, -286151, -137580, -32771, -31335, -66409, -48694, 2666, -3949, -89829, -169738, -164753, -92000, -18551, 25408, 47574, 40902, -13992, -95425, -138630, -107935, -42415, -8947, -31522, -86679, -144374, -183190, -183328, -142368, -92319]
41533i2319K3879J208r99j7577o5715r4606n7712N376K3061j528m349L9533R3863
41520a47885J20721J01464K5416p2372r6126k133J02028P8809l6483p9469k458
41509h488O5858L4089k6841l3562k5540n8905q1752k5261O5516R7456O1989J3001
41497G7560k4959m7068l6075j4017m2213r3084l4376J48916K42379P6501j85147
41486F8417k34740m4342J17528Q7203p76K4135J12160J08852n645j10558j09717
41475A2517j9684O9517P8355J1966m3555l4113j2356l4098m1164L6107J15860
41464A39352O6783n6219p1466K9637N6313o0212j41154n3436P8719R1410K7432
41453A07159K891j3137r7182j73840j22414R95M1987p070k2482L0392O6355M6098
$$ y = [-92319, -68440, -67232, -68231, -85808, -151523, -246129, -303841, -298465, -275404, -276932, -281281, -241748, -147885, -27164, 74300, 99716, 27344, -68782, -70915, 31113, 109922, 73439, -6030, -8488, 57370, 91459, 64618, 31056, 5516, -53389, -135141, -160402, -94886, 2570, 64559, 77560, 52601, 5533, -30542, -44559, -86772, -179856, -214232, -65316, 177063, 253564, 68417, -166323, -210665, -93137, -5934, -6710, 17425, 129585, 238437, 232792, 122234, 12517, -7167, 62350, 140705, 152671, 109116, 75003, 62647, 28549, -12615, 23492, 139352, 206135, 149916, 78450, 108087, 164400, 104188, -36966, -90402, -11683, 79727, 107159, 110050, 96913, -269, -174109, -296523, -295528, -253541, -260611, -283093, -252701, -186346, -140248]
41441a40248J3462j4341m7240l8156N3441J41657J12970J7834k315M6420L3256
41430A76740m5380m8344M9096R2815J4154m8768Q317Q0465M2523m7333p1747m6124
41418A56414m0784k9248K9737N7575k7855j32539r7629M8897J21024M3010o8865
41407E9737j01535p4747m4385q489L5870M5289K689l6149k3439J1361K0175J0790
41395a02833J2888J2884k1501p4289q9491m3463K4999O1832N4801L4414K7001
41384a02758K3027L981j1532J7138Q1763J08542M4693o4150j21549q9015j0025
41373a19885N8957R6900J03024P8647L3484j8945p4586j23216j28612o2102M3719
41362a12615J11309R5193J7134o9347j14116q0373K3373J11340Q2636m9310j38958
$$ y = [-140248, -126786, -141127, -188367, -226523, -173082, -31425, 81545, 99379, 97064, 143484, 176740, 131360, 83016, 132112, 224927, 239081, 190313, 198630, 279095, 321618, 274285, 202538, 156414, 115630, 86382, 116119, 173694, 145839, 13300, -84329, -35432, 85592, 128602, 59737, -41798, -116545, -160930, -169419, -133549, -88260, -85571, -121720, -145159, -133798, -113623, -102833, -89945, -77061, -98562, -172851, -262342, -305805, -280806, -218974, -164173, -129759, -102758, -79731, -75750, -87282, -70144, 11619, 120161, 164854, 100704, -20845, -109860, -119885, -60928, 35972, 138996, 217643, 251127, 232182, 157596, 34380, -94232, -156334, -112615, -1306, 93887, 111021, 41674, -72442, -152815, -129442, -18102, 64534, 15224, -123734]
41351a23734p2160Q2153J42921L3740j26274j63977m4555J05620J47296O7076
41341D8106l2028n3289k40M8769L9397n798l2587k7607k2979l9147n5352m5903
41329a78658j8457M907K4511N1228O9355M8630m049m1075l4399o859J3455L4888
41317c6523O8302Q0892K8444p2606j42400j15607p812R5700J13792M6788j7530
41306D1440r86O2512O9613K2m9156j9412Q253n0717j26718r3344K6772R0956N2069
41293A1304J197q136k6498o9242o4211K369L2215j4757l4575M0345J08688O7147
41281D5846j3699k0856N665k7274o6906p847Q2628M8612p1638p5782O7944J43887
41269A10580K2909j31643j14714K6400J00218N9816J9816M3902O9229L4313l5780
$$ y = [-123734, -195894, -113741, 29180, 62920, -63354, -227331, -271886, -166266, -18970, 48106, 16078, -37211, -37451, 11318, 50715, 44917, 12330, -15277, -38256, -77403, -132755, -178658, -197115, -192208, -167697, -116469, -47114, 1516, -2533, -43608, -78007, -84866, -71411, -36523, 31779, 112671, 141115, 68509, -73891, -189498, -197310, -101610, 12182, 58970, 41440, 40454, 102966, 172579, 172601, 123445, 104033, 112286, 61569, -65149, -158493, -131721, -40765, 11304, 12501, 4365, -22133, -91375, -155586, -153217, -121002, -135759, -170334, -129989, -21301, 45846, 32147, 11291, 16956, -10318, -77224, -85071, -2443, 46169, -25469, -101251, -33307, 110580, 133489, 1846, -112868, -86468, 13750, 73566, 93382, 137284, 206513, 240826, 205046]
41258B05046q6611r6421o6129n908N2521O9223L7203o275j4299K4660O7590N3791
41246B34391j3598m4580K5061J14203P5148r3595k08997j30342N3805J38764N1763
41235B02023r0369j42386p6730K4417O7281K9737k7105l1682J0239K7901j0577
41224a7251n5945n7959l1381r924Q596K8137K1348j5477k4606L2912R9996R3897
41212G2343K2962l3931l9526k0551M343M5015Q7348Q4599J7746p4181j33108j28590
41200i5531p3637j6939l289k0515j2688L2161N1179K90p0027q5107m7387o241
41188c47731K8663O9529Q5501M4423n885O996N6214M6057l3616q5438n3687L780
41176a85194K4069K5882M1764M8545K4939Q670K9590M2695K82n3013l8478K6174
$$ y = [205046, 118435, 22014, -44115, -50023, 2498, 71721, 108924, 102649, 88350, 113010, 180600, 234391, 220793, 176213, 201274, 315477, 390625, 297030, 88033, -42309, 11496, 150260, 202023, 111654, -30732, -107462, -83045, -15764, 13973, -13132, -44814, -34575, -6674, -17251, -73196, -131155, -162536, -172460, -163864, -135727, -114379, -129856, -154462, -121550, -21554, 72343, 95305, 61374, 21848, 1297, 5640, 50655, 138003, 222602, 240348, 166167, 33059, -95531, -169168, -186107, -189396, -209911, -222599, -190438, -139259, -138969, -208996, -294103, -341490, -347731, -319068, -249539, -164038, -119615, -125500, -118504, -62290, -16233, -49849, -135287, -188974, -185194, -161125, -135243, -93479, -44934, -19995, -11325, 18265, 60960, 61242, 8229, -30249, -4075]
41164d075L8216m2723j29871j19777j9710P2563Q8955M9728R818q659j1555K898
41152g4192L1357L3868k6469j04837j00345N809R8229P1056k3568m6861L5130
41141a00823J18758J16911N7220P068j8338l2620k7068K852J9438j3892o8264
41130F1242p4230j0411O4214P5924J9098m0203m5028j7150k3291p6838j13016
41119a79689p6670O802P4871R9651Q2417K5825l9039m6701J7213O7449K9197m3848
41107A7478m5379K6107Q1630Q2666O1213K4608l7985o9916o899P6236L2567j16871
41095A25455j72773m5143J07491J12676J1330n7253o4111n5026k1089M7485O6351
41084E5393k8909j35879j06198K8265R9240M5566l3629n9480o4021q5671r6123
$$ y = [-4075, 34141, -8582, -138453, -258230, -277940, -205377, -116422, -66694, -56876, -65535, -77090, -74192, -42835, -8967, -35436, -140273, -240618, -234809, -136580, -65524, -89092, -135953, -100823, 17935, 134846, 192066, 199134, 180796, 148176, 121108, 123960, 143398, 129506, 61242, -12988, -23399, 40815, 116739, 135837, 95634, 50606, 33456, 10165, -66673, -179689, -256359, -249557, -174686, -75035, 7382, 33207, -5832, -52533, -35320, 32129, 61326, 17478, -27901, -1794, 79836, 162502, 223715, 248323, 210338, 140422, 133523, 209759, 242326, 125455, -47318, -92461, 15030, 127706, 139036, 81783, 17672, -37354, -58443, -10958, 55393, 26484, -109395, -215593, -187328, -88088, -42522, -76151, -135631, -199652, -285323, -381446]
41073c81446n9969J8866J17703J88662J56058J5011r9634o0705O1591R3733K2874
41062G2744O79P3272R4446k6475j60725j50414l1587N1913N7341M3229L3738N516
41050F3677l0932m0447k8744k0123j243M1734O7906L8265q300j1558J1782O836
41038H8853j3038J0534O5213O7700j1270r7368j08873m8644J7652L5613K297m0024
41026c1355m7039k3972j6952l8736m4233j0721J1721j5825m1004K25O9553Q3960
41014a04378N1989M5544N8553J9177n6531o1838J6370M9462k9126j00570m3093
41003a54441O6682O5981m5347j09731m4790N8722Q4407K9449l4311n9545m8634
40992a91558l0945l5979n3369k6008O8245J48917J22060K3844j9367K4511N9160
$$ y = [-381446, -441415, -422549, -304846, -116184, 39874, 54885, -44749, -105454, -43863, 49870, 72744, 73423, 146695, 241141, 214666, 53941, -96473, -128060, -76147, -18806, 24423, 58161, 63677, 32745, -7702, -36446, -56569, -57812, -16078, 51828, 90093, 81793, 70235, 82017, 88853, 75815, 86349, 151562, 219262, 207992, 110624, 1751, -46893, -29241, 6372, 8669, -31355, -78394, -102366, -119318, -158054, -202287, -213008, -201287, -217112, -258116, -257891, -188338, -104378, -52389, -6845, 51708, 70885, 14354, -47484, -31114, 18348, -10778, -111348, -154441, -87759, -21778, -67125, -176856, -221646, -162924, -78517, -49068, -83379, -142924, -191558, -222503, -258482, -311851, -337859, -269614, -120697, 1363, 25207, 5840, 30351, 89511]
40981H9511L1477R903L4397J9943q5915j59718o0770J32128J99299P3330r4526
40970A89059j62657j47114j12436n6785K7007Q5850Q0359M6416K0473j7635o6137
40959a13600n6244L0494Q4300J3957r4092q7364K3374Q1957K3808m1404q804Q0934
40947f2684J29931J15061O9645R334n4281p9419m3154O618O274l8075o8020n5491
40935f4261k2407N551J9824J4399o445j1289K5980P6352P8158J7431m9168o5715
40923A8410m0713j9099j5888q308J6825M0444M1559K6560J5846J5683J5206P22
40911A07247l5580q5818j13396p3136K8155J09481R4440P768m9026k3305L0805
40900b365L5159j2438m7183j9362N5152J09396Q2326j5734r6538q7395k2446J1706
$$ y = [89511, 120988, 130891, 165288, 185231, 99316, -60402, -121172, 10956, 210255, 283585, 189059, 26402, -120712, -233148, -289933, -262926, -177076, -96717, -50301, -29828, -47463, -113600, -169844, -139350, -55050, -41093, -135185, -222549, -199175, -117218, -93410, -134814, -143618, -62684, 67247, 182308, 251953, 261287, 207006, 127587, 84433, 91051, 97325, 59250, -8770, -64261, -86668, -81117, -61293, -46894, -53339, -64628, -38648, 37704, 115862, 133293, 84125, 18410, -22303, -41402, -57290, -65598, -48773, -8329, 33230, 59790, 75636, 91319, 106525, 107247, 71667, -14151, -127547, -200683, -172528, -63047, 31393, 39161, -9865, -33170, -2365, 32794, 20356, -26827, -46189, 8963, 118359, 200685, 184951, 88413, 1018, -21428, -9722]
40888i722Q718L6508R4656R0950K818n7453j8061K6129k4505q9687l7578P5918
40876I8691P5366n5413j45483r7080j232M0432M5199M5198Q783n6842o2812J1973
40864i3220N3655o674o5895j6188P1151O6449k655j2307L8266L4507m4078q2348
40852e9337j8875N9802O2001K0235J2091K6606j2453j17325j95409j53338j6128
40841c92130Q9113Q1405K6326M0756J20223J45946P0780r327j5664p544n7590
40830I2294j04948n2752N7187J01495O5516L8623M1373K447q5023j24892p1232
40819c9912j27J7844J1606K4187K9820J02k7284j5569j190k8963o3780l8798L6418
40806i5646P9973M1049m4885j01774q7612k6375K3281L5526M4213Q1378J09388
$$ y = [-9722, -1004, 35504, 130160, 221110, 223928, 166475, 148414, 174543, 150038, 60351, 22773, 98691, 174057, 118644, -26839, -123919, -125151, -84719, -39520, 5678, 14461, -42381, -105193, -93220, -39565, -46239, -112134, -128322, -57171, 9278, 6623, -5684, 32582, 67089, 23011, -59337, -78212, -18410, 43591, 63826, 75917, 102523, 90070, -27255, -222664, -376002, -392130, -303017, -221612, -195286, -154530, -34307, 111639, 182419, 173092, 157428, 149884, 92294, -12654, -65406, -8219, 93276, 158792, 197415, 238788, 241235, 156212, 31320, -39912, -40039, -22195, -10589, 13598, 43418, 43520, 16236, 667, -523, -29486, -93266, -132064, -95646, -15673, 25376, -19509, -121283, -208895, -235270, -211989, -176463, -132250, -50872, 58516]
40795E8516O4307l8214j01123o6705J1945M4283P767m4059n0261j272N3658N7194
40783c964J8714J4508P7122J21402M9924r1821j55235q3304K4749N7846J3829
40772D3770m8023q8075q4541l0492K8209K5383k1011j8302M9656P6042n151j02670
40760a75205r6213k577P5826J00540R6567N9062k8104j12394j18368n9946j4261
40749b75073K211L6133Q5580R0858M8836L4343P4062Q9356J8381p4959q2381k211
40737D5136N8835K4891o2302j06409p0790p250J5593j1820m1198k6633K9530P9698
40725g2719O7294k1254j18976j18746P404J49255J72098P5305k5980o2986p0032
40714a9337p7091n3827J261J8813l0133o5711j4516P8198J22338R9776L8587m9185
$$ y = [58516, 122823, 84609, -16514, -83219, -71274, -26991, -19224, -63283, -113544, -114816, -61158, -3964, 14750, 29258, 106380, 227782, 277706, 185885, 30650, -52654, -27905, 29941, 43770, -4253, -92328, -176869, -207361, -179152, -153769, -174780, -193082, -143426, -67384, -72535, -175205, -271418, -273995, -198169, -97629, -1062, 58000, 29896, -82498, -200866, -260812, -275073, -272862, -236729, -151149, -60291, -11455, 22888, 96950, 186306, 204687, 129728, 47347, 45136, 103971, 128862, 66560, -39849, -110639, -117889, -102296, -114116, -155314, -181947, -152417, -72719, -5425, -26679, -145655, -264401, -256997, -107742, 64356, 139661, 113681, 50695, -19337, -96428, -150255, -148994, -130181, -160314, -226025, -240541, -162343, -40005, 59771, 98358, 49173]
40702D9173j22103r0787M7458J37642O0453p4421p9158K5279N3445l6758q1804
40691a11581R898J07244O4560o7594j39263j02388k1353L7685M6538Q161k5029
40680a93122J2936R7238J14901K1759q2369r3012l4774R294J9899J6397j2117
40669a22970o1455o5730P595P3039L7741n0145o7803L451P1329P9279N4040K2192
40657a9437j4059k2183L3109J00185Q2512j0620n7581k801N6325J5928q2523j19259
40645d0404o2140Q898J9110k2418n9535o2016n0510o1212r0236q5167j2351Q0271
40633d37710J07666N4681o619j5379R320J5806r994m8149p8465p9800k9885N9740
40621d58788J32719J40754Q9658J8717l3928l2668L7125J20248J16859Q903q7084
$$ y = [49173, -72930, -163717, -116259, 21383, 81836, 7415, -71743, -46464, 6981, -29777, -111581, -101683, 5561, 70121, 2527, -136736, -239124, -260477, -222792, -176254, -168093, -193122, -180186, -82948, 31953, 53712, -28657, -121669, -156443, -147149, -127250, -110853, -122970, -184425, -250155, -242560, -169521, -131780, -181925, -249728, -246277, -174948, -95669, -41629, -19437, -33496, -55679, -22570, 77615, 160127, 149507, 91926, 89125, 145450, 161378, 78855, -40404, -102544, -93646, -74536, -96954, -156489, -218505, -269015, -330227, -420463, -505630, -517981, -437710, -330044, -275363, -281982, -297361, -288041, -272235, -282229, -330378, -408843, -488643, -518528, -458788, -326069, -185315, -95657, -76940, -110868, -143536, -106411, 13837, 130696, 139599, 52515]
40610E2515n9471M8132J06571Q5833O6005P7449N7132p156j8163O9204J33579
40599F11630M5899j24631j89485r6694J9065M4435K0793L2617P2738Q8836Q6131
40588F11334R9628J08281O0003l1820q5602n1658K8469O9981K6982p0638j42488
40577F22472j28488n1161O039n180m7391n7400k2831K5064N8897O4067L5191k972
40565D96307q505J0675p302p2236r6210k2783O2771M9497k6114m4182l104j0914
40553C27900p8381q2084K4422J14840Q1950n827l6328k7729n3000q1995l6522
40542A47246N1891P6749K5304j1846O532K3974n3k9658k7387o479J5224M3006
40530C14503O5220M9064q59l4299k6867j3529l3421p9182j10670q8974n209Q8170
$$ y = [52515, -6956, 41176, 147747, 233580, 299585, 377034, 434166, 427010, 408847, 478051, 611630, 657529, 532898, 343413, 246719, 265784, 310219, 331012, 363629, 436367, 525203, 611334, 710962, 819243, 879246, 847426, 761824, 710166, 738635, 808616, 835598, 764960, 622472, 493984, 442823, 448862, 443682, 396291, 338891, 316060, 341124, 400021, 464088, 499279, 496307, 487802, 498477, 491175, 418939, 322729, 299946, 362717, 412214, 386100, 341918, 338814, 327900, 249519, 167435, 191857, 306697, 388647, 382820, 346492, 318763, 265763, 183768, 147246, 199137, 275886, 301190, 289344, 295876, 319850, 319797, 290139, 262752, 256273, 271497, 314503, 379723, 428787, 427928, 393629, 366762, 353233, 319812, 240630, 129960, 40986, 35777, 123947]
40518A23947R9074L048r9046j01604m2328l4571p5899n3869M7440R4689J7452
40507b1667o4420k4170P2735P9768J467l0848K0961N3901L828n6547m1143K6004
40495A9869O6051N6002K7950L153j9371l2151k1491M991J7669p408o2445j00990
40483d8171o8331L3343J18091R6629j0835q6486n6126K5517N8519K5179j0887
40472G6442p128J1124N689j9229l5142l4724l4656m1455l5606J431N2041P2243
40460A1030M6842J7504K8202N2099J7762q0481j49401j10365m303O7762P5186
40449b8163O1605M2785q230o8254n7273L3075R5166N7377J194L3562J05858Q2781
40437C51483l7357j08794n6624K4436L4895J0779K2916M1659O471m5120l5434
$$ y = [123947, 223021, 226069, 127023, 25419, -16909, -51480, -127379, -181248, -133808, -39119, -21667, -86087, -110257, -37522, 42246, 43713, 12865, 33826, 87727, 91555, 35008, -6135, 19869, 85920, 141922, 169872, 173025, 153654, 121503, 100012, 105003, 122672, 115264, 52819, -48171, -116502, -83159, 34932, 131561, 120726, 34240, -21886, 3631, 62150, 87329, 76442, 69314, 80438, 86127, 66898, 31756, -2968, -37624, -79079, -114685, -113254, -61213, 11030, 57872, 75376, 103578, 155677, 173439, 92958, -56443, -166808, -171111, -103349, -28163, 33442, 76227, 67997, -257, -57530, -24455, 70711, 128088, 129282, 162844, 268702, 351483, 314126, 205332, 148708, 173144, 208039, 218818, 241734, 283393, 289864, 244744, 209310]
40426B09310J3489J7544j8262j1250M0032L8578m0921q7622k1272P7256Q3284
40415C00166K494o2009o5751n0242m0583j2349L6271O1296M2634J4394K259j4510
40403B14070m8899o2565j7969N7366R9981Q4290L2616k6894p0241o3734L357P2333
40391B73711O1155k5204q6956o2240j0063j2628n1061n2196j6502l429j0818J7451
40379B1220N9226J9195r2051j18335J4769J51016J09491m7248j05924j4711O8346
40368F4994L5510l2578l0953J6569M1274M8894O9949P9278M8277R469l087j5419
40356C32177n1889p8340p0863o7900q2254m3741P6367J62749R8841m4233r4848
40345A36066k3647L9735K0431j5969r064L888j1621j2857K8717N4857J1563n6622
$$ y = [209310, 222799, 240343, 222081, 210831, 250863, 289441, 248520, 160898, 139626, 216882, 300166, 302660, 240651, 174900, 124658, 84075, 71726, 107997, 169293, 211927, 226321, 228580, 214070, 165171, 102606, 84637, 142003, 241984, 326274, 358890, 331996, 261755, 198021, 201378, 273711, 334866, 309662, 222706, 160466, 150403, 137775, 86714, 34518, 18016, 14587, 3769, 21220, 80446, 99641, 7590, -110745, -95976, 55040, 164531, 117283, 11359, -3352, 64994, 100504, 67926, 36973, 53542, 94816, 143710, 213659, 292937, 341214, 350683, 347596, 332177, 280288, 201948, 131085, 63185, -19069, -62810, 13557, 176306, 275147, 230914, 136066, 112419, 152154, 172585, 156616, 147552, 151440, 139819, 126962, 155679, 210536, 222099, 165477]
40333A65477p2691l6022l052J434k064L480J1855O363k6214o9920o9646M282Q6202
40320e16Q4833K7732L5247J19952J32760j4441j83611j85748m3926N4605K5839
40309E2726l4326l1924M953J4684j886j5881j7165O207O0596R6280M6853n4952
40297A26165r1760k9707K3298j8590r3918j07811p8366o7758m5293N0789J60691
40286a72260J57350M8185j7613K8932P7235J7697q9606j13379m0818K8138L2047
40275d4092l5k8803n0931o1224l8352J3023N3269N7899M2611K8311J4090k621
40263a6855p217J3850M9984P0118M4177k9774j05994j15640l8663O0134R6654
40252B0774N8405j340m1694n9161m8000n17M6313L1998l4315o3651p986O3851
$$ y = [165477, 92786, 56764, 53712, 55146, 53082, 56562, 68417, 74780, 48566, -21354, -91000, -86718, -516, 84317, 112049, 147296, 267248, 400008, 385567, 201956, 16208, -27718, 26887, 52726, 18400, -13524, -8571, 6113, 4227, -11654, -28819, -22612, 37984, 134264, 181117, 126165, 34405, 4698, 27996, 9406, -84512, -192323, -270689, -338447, -383740, -332951, -172260, -14910, 33275, 15662, 44594, 121829, 139526, 49920, -63459, -104277, -76139, -44092, -44127, -72930, -123861, -185085, -223437, -210414, -157145, -99246, -56635, -28324, -14234, -16855, -24072, -10222, 39762, 109880, 154057, 124283, 18289, -97351, -136014, -75880, 20774, 79179, 77839, 36145, -23016, -71016, -71533, -25220, 6778, -27537, -91188, -99174, -35323]
40240c5323O0650o443n2621l9773l815J9207K8695K5778N243j2637L610L8572
40228C1143L5712k0480p2766o6674j9354J8372L7603O6540J03034R8504K5826
40217B37460o4228q7547l0505K0498j9269j16235j46748m9648R4130J60445J20539
40206A18892M2765q383k1748r854J0273J0555k2774n7630n3746k3817p744K03
40194b3008L1714N9514J7506p7831j15209l9015O5320R0365M3989M786J70M407
40182F2708J3492L9220N4089K1362l1833m2263m784K5517J8559o856l7119p2674
40170C9418q4260l5457L9828N6033m316n6974l3148L1080O0782M2246R825k2838
40158D2219o4161j02305j09177p6671k1511K8361L2803m0834j63330k41796k18028
$$ y = [-35323, 25327, 18884, -33737, -73510, -77325, -58118, -29423, -3645, 1598, -11039, -7429, 31143, 66855, 46375, -26391, -93065, -112419, -94047, -56444, 10096, 113130, 211634, 237460, 173232, 85685, 55180, 75678, 56409, -59826, -206574, -256222, -162092, -1647, 118892, 161657, 153274, 131526, 121672, 131945, 142500, 119726, 62096, 8350, -15467, -23211, -23008, 8706, 68220, 85726, 7895, -107314, -146329, -81009, 9356, 53345, 58131, 58301, 62708, 76200, 115420, 169509, 190871, 159038, 116775, 111991, 137508, 156067, 149211, 112092, 39418, -44842, -80299, -40471, 15562, 11246, -45728, -78876, -47796, 12986, 55232, 65057, 42219, -21942, -124247, -233424, -310095, -331606, -303245, -270442, -311276, -474606, -716402, -934430]
40147i34430j46325j23232j53575j43882l5121J10668J82336J45672O6709K5162
40137a006018L7034O5728Q0951Q2076P4151N5704L9639M9844P2217M8418l5537
40126d35793r1322l2821Q1041J05055J9002l1451M5088J34461Q2860o5157j21506
40115c10543j6704J17781J36802M6137m6900o4056m014P6477J00417M0985l1014
40104D5368k6163L1546K8367o4934j33223p9919L1543P0467J4584m6193m5385
40093a73942k310L3853L4897n694o7006r5241m8643M6811J14204R7596N931r3613
40081a53157j13292j5886J22919J65565O5934o8317j09065n6052K863K6578L5662
40070i6248L0496r174n4568m9314l952J3195j2381j8635K8564Q2028Q6470M3654
$$ y = [-934430, -1080755, -1203987, -1357562, -1501444, -1536565, -1425897, -1243561, -1097889, -1031180, -1006018, -968984, -903256, -822305, -740229, -666078, -610374, -570735, -520891, -448674, -400256, -435793, -527115, -559936, -478895, -373840, -354838, -386289, -341201, -206740, -123880, -189037, -310543, -327247, -209466, -72664, -26527, -73427, -137483, -141497, -65020, 35397, 76382, 45368, 19205, 50751, 79118, 14184, -119039, -198958, -167415, -96948, -82364, -128557, -173942, -176252, -142399, -107502, -113196, -180202, -275443, -324086, -277275, -163071, -65475, -59544, -153157, -266449, -282335, -159416, 6149, 72083, 3766, -105299, -161351, -158488, -131910, -96248, -65752, -74926, -129494, -178808, -182760, -169565, -181946, -200581, -172017, -89989, -3519, 40135]
40058D0135j2250m8432l6161K0293N8604K9641j6582q67M4214J8256o2788p0531
40046c6468J4360M2731o4018j66419j15166J9906P0755K2690r874J2230L4085
40035a75188M7301R0245J30606R7323J7525j9324j9532n8982j11718p3996L1083
40024d4657N4516l3426q0926o289O5233J8336n9677l5916M8228O2550j687n2874
40012f6589n9057m9195j4411N7832J02107O0295K341K7184Q6996N6847n2543j09010
40000D2797p0431k0498K926M0958O1418l1693j80838j66688P1855K81794K11535
39989B43135m6734j97163j29238J1353Q1271P8835L6293m5162j17417r2284J7237
39978a59874Q1662L9248j4130J2156N7147K2665n0093m4781K9118L5355p5946
$$ y = [40135, 27885, -20547, -56708, -36415, 22189, 51830, 35248, 34381, 78595, 96851, 34063, -36468, -22108, 20623, -43395, -209814, -324980, -305074, -234319, -211629, -221503, -209273, -175188, -127887, -37642, 92964, 190287, 207812, 188488, 168956, 109974, -1744, -75740, -44657, 9859, -23567, -104493, -110782, -45549, -27213, -86890, -122806, -74578, -12028, -13715, -66589, -125646, -174841, -189252, -131420, -29313, 30982, 33323, 60507, 147503, 204350, 151807, 42797, -27634, -48132, -45206, -4248, 57170, 25477, -155361, -322049, -250194, 31600, 243135, 196401, -762, -130000, -118647, -37376, 41459, 77752, 32590, -84827, -177111, -159874, -78212, -38964, -53094, -40938, 16209, 38874, -11219, -56000, -26882, 8473, -67473]
39967f7473j73817j23359K4566J04162N7137p319J7595Q9885R5602K1275l1909
39956F345j875M8680L5489k5338o0082n5352n3211n2111o461O9132R0127L0810
39944B6153k1776M297N7934N2782n03l2887l7542n5035p2042m3694k774k7930
39932a53017r4088q0786L0810R5538J5736r5045p1508N6708J10879K2971q4095
39921b45897q4682j970O7832R1246R7037R5874O5343J08o3825p9955l9539R214
39909h9214M394n0458p6175k1939N0799M7629j6133l2732L4641R4853O9032P351
39897B2048M661N4576O1995j7569j12628j16297k585J42268J97066J23742O543
39886C63820m7386l2676k5802n2337n1304Q759O1358M0727j7746m0078k4872k1522
$$ y = [-67473, -241290, -364649, -340083, -235921, -178784, -186103, -168508, -78623, 16979, 38254, 6345, 4470, 53150, 88639, 63301, 3219, -52133, -105344, -157455, -163916, -94784, -4657, 26153, 4377, 8674, 66608, 119390, 118887, 86000, 48458, -6577, -78619, -122313, -125087, -153017, -247105, -327891, -297081, -201543, -185807, -280852, -352360, -295652, -184773, -161802, -245897, -330579, -332549, -264717, -173471, -76434, 19440, 84783, 84891, 21066, -58889, -98428, -89214, -84820, -135278, -211453, -233392, -182593, -134964, -151097, -183829, -149188, -54335, 14697, 22048, 26709, 81285, 143280, 125711, 13083, -103214, -105799, 36469, 233535, 357277, 363820, 316434, 283758, 257956, 205619, 154315, 163074, 224432, 265159, 247413, 207335, 182463, 160941]
39874A60941l5600k9600L693L4296M7705N0475L9822J5943K442Q567K117l1565
39862B69236m6481j1565K1051p46l1739j0728J6244k2229o4829P64J18400J12129
39850C49507k4861r2716n958N6566m6437j60095p4057J21881J65586K8551o8004
39839B49963l0029j4042j13447j76605p4334N7837L2708p9765p3157N1794R6858
39828g2219n27p3499q736Q3610P6612K6647L2652L9352m4307j28086m9355J35218
39816A7362J82719J9236j38939j01933L3451O8208k04l3899j0840k6849q1455
39805g3143o4984K5301M7899m3369r6177N84J19435P9891o8590j16982o320J01703
39793i4752P4129k2491n4320q084L4624L8316M0055O4849Q8008P7533K6187n2893
$$ y = [160941, 125341, 95741, 99434, 133730, 181435, 231910, 271732, 287675, 290117, 298684, 300801, 269236, 222755, 211190, 232241, 231495, 199756, 189028, 205272, 183043, 118214, 118978, 237378, 349507, 324646, 231930, 225972, 282538, 236101, 76006, 1949, 123830, 289416, 317967, 249963, 219934, 205892, 92445, -84160, -158494, -100657, -67949, -147714, -220871, -169077, -72219, -72746, -146245, -154981, -71371, 5241, 31888, 64540, 103892, 59585, -68501, -117856, 17362, 200081, 219317, 80378, -21555, 11896, 80104, 79900, 46001, 35161, 8312, -73143, -138127, -112826, -64927, -108296, -204473, -203889, -84454, -4563, -73153, -190135, -196455, -94752, -20623, -43114, -97434, -105518, -70894, -32578, 7477, 72326, 160334, 237867, 264054, 211161]
39781B11161j23149j27814m3033P2755J27717R9747M5541L851m5261r9891r3864
39770B7760k278P3336K5400q7852j09953k1834K6904m0061r5657j2218J26785
39759h9668J50298N3597k1318j3584N286m448O650M7712M3307l4726j08793j16743
39747h2430q6352m8109J3953P6901O4280k0195o2721j5199K3756q298j0680R6746
39735e8348J89076J05513q3290j63203q6421q715l1533q4893q2650l3632L4259
39724c03837J19035J77071J40936M3247P1L6928N9522L1355L1349P8091O0401
39713D74169n7315j14172J9184K08909K22935N6406p8837n6923L6415Q3535Q4873
39702H79179Q5786P4409K0192n4807r6461p3519N651Q8155Q9204k5105j59736
$$ y = [211161, 88012, -39802, -82835, -10080, 117637, 217384, 262925, 266776, 221515, 121624, 27760, 25482, 98818, 124218, 36366, -73587, -95421, -68517, -108578, -204235, -216453, -89668, 60630, 114227, 92909, 79325, 84611, 80163, 86813, 134525, 177832, 143106, 34313, -82430, -168782, -216891, -202938, -126037, -61757, -81952, -144673, -159872, -136116, -144414, -155094, -58348, 130728, 236241, 152951, -10252, -96673, -105388, -136921, -221814, -304464, -338096, -303837, -184802, -7731, 133205, 176452, 176523, 213451, 272973, 304328, 335677, 413768, 474169, 416854, 302682, 321866, 530775, 753710, 810116, 731279, 674356, 710771, 794306, 879179, 964965, 1039374, 1059566, 1004759, 908298, 834779, 840430, 928585, 1017789, 992684, 832948]
39691H32948j70525m4775P3942P6641K4622L4133R6257J02767J7292p5424r2445
39680H75433m5414N462K2665p277q0119j44063j19892l660R2752O4714n0376j25744
39668D84481j09250n8268k3943L740K1253j4078q5859r0088J5305J07852N0583
39657C01728j02171j63746o5050O7211R4436K5173m4384o2451m1792q374J4564
39646A5144N339l0439n2494k9091K8445Q1816R3378M2181n0499j15814j02105
39635a14139m2686j1938k1736k0357J2718M3011N2773N7822M5652j6710r6977
39624a12567j11179m8479J0031K3770L9646P2117N7642j2837m2102J0626M0812
39613g2520k3111p7272j2694Q5595P4890q85N882P9216O5814m8700j03265k6654
$$ y = [832948, 662423, 617648, 691590, 768231, 792853, 826986, 923243, 1026010, 1043302, 967878, 875433, 830019, 835481, 858146, 850869, 770750, 626687, 506795, 503135, 595887, 660601, 610225, 484481, 375231, 316963, 293020, 296760, 318013, 303935, 218076, 127988, 143293, 251145, 301728, 199557, 35811, -29239, 37972, 132408, 157581, 113197, 50746, 8954, 580, 15144, 20483, -9956, -62450, -91541, -63096, 18720, 112098, 154279, 103780, -12034, -114139, -156825, -168763, -190499, -210856, -198138, -155127, -102354, -44532, 1120, -15590, -112567, -223746, -272225, -262194, -238424, -198778, -126661, -69019, -81856, -123958, -113332, -72520, -95631, -172903, -185597, -100002, -25112, -25997, -20115, 59101, 124915, 76215, -27050, -53704]
39601e3704N9522N7067K7032L2731J7760n5252r2997k5868M4738n142j12003j11451
39589b17567J3260J11960Q5571M23l2161L491M1386L0676j6692n3094n2353l7590
39577a22690m1699m8124r760O9160J21295J04013M7957j843l5500m5288j1932
39566B5589L8716L6744k4089n0963J3286R0026P7110j324m9761n5903q3678j37562
39554a21809j42054o0098N2448J18661J04533K1901o6204o4221N0745J59767J29479
39543A83148m533q6436o6294m9287r6068j16743l6446N7934M7193l1401n1386
39532b50319j20K1381j4194j1294Q0595J67941J47101N2804p946j3640k7054o4529
39520H0726p0450l0945j0599l1779j3322Q8013J54157N0673j41918j96080n4072
$$ y = [-53704, 5818, 62885, 89917, 122648, 140408, 85156, -7841, -33709, 11029, 5887, -106116, -217567, -204307, -92347, -6776, -6353, -38514, -35023, 6363, 37039, 20347, -32747, -85100, -122690, -164389, -212513, -222273, -153113, -31818, 72195, 120152, 118309, 82809, 37521, 25589, 64305, 101049, 76960, 25997, 39283, 129309, 206419, 205095, 155334, 99431, 15753, -121809, -263863, -323961, -271513, -152852, -48319, -26418, -92622, -156843, -106098, 53669, 183148, 178615, 92179, 25885, -23402, -119470, -236213, -272659, -214725, -167532, -198933, -250319, -250439, -229058, -243252, -254546, -173951, -6010, 141091, 193895, 185949, 172309, 145255, 80726, 10276, -20669, -31268, -63047, -76369, 11644, 165801, 216474, 74556, -121524, -175596]
39509a75596Q2940N2687l6475k858J04701R0025o2074j52167p5314L2952K8299
39498a12880l1984j8270N9498R9588Q3738P1090O5439J6231o4874r8572n2410
39487A6594K2350O9028P0891K7528m0447p2065k8104L5072L5124k311K0175R6760
39475B50595J01075j2835j11820p0769L5858M3481n8598j20486n5874M9106P7102
39464A26835K9509j5980k5008j8952j0581P095K3611J6198r698k4048j6344l832
39452G8805L312J2596K3551K5159K5124M6089P8318P1646L99r0031j30566j03245
39440D1157m2178J7200N3811M5755j1251p2683p8819k8064K0431K3048q261m6191
39428h6045p8117q1165k4673O7791J09933N6950j9078j5831O2031J15528R0955
$$ y = [-175596, -92656, -39969, -76444, -79302, 25399, 115424, 53350, -98817, -174131, -141179, -112880, -144864, -163134, -103636, -4048, 79690, 150780, 216219, 232450, 167576, 69004, 16594, 38944, 107972, 178863, 206391, 165944, 93879, 65775, 100847, 135971, 133660, 153835, 250595, 351670, 338835, 227015, 156246, 192104, 235585, 176987, 56501, 627, 49733, 126835, 156344, 140364, 115356, 96404, 85823, 92918, 116529, 132727, 123029, 98981, 82637, 78805, 82117, 94713, 118264, 143423, 168547, 214636, 292954, 364600, 364999, 274968, 144402, 41157, -1021, 16179, 69990, 115745, 104494, 31811, -47008, -75072, -54641, -31593, -39854, -86045, -164162, -245327, -270000, -202209, -92276, -35326, -54404, -70235, -8204, 107324, 198279]
39417A98279M0219L0725N2621M6744p684o5161o6296n497N4783M7777j2277l5060
39405B79173K8618J04765Q2342l4616j25778j10960m2206j3109l3795m3533j2925
39394G7976K1877K2634M338Q824L8418M2061j4369p9271o5176J9478N4081k6611
39382A04260j15110p5945M0857O4916k7815p4618R020R2861N5682j0308L0714
39371I4514J04831M1761j20468j61987j8543J13210P0295n2271p5105K421M3949
39360D2607p34m7899k5891L8738Q1213P1140J9167m0463o9796n8058k9033o020
39348b5029R435J6558J0194P554L2784O0859L6630k8303m9593L096N2153L6612
39336A62950O366J9438L0841j6154o2965k5289M4277K6153o2190q5984j5493L1991
$$ y = [198279, 238498, 269223, 321844, 368588, 360904, 295743, 229447, 223950, 278733, 326510, 314233, 279173, 307791, 412556, 494898, 460282, 334504, 223544, 181338, 168229, 134434, 90901, 77976, 99853, 122487, 126825, 135649, 174067, 216128, 201759, 122488, 57312, 76790, 130871, 104260, -10850, -86795, -45938, 18978, -8837, -83455, -74435, 18426, 74108, 63800, 94514, 199345, 241106, 120638, -41349, -59892, 53318, 123613, 71342, -3763, -1342, 42607, 41873, -6026, -31917, 6821, 88034, 159174, 178341, 137878, 68082, 10024, -19009, -25029, -15594, 964, 11158, 18712, 51496, 112355, 148985, 120682, 71089, 74185, 126338, 162950, 169316, 188754, 219595, 203441, 140476, 115187, 159464, 185617, 123427, 37443, 21950, 53941]
39324E3941O64j6267L7877O4157k2340j30432j28066m4373K864J1476O9356J57825
39312E6682J47445R592j13578j05388k6705j502m0654o5321m3841j0673K1303
39301a72640P4770J33669J34331N5756l6932p0678m7104j6743n097k548k558m455
39289C9771Q863M9251Q4552P1618K8934J7633L8061J6351p0477j30990q7139k986
39277F3442N368n3569o9274j2239K5908q802n0401l2970J0248K6983L4550N9303
39265a453O9204M4312L7439P5235P3391l7852j62562j45499M67J09376R7962M8740
39253B08760M1445M1095L072l4156l2979l2348o0290n8620J4781Q2439M9588m2449
39241A80338p5566l6154k0573o4106q2348j5022P1610Q5899M4210K9499N4966
$$ y = [53941, 54605, 38338, 76215, 140372, 118032, -12400, -140466, -184839, -181975, -170499, -101143, 56682, 204127, 213719, 100141, -5247, -31952, -33454, -74108, -139429, -183270, -193943, -172640, -97870, 35799, 170130, 225886, 188954, 118276, 71172, 54429, 49332, 46784, 44226, 39771, 48634, 97885, 182437, 254055, 282989, 300622, 338683, 355034, 284557, 153567, 66428, 63442, 68810, 15241, -54033, -66272, -40364, -49166, -99567, -132537, -122289, -95306, -60756, -1453, 67751, 112063, 149502, 224737, 298128, 260276, 97714, -47785, -47318, 62058, 160020, 208760, 250205, 291300, 294372, 260216, 227237, 194889, 134599, 75979, 90760, 173199, 222787, 180338, 104772, 68618, 48045, -16061, -98409, -113431, -41821, 44078, 88288, 117787, 172753]
39230A72753M8142k9567j12964j11439k1563P3273J01116O5829J5122j9018l0000
39219A51684j5716J7738M1078K4258k2705n4952m2803o7L4008K3674m0136j18076
39207b015j37536o6665L6799R1264R0844Q6124Q4184M7874p237j3994K4030J6913
39195B50585n5862q4183k193Q1691M5487m3383l3103O2117Q7698P452m5234l261
39183B67811K4553m6095j20103p9432K4445O2768K9764J5752L4670J8201l8047
39172A94287n5187j0032J9640j7484o3035m0817K9907O4349K4130m0613n3355
39161E1790Q03N1331J9883p1227j04859j5806J08927J33364M5497m4965o4031
39150A10707m3947l2933k1750J0420M6896O7701Q0228Q4858N8649J584m7530o5745
$$ y = [172753, 220895, 191328, 78364, -33075, -54638, 18635, 119751, 185580, 200702, 181684, 151684, 135968, 153706, 194784, 219042, 196337, 141385, 98582, 98515, 132523, 156197, 116061, -2015, -139551, -206216, -169417, -78153, 12691, 98815, 182999, 230873, 223636, 209642, 233672, 250585, 194723, 110540, 108347, 190038, 235525, 192142, 159039, 221156, 308854, 316306, 271072, 267811, 292364, 246269, 126166, 46734, 71179, 133947, 163711, 179463, 214133, 232334, 194287, 139100, 129068, 148708, 131224, 68189, 27372, 57279, 121628, 145758, 105145, 51790, 52593, 103924, 123807, 52580, -52279, -68085, 40842, 174206, 219703, 174738, 110707, 66760, 33827, 12077, 22497, 69393, 137094, 217322, 302180, 360829, 362413, 314883, 249138]
39138B49138o8363n8034j2134N2495P0154K1086l0089l4925k9017m5428m0032
39127G4851J8525N9117J1271n9122l5488O3688J10939O6098J5998J4030J4828
39116C54735k877J7776Q5403R9026o256j44466j93116j46891p7019j2060M7571
39105B1826O0855J260n8498k4389P5059J19930O3004k7897q2521q9866m8700M4371
39093E4434J38502J49676P0556j0549k7336p291l144j9980l7436m1524j1217N9785
39081C14476J08751N4625o5193j03228j489J10653R3566j4713q2693p9302o4603
39070B70850m5886J5076P5222L8916p3852j23265m8519N1317Q2017P9312J00109
39059D21297J02301L4510l9993k8124L7144M7771N43N68Q0200J34606P8625k7070
$$ y = [249138, 180775, 122741, 110607, 163102, 233256, 254342, 224253, 189328, 160311, 114883, 74851, 93376, 152493, 163764, 104642, 69154, 132842, 243781, 309879, 325877, 339907, 354735, 351858, 369634, 455037, 554063, 547807, 403341, 210225, 63334, -13685, -25745, 21826, 82681, 83941, 25443, 1054, 76113, 196043, 259047, 231150, 148629, 58763, 10063, 54434, 192936, 342612, 413168, 402619, 375283, 367992, 364848, 344868, 307432, 265908, 254691, 314476, 423227, 477852, 412659, 309431, 307942, 418595, 512161, 497448, 414755, 335453, 270850, 224964, 240040, 315262, 354178, 280326, 157061, 108542, 159859, 241876, 321188, 421297, 523598, 558108, 518115, 489991, 527135, 574906, 575449, 576017, 656217, 790823, 869448, 842378]
39047H42378o6981k2680L0791L7369M017m3516q5581r4278n1215Q421J5036m8910
39035E24851j14532j08596m7253r845k9375n6228m2305j2755j5604l4054q829
39024D5475N7677Q3489J7048q3760j20947p3921o000K7652L2864L8490M6712M1079
39012A05858K6132L4144Q1095J23452Q8398l0630j35824j30035m5844m968m7270
39001F4508q0979k9791N7475R7814R2713Q1768N3295m270k8142K6723P4507J1161
38989D16782r8071r9457l805K1256o3996q8978M3479J70740J03279q9387j84090
38978A27752j10660L260M5079K7215J224j2722o996J3924K0744J0298L2681R7141
38966B48940J11746J4923r5303q7721j575K0718l3084m5194R395K1022m6213q0129
$$ y = [842378, 775397, 752717, 783508, 820877, 824894, 781378, 695797, 601519, 550304, 558725, 573761, 524851, 410319, 301723, 254470, 244625, 215250, 159022, 116717, 103962, 88358, 54304, 45475, 103152, 186641, 203689, 119929, -1018, -74939, -80939, -53287, -20423, 18067, 64779, 105858, 131990, 166134, 247229, 370681, 459079, 428449, 292625, 162590, 116746, 111778, 64508, -16471, -46262, 11213, 109027, 201740, 283508, 336803, 332533, 304391, 331114, 405621, 416782, 318711, 219254, 215449, 236705, 172709, 83731, 127210, 297950, 401229, 311842, 127752, 17092, 20352, 65431, 92646, 93870, 81148, 74152, 88076, 108820, 119118, 151799, 248940, 360686, 375609, 280306, 192585, 191010, 211728, 178644, 133450, 142845, 163867, 117654, 37525]
38954C7525j7279M1872n02q8011j16982q4447l6922K8623J13774J54298J08475
38943A40424M1038K4178J9246m4106j26256j21705j5956R2962J15624M7516n4167
38932A18798j13232p9870J6681Q7484Q9157O4921N2671K3523m0294q3709n9996
38921G6134n435K9378M9587N6503Q932p8877j00132j2474O9387M9117O517M2010
38909A90647P9883Q418q3832l7488P5282L6680j38439j85454p006J57301R7077
38898A93069o0211p2365N8573J39708Q8032p016o2574q2428q0285m9491n776K5092
38886H4328M8852O9771N0818k5938r5055p4410K7441J24820J47855Q0688m7564
38875C91606j60739j72328p8878K4466O5332P5946J06078J23391P2743k0849q6603
$$ y = [37525, 20246, 62118, 61616, -26395, -143377, -227824, -264746, -236123, -122349, 31949, 140424, 181462, 205640, 224886, 180780, 54524, -67181, -83137, 9825, 125449, 172965, 118798, 5566, -74304, -57623, 29861, 119018, 183939, 236610, 260133, 219839, 136130, 76134, 70699, 100077, 149664, 206167, 215099, 136222, 36090, 23616, 93003, 142120, 148637, 190647, 270530, 278948, 195116, 157628, 232910, 269590, 131151, -54303, -61309, 95992, 193069, 132858, 60493, 119066, 258774, 346806, 339790, 277216, 194788, 114503, 65012, 59236, 84328, 133180, 202951, 253769, 227831, 132776, 58366, 85807, 210627, 358482, 439170, 391606, 230867, 58539, -20339, 4127, 69459, 145405, 251483, 374874, 447617, 426768, 340165]
38864C40165j04280r7003o9702k3448R016P978N977K2967J6960l2854n9259r934
38852F583M7435K8246j8766R329Q1462O8472m2284j14887o8734J9735O0000O8471
38840A45062Q4578P3476j399q1736q1687j4896K4356o063m4666j5593O8400J13241
38828B63073N1382o9505j29724p8505M919K2475j2353j3500M0347Q5753Q0778
38817B45140M8148Q243m5864q8108n9848L3669J04255J01291P7515Q3057P3055
38806E80553R4o7141k5359R1975J37433N0407o6359r9882o3335k6438Q001P3414
38794E93363J35999J22539M0273k4177l5506m9487r1621q5196L4761J96467K57131
38783A094546J67989J8808o0920j0066J17173J84575J15471K5444J07431L41148
$$ y = [340165, 235885, 138882, 69180, 45732, 54748, 62726, 68703, 91670, 108630, 75776, 16517, 6583, 54018, 82264, 63498, 72827, 154289, 222761, 180477, 65590, -3144, 16591, 76591, 145062, 229640, 303116, 301717, 219981, 138294, 123398, 147754, 141691, 97025, 81432, 149832, 263073, 314455, 244950, 115226, 36721, 41640, 64115, 51762, 38262, 78609, 164362, 245140, 293288, 301531, 255667, 167559, 107711, 141380, 245635, 346926, 424441, 507498, 580553, 580647, 513506, 488147, 580122, 717555, 767962, 701603, 601721, 538386, 511948, 519949, 593363, 729362, 851901, 892174, 867997, 832491, 783004, 691383, 606187, 640948, 837415, 1094546, 1262535, 1281343, 1220423, 1210357, 1327530, 1512105, 1627576, 1653020, 1760451, 2101599]
38773B101599M91444N15238P31859J292015J655083J072837l54167j568295j725273
38764D212340j103640n59335m22836l73153j82606l5247q5853j73333j32821n9197
38754A084319p8252j11177n5929j254o1996j51180j16250k172J5922q7436j53315
38743B81280q2671K8868M1519l6021o8958J7075J30704J28764J0716p4947m1688
38732C34641J1875l3672j21951j14269j4718N2537N5159P2867J15582R8412J5195
38721D71658l6006l1051n1491j01775p8667K2027O0037r928m5401L7241J14281
38710C50925P4944L239n336k5387j26303j88367j00953M615m5258j52853r3498
38699c04232J04042J94230J04172J6793M4231P2683J725q2358p5621k5771j9159
$$ y = [2101599, 2593043, 3108281, 3840140, 5132155, 6787238, 7860075, 7505908, 5937613, 4212340, 3108700, 2549365, 2126529, 1753376, 1570770, 1535523, 1449670, 1276337, 1143516, 1084319, 1006067, 894890, 838961, 837707, 775711, 624531, 508281, 506109, 522031, 434595, 281280, 198609, 227477, 268996, 232975, 164017, 181092, 311796, 440560, 451276, 376329, 334641, 346516, 312844, 190893, 76624, 61906, 114443, 169602, 242469, 358051, 456463, 471658, 435652, 404601, 353110, 251335, 172668, 194695, 254732, 244804, 199403, 236644, 350925, 425869, 429108, 423772, 398385, 272082, 83715, -17238, -12623, -57881, -210734, -304232, -200190, -5960, 98212, 115005, 159236, 231919, 233644, 151286, 75665, 49894, 30735]
38688C0735l0804oM2521L1250j4653k1894K2376N5824K4399n7836j19717r4439
38676a32244O517Q6887O8380j4167o5609n6482l3698k2187O090N8960R0102O1029
38664E3578p100n9356n9104j6219J8810P572j8020O381O6665P0222o449n9413
38652b433j0742P1649R3108P7865Q7552Q4937J3038o5683n9499j5120l4682p8602
38640A61388l1328P0754P4264l3337r9302n7884j0539j5236O314Q2878J02919
38629B50891O386r3173q4734k0117P474J6459N4116P4245K0640n4638p0000l8332
38617F9217j3323J2969N9599P7621K7730k5381l788M9450L4413m4766q9218n6766
38605I7757p848m93j6571o665L8487P5220N2650k2295p3303m3071K0686K8712
$$ y = [30735, -69, -75, 42446, 73696, 59043, 37149, 59525, 115349, 139748, 81912, -37805, -132244, -125727, -38840, 29540, 15373, -50236, -106718, -140416, -162603, -156513, -97553, -7451, 53578, 46478, -12878, -71982, -88201, -69391, -61819, -79839, -73458, -6793, 63429, 56980, -2433, -13175, 58474, 151582, 229447, 316999, 401936, 414974, 349291, 289792, 274672, 239990, 161388, 130060, 200814, 275078, 241741, 142439, 84555, 74016, 58780, 65094, 147972, 250891, 257277, 164104, 79370, 59253, 66727, 83186, 137302, 211547, 232187, 177549, 107549, 69217, 55894, 68863, 128462, 206083, 233813, 208432, 204644, 254094, 288507, 243741, 154523, 97757, 89909, 89416, 72845, 66180, 104667, 179887, 232537, 210242, 136939, 93868, 114554, 143266]
38593A43266j3320k1201J5246J1126n3488p5806O281J03186J04536L0912k3542
38582B27196k0734K0904P7395J03833N0665m1784n9368J1481M0724l2672p9596
38571B98044Q076J15846P5700o5681j28001p5539k7023l1259k1800K0103L6101
38560B04567K6022M7075P4132K7906m8784k4482Q1663Q7480n8515j61103o6786
38549A89175R7804J24120L1608M371R0808J47597P2763n9375j25067r8318k8505
38538D46981M2139Q4620O6079j1406p9898o5978J8674Q2777O0647j3850n6848
38527E73937l9533j0046j0296j3870K1806P1151O2075j7277q6802p6113j7573
38516D57459P200r577M253P3990J14003M4865p0183r1129K913P9442M4348k8422
$$ y = [143266, 129946, 108745, 123991, 135117, 81629, 5823, 12104, 115290, 219826, 250738, 227196, 206462, 227366, 304761, 408594, 459259, 417475, 358107, 369588, 410312, 377640, 298044, 306120, 421966, 497666, 431985, 303984, 228445, 201422, 170163, 148363, 168466, 204567, 230589, 277664, 351796, 379702, 330918, 306436, 388099, 475579, 417064, 255961, 189175, 286979, 411099, 442707, 447078, 537886, 685483, 758246, 698871, 573804, 475486, 446981, 489120, 573740, 639819, 628413, 548515, 482537, 501211, 583988, 644635, 630785, 573937, 534404, 524358, 514062, 500192, 521998, 593149, 655224, 637947, 551145, 475032, 457459, 464659, 455082, 459335, 533325, 647328, 692193, 622010, 530881, 533794, 613236, 657584, 629162]
38504F29162k6277K9524M4737K3637M7089J04687R3509j686o6877l9457P94j2753
38492H26089j1396P8428J83792J87239J18447J15620K14616K88141K09194o77
38482B209493k06829k98412k73268k10164j69591j33453o2588J2798K5472j3875
38472H79583k2925J4718J8392m4857r0641n7327j4027l9830q3570n1262L4701
38461E42955Q0187P5588Q7114J16465Q7795k0602j28087j54204j01550k3320L7102
38450E99443O1429N1496K2835r287l2424k8943L607K8663J5260j582K6486N8974
38438G95957J5463p2967q6356j3078J8756m2873p9118k070R7694J09449O8515
38427H09372M6314J1455o4272r1386o580Q5627P1947J6965K6171M3810k0278p5861
$$ y = [629162, 602885, 632409, 677146, 700783, 747872, 852559, 946068, 944382, 877505, 838048, 838842, 826089, 814693, 893121, 1076913, 1264152, 1382599, 1498219, 1712835, 2000976, 2210170, 2209493, 2002664, 1704252, 1430984, 1220820, 1051229, 917776, 855188, 867986, 893458, 879583, 856658, 871376, 889768, 844911, 754270, 696943, 682916, 643086, 559516, 508254, 542955, 623142, 698730, 785844, 902309, 990104, 969502, 841415, 687211, 585661, 562341, 599443, 660872, 712368, 735203, 725916, 693492, 664549, 668156, 696819, 712079, 710497, 736983, 795957, 811420, 738453, 652097, 639019, 657775, 614902, 535784, 533714, 631408, 740857, 809372, 855686, 867141, 802869, 711483, 704903, 790530, 862477, 879442, 905613, 949423, 929145, 853284]
38415H53284R394J40373J08910o4832j49923n7096N6890N9105M990j2129O67L539
38403I53172l380j3403k0028Q358O7827P5296m103n6571J3597J00607N5985m8589
38391A128768k4343J25853K21407J89303J16306M6105n0952j25130q9080K87J8395
38380A556919M689Q5890K01099J67346R024n3559M1893J28379J15335R4914J10594
38369B462523Q9713M7247R1429J85152J66600M4930O080R1673J52461J49657K03276
38358C690741L06225L06359K20094K41898L89653M68096M33045M49727N43950
38349G049788N59195N06789N74423P42941Q05502Q04788J000320J362855J597199
38340A5003800J708711K000126K467258K823995L179617L965124N087416N975899
$$ y = [853284, 862678, 1003051, 1111961, 1047129, 897206, 840110, 897000, 956105, 961095, 948966, 949633, 953172, 949792, 936389, 916361, 924719, 992546, 1067842, 1063739, 1007168, 1020765, 1121372, 1177357, 1128768, 1104425, 1230278, 1451685, 1640988, 1757294, 1803399, 1752447, 1627317, 1538237, 1538524, 1556919, 1561608, 1647498, 1848597, 2015943, 2024967, 1971408, 2013301, 2141680, 2257015, 2351929, 2462523, 2552236, 2599483, 2690912, 2876064, 3042664, 3087594, 3093674, 3185347, 3337808, 3487465, 3690741, 3996966, 4303325, 4523419, 4765317, 5154970, 5623066, 6056111, 6505838, 7049788, 7608983, 8115772, 8690195, 9433136, 10238638, 11043426, 12043746, 13406601, 15003800, 16712511, 18712637, 21179895, 24003890, 27183507, 31148631, 36236047, 42211946]
38332D2211946O625838P688450R340585J1136330J3245444J6564578K1212700
38325A28025871K6433962L2355346L9280227M3592256L7311084J5890477j3911811
38318C08977412l7705777m6157348m1866910l3466625k6305137k0662209j5880968
38311H6932438j2418912j0360466q802059p256502o107825n443479m714419l750531
38303B8078245l028082k727315k438271j972508j646438j583220j463216j149016
38295A2070179r19396r15265r15700p99405p12893o78692n32205l28194l19262
38286E949167m58180m16726j77903j03016l00267m30869k96743j40846j70731
38277C453886k27644j54083r1933j68185k29069j39637n1806j23846k24678j63461
$$ y = [42211946, 48837784, 56526234, 65866819, 77003149, 90248593, 106813171, 128025871, 154459833, 186815179, 226095406, 269687662, 306998746, 322889223, 308977412, 271271635, 225114287, 183247377, 149780752, 123475615, 102813406, 86932438, 74513526, 64153060, 55351001, 48094499, 41986674, 36543195, 31828776, 28078245, 25050163, 22322848, 19884577, 17912069, 16265631, 14682411, 13219195, 12070179, 11150783, 10235518, 9319818, 8520413, 7807520, 7128828, 6596623, 6268429, 5949167, 5490987, 5074261, 4896358, 4793342, 4493075, 4062206, 3765463, 3624617, 3453886, 3226242, 3072159, 2980226, 2812041, 2582972, 2443335, 2391529, 2267683, 2043005, 1879544]
38267A879544j0007M5033n396k2721M5234J25770J34591L6200j24705k16679j59687
38256A727177p0323j15681k37018k21112m9318N8864j0645j14149j06832l2156
38246H28807K1345M9172M1481m2210j39674j16548Q349O0596j2143o5145j8465
38235F15565K3798q238l1107J922L906n1083m2405P4671J54595R0803j6963m3046
38223G72418k0312l0369n9621o7146n9534k4421O4634J31010O0819p5971q5578
38212F05929K3400L1406j01083j32301L8823J59614L4880j35615q9310P2173Q3765
38201E91681m2860r2417l1120j1841o7500p7762o612O0867Q9359J00963N7000
38190E69758p4815j84530j41578m707O8759O3280O9808Q0783K7524l5872o095
$$ y = [1879544, 1869537, 1914570, 1909174, 1886453, 1931687, 2057457, 2192048, 2228248, 2103543, 1886864, 1727177, 1656854, 1541173, 1304155, 1083043, 1033725, 1092589, 1081944, 967795, 860963, 828807, 850152, 899324, 940805, 898595, 758921, 642373, 650722, 711318, 699175, 634030, 615565, 639363, 631125, 600018, 601940, 605846, 554763, 512358, 587029, 741624, 832427, 815464, 772418, 752106, 721737, 662116, 594970, 535436, 511015, 575649, 706659, 767478, 691507, 605929, 629329, 660735, 559652, 427351, 466174, 625788, 660668, 525053, 435743, 507916, 591681, 548821, 456404, 425284, 413443, 345943, 268181, 261569, 322436, 411795, 512758, 569758, 494943, 310413, 168835, 164128, 232887, 296167, 365975, 446758, 474282, 438410, 432315]
38179D32315N3558k985j30217j34206R504J12117P2519N016J9505P1867R3479
38168F02472R5635Q3890K4711m7020l2738O9246J47453J59020J81450K45773K73389
38157A803281K24551J52347O1301j14555l25952l85867k36465o9202n3585j04181
38147I51673o5869J7270P532o0545l6645P1099R1924k9649j40211j10512r347
38136F86720K8737o355k9100o12M3102O1797M0696k2694j04511j48218j22207
38125D27355o6857l9138l1883l471L0637J1935n0955p0281j1562M1405J3823l6997
38113B14011j0773P2810J03746N0293j2356l8918o3220r1211o4413K1313O8821
38102B50103J8991n5503p0005n3365o4952o7524M626J03680J13269J5351q7720
$$ y = [432315, 485873, 482888, 352671, 218465, 227969, 340086, 412605, 417621, 437126, 508993, 602472, 698107, 781997, 806708, 759688, 726950, 796196, 943649, 1102669, 1284119, 1529892, 1803281, 2027832, 2180179, 2241480, 2126925, 1800973, 1415106, 1178641, 1109439, 1055854, 951673, 885804, 903074, 910606, 850061, 813416, 884515, 976439, 946790, 806579, 696067, 686720, 715457, 709102, 680002, 679390, 722492, 784289, 824985, 802291, 697780, 549562, 427355, 360498, 321360, 289477, 286006, 316643, 328578, 277623, 207342, 195780, 237185, 251008, 214011, 203238, 276048, 379794, 430087, 417731, 378813, 315593, 224382, 159969, 181282, 250103, 269094, 213591, 143586, 90221, 25269, -42255, -37629, 66051, 179320, 194671, 106951]
38091A06951j09286n5131K2244O9828N0735j1724k7431M8181J24500Q7551k5692
38080B80726p1606o806O6118O8209L7676J9769j8115r4537j33557o6310M5942
38069A27509Q1639K2956l4045k7050n886l7809r4129q6907l88P5342O3699O700
38057I1631NM9546O3737p198r5600j08273l7630N0635R2342O1237j7095o6036
38045G7301l3205K1052m467p5250m2247J08395J79161M5862j26337j14467L1995
38034F7793R4462L6506J5660P5009P6988k2078p2680Q051Q7406M3293m0267l9001
38022C31142J893k3793q5167q4664l7177k0482j5551M2571J02845N5557o4981
38011B02193r9889m445Q2199M8590l9463o6722l6006j9413k0890Q099N3886M5123
$$ y = [106951, -2335, -57466, -35222, 34606, 85341, 73617, 46186, 94367, 218867, 306418, 280726, 209120, 202314, 268432, 336641, 374317, 394086, 375971, 281434, 147877, 81567, 127509, 209148, 232104, 198059, 171009, 165123, 127314, 33185, -53722, -54110, 21232, 84931, 91631, 91636, 141182, 204919, 197721, 102121, -6152, -43782, 6853, 99195, 160432, 143337, 77301, 44096, 65148, 60681, -14569, -56816, 51579, 230740, 276602, 150265, 35798, 67793, 162255, 198761, 214421, 289430, 366418, 344340, 271660, 279711, 367117, 410410, 370143, 331142, 333035, 309242, 224075, 139411, 102234, 81752, 66201, 108772, 211617, 267174, 202193, 102304, 97859, 180058, 228648, 189185, 122463, 86457, 67044, 46154, 54253, 108139, 153262]
37999A53262k6428p6021m3883K2520M5786K7084K0160L1471J9593j5908k5766
37988A31870m778j2677o7093r6940n7278j1087j9585k6243M5068J35425J23122
37977A39804J9754m2742j4054K3759J7594J2296K8539J6398j9052Q757R7829J08412
37965C97294j5401j14883m3372R3214Q7015o1121j60326j18764l5343m720K978
37954B6571L5851P1892Q3262Q0649N5535k1131j09434j15575l8368O528l7432
37943C8348p6729k6051M8994M7906M208J3613N6481L3581m9002p6798j4743M1014
37931D0822L1400K0980N6093O1415k6705j22656j05293k945N8720M8251L6737
37920I6819M2682J5776k2625J9442J21659J24393l1861j74493j24756M4832J16485
$$ y = [153262, 126834, 50813, 6930, 29450, 75236, 102320, 122480, 153951, 173544, 157636, 131870, 127092, 114415, 47322, -49618, -106896, -117983, -137568, -163811, -118743, 16682, 139804, 159558, 116816, 102762, 126521, 144115, 156411, 184950, 201348, 182296, 191053, 288882, 397294, 381893, 267010, 223638, 316852, 403867, 342746, 182420, 63656, 28313, 23593, 26571, 62422, 134314, 217576, 298225, 353760, 332629, 223195, 107620, 69252, 75780, 38348, -38381, -64432, -15438, 32468, 36676, 50289, 106770, 140351, 91349, 14551, -192, 40822, 72222, 93202, 149295, 210710, 184005, 61349, -43944, -46889, 11831, 60082, 96819, 139501, 155277, 132652, 152094, 273753, 398146, 366285, 191792, 67036, 111868, 228353]
37909B28353K6203q6943j01872m6543j428J0113N419O00J2670M5335O3449L4211
37897A89567j2267k1008L238J3648N467J0621K6944L1009M1804Q5822J19020P9973
37885E73838M207j8781J2140K4591J5720M7274R9914Q2432N574j0835N4928P3258
37873I64260j8878j04132p5748K700K8889J8759K2080Q007m3591n3272K5667R2405
37861H67146M9883l1170l9339j1167l7097p5439l5405L5010L1414m591L3371Q7366
37849H69982J2003j44011j73316m3652M3182j9506q8363l8947K6841k0111j08195
37838C15907r9165j6070K9453L5172O3891P7799k679j12313r4567M9516J30600
37827C77544M0212q4914n6679R5451J62088L3848j59995k19148j06481M1420R7459
$$ y = [228353, 254556, 167613, 65741, 19198, 17770, 27883, 33302, 33902, 46572, 91907, 155356, 189567, 177300, 156292, 159530, 173178, 178645, 189266, 216210, 247219, 289023, 374845, 493865, 573838, 578045, 559264, 571404, 595995, 611715, 658989, 758903, 841335, 846909, 836074, 891002, 964260, 945382, 841250, 765502, 768202, 797091, 815850, 837930, 845937, 802346, 749074, 774741, 867146, 917029, 885859, 846520, 835353, 798256, 722817, 687412, 722422, 753836, 749245, 782616, 869982, 881985, 737974, 564658, 521006, 564188, 544682, 456319, 417372, 444213, 424102, 315907, 216742, 200672, 230125, 265297, 329188, 406987, 404308, 291995, 197428, 246944, 377544, 417756, 332842, 276163, 371614, 533702, 567550, 407555, 188407, 81926, 123346, 220805]
37816B20805O1404j290n2160p4650m8530R453L2368m407k9338J1687M8150k427
37804A71065o7071p498J40407J84813O4362n1762k2589O0390L9820o3348j13752
37793C34837q2083m9074l9369m340M6304M0322j8931l9410O739L5648J044k0081
37781B11606L9390J09972Q5093j1869o1623k4241J9473O705j9295L124M7068L7223
37769D42626l6196j01173r4596k7001M4169P3719N8800L5411M4513Q0742Q7000
37758F08014L1734k6614m969Q2021J32576J00467N0813M2275L3321l3587j19074
37747H96977j38070q5856l5309l0220n0560o6735o4271l0889K0750L7654n338
37736D48133m9963l5900l248k6766p9359p0637q043M480n9190j00286n9370q203
$$ y = [220805, 282209, 280919, 228759, 154109, 105579, 115032, 147400, 142993, 113655, 125342, 173492, 171065, 103994, 96496, 236903, 421716, 486078, 434316, 411727, 472117, 511937, 448589, 334837, 252754, 203680, 164311, 159971, 206275, 246597, 227666, 188256, 194995, 230643, 231687, 211606, 250996, 360968, 446061, 434192, 372569, 348328, 367801, 374506, 355211, 358335, 405403, 442626, 406430, 305257, 210661, 183660, 227829, 301548, 360348, 395759, 440272, 521014, 608014, 639748, 613134, 608165, 690186, 822762, 923229, 974042, 1016317, 1049638, 1016051, 896977, 758907, 673051, 637742, 607522, 556962, 490227, 425956, 395067, 415817, 453471, 448133, 398170, 362270, 359022, 332256, 252897, 182260, 174217, 178697, 119507, 19221, -40149, -48352]
37724d8352j8302m3521j0665N6795Q8470P6642N6659K9966j5528m7486k4621L6408
37712A36465Q6754J07929R8655M0716n9653j31988j13794m2259q948l6073n9308
37701A8496k8496L0969O3121M6275N520j5042O331M0981L7920p699m1853k5664
37689A30859J2919K6795J0781j5845m5544o1766k7749M9380Q2944M161j26597
37678D0338j77026j05460j167M0322J9577l244R857N7067J16908J49289J05484
37667B51945j6884j33419j33790r182J09571Q8437m0444j08146l1731O6413L1600
37656G4370r3037j25336j3284R1406O0834l7033o6544j9161J9993K6795M6272
37645c4725Q2798Q7669M8222O117j3815k7653m6698o2275p1909p5525n8395k1120
$$ y = [-48352, -66654, -110175, -120840, -64045, 24425, 101067, 157726, 187692, 172164, 124678, 100057, 136465, 223219, 331148, 429803, 470519, 410866, 278878, 165084, 122825, 113877, 77804, 18496, -10000, 20969, 84090, 130365, 135885, 120843, 127174, 168155, 206075, 198376, 156523, 130859, 143778, 170573, 181354, 165509, 119965, 58199, 30450, 79830, 162774, 166935, 40338, -136688, -242148, -243315, -202993, -183416, -186660, -176803, -119736, -2828, 146461, 251945, 235061, 101642, -32148, -41330, 68241, 156678, 116234, 8088, -23643, 42770, 74370, -18667, -144003, -157287, -65881, -5047, -42080, -108624, -127785, -107792, -80997, -34725, 48073, 135742, 183964, 190081, 176266, 148613, 101915, 39640, -32269, -107794, -166189, -187309]
37633a87309l557k9053n1949j9952L7138N0293K2805J9359N0440N3467L752l6364
37621i0930j3579L5313M3855J2457o482M806J0838p729j1366M1882J18156J32238
37609B69459N9738k3992n0658n1799p9713q7696qJ21433J24953P319n1576L9645
37597B77105J33351P9258l1715k4468O7274O6230m5453j02306l3814L5842P805
37586D29109n0523n3525l4175m7004n9197l0517m34o357l770M2826P0598J6780
37574B73811o0253n9203J2451O1594M8902J2284k2881o3248q7733n6915J1859
37563G0668N3036M7200M1891O6028Q6784P1827L5793l032n6619j19295j37508
37552A56773q3683k2651l3240q2386o1488M4611J16606O9317k4361m7679n362
$$ y = [-187309, -190866, -219919, -271868, -291820, -254682, -204389, -181584, -162225, -111785, -58318, -54566, -90930, -104509, -69196, -25341, -12884, -19366, -14560, -3722, -11451, -22817, 19065, 137221, 269459, 329197, 305205, 254547, 202748, 123035, 35339, 35331, 156764, 281717, 289036, 237460, 277105, 410456, 489714, 457999, 433531, 500805, 567035, 521582, 419276, 385462, 421304, 429109, 378586, 325061, 290886, 243882, 184685, 154168, 153734, 147377, 143607, 186433, 257031, 273811, 213558, 154355, 166806, 228400, 277302, 289586, 266705, 203457, 115724, 58809, 70668, 123704, 170904, 212795, 278823, 365607, 437434, 473227, 470195, 413576, 294281, 156773, 73090, 50439, 17199, -65187, -126675, -82064, 34542, 103859, 79498, 31819, 26457]
37541B6457J9568J5418K8146L5060k4934j02280p4790M1425Q3320l453p1148j9709
37529d6920L4075l1926j24863r8482k062K6877J0605N7161J22227Q1008j4389
37518A3311J023J04802J08982q429o1422R639L5944n8401j03689O066R8821O319
37506A52966j46087j46886l5376j92n2696l7879Q2215J68544J20240j2043j24968
37495c2162j50576o4257Q2618J61648R9250k0416o8361l3738J2374M1804N1817
37484H0001K518j02792j49480o2121M6436K7428o7837p3963J8950P1147M2987
37473a66726L9694R7466J16247M6414k4768k6750l204l942o724N263N254J432
37461G9656L7080Q0178L8917p4532j26985n9592K8711M7355L1872L1154J1764
$$ y = [26457, 46025, 61443, 89589, 124649, 99715, -2565, -77355, -35930, 47390, 43937, -27211, -46920, -12845, -44771, -169634, -268116, -270178, -243301, -232696, -175535, -53308, 27700, 13311, 14334, 119136, 228118, 219689, 158267, 167906, 203850, 145449, 41760, 47826, 146647, 152966, 6879, -140007, -175383, -175575, -228271, -266150, -183935, -15391, 104849, 92806, -32162, -182738, -246995, -164377, -2729, 96521, 76105, 7744, -25994, -13620, 28184, 80001, 82519, -20273, -169753, -231874, -185438, -158010, -225847, -299810, -280860, -209713, -166726, -127032, -29566, 86681, 133095, 108327, 81577, 78373, 74431, 67707, 72970, 78224, 79656, 116736, 196914, 235831, 161299, 34314, -25278, 3433, 50788, 82660, 113814, 125578]
37450A25578m0898n2346R478M4819k4027j07509q0225K0714N8291K859n1525m8487
37438a43278k7362k6080k6818p667K5867O7766J11363J22642O8119k6518q9225
37427D8809p9411k5312J5948J6707O66J2418N5432P3384K4951m2438n1419j3328
37415C6407p995m5426m6521J5406N9712L1484j3144j8192k4406p1774r6756l0650
37403b11855O8069Q8488K6971k8643l3931j1147K2855N4439L6683m3038r3920
37392a25029k9184Q6968J17439N4932J6392M2395M6276j4195n8269k9951L253
37381A11027k3468n4635j8571L3870N923p7852r5396r248P5249N8263k1200m6358
37369f2396K0949R8538R8642L8811L928J9561K0574m0848j14424j21599o1362
$$ y = [125578, 84680, 32334, 41812, 86631, 62604, -44905, -125130, -104416, -46125, -43266, -94791, -143278, -170640, -196720, -223538, -231205, -205338, -137572, -26209, 96433, 164552, 138034, 48809, -30602, -55914, -39966, -23259, -22593, -10175, 45257, 118641, 143592, 101154, 49735, 36407, 28412, -17014, -63535, -48129, 11583, 43067, 29923, 11731, -12675, -84449, -181205, -211855, -143786, -55298, -28327, -56970, -90901, -102048, -79193, -24754, 11929, -31109, -125029, -154213, -67245, 50194, 105126, 121518, 163913, 210189, 195994, 137725, 107774, 111027, 87559, 32924, 14353, 48223, 54146, -23706, -119102, -128350, -53101, 5162, -16038, -62396, -41447, 57091, 155733, 194544, 198472, 218033, 238607, 197759, 83335, -38264, -99626]
37358i9626Q424N7889Q8248Q1150K6387j9123Q987O9627N9789k3482p1017l4382
37346A52871K708k6585o4135m0840K988M684j938L3157N1777k1249j11424p4609
37334i2595O6191J24394K3958q0284l3139R2106J06970k4706j53728j53569n4294
37323a78696L8397P1738O1230L2956l807l9173m6165K825R2834J48933J00453
37312B81525k0424q7114k5765Q1810R9011J2624o3889n8175k1513j9187k6954
37301A51949K411L7140J6188l5279l3265K8181N7439L036o8027p1128k1949J294
37289F7990k6767n9377n2932q757N0330R9073J09857P5459L0255J1204K719l6434
37277B62620r4482j09008n8925K73J6456N206K442L134q253j2048M934K098m7979
$$ y = [-99626, -91202, -33313, 54935, 136085, 162472, 143349, 152336, 221963, 281752, 258270, 187253, 152871, 155579, 128994, 64859, 24019, 27007, 31691, 29753, 62910, 114687, 93438, -17986, -92595, -26404, 97990, 121948, 41664, 8525, 100631, 207601, 182895, 29167, -124402, -178696, -140299, -68561, -7331, 25625, 21818, -17355, -63520, -60695, 32139, 181072, 281525, 261101, 173987, 148222, 230032, 329043, 341667, 277778, 219603, 198090, 178903, 151949, 154360, 191500, 207688, 172409, 139144, 167325, 224764, 227800, 159773, 88645, 66696, 67990, 41223, -18154, -71086, -79843, -29513, 69560, 179417, 254876, 285131, 296335, 299054, 262620, 168138, 59130, 205, 478, 16934, 22140, 24582, 27716, 19463, 7415, 12349, 14447, -33532]
37264c3532p6015O139J48573J90476P4569o6421r7128o0986q1344j50811j45190
37253b91670k6273R6116J24055Q3645L7960j0529o6162p4814j786Q0633P8615
37242B9790J7130m07M5919P4377M8380L0999N8032O1781q854p6736m2443M9852
37230B87820O4722k1435q4536m2170K7019J1069p0488j11946q0081l4846j4383
37219f9255N173L2593L7569K8134O1257J28799J20913j6273j55008j27941L5210
37208H1171J32772N9753o5335q4665r290L4950R52l7583j6662L1398L7771q935
37196A56297n5600n3411j6340m187m2381p6467l9709M4803Q4721M6814k037o365
37184C6138m2k4293m0965l964L7851L535q2007j08850l7949M8435O4428J9561
$$ y = [-33532, -109547, -103408, 45165, 235641, 310210, 243789, 146661, 85675, 4331, -146480, -291670, -317943, -221827, -97772, -14127, 23833, 13304, -52858, -127672, -129458, -48825, 29790, 46920, 46513, 92432, 166809, 215189, 246188, 304220, 366001, 357147, 280411, 237968, 287820, 352542, 331107, 246571, 204401, 231420, 242489, 172001, 60055, -20026, -54872, -69255, -64082, -31489, 6080, 34214, 95471, 224270, 345183, 328910, 173902, 45961, 81171, 213943, 273696, 208361, 123696, 114406, 149356, 150308, 112725, 96063, 127461, 165232, 156297, 100697, 47286, 30946, 26759, -15622, -92089, -131798, -86995, -2274, 44540, 42503, 36138, 36096, 11803, -29162, -33126, 4725, 8260, -73747, -182597, -220546, -172111, -107683, -88122]
37172h8122j8591r342L0109M6328L628n9196n5638K6433Q0189K6820m7767r812
37160g4961J05354J29872J7135q5697n7926L4750O5335J5402n9610j33786j84835
37149b28967j48007n097J33106J38109K8595o3309o5017j8608J8164M0068O1283
37138a09680Q1625R5471R0184L9871n6659j40185j38877n2368M3852P5238K9194
37127d2334m5412p8689l8719L0950N3974J1316m3140o0888m3000m03O0896R7058
37115i8391N2200l9218o6907r184K0561l8861p8359L311J09527Q1828m8473j11786
37103b23752o2137j2710j9620q681N4581Q7823M3667m46K3262O2615M4937r089
37091a9550m5108o4833q2452o5526M271P0981P6946M7998M3253O2182N7751N851
$$ y = [-88122, -106713, -116055, -85946, -39618, -35990, -95186, -150824, -124391, -44202, -17382, -65149, -74961, 30393, 160265, 177400, 91703, 33777, 68527, 133862, 149264, 89654, -44132, -228967, -376974, -382071, -248965, -110856, -82261, -145570, -210587, -229195, -211031, -170963, -109680, -28055, 67416, 157600, 197471, 140812, 627, -138250, -190618, -146766, -71528, -42334, -87746, -166435, -205154, -174204, -120230, -108914, -152054, -212942, -255942, -256345, -195449, -98391, -46191, -85409, -152316, -161500, -140939, -179800, -258159, -254848, -145321, -63493, -111966, -223752, -285889, -298599, -318219, -326900, -272319, -184496, -140829, -141275, -118013, -55398, -10461, -19550, -64658, -129491, -211943, -277469, -273198, -202217, -125271, -77273, -34020, 28162, 85913, 91764]
37079I1764p9650j57769j56474k5813J58796K23761J00164o5131q5696K9112J09264
37068A42328N6758o1397j38906j43836r3529q366P3795J02798P4263L9032K8696
37057G1636J6183k1817n0008k6581K0994K5074k6986p5510p0966k8128J9302P1426
37045g5381J28777J42827O6546n2700j04510n9144q959k8169o4372l6541K2954
37034f8672K2020l1540l7974K8916P8070N0148M957Q339K3948o689m5604j4634
37022A1285O3620P8906o060q7928n3936O6466J35935Q5667j512j7924P817m0508
37010B41828j63256k05377q0166P4319P8545k3732l9697O5024J16139J7338r3888
36999a2923o7600K8935L4154n2942q7504n599R6063J06300K8002n4387p2951k8800
$$ y = [91764, 12114, -145655, -302129, -327942, -169146, 54615, 154779, 89648, 3952, 33064, 142328, 199086, 137689, -1217, -145053, -238582, -246948, -173153, -70355, 3908, 42940, 71636, 87819, 66002, 15994, -10587, 10407, 35481, 8495, -67015, -137981, -166109, -146807, -75381, 53396, 196223, 262769, 210069, 105559, 46415, 37456, 9287, -55085, -91626, -68672, -46652, -78192, -116166, -87250, -9180, 40968, 45925, 54264, 78212, 71523, 25919, 11285, 74905, 153811, 147751, 59823, 5887, 72353, 208288, 293955, 292443, 274519, 282336, 241828, 78572, -126805, -206971, -132652, -54107, -77839, -117536, -52512, 63627, 80965, -12923, -80523, -51588, -17434, -70376, -157880, -163479, -67416, 38884, 66886, 12499, -60452, -89252]
36987h9252J8337J2393l2241m7739m276O0013J10515J50936J64145J04190m732
36976D42289m9870J8903J00510Q8878K9836L0158P9164Q4646M1726L2729P4269
36965I73238R0863M8139K437q19J3073R408r767l2043m2961j4158M7565O0760
36953A145735l0981j39875j25989l700O8768K1636l8600j7388K4535n345p3227
36942H25569q3471k6179L5177O7164O8465J9849p2630j24427o7502K0798n650
36931F57163j48300k34623j42110L8962J32882J01798N2424N1914M3219l4168
36921E19161j29004j47012q3751j7294O329Q227Q211k584j6092r632o654n4825
36909G5080j21824j06129M087P9822L0652n2800l1538P5841J29944O9166l6209
$$ y = [-89252, -70915, -58522, -90763, -138502, -142778, -82765, 27750, 178686, 342831, 447021, 442289, 392419, 411322, 511832, 600710, 630546, 660704, 739868, 824514, 866240, 898969, 973238, 1064101, 1112240, 1114677, 1113858, 1126931, 1136339, 1126572, 1094529, 1051568, 1037410, 1084975, 1145735, 1114754, 974879, 848890, 845190, 913958, 935594, 896994, 879606, 904141, 898796, 825569, 742098, 715919, 751096, 818260, 886725, 906574, 833944, 709517, 642015, 662813, 657163, 508863, 274240, 132130, 171092, 303974, 405772, 458196, 510110, 553329, 519161, 390157, 243145, 159394, 142100, 148429, 156656, 164867, 162283, 146191, 136559, 129905, 75080, -46744, -152873, -148786, -68964, -38312, -91112, -122650, -46809, 83135, 152301, 116092]
36898A16092r9430q8202r100Q1626Q5007j9011r6146k4729J03741J02403j8713
36887A33538o3116L5501J09225L7328o0675l5025M9120L4643o7404j12496o0770
36876a31j4578k8544k7819N2707J51939J58187N0442p6900j17139o2829p270k5015
36864E3050p3009n6851K2575O9259M4226J8877M3198O4189L4649K820J2688P343
36852B43014o7129j40042j14075k2774L2669N0572R3711J24825M0775j24279j93220
36841g5953r1200M2451N7333j1531l9251n338J9216J6940L4369O7576N1192k0934
36829D4870n7823k39P7316N7831n4793j32224q6411K1864P1617L6418m332O412
36817a9494L0374J1885k3319J342R8063J77585J44116P685j18425j33977n1669
$$ y = [116092, 16662, -71540, -80640, 986, 85993, 66982, -29164, -53893, 49848, 152251, 133538, 70422, 105923, 215148, 252476, 191801, 156776, 205896, 240539, 173135, 60639, -131, -14709, -43253, -71072, -18365, 133574, 291761, 342203, 265303, 148164, 85335, 78065, 53050, -19959, -76810, -54235, 15024, 59250, 78127, 121325, 185514, 220163, 222983, 235671, 243014, 175885, 35843, -78232, -101006, -68337, -17765, 75946, 200771, 241546, 117267, -75953, -167153, -124702, -67369, -78900, -118151, -123489, -104273, -87333, -52964, 14612, 65804, 44870, -12953, -13192, 64124, 121955, 67162, -65062, -151473, -129609, -57992, -21574, -25906, -19494, 10880, 22765, -554, 788, 98851, 276436, 420552, 428237, 309812, 175835, 124166]
36806A24166L3165O0845N8221O3499N2937j2832j06827j59963j46319q6417P545
36795a11980J13916J53808O5209p2239r9054R354J00991O6308j5338k1223L0550
36784B20302M6014K0660J7177K8728r479q8491j16528m8608N6638J15506R1999
36773C33918P69r8683j22686m4505N3997P2434J8230k0895r346R832R814J5348
36761B18227L5487L8693J4248n063j089L343o332j0572J775O891j7775n8965q2968
36748A35900p0149l4623j7734m2747o9309l5278L9929N9191o113n2891J86P4660
36736a8978N1189l6702n8642j965J5973m8650r4967m6970K9741M0458l991l0928
36724b04432j7667P21m728k5931k6480K6628J07412J24214K7738r3013j03379
$$ y = [124166, 157331, 218176, 276397, 339896, 392833, 380001, 273174, 113211, -33108, -119525, -111980, 1936, 155744, 220953, 148714, 49660, 59014, 160005, 226313, 210975, 189752, 220302, 266316, 286976, 304153, 332881, 323402, 234911, 118383, 69775, 126413, 241919, 333918, 334687, 236004, 113318, 68813, 122810, 195244, 213474, 192579, 183233, 193065, 202879, 218227, 253714, 292407, 306655, 301592, 300503, 303846, 297514, 286942, 288717, 295608, 277833, 218868, 135900, 65751, 31128, 13394, -29353, -98662, -133940, -94011, -34820, -40933, -93824, -93638, -18978, 32211, -4491, -63133, -65098, -49125, -97775, -192742, -239712, -209971, -169513, -173504, -204432, -222099, -221378, -226106, -252037, -278517, -251889, -144477, -20263, 7475, -85538, -188917]
36713a88917k619P9433O4365L656l5462n4494o3162l6205K3098O0285N4212M9908
36701d5902P1906Q0507M6853m187n2285j01488j21734o6683K5830N8909L1498
36690g6776M3935J06890R1704m9603j61890j04002L3961P0722m210o0109m6465
36679a55843k5650k2523M498M9709N1105L705k6366r152K0022L9366O0556P1880
36667F1307M8535J9058L6082P9110P0910k130o6535p0418m2165k6323k7606l5198
36655D4627m5379m4726j7108K4800N2690O0618N2686J6037m4702p6466m4490M06
36643b1007m781k7076M644N8929L5221o0076r5267p576R6033R3485J1877l9683
36631D4723l3912l3244o7975r1668n8982J2247P1716R2983Q0975M3667j8909r2905
$$ y = [-188917, -191536, -112103, -47738, -44082, -79544, -134038, -197200, -233405, -210307, -150022, -95810, -45902, 26004, 106511, 153364, 149177, 96892, -4596, -126330, -193013, -167183, -108274, -76776, -32841, 74049, 165753, 116150, -45740, -149742, -115781, -45059, -49269, -109378, -155843, -181493, -204016, -199518, -149809, -98704, -94999, -121365, -130517, -110495, -71129, -10573, 61307, 109842, 128900, 164982, 244092, 315002, 312872, 246337, 175919, 133754, 107431, 79825, 44627, -752, -45478, -62586, -37786, 14904, 75522, 128208, 144245, 99543, 23077, -21413, -21007, -25788, -52864, -48220, 10709, 45930, -14146, -109413, -116989, -20956, 72529, 84406, 44723, 10811, -22433, -90408, -182076, -241058, -228811, -157095, -64112, 16863, 60530, 41621, -51284]
36619e1284j36829j15964n1491m674R6L045L8682P4560N6353j3113p7710r0692
36607c69021m3563M0352J09555J14035O5975L4799M8211M8798n432n8370m1406
36596e6067J4322L2674J0796p451k9220p8359j02821l8951N3007M9911l8403o9812
36584b60374J2478R6049P7734O334j6473J8267M9071M1121L137l7219l6539K7884
36572a8530R8904Q4310j5878r9249r6821l7759L3467J00413J13603J3183j36220
36561C9423j63953k6673R7709N0286q4458j17321k6498N1941M7961K3139L1133
36550g7311M4881L2517N794k0744m4378m5298p350L7214M1687J1283j8308m5398
36538h5411q4942j11353q4861j8412L8524O2117N2551R368l6285j7715O6359J04134
$$ y = [-51284, -188113, -304077, -355568, -360242, -360146, -357101, -318419, -243859, -187506, -200619, -278329, -369021, -412584, -372232, -262677, -148642, -82667, -47868, 343, 49141, 43709, -14661, -56067, -41745, -9071, 1725, -5726, -34946, -113305, -216126, -255077, -202070, -152159, -190562, -260374, -247896, -151847, -74113, -67779, -84252, -65985, -16914, 24207, 27344, -9875, -46414, -18530, 80374, 164684, 148806, 49557, -47264, -85023, -51556, 48857, 162460, 175643, 39423, -124530, -151203, -53494, -3208, -87666, -204987, -231485, -179544, -131583, -108444, -77311, -32430, 87, 5881, -14863, -59241, -104539, -111889, -74675, -32988, -21705, -40013, -85411, -170353, -281706, -366567, -384979, -346455, -284338, -231787, -222419, -258704, -276419, -210060, -105926]
36526a05926J5924j07356j21938m0778O886n518J9250R8068J06344k2583j71518
36515c29145j94369j01199r095J9163J0908Q049K1515L3934J1863n4974j15158
36504f98508j06248n1736m1062j00935j63651j79770j70512j39814m0501J15844
36494a576893K16817J95809J37196J49775K08245K13109J46215O8392J0872l3518
36484b63981m9680k3934O282J2679M1040J20184J60796P0710o8433q8094J4813
36473f7618O9940m344r0585p4249n303K2030J9647L5831M4743J7205J1147P0297
36461D8741J06828J9490j21147j48549m1831M8209K2845m6317n8981l1019l2290
36450b34021n8404m1858L9862J23657J28038M4117m1429l0245O6902J30283Q6811
$$ y = [-105926, -90002, -197358, -319296, -360074, -353188, -358706, -339456, -241388, -135044, -157627, -329145, -523514, -624713, -633808, -614645, -603737, -595688, -574173, -540239, -528376, -583350, -698508, -804756, -856492, -897554, -998489, -1162140, -1341910, -1512422, -1652236, -1692737, -1576893, -1360076, -1164267, -1027071, -877296, -669051, -455942, -309727, -241335, -230463, -263981, -313661, -337595, -331313, -318634, -277594, -157410, 3386, 74096, 5663, -82431, -67618, 2322, -2022, -92607, -166856, -172159, -150129, -130482, -94651, -49908, -32703, -21556, 48741, 155569, 175059, 53912, -94637, -136468, -88259, -65414, -111731, -170712, -201731, -234021, -292425, -334283, -294421, -170764, -42726, 1391, -40038, -70283, -3381, 126902, 213713]
36439B13713J0584L26J6574m3979j45428j32790K7272J70579J55626L6501n2794
36428B56184p3882o0506k2045L0049M0451o653l2868J2347N1079K320p0655o2311
36416F3510m697k196m0454k1547L9233K5205o8996j06809k7420N9978N4890K297
36404b7006j7064j5024l7224p0178p9250o3412j8172P4296J68518J62022M0635
36393A18141o9523o2411J6912O8284P7855Q3716P6916K7797m2128r1299j13847
36382I0413j06984m7972L6927O0311M245k2761N0616J25945Q0527l2179o5485
36371A73603r316J5123l0441m7637J7653P4479K1268j05741j73779j01859N7837
36360a08810J62829J11121m4073j36770p6842M8780J03525O4186n178o6784j07372
$$ y = [213713, 224297, 224623, 241197, 197218, 51790, -81000, -53728, 116851, 272477, 308978, 256184, 182302, 121796, 99751, 129800, 170251, 163598, 130730, 143077, 194156, 196476, 125821, 63510, 58813, 56617, 16163, -5384, 33849, 59054, -9942, -116751, -144171, -84193, -29303, -27006, -44070, -59094, -96318, -166496, -245746, -309158, -327330, -253034, -84516, 77506, 118141, 48618, -13793, 3119, 71403, 149258, 232974, 309890, 337687, 295559, 204260, 90413, -16571, -64543, -27616, 32695, 36940, 14179, 64795, 190740, 271267, 239088, 173603, 164287, 179410, 148969, 101332, 118985, 193464, 214732, 108991, -64788, -166647, -108810, 54019, 165140, 121067, -15703, -92545, -43765, 59760, 123946, 118768, 51984, -55388]
36349e5388r0869j7090L0904M798j0791N9655J21120M8467q0288q9117j957o106
36337h6662j16427j28180L3086J62939J01148j6351K668R2569O0797q5198j57470
36326a37081p8421M2865J07787J29241J24302N9284n1988j08609m4456P4402J25420
36315B42746O9570j8820m8482j4506O992k9555o5956k7017M4686L0996p5772j36650
36303b1768o4361M5976O4655J6210J2098N7609N3683k7871r1104n6440L3342P8997
36291A01026M0887l6161p8375m8019K4600O9350M9097m466l7305l3021j3090m128
36279C0395j8978m2323l0015L7224R9761P9379l7l0314K1456O1722J9731m6672
36267A81329n7201l1385k4247j9305J8604M5711k662r4443j31736p4191L5546
$$ y = [-55388, -146257, -163347, -132443, -127645, -138436, -78781, 42339, 90806, 10518, -78599, -80556, -86662, -203089, -331269, -298183, -135244, -34096, -50447, -47779, 44790, 105587, 20389, -137081, -215502, -172637, -64850, 64391, 188693, 247977, 195989, 87380, 42924, 117326, 242746, 312316, 293496, 245014, 230508, 237500, 207945, 141989, 114972, 159658, 190654, 114882, -21768, -86129, -40153, 24502, 40712, 52810, 110419, 164102, 136231, 45127, -11313, 22029, 101026, 141913, 105752, 27377, -20642, 3958, 73308, 122405, 117939, 80634, 47613, 34523, 30395, 11417, -30906, -60921, -23697, 76064, 155443, 155406, 125092, 146548, 208270, 228001, 181329, 124128, 92743, 68496, 49191, 67795, 113506, 110844, 16401, -115335, -189526, -153980]
36256a53980J32210J56045P8185l5671n4877M6351J25540O7325m4875o5124n652
36245B45477J8416q620j5962q578m7544j01376q5676k6467j2518j1376P2733J71640
36233A90149J08989r1768j90930r2095J3616k9193r7002k6518R4045P7278m7679
36222i1108q5320K3833J39431J38337M7538l3375l3543N1299J40318J21701l110
36211D16001q9763m5765K7419n555r8289j08692l2541J4160P096L1644R5365R7445
36199C08525J1168o1244n7182l1136j6674L7416J20695J01719p0168k23462j66794
36188d7137M1976J71430J18690m523p0628p6881o5946l9081p773k7020r7395j14381
36176b18669j1414J05671Q5106l6597o4464O8905J87307J20335m8407j11487m3261
$$ y = [-153980, -21770, 134275, 212460, 176789, 121912, 168263, 293803, 361128, 316253, 251129, 245477, 263893, 255273, 239311, 230733, 183189, 81813, -3863, -30330, -42848, -54224, 18509, 190149, 299138, 207370, 16440, -75655, -62039, -91232, -188234, -214752, -120707, -43429, -91108, -176428, -152595, -13164, 125173, 172711, 139336, 105793, 157092, 297410, 419111, 416001, 326238, 280473, 307892, 302337, 204048, 95356, 62815, 76975, 84071, 115715, 211080, 308525, 319693, 258449, 201267, 170131, 153457, 190873, 311568, 413287, 343119, 119657, -47137, -5161, 166269, 284959, 280436, 209808, 132927, 66981, 27900, 20127, -6893, -104288, -218669, -230083, -124412, -39306, -75903, -140367, -71462, 115845, 236180, 187773, 76286, 33025]
36165C3025j1938r5969j58428o6166R8878J53035N9950m2850l6839M9889J07906
36154I0493P5667j0132o3676m4674o015k3471q2759r3834l0544K1347j584l6017
36142b05199P639J01511J41011Q9514K530n9860o9622j6143O2881P2069k7738
36131I8593j27408r4710L2574R4849M0544k2055j2908J7222J1552L273K1587J7322
36119H0435l6106o5906j4936N0767M6980Q815J4719L7817R48o1348l9051O0018
36107H3152R4889K191j02491r4182p747M2292L4896L8982P7558R4354N3504o633
36095C10765l6485l5605k9462k8667l1714l4063j8066L1061Q2911P8255J4908
36084C03838k9154k402L5191p45p9248q8331k129Q2354R5708Q6484J13878J40846
$$ y = [33025, 21087, -74882, -233310, -299476, -200598, -47563, 12387, -30463, -67302, -17413, 90493, 166160, 156028, 92352, 47678, 41663, 18192, -64567, -158401, -188945, -167598, -169182, -205199, -197560, -96049, 44962, 134476, 137006, 77146, 7524, -8619, 54262, 126331, 98593, -28815, -123525, -90951, 3898, 44442, 22387, 9479, 26701, 38253, 41526, 63113, 80435, 44329, -21577, -36513, 14254, 61234, 70049, 84768, 122585, 123533, 62185, 23134, 83152, 178041, 180232, 77741, -16441, -24188, 18104, 53000, 91982, 169540, 263894, 317398, 310765, 274280, 238675, 209213, 180546, 148832, 114769, 96703, 127764, 210675, 288930, 303838, 274684, 272282, 307473, 306728, 227480, 139149, 137020, 219374, 315082, 401566, 515444, 656290]
36072F56290J08832M6129R920k4079j07341j88715j58105j6445J10986J45918
36062E83390J34417J26154Q8723l41p2261n7532O381L2833J778n0103j04862j51791
36050E36786j41592m1332Q1674J14688M0181m6896o8676m8792n1391q6595j03390
36039A84665n4219M4940J12343P5543l4774r9257n1366L4413M5256j8834o5520
36028A73190n0139j0842J8642L6226J4184q0056j85427j75543l1338J05747J09583
36017g5773J8654m9646n4974l2517p498N460k3296p9756p7889J9133J06188P2041
36005a79873k2881l3099M2021O5243n246n0920J257O0063L0392l4339l3976K0550
35993a40808M9547L4080J1745k399j1279k661J0630k4111j03884j26540k5985
$$ y = [656290, 765122, 811251, 821171, 797092, 689751, 501036, 342931, 326486, 437472, 583390, 717807, 843961, 932684, 932343, 860082, 802550, 808931, 841764, 843542, 793439, 688577, 536786, 395194, 353862, 435536, 550224, 590405, 543509, 474833, 426041, 374650, 288055, 184665, 130446, 175386, 287729, 363272, 328498, 229241, 177875, 212288, 257544, 238710, 173190, 123051, 112209, 130851, 167077, 181261, 101205, -84222, -259765, -291103, -185356, -75773, -57119, -106765, -161739, -194256, -201754, -196294, -219590, -299346, -377235, -358102, -251914, -179873, -202754, -235853, -193832, -128589, -133835, -184755, -183498, -123435, -93043, -127382, -161358, -140808, -91261, -57181, -45436, -47835, -59114, -61775, -51145, -75256, -179140, -305680, -331665]
35982c31665J12065J58199J01648J4486p1221j37049j07204M6383J81892J39263
35972A06797j3428o3914K0999N4837n2428j43903p2971O5762R3431P326n4616
35961e2108k4181N1390J17180J50884J32805O9170J7344J6130K3055j8681q8627
35950C94361j20247q7228j4623N4980P4737K5526m2639o6083p1224j25494j78838
35939a56772r9132R2369J88523Q5793n8267p2664j5439k0263n4446j3782O4245
35928e9835P6775M5435M1111J9851o8765j16685k3432P6829O761j27057q4320
35917b13332R7991J59061M8219k5296J9275L7435j1410J2279J04470P4457p0487
35906B32662o3101J56456K81991J42356l560Q8466K60159K89019K78622L87719
$$ y = [-331665, -219600, -61401, 40247, 54733, -16488, -153537, -260741, -214358, -32466, 106797, 93369, 29455, 50454, 105291, 52863, -91040, -164011, -98249, -4818, 2508, -52108, -76289, -24899, 92281, 243165, 375970, 445140, 462484, 478614, 501669, 482988, 394361, 274114, 186886, 172263, 227243, 301980, 327506, 284867, 218784, 147560, 22066, -156772, -255904, -163535, 24988, 110781, 52514, -20150, -35589, -55852, -110298, -124080, -59835, 16940, 62375, 103486, 123337, 54572, -62113, -85545, -8716, -1955, -129012, -213332, -115341, 43720, 91939, 66643, 85918, 123353, 111943, 124222, 228692, 303149, 232662, 169561, 326017, 608008, 750364, 746804, 835270, 1095429, 1384448, 1663070, 2050789]
35896B050789M85572M38871M47203P07112J048887J338831J866320K696869K946612
35887A4027066J591460r58878k931908l119476k083142j136550p91920p03262
35879C893390n89303n10973m63390l18829j47974j49170k68346k57868r9669k6529
35869A061339j15959j85782j30626o7927q4494r6817m6063r917l2845l7699Q793
35858B62003J9216l8982n7126K6862J02859O0529l8681p5419n1905l9250l3826
35847A36280O572M4914J3120n3648n4115J3459L8067k9404r1099m6440N4173Q0233
35835A12112Q482n2431k9356J4622n586n7508n1104O325K3859j3130j5216N1991
35823f940R7075M9374k7915n0333m3722o3579o6285J2805J09097R8017q261p2483
$$ y = [2050789, 2536361, 2975232, 3422435, 4129547, 5178434, 6517265, 8383585, 11080454, 14027066, 15618526, 14659648, 11727740, 8608264, 6525122, 5388572, 4596652, 3893390, 3304087, 2793114, 2329724, 2010895, 1862921, 1713751, 1445405, 1187537, 1087868, 1061339, 945380, 759598, 628972, 561045, 476551, 379734, 333671, 323754, 290909, 253210, 262003, 281219, 242237, 185111, 211973, 314832, 375361, 336680, 261261, 209356, 170106, 136280, 142852, 187766, 200886, 147238, 93123, 106582, 144649, 115245, 24146, -22294, 31879, 112112, 120594, 68163, 38807, 53429, 47843, -9665, -60769, -54444, -30585, -43715, -58931, -6940, 90135, 139509, 111594, 61261, 17539, -46040, -112325, -99520, 9577, 107594, 99333, 26850]
35811B6850m3050j7486o6001j15444o8045N3821J45162J42758O4485l0037q2090
35800A0923p3171m1608k9591k1323J6103N0846K6508k5901j8250M3921N6352o595
35788a1786l3960L8044J02737M1645q7070j35914p9494j5145Q281L4415Q0464
35777e7783R3780M8911m694k1616j6037j2176j954J9413K8326J3501J920J8242
35765A09833M7526N4644J8547n2182j09814r0435L692O4215k241j16265r3630
35754a66110R3720K36504J52229n9053j45580m1234P2123M1457o3814r2463k7505
35743B74L6250N6335O8734P7673L4385n6606j02833m2759N9571R3125M1044r276
35731B55917J3050P6677R3511K6074o5512q2879L935J12432J24817J4562j21220
$$ y = [26850, -16200, -33686, -99687, -215131, -283176, -229355, -84193, 58565, 123050, 93013, 10923, -62248, -103856, -133447, -154770, -138667, -87821, -61313, -87214, -105464, -61543, -5191, -11786, -45746, -7702, 95035, 136680, 49610, -86304, -165798, -180943, -172662, -138247, -57783, 35997, 84908, 80214, 58598, 42561, 30385, 28431, 47844, 76170, 89671, 91591, 109833, 157359, 212003, 230550, 178368, 68554, -21881, -18189, 46026, 43785, -72480, -166110, -72390, 164114, 316343, 257290, 111710, 70476, 142599, 184056, 120242, 27779, 274, 36524, 92859, 161593, 239266, 273651, 217045, 114212, 71453, 131024, 224149, 265193, 255917, 268967, 345644, 439155, 465229, 399717, 316838, 320773, 433205, 558022, 572584, 451364]
35720D51364j67399j10591l2958k047k783J3087M2666L2394l7063j00339p3397
35709A2934L6149J21450R5885q812r0993r9741o6126l2517p907M110q311l0100
35697g3979k0130K6477O2342O1712N9025P5100O1341k0385j07204j04754k4961
35686e416K8628P276l4746m5211l9170l1472R646Q7906J27678O8607l4018p7378
35674F2330n0063k6336l8546m0447n234K3228J0093q642P949L2566K0408j0135
35662b2829j5668j4474n2530r7867o5274M1033J08751P9538L1957L9595M3659
35651G5891l3562j27839j17779k4173K2180m606j275N8918O4767l0461j04361
35640b22300n8019K5230L1291K645L2263P4225K9352n1756l6466N5352P4521l083
$$ y = [451364, 283965, 173374, 140416, 138369, 135586, 148673, 191339, 223733, 186670, 86331, 12934, 49083, 170533, 266418, 257606, 166613, 66872, 746, -31771, -39678, -35568, -43879, -73979, -94109, -67632, -5290, 56422, 115447, 190547, 251888, 231503, 124299, 19545, -5416, 23212, 30488, -4258, -49469, -88639, -120111, -110465, -22559, 105119, 173726, 139708, 62330, 12267, -14069, -52615, -93062, -98296, -75068, -64975, -73617, -65668, -33102, -12694, -22829, -38497, -52971, -105501, -203368, -268642, -227609, -118858, -39320, -7363, 32232, 75891, 42329, -85510, -203289, -227462, -205282, -209888, -211163, -152245, -87478, -117939, -222300, -280319, -255089, -223798, -221153, -188890, -114665, -85313, -137069, -173535, -118183, -43662, -46745]
35628d6745l6191L6917R7580N6118o471n28J6232l3795q3048k5238Q9140J11272
35616A75243J4093p8722p8149k8675o011j2859j3836o147q477j4878j748K8127
35604c2039L7500L36n6485p7228m5356R88L5030P7272J25752J07286j8163j43076
35592A1817j18846K7585J11197M7357m2642m0713o519m0580r2504m8884O0198
35581a32534R6126K6444l5260p212O2170R3286P3314K6544l2756q4867j01936
35570a6681q7754p4771o7754l6731K2625O8319O8433M1961K8122L9950N7144N0379
35558I3242J5094j3670k207K1320o801q0459j07856m3247L3085L2122r334R81
35546f7730N3818N5739j7775q6968q5146k8532L3289O6952N7468K0811K652J3538
$$ y = [-46745, -82936, -46019, 51561, 107679, 101208, 100680, 116912, 83117, 69, -25169, 63971, 175243, 189336, 110614, 32465, 3790, -2221, -15080, -28916, -35063, -43540, -58418, -60166, -32039, 5461, 5797, -50688, -127916, -173272, -172284, -137254, -59982, 65770, 173056, 154893, 11817, -107029, -79444, 31753, 79110, 36468, -4245, -10764, -51344, -143848, -192732, -132534, -36408, -9964, -45224, -52436, 9734, 103020, 176334, 202878, 170122, 85255, -16681, -104435, -179206, -246960, -283691, -261066, -192747, -124314, -82353, -54231, -14281, 42863, 93242, 108336, 94666, 92459, 113779, 106978, 26519, -81337, -124584, -91499, -59377, -68711, -67730, -13912, 41827, 24052, -62916, -148062, -176594, -143305, -76353, -18885, 1926, 4578, 18116]
35534A8116J710m9170n6696L2540J16422O7037o1369j04499l8465J0914Q72K4428
35522c8160J00629J05267j4913j27462j08522j0726N5926P6008O5544n128j10597
35511a2134j21972Q475J26931Q2463m9961r9849n9542m2337n7037j5220P0629
35500a69554Q5501J2708l1639J0088N8192M4869J1729R252R246k4105n9022m7453
35488i0188N499O0847Q8319O9987Q986n1252n9647j6720L2867N6159M4136l769
35476A45224o0232p2926m1322l7381p9818o2735P8809K03998J26947r2700k03233
35465i5369j12802K443p222n1474J2546J32338J46925L3103p6445q1968j2033
35454a09958N2605O6124L3286q112k4982k9561n3802p7141m1116M4703Q8046M3698
$$ y = [18116, 19826, -29344, -86040, -53500, 62922, 129959, 68590, -35909, -74374, -63460, -62588, -38160, 62469, 167736, 152823, 25361, -83161, -93887, -37961, 38047, 103591, 98463, -12134, -134106, -125631, 1300, 83763, 33802, -66047, -125589, -167926, -224963, -240183, -169554, -84053, -71345, -102984, -92896, -34704, 10165, 21894, 31146, 40392, 16287, -42735, -90188, -84689, -23842, 64477, 134464, 143450, 92198, 32551, 15831, 48698, 104857, 148993, 145224, 84992, 12066, -29256, -66637, -146455, -209190, -130381, 73617, 200564, 107864, -95369, -208171, -205728, -212950, -264424, -251878, -119540, 27385, 60488, -15957, -97925, -109958, -57353, 8771, 42057, 33945, 8963, -20598, -74400, -151541, -192657, -147954, -59908, -16210]
35442a6210j7685k0281R445M695l6266o7734o5152k4151N0442J08176P6966k3689
35430b1444p5038k7075J9303j9049n9748M059J03250Q8142k7018q3201k7829K0590
35418a05058j4523m6410J5933J08738J06484K278r1875r1193j7766N2765P6590
35407d037O8803O4689O4838L3261m1055j07060j04366l3518N4038J11306J11667
35396B18566M5773n2783j09619q5203k1388K5376N1931O3137K3797o8480j23385
35385c2278o8037L0970N9772K4415P632P274l3883p0014j850J14556J02200n1862
35373H8895j40884m9356O8912M7624k8055J3012J25117J15365m0298j52446r5604
35362d7718L4171Q0449K3051m4018n3135k2778p663k4114k8262J9467P2396L5834
$$ y = [-16210, -33895, -54176, -44731, -40036, -76302, -144036, -209188, -233339, -182897, -74721, 2245, -21444, -96482, -123557, -104254, -123303, -183051, -178992, -75742, 12400, -14618, -97819, -125648, -105058, -119581, -165991, -150058, -41320, 65164, 67442, -24433, -115626, -133392, -80627, -4037, 64766, 129455, 194293, 227554, 186499, 79439, -24927, -58445, -4407, 106899, 218566, 264339, 211556, 101937, 16734, -4654, 20722, 72653, 135790, 159587, 91107, -32278, -100315, -69345, -9573, 14842, 22474, 29748, -4135, -74149, -75999, 38557, 140757, 88895, -51989, -101345, -32433, 15191, -12864, 148, 125265, 240630, 200332, 47886, -47718, -13547, 66902, 89953, 45935, -7200, -29978, -37641, -61755, -90017, -70550, 1846, 37680]
35350C7680q7143j60524q7090M9067R5049L4674j6421Q163N4822N8914K9973Q160
35338B5324M836Q947O684j4593m7246n5028j8987K6223L9785L0839K4274P525
35326C8583l3971o6523n6152l0173k6114k0997J7164N5327N4501M9527P4862P1670
35314A27704j1768q6186l7268O8266O6387l5645o9553N822L8417m4607j11218
35303h9649o3144K51j8400l5174L8677J03635M0454o0043m1243M4184K4647q6144
35291a41949j06322P055R0565M1630m5272o3505m0645k7577O119P6209J07522
35280i6170N0768j9413j4757L5707N1261K8785J8308K0406l549m6764n8829k2094
35268e6341K5831L7948k627o6889q5152j0719R6647J09353k392j05827p2434M5430
$$ y = [37680, -49463, -209987, -297077, -248010, -152961, -118287, -134708, -126545, -71723, -12809, 17164, 25324, 30160, 39107, 45791, 31198, -16048, -71076, -90063, -63840, -24055, 6784, 31058, 38583, 4612, -61911, -118063, -148236, -174350, -195347, -178183, -122856, -68355, -18828, 56034, 127704, 115936, 29750, -7518, 60748, 127135, 91490, 21937, 27759, 66176, 21569, -89649, -152793, -152542, -170942, -206116, -167439, -63804, -23350, -83393, -124636, -80452, -55805, -141949, -248271, -241216, -150651, -109021, -154293, -217798, -258443, -286020, -279901, -203692, -96170, -45402, -64815, -79572, -43865, 7396, 36181, 54489, 74895, 71346, 24582, -34247, -56341, -30510, 7438, 4811, -62078, -147230, -157949, -61302, 48051, 45659, -60168, -132602, -87172]
35256h7172R3469L5211j7095Q118L6597j8285j07022j13051k5924M5462K9345
35245a20347k0609k1788J6376K2290k2041n9279m4872J521M2482O7246O8951L0106
35233c9964l2043m9329J7067J05810J15840K5584q9707j47464j25003n1609K2184
35222b48634N5071N3444O8279J17058J33294N0233q1907j33631n6720N7600R8062
35211A12149N4828k401k1542j2009j5034m8797p6426m1906M3888Q8862L6412m3782
35199G4242n1951r357j5621p3446p6435J2722R4175Q6511M0192L1177L8546Q350
35187A59105l9241n4270m9073o0573o6978k4460M6854Q6332P3005K2432n6139
35176C6994j33693j37216l2211R9904J45087R5918L6355J3222L341p636K77K3187
$$ y = [-87172, 6297, 41508, 24413, 32531, 69128, 50843, -56179, -169230, -195154, -149692, -120347, -140956, -162744, -146368, -124078, -146119, -205398, -250270, -248749, -206267, -139021, -70070, -39964, -72007, -121336, -104269, 1541, 117381, 142965, 53258, -94206, -219209, -270818, -248634, -193563, -140119, -71840, 45218, 178512, 228745, 146838, 13207, -43513, 14087, 112149, 166977, 164576, 143034, 131025, 115991, 67194, -9232, -51138, -7250, 81612, 118024, 74242, 22291, 12934, -2687, -76133, -152568, -139846, -45671, 40840, 81032, 112209, 150755, 159105, 119864, 65594, 16521, -44052, -111030, -135490, -88636, -2304, 70701, 93133, 36994, -96699, -233915, -266126, -166222, -21135, 74783, 111138, 124360, 127701, 120065, 120342, 143529]
35164A43529K2138j3909m4666l1133K0306O6308O0146k867n7703l1158M6303N7957
35152B35251k7617q8132k5259P7894Q5579J8398o189J1706l4289j43872j78946
35141g5476p6647N2265Q7446M0646j5469m8632m5807N181N8964L3984n8643j04064
35129a46252n1376J1723J1044M82M2482P9594L2773n1529o7735j2411K8998K1733
35117a00474Q100J3919J5948m107l8035p3303q8872n3663K4128P8630O4220J4762
35105a38747j8849m0132o4086o2580k1898R12m0123q9392o6957O173N1208O0679
35093d23792Q1975J00855N5855l5879p6969k9083L8828O0682M8684L6702K4260
35082a17882N735n549q376k1111m3426n3882m9407m1924k0564L0583Q3987R5213
$$ y = [143529, 165667, 151758, 107092, 75959, 96265, 162573, 222719, 219852, 162149, 130991, 177294, 235251, 207634, 119502, 94243, 172137, 257716, 276114, 269925, 281631, 247342, 103470, -75476, -152123, -99858, -12412, 28234, 12765, -35867, -81674, -76493, -17529, 16455, -42188, -146252, -197628, -185905, -174861, -174379, -131897, -52303, -19530, -71059, -138794, -151205, -122207, -100474, -92374, -78455, -62507, -66614, -104649, -177952, -266824, -320487, -296359, -217729, -153509, -138747, -157596, -197728, -261814, -324394, -346292, -345380, -385503, -474895, -541852, -535679, -484471, -423792, -341817, -240962, -185107, -220986, -297955, -327038, -288210, -227528, -178844, -142142, -117882, -112147, -117696, -126072, -147183, -190609, -244491, -293898, -335822, -356386, -325803, -241816, -146603]
35070a46603P1697N6472N1849K2048l6227q8184j13310j01210k4725R9889J59714
35059d8590O4747r3925j30944j4886J01086J10489O8935M1710m446q0863r8199
35048h4886j8632L8123l0166j27778r7262L8848J20895Q8655K7202r45k6275o9058
35036a41279q8743n9917o941N0743J06937J21628N5016m4406p5639k4381J7525
35025h9457r857n9622o6401l2579N971L4463M7863M0583L0307L8448L5789k5155
35013d9647j09780j14595j2453R3756J06097M8812J645j4236k2573k3338o106
$$ y = [-146603, -74906, -18434, 33415, 55463, 19236, -68948, -182258, -283468, -308193, -208304, -48590, 16157, -77768, -208712, -223598, -122512, -12023, 56912, 98622, 94176, 13313, -84886, -103518, -65395, -95561, -223339, -320601, -281753, -160858, -72203, -45001, -45946, -72221, -141279, -230022, -289939, -296880, -246137, -139200, -17572, 37444, -6962, -82601, -106982, -89457, -99314, -158936, -225337, -257916, -251945, -217482, -169619, -129036, -98729, -60281, -24492, -49647, -159427, -274022, -286475, -192719, -86622, -37810, -36165, -50401, -72974, -96312, -102418]
$$ [...]
##END NTUPLES=NMR SPECTRUM
##END=
