##TITLE=31Pdec_LR-723-C1
 CDcl3, 24 sc
 22.9.2020
##JCAMPDX= 6.0         $$ Bruker NMR JCAMP-DX V2.0
##DATA TYPE= NMR SPECTRUM
##DATA CLASS= NTUPLES
##ORIGIN= UXNMR, Bruker Analytische Messtechnik GmbH
##OWNER= root
$$ XWIN-NMR		Version 3.5
$$ Tue Sep 22 12:16:00 2020 Russian Standard Time (UT+4h)  she@DPX200
##.OBSERVE FREQUENCY= 81.013821
##.OBSERVE NUCLEUS= ^31P
##.ACQUISITION MODE= SIMULTANEOUS
##.ACQUISITION SCHEME= undefined
##.AVERAGES= 24
##.DIGITISER RES= 17
##SPECTROMETER/DATA SYSTEM= spect
##.PULSE SEQUENCE= zgpg30
##.SOLVENT NAME= CDCl3
##.SHIFT REFERENCE= (INTERNAL, CDCl3, 0, 182.463)
##AUDIT TRAIL= $$ (NUMBER, WHEN, WHO, WHERE, WHAT)
$$ ##TITLE= Audit trail, XWIN-NMR		Version 3.5
$$ ##JCAMPDX= 5.01
$$ ##ORIGIN= Bruker BioSpin GmbH
$$ ##OWNER= she
$$ F:/spectra/data/she/nmr/P31/1/pdata/1/auditp.txt
$$ ##AUDIT TRAIL=  $$ (NUMBER, WHEN, WHO, WHERE, WHAT)
(   1,<2020-09-22 12:14:06.87 +0400>,<she>,<DPX200>,
      <created by zg, POWCHK disabled, PULCHK disabled
       configuration hash MD5:
       00 E9 B6 7A A2 85 ED C7 34 08 36 98 17 FE 4E 26
       data hash MD5: 32K
       5D D5 1E D5 B9 3C 74 D9 1C 99 0F 06 D5 AC D1 B4>)
(   2,<2020-09-22 12:14:09.25 +0400>,<she>,<DPX200>,
      <Start of raw data processing
       efp BC_mod = 2 LB = 1 FT_mod = 6 PKNL = 1 PHC0 = -2738.438 PHC1 = 61.40167 SI = 64K 
       data hash MD5: 64K
       B1 EC 29 B2 54 50 C5 ED 32 CE 1C 16 55 03 8C 77>)
(   3,<2020-09-22 12:14:33.67 +0400>,<she>,<DPX200>,
      <pk PHC0 = -7.295003 PHC1 = 18.6 
       data hash MD5: 64K
       98 E2 8F 2C CB F5 EE F0 2B 5B E8 41 D0 BA 47 DC>)
(   4,<2020-09-22 12:14:37.98 +0400>,<she>,<DPX200>,
      <abs ABSG = 5 
       data hash MD5: 64K
       B3 0D 93 54 37 F3 3F 09 6F 4D 78 02 0A 77 8D D5>)
$$ ##END=
$$ 
$$ hash MD5
$$ 48 07 53 74 7D A6 BC C8 2C 02 11 A1 E9 33 FA 60
##$RELAX= 
##$RELAX= 
##$RELAX= 
##$RELAX= 
##$RELAX= 
##$RELAX= 
##$RELAX= 
##$RELAX= 
$$ Bruker specific parameters
$$ --------------------------
##$DU= <F:/spectra>
##$EXPNO= 1
##$NAME= <P31>
##$PROCNO= 1
##$TYPE= <nmr>
##$USER= <she>
##$AMP= (0..31)
100 100 100 100 100 100 100 100 100 100 100 100 100 100 100 100 100 100 
100 100 100 100 100 100 100 100 100 100 100 100 100 100 
##$AQSEQ= 0
##$AQ_mod= 1
##$AUNM= <au_zg>
##$AUTOPOS= <>
##$BF1= 81.014009
##$BF2= 200.13
##$BF3= 200.13
##$BF4= 200.13
##$BF5= 200.13
##$BF6= 200.13
##$BF7= 200.13
##$BF8= 200.13
##$BYTORDA= 1
##$CFDGTYP= 0
##$CFRGTYP= 5
##$CHEMSTR= <none>
##$CNST= (0..31)
1 1 145 1 1 1 1 1 1 1 1 1 1 1 1 1 1 1 1 1 1 1 1 1 1 1 1 1 1 1 1 1 
##$CPDPRG= <waltz16>
##$CPDPRG1= <>
##$CPDPRG2= <waltz16>
##$CPDPRG3= <>
##$CPDPRG4= <mlev>
##$CPDPRG5= <mlev>
##$CPDPRG6= <mlev>
##$CPDPRG7= <mlev>
##$CPDPRG8= <mlev>
##$CPDPRGB= <>
##$CPDPRGT= <>
##$D= (0..31)
0 1 0 0 0 0 0 0 0 0 0 0.03 2e-05 3e-06 0 0 0 0 0 0 0 0 0 0 0 0 0 0 0 0 
0 0 
##$DATE= 1600762446
##$DBL= (0..7)
120 120 120 11 120 120 24 19 
##$DBP= (0..7)
150 150 150 150 150 150 150 150 
##$DBP07= 0
##$DBPNAM0= <>
##$DBPNAM1= <>
##$DBPNAM2= <>
$$ [...]
##$SUBNAM3= <"">
##$SUBNAM4= <"">
##$SUBNAM5= <"">
##$SUBNAM6= <"">
##$SUBNAM7= <"">
##$SUBNAM8= <"">
##$SUBNAM9= <"">
##$SW= 369.568048894756
##$SWIBOX= (0..15)
0 1 3 0 0 0 0 0 0 0 0 0 0 0 0 0 
##$SW_h= 29940.119760479
##$TD= 32768
##$TD0= 1
##$TE= 0
##$TE2= 300
##$TE3= 300
##$TEG= 300
##$TL= (0..7)
0 120 53 12 22 120 120 120 
##$TP= (0..7)
150 150 150 150 150 150 150 150 
##$TP07= 0
##$TPNAME0= <>
##$TPNAME1= <>
##$TPNAME2= <>
##$TPNAME3= <>
##$TPNAME4= <>
##$TPNAME5= <>
##$TPNAME6= <>
##$TPNAME7= <>
##$TPOAL= (0..7)
0.5 0.5 0.5 0.5 0.5 0.5 0.5 0.5 
##$TPOFFS= (0..7)
0 0 0 0 0 0 0 0 
##$TUNHIN= 0
##$TUNHOUT= 0
##$TUNXOUT= 0
##$USERA1= <user>
##$USERA2= <user>
##$USERA3= <user>
##$USERA4= <user>
##$USERA5= <user>
##$V9= 5
##$VALIST= <valist>
##$VCLIST= <CCCCCCCCCCCCCCC>
##$VD= 0
##$VDLIST= <DDDDDDDDDDDDDDD>
##$VPLIST= <PPPPPPPPPPPPPPP>
##$VTLIST= <TTTTTTTTTTTTTTT>
##$WBST= 1024
##$WBSW= 4
##$XGAIN= (0..3)
0 0 0 0 
##$XL= 0
##$YL= 0
##$YMAX_a= 34465
##$YMIN_a= -31985
##$ZGOPTNS= <>
##$ZL1= 120
##$ZL2= 120
##$ZL3= 120
##$ZL4= 120
##$ABSF1= 182.463
##$ABSF2= -187.1042
##$ABSG= 5
##$ABSL= 3
##$ALPHA= 0
##$AQORDER= 0
##$ASSFAC= 0
##$ASSFACI= 0
##$ASSFACX= 0
##$ASSWID= 0
##$AUNMP= <proc_1d>
##$AZFE= 0.1
##$AZFW= 0.5
##$BCFW= 0
##$BC_mod= 2
##$BYTORDP= 0
##$COROFFS= 0
##$CY= -3
##$DATMOD= 1
##$DC= 0
##$DFILT= <>
##$DTYPP= 0
##$F1P= 0
##$F2P= 0
##$FCOR= 1
##$FTSIZE= 65536
##$FT_mod= 6
##$GAMMA= 0
##$GB= 0
##$INTBC= 1
##$INTSCL= 5.30512e-09
##$ISEN= 30
##$LB= 1
##$LEV0= 0
##$LPBIN= 0
##$MAXI= 10000
##$MC2= 0
##$MEAN= 0
##$ME_mod= 0
##$MI= 50
##$NCOEF= 0
##$NC_proc= -3
##$NLEV= 6
##$NOISF1= 182.463
##$NOISF2= 159.3651
##$NSP= 0
##$NTH_PI= 0
##$NZP= 0
##$OFFSET= 182.463
##$PC= 4
##$PHC0= -2745.733
##$PHC1= 80.00167
##$PH_mod= 1
##$PKNL= yes
##$PPARMOD= 0
##$PSCAL= 0
##$PSIGN= 0
##$REVERSE= no
##$SF= 81.0140089999434
##$SI= 65536
##$SIGF1= 159.3651
##$SIGF2= -187.1042
##$SINO= 113.3802
##$SIOLD= 16384
##$SREGLST= <1H.CDCl3>
##$SSB= 0
##$STSI= 65536
##$STSR= 0
##$SW_p= 29940.119760479
##$SYMM= 0
##$S_DEV= 0
##$TDeff= 32768
##$TDoff= 0
##$TI= <>
##$TILT= no
##$TM1= 0
##$TM2= 0
##$TOPLEV= 0
##$USERP1= <user>
##$USERP2= <user>
##$USERP3= <user>
##$USERP4= <user>
##$USERP5= <user>
##$WDW= 1
##$XDIM= 65536
##$YMAX_p= 443505806
##$YMIN_p= -2890873
$$ End of Bruker specific parameters
$$ ---------------------------------
##NTUPLES= NMR SPECTRUM
##VAR_NAME=  FREQUENCY,     SPECTRUM/REAL,   SPECTRUM/IMAG
##SYMBOL=    X,             R,               I
##VAR_TYPE=  INDEPENDENT,   DEPENDENT,       DEPENDENT
##VAR_FORM=  AFFN,          ASDF,            ASDF
##VAR_DIM=   65536,         65536,           65536
##UNITS=     HZ,            ARBITRARY UNITS, ARBITRARY UNITS
##FACTOR=    0.456856943014862, 1,           1
##FIRST=     14782.0589164792, 0,            0
##LAST=      -15158.0608439998, 0,           0
##MIN=       -15158.0608439998, -2890873,    0
##MAX=       14782.0589164792, 443505806,    0
$$ Real data points
##PAGE= N=1
##DATA TABLE= (X++(R..R)), XYDATA
$$ [...]
##PAGE= N=2
##DATA TABLE= (X++(I..I)), XYDATA
43512 372672 359301 457179 565962 515200 346611 237653 244111 321073 485973 724018 830732
43501 830732 628464 295528 194430 368735 489827 349248 128982 76937 156730 186595
43491 186595 155912 205570 360999 451182 313666 6369 -219563 -166699 88469 268145
43481 268145 217686 86365 117053 339485 581671 713498 740986 706346 638307 575849 518976
43470 518976 399899 223826 154848 292760 450644 377665 146767 60970 191422 297721
43460 297721 245137 197567 283941 350495 219524 -20603 -174378 -222330 -255864 -257948 -140478
43449 -140478 76741 282856 417264 474110 428498 271067 67715 -98476 -193002 -193219 -85161
43438 -85161 46450 49659 -90831 -203700 -171694 -86099 -59612 -40515 46500 127883 132266
43427 132266 181056 403470 648547 632683 354947 128511 166445 342143 425593 378940
43417 378940 316883 304922 318803 338583 377319 428654 446045 380563 228399 56533 -18239
43406 -18239 88858 345642 607913 722957 640454 439033 251294 157388 154191 218618 349916
43395 349916 521424 655715 709780 718818 678777 489201 157885 -45944 117796 464339
43385 464339 572810 392775 325601 584174 828662 687814 340407 227250 383599 455583
43375 455583 292884 125914 137012 214169 224590 241515 369308 566167 766500 991061
43365 991061 1209399 1260514 1059085 768286 632994 708724 848930 895778 805739 644635
43355 644635 526591 519151 573473 589571 551271 523499 519457 472856 359877 246901 190306
43344 190306 183640 225028 334619 479026 577748 605234 586538 492945 282092 61209 46302
43333 46302 295940 626939 855715 976378 1035552 1005634 891143 800637 783150 738540 621886
43322 621886 572527 669513 727430 566962 351652 370347 565724 604338 412256 298928
43312 298928 455581 648448 593557 381179 284946 327996 319056 229914 246403 430502 577875
43301 577875 497871 267294 105411 108599 202764 281652 306064 311393 376544 543060 723272
43290 723272 749523 571537 346916 266803 342066 439674 481557 501862 526319 513212 443439
43279 443439 378415 376056 400987 364748 232010 64455 -24766 36832 204534 341368 355046
43268 355046 287914 223087 145306 -8796 -184885 -228538 -101759 38151 44557 -24341 -189
43257 -189 162854 329249 339544 187764 44776 82527 238134 226675 -92368 -438146 -412557
43246 -412557 -61006 156430 24177 -126718 30037 279846 217546 -86213 -187136 50787
43236 50787 299467 313659 236567 255774 310171 310398 351365 486008 516722 252241 -177098
43225 -177098 -469108 -500349 -357091 -145024 47081 111461 52683 69076 304994 594838
43215 594838 657064 480549 294877 196853 64875 -132196 -207334 -48541 170299 232171
43205 232171 188641 252508 462177 637274 651476 581331 544743 530516 476626 424609 471119
43194 471119 590790 626863 483990 239726 27744 -99209 -132993 -35596 193392 437965
43184 437965 570121 593096 573122 488333 295491 101303 70029 155763 138148 -24265 -92712
43173 -92712 96619 373760 475837 383065 253748 169320 128130 173709 322519 439916
43163 439916 389206 256067 237291 346115 415755 366251 274101 187778 69454 -67578 -146083
43152 -146083 -168891 -201315 -195340 -25372 263179 443457 416360 339610 356021 380102 285259
43141 285259 142718 111379 196115 270604 273843 257356 291316 421824 650842 860744 845624
43130 845624 544428 178086 23477 97970 194633 185036 141529 172717 280507 403820 494464
43119 494464 518843 465975 378263 314499 278871 245183 236065 298037 400806 444768 384254
43108 384254 281662 231366 277973 393710 476973 404072 169151 -48947 -61832 92072
43098 92072 192306 120876 -10828 -34588 94739 321791 568295 735913 749098 661932
43088 661932 617726 642419 602348 446375 341482 428349 566433 507807 253040 39663
43078 39663 8789 78450 146472 215046 267136 209982 35210 -114569 -145459 -155186 -260031
43067 -260031 -382183 -346412 -128496 119147 254110 245435 120452 -67912 -218259 -231678
43057 -231678 -118215 9442 65203 62958 58633 77137 111444 146657 164326 152223 123855
43046 123855 110838 131780 178241 223017 234817 203575 158422 134128 118754 79499 43845
43035 43845 86533 212746 330657 379172 401832 441828 453997 396300 321223 284165 246138
43024 246138 175280 157791 271488 421369 456266 394161 366025 383845 353697 289464 298314
43013 298314 349557 288631 128679 98924 310100 575511 677816 629808 549737 462066 370534
43002 370534 360792 459428 531937 487785 441189 483992 460204 215039 -57976 -23886 286217
42991 286217 486482 382075 211006 254354 468958 650999 746550 805425 771609 540330
42981 540330 183410 -54224 -3416 271754 565985 720409 727709 699842 726313 748701 617211
42970 617211 297725 -39024 -190494 -135817 -10517 88928 183545 303789 402336 418592
42960 418592 371053 329518 322466 322090 306112 279293 234435 156711 89952 130326 298895 476877
42948 476877 547296 559846 649571 804805 839419 629727 277538 -10414 -120288 -64434
42938 -64434 87525 241544 320009 345701 429142 612285 785492 819600 720981 602905 567515
42927 567515 655474 820845 909188 780645 526756 425540 573248 711073 577276 294793
42917 294793 194496 341256 480180 433778 316516 309750 407036 455260 338354 84343
42907 84343 -132438 -114365 144978 422985 550658 632216 817895 981854 892224 636942
42897 636942 558963 746248 907691 840741 709150 708258 741830 643572 493831 472929 552395
42886 552395 564817 481538 419230 442119 522438 623340 676778 571715 320829 148267 241293
42875 241293 488840 637812 640561 659347 768532 851134 799368 653661 514529 440553 452167
42864 452167 529130 589732 564459 497142 491768 561250 607709 551323 411881 269629 200326
42853 200326 231251 314493 371488 395047 449921 540670 572912 504694 426332 403257 360301
42842 360301 244290 180693 299938 497776 561597 480385 425472 448246 418536 293131 232772
42831 232772 358626 549067 594843 458014 268797 128060 23725 -63231 -58080 141681
42821 141681 500750 801222 828134 590842 290327 78366 -45764 -104178 -70294 18201
42811 18201 54553 65851 229392 545358 703321 500370 214959 271319 642935 910203
42801 910203 858302 683089 599653 588691 601410 689959 801995 729693 435016 194592 238101
42790 238101 432016 502749 407723 300028 268479 306939 428984 614807 715704 593988
42780 593988 323921 112616 54087 78534 104447 125507 170886 267859 419447 564199 611180
42769 611180 562088 520351 529834 508365 405605 304442 276428 263467 214021 208525 312493
42758 312493 422563 415102 347424 348833 407930 444909 501090 649300 786956 750742 605508
42747 605508 581920 723902 832700 793619 723396 721572 699328 572551 440598 434801 529726
42736 529726 635278 748735 874086 899353 716592 405125 154666 43748 11095 2403
42726 2403 17455 35554 19672 -6249 10384 45228 32669 12471 120708 392064 669101
42715 669101 771151 689553 560743 500985 527522 602671 687782 757333 795051 774629 645445
42704 645445 382603 69596 -130696 -138180 -43660 15917 16797 12799 -507 -71589 -163207 -162743
42692 -162743 -42391 99041 184270 242570 308547 347961 345687 361517 419022 433921 341277
42681 341277 206174 118914 78813 85794 227656 519625 757371 729783 524542 413677
42671 413677 460839 466854 319462 164117 157331 253593 335026 382790 415076 399705 330341
42660 330341 267569 229296 174439 151736 284152 519816 606582 449198 283608 318925 412330
42649 412330 332741 164112 153296 281913 314117 211819 174274 267854 339463 344458 445578
42638 445578 683892 839469 765973 615320 562093 532551 408675 298792 355917 471902
42628 471902 427633 268948 251850 426689 552758 485677 400108 493957 661923 652729 448579
42617 448579 286582 321771 451988 524283 560437 665404 805926 827669 674271 456085
42607 456085 280430 138658 15666 -9971 122743 330773 489442 601826 739707 864679
42597 864679 866555 772880 750742 856683 937500 856841 687798 572838 496832 336468 84672
42586 84672 -107254 -109721 57360 278981 444172 478738 361511 161567 28159 88789
42576 88789 329444 576666 628237 442010 194718 113104 241722 423330 509559 511676 505391
42565 505391 476268 359156 191915 112368 179216 283172 288096 206646 171144 251813 375048
42554 375048 440722 462898 538736 698608 851834 892985 805289 633151 412627 178743
42544 178743 -11650 -134817 -238700 -347554 -368443 -205086 50757 181970 133767 100579
42534 100579 247665 469285 548652 475896 452604 602470 824387 955476 952572 856534 684157
42523 684157 451936 250609 188953 262714 355804 388576 403838 478072 603205 704869 737180
42512 737180 696697 572493 371270 192767 174681 313227 426301 369765 218187 138848
42502 138848 154312 160931 146015 222026 417507 584422 586501 466190 343187 250290 173864
42491 173864 171412 310941 523476 642265 597647 481713 412834 421795 482690 561766 595075
42480 595075 500567 286993 109577 134351 339295 508938 461425 254219 121726 209700
42470 209700 417793 532461 473322 347011 278090 279031 315909 406675 561740 674366 592110
42459 592110 323643 83263 66343 229451 361559 344886 260238 228066 241949 221998 163227
42448 163227 130414 132948 116015 80541 92937 142318 118254 5482 -27823 142398 385991
42437 385991 487231 437610 378536 320226 151821 -76934 -143066 12189 167929 154711
42427 154711 83790 104221 145375 100817 85740 256795 495383 546401 414828 349887 444649
42416 444649 523897 470569 402305 428452 460266 399823 335875 393295 519838 581163 573416
42405 573416 590037 643026 659435 616434 556756 497252 430314 391671 421898 475477 467828 409223
42393 409223 403364 510940 689744 862878 964138 922898 708531 421616 254524 304830
42383 304830 473559 586163 571064 481766 387561 302006 210295 119389 62904 69156 135389
42372 135389 236743 356275 487124 592520 590559 423346 146951 -81462 -126766 17083
42362 17083 230754 357285 305042 117259 -47730 -51515 81749 189978 164632 79145 87020
42351 87020 226411 386278 454369 429846 373343 311905 244340 202997 241849 358506 479988
42340 479988 549316 587971 635147 653286 559660 365993 220533 248290 380601 430111 344172
42329 344172 284000 386293 530062 466966 163659 -126445 -177835 -61240 -12619 -122827
42319 -122827 -271708 -318467 -227112 -17051 271762 529896 615407 511098 366197 316350
42309 316350 332663 316238 263687 240316 250138 256402 297387 434211 573696 503690 181580
42298 181580 -139249 -185888 13929 209620 257810 220208 163764 56319 -88508 -139023
42288 -139023 -33216 89881 86111 32116 86612 200192 179050 28175 -4883 200586 438453
42277 438453 474511 371675 350863 461902 583679 654581 694256 659334 505266 372255
42267 372255 471827 755675 922605 824237 649920 604691 611345 492683 283359 158451
42257 158451 147981 121056 13963 -96944 -141052 -132324 -97369 -37244 27115 55115 39254
42246 39254 2811 -37456 -61082 -40332 5030 17242 21615 139257 389150 591459 600015
42235 600015 519439 518856 535586 395632 166188 111507 286164 450127 461782 488640 690045
42224 690045 920870 942566 770238 616285 595198 654161 706872 678202 503978 251841
42214 251841 162673 389872 751283 923007 840509 715431 678272 627524 470951 304111
42204 304111 249790 277637 298046 318853 388490 460939 434103 291364 128044 59074 136618
42193 136618 307382 416916 333949 128251 43003 208563 457952 529554 392348 246412
42183 246412 241223 341040 468367 619912 778641 841149 738210 557308 444145 416595
42173 416595 365764 231848 100354 102871 262716 459337 539845 473003 391582 448754 624604
42162 624604 728914 626385 400989 245310 241421 320529 390555 412486 380668 330161 354160
42151 354160 508228 688668 711806 540242 330196 218099 163105 60527 -80219 -152625
42141 -152625 -90904 76237 262123 358824 292479 103349 -69292 -125273 -80783 13248 143352
42130 143352 279893 354868 368632 421449 552099 651544 647467 658121 805428 973209 951245
42119 951245 763678 631671 619177 550993 333339 134593 137344 281572 386182 399394
42109 399394 388859 370026 290341 154960 53112 47655 97322 104124 29156 -36472 49757
42098 49757 288601 477601 433524 224391 49010 -62850 -234510 -438568 -461888 -252808
42088 -252808 -56005 -48952 -59320 148805 477238 628992 534871 392930 338469 323272 313206
42077 313206 369847 496779 593921 608787 578285 502258 345969 192872 210249 411894 628487
42066 628487 764229 890810 1016489 986560 754294 547309 566530 675507 615671 414137
42056 414137 316452 370383 357126 160971 -47500 -76937 48426 216805 397522 552811
42046 552811 560852 399784 270027 337862 461465 390058 164363 64672 168094 228196 71979
42035 71979 -127656 -122466 54703 186460 199089 201637 265219 346025 406199 456223 474803
42024 474803 412819 289718 191571 171387 225908 346003 502988 612111 598499 472533
42014 472533 271863 4574 -247485 -276432 21350 427286 612916 534061 408646 343778
42004 343778 246896 113937 102737 222628 227425 -24691 -325469 -399760 -252148 -74024
41994 -74024 14722 -32321 -255036 -555892 -668395 -477704 -238746 -255851 -474146 -626513
41984 -626513 -667761 -787075 -1053751 -1321037 -1456599 -1422910 -1150936 -593240 75267 541274
41974 541274 684732 651355 592334 528758 476427 483457 503639 428455 284811 220363 270294
41963 270294 329091 364161 436296 486473 359803 110015 18644 195021 395099 377818 219134
41952 219134 108839 47173 -49089 -102782 32225 326683 610656 783848 843159 787195
41942 787195 651884 571304 648300 808011 896634 864625 749690 572699 380019 293120
41932 293120 361022 442689 401657 347404 490612 790527 950482 796284 499187 365031
41922 365031 508633 784574 962641 931597 774143 659622 652495 663769 611070 540545 523283
41911 523283 522430 468157 388530 342457 288613 167531 70068 158704 424722 678136 797993
41900 797993 847703 901957 897432 737564 461640 230931 179439 307860 485752 548160 442242
41889 442242 289386 254413 355576 462546 474223 418390 366060 335791 321515 341906 402692
41878 402692 452204 434321 371802 350746 421127 548580 676273 796669 918719 986258 912652
41867 912652 725461 585158 584690 617528 559527 491236 558690 675793 615275 403572 340019
41856 340019 534536 716712 667034 553206 597388 673377 565939 426758 563238 877074
41846 877074 956616 734749 616488 839881 1107952 1060542 793735 654530 743961 883056
41836 883056 923174 855066 708401 542710 466685 507561 536812 460353 382039 431523 542476
41825 542476 582611 606004 757195 971820 1002953 768944 488978 417240 573569 783740
41815 783740 878585 809188 650359 531371 512433 522941 467135 358353 274221 223179 165936
41804 165936 137748 208669 320889 318471 181562 86706 156123 273227 260530 147979 121645
41793 121645 241969 357119 321423 191183 143306 259536 453174 580843 571224 455305
41783 455305 328442 296003 403174 577939 674966 624893 521941 504839 557716 511554 281303
41772 281303 28070 -669 226900 471069 493893 328433 221398 334452 574069 737967
41762 737967 760590 736345 732131 698631 607897 558332 629692 707388 600967 321851 93468
41751 93468 61599 136442 172796 167842 194268 256899 326063 420620 540525 594184 519409 415694
41739 415694 423448 519160 569303 548910 552100 607249 653569 705419 849323 1029517 1031852 787986
41727 787986 528451 483578 559655 493354 249603 63318 96430 243683 326553 325169 330674
41716 330674 374498 409948 410259 394484 377784 364031 374459 424198 473289 452196 344100 207260
41704 207260 113435 97239 163037 290624 411962 428916 304750 125175 22957 38847
41694 38847 97365 129457 166745 270849 407044 463960 405373 328963 333129 382861 373255 290962
41682 290962 230778 257657 333323 393971 424040 429607 422334 468913 658954 946838 1115254
41671 1115254 1010330 750402 569326 500799 384661 172863 26077 45486 100453 49048
41661 49048 -20014 67120 275854 395409 329764 195723 131851 145374 166574 148773 98062
41650 98062 85973 221891 518107 802458 881755 779663 681927 657497 601553 473168 386825
41639 386825 383366 310531 88167 -69141 90187 464481 703452 682764 629609 717494 775068
41628 775068 566948 206636 51873 222147 448937 463222 328563 252009 232810 129958
41618 129958 -3819 50870 282097 373644 178264 -4081 136540 424801 472158 296030
41608 296030 256760 414467 411643 109097 -107123 91270 446033 507937 302226 216292
41598 216292 384327 576887 629361 602577 527119 347505 167591 219442 492233 679828
41588 679828 609184 455633 407992 387727 274051 164674 185693 222347 84384 -172931
41578 -172931 -318597 -261990 -99074 90836 285732 392606 293250 49766 -96198 16048
41568 16048 298566 524896 532202 325560 67704 -42329 48311 204343 292484 341714 431647
41557 431647 523219 543625 550853 621186 631067 390716 1761 -172539 22787 316927 393413
41546 393413 296887 289860 446661 594144 591222 481678 380633 355211 428840 590154 769318
41535 769318 875540 880465 836236 824213 901693 1048702 1141165 1054160 838620 700185 729163
41524 729163 760005 613515 376725 282582 377875 494356 529890 574301 729016 954120
41514 954120 1137765 1200784 1109083 899858 712244 667590 702562 651243 504912 438256 552027
41503 552027 756652 953104 1143123 1286217 1244879 999118 751189 673208 686910 632991
41493 632991 522107 461142 454132 445034 453649 506573 539827 534590 624429 869477 1047588 913152
41481 913152 575990 366552 391493 496194 612987 822371 1057157 1080634 849766 615498
41471 615498 554347 562193 527761 539276 661183 756839 729068 722761 875319 1050286 1047932
41460 1047932 928335 887385 935068 943884 921537 969494 1015690 861977 530032 330479 495557
41449 495557 882893 1129449 1026704 696633 439913 431340 559612 597113 507750 467191
41439 467191 553447 597698 457281 265651 228440 303159 303322 234494 280865 484476 673951
41428 673951 730880 720849 723955 723187 712343 745686 817000 834620 777977 743887 771978 751237
41416 751237 581628 331727 158738 140746 241217 372854 449811 432607 358983 295190
41406 295190 256890 225126 213289 240553 265145 239190 207306 242706 305069 288779 211296
41395 211296 221305 397833 655892 870762 986670 990349 894895 771157 686803 603611 447902
41384 447902 278419 240824 341097 418962 382915 318296 309158 303926 233547 133732 71328
41373 71328 59359 109884 256805 456693 574097 535977 411780 296985 220718 199053 248249
41362 248249 301159 249966 122031 67294 126009 183768 214116 348885 597602 727338 600601
41351 600601 432720 489567 690865 769959 707415 714259 836298 877406 749169 629143 673131
41340 673131 776064 749712 596305 465525 423997 406657 372069 382388 490935 627680
41330 627680 675092 638627 648154 757302 842348 787945 675646 640698 620956 462478 244748
41319 244748 229532 429687 513250 284598 8529 39206 320916 507443 443854 275200
41309 275200 162020 133232 175437 248188 238103 89685 -50210 4838 219316 409045
41299 409045 504087 540262 473090 251818 30517 31841 206276 291664 214677 150722 162989
41288 162989 102074 -49611 -57045 183536 421804 420202 310711 351043 509075 550519 427162
41277 427162 325622 375602 514777 626201 653214 597795 529473 558200 686429 750490 633309
41266 633309 457087 405657 424736 302417 29092 -142889 -49454 165416 274539 259952
41256 259952 252874 287123 266783 145908 5603 -60969 -41332 39861 160337 246719 175151
41245 175151 -70933 -288999 -230608 100250 432500 544486 479483 385898 280380 106979
41235 106979 -63581 -82154 47616 158879 166854 170358 258451 357965 358538 284822 249605 301042
41223 301042 394493 468700 489818 460277 427166 441476 484627 490247 455280 453541 511471 552687
41211 552687 502231 366667 184443 -1698 -89094 35582 315346 517293 510559 433716
41201 433716 463973 541186 494212 354480 328180 470691 595413 550507 415052 344112 351927
41190 351927 343441 273978 189661 158213 215388 336194 430051 426169 385042 437321 580502
41179 580502 656829 606251 602043 785857 974555 851414 431512 101768 125287 311835
41169 311835 319812 123003 -16881 53960 231877 377039 472976 531755 525961 488690 530715
41158 530715 670679 776303 766433 746138 825900 919691 869269 694547 568037 578926 661938
41147 661938 739070 797567 824625 781635 667178 530773 418885 361009 381195 458813 518214
41136 518214 525657 537783 575738 539908 371942 215543 251684 428588 530344 476302 369141
41125 369141 277450 182105 135490 242652 440095 512548 402186 297853 330572 383157 320277
41114 320277 222782 243929 373220 489531 541645 550030 524351 486491 484419 502185 469715
41103 469715 433397 559901 860953 1081144 1015770 799642 703393 759204 781970 679893
41093 679893 548749 499379 558378 711707 908777 1055258 1113282 1150099 1183589 1084859 784499
41082 784499 468450 372150 455408 497617 466119 547781 811164 1077629 1189548 1201642 1208737
41071 1208737 1146302 893091 490697 155666 90537 311937 635722 830801 822750 729870
41061 729870 680724 673180 665025 681950 714679 628280 356988 104989 130883 367683 492186
41050 492186 378662 243091 286556 433605 528084 579328 667765 763055 792483 781414 783615
41039 783615 755995 634867 471591 366919 315690 233442 114834 66276 180882 439070
41029 439070 718497 863661 788963 571218 405918 415391 533185 631722 714057 883587
41019 883587 1134669 1283287 1164087 840195 543981 423016 419168 416337 417132 486240 574491
41008 574491 539168 360189 209044 238465 400489 542090 588543 556705 487694 461273 569747
40997 569747 752801 762114 454056 42931 -120177 22761 214978 266258 248908 294497
40987 294497 397610 492291 568965 636833 682053 718226 779674 834858 814802 746257 730766
40976 730766 767847 738724 604881 478523 438347 417376 354336 329368 442993 640999 755038
40965 755038 680611 471236 295207 303045 475993 621733 599417 502351 494574 529920 432546
40954 432546 236239 196772 408182 638676 657118 525661 439350 446162 470911 480608 483356
40943 483356 464780 438574 464210 530853 538080 462797 403140 380674 272763 51181 -91546
40932 -91546 -1671 201775 304668 278070 242811 286611 441004 688177 868907 772199 462612
40921 462612 298973 441208 588632 467057 316444 522192 948543 1085525 793225 460122
40911 460122 399676 500564 564613 617366 729940 833418 879183 948280 1055146 1054047 876007
40900 876007 665343 560413 530204 537392 647655 837369 906379 760846 603268 649505
40890 649505 806969 831410 679561 505822 407476 375058 424683 579092 751236 821167
40880 821167 808921 821238 854455 806930 673876 569230 537522 490107 370756 262512 263415
40869 263415 335767 350710 254615 148190 196858 458022 794147 989346 968800 854369
40859 854369 777823 719031 600704 466455 437370 510379 531026 404569 238652 212313 355566
40848 355566 525286 585720 556980 560975 645623 713032 652014 507012 444794 545007 697431
40837 697431 748418 687922 628158 638119 674645 664284 586862 476958 398396 422144 572396
40826 572396 769925 868832 785756 583854 410779 359065 400423 452228 483270 529655 615949
40815 615949 705878 753381 759873 740715 681830 597509 585646 714928 872602 863893 691738
40804 691738 587784 691774 854334 888104 871180 995851 1198862 1199364 923319 648219
40794 648219 628860 772866 822856 707558 550531 446351 412636 489806 686402 847116
40784 847116 773901 505759 306452 327245 439172 458806 379247 288841 217902 190482 285192
40773 285192 481695 563757 378049 120992 141366 464094 735408 695006 499922 470406
40763 470406 669157 878586 913200 814155 744359 774484 794829 641360 329692 114548
40753 114548 215475 509512 647266 493690 282519 268578 407028 497303 481344 428871
40743 428871 349779 221763 136540 219879 427804 592073 655116 700572 763787 785296 764394
40732 764394 783991 839678 805049 635561 470128 449809 550334 675831 806260 943846
40722 943846 1000879 879328 641181 484912 527569 675582 744028 671831 581175 615265 742094
40711 742094 770317 587291 336774 293410 561418 948519 1151083 1037436 750431 557747
40701 557747 599674 768421 841112 720732 505402 341891 310838 464568 820702 1224619
40691 1224619 1370336 1132219 786139 706982 895270 1010949 860718 618976 517945 548391
40681 548391 588081 640275 766735 891428 862348 689111 567816 637095 806841 884422
40671 884422 822403 772097 879939 1087257 1198259 1128222 985998 886450 800445 670104
40661 670104 560488 568942 660350 729243 764111 807945 818964 737593 641306 644868 680158 583014
40649 583014 389323 323329 473460 702475 909156 1132334 1328907 1313255 1052398 797941
40639 797941 767264 882504 978239 1070730 1229584 1357042 1328355 1241391 1301544 1518879 1708295
40628 1708295 1743851 1652329 1506130 1375060 1332031 1360931 1313425 1101677 876113 858104
40618 858104 1042605 1218190 1240459 1132977 954827 734706 533461 431225 443807 548973
40608 548973 759874 1057132 1299876 1355265 1291238 1288662 1373285 1389680 1249863 1056974 947006
40597 947006 932842 948742 950104 924836 873673 805759 711859 556533 347091 170231 93469
40586 93469 84057 104644 210783 432847 633329 641095 493311 385264 399385 448006 478732
40575 478732 555246 696916 799167 779314 685164 607775 585358 624570 713717 789104 792236
40564 792236 775951 837827 937294 920661 759499 609905 573709 555406 453203 354294 405255
40553 405255 577184 697995 675795 576702 504241 496543 533631 571500 571397 547827 575125 697077
40541 697077 844398 893854 804900 653461 532404 464563 425844 410978 438072 501824 564973
40530 564973 608360 652999 705181 716109 644403 529625 440181 374238 294755 235802 254709
40519 254709 287172 208758 75566 120541 411899 687183 678511 464500 320674 334255 377626
40508 377626 386769 425180 483552 450926 336287 325180 525190 786894 870495 715712 484324
40497 484324 381931 469963 625807 685744 630742 574694 560471 496232 358885 295610 385598
40486 385598 463436 375175 261528 336040 503759 504796 362692 347953 513027 629127 629400
40475 629400 731103 990296 1105968 882774 577612 518192 620959 585791 393690 293971
40465 293971 386664 514297 551772 554452 586812 595558 514534 378534 283931 299710 432428
40454 432428 631802 822255 943239 954317 841455 687412 681257 913310 1178509 1169262
40444 1169262 890780 680474 745041 892699 848165 635682 480651 486008 590365 734288
40434 734288 888130 988808 998992 970437 941414 858126 698333 561108 522093 523068 524206
40423 524206 619299 846327 1028258 989579 812860 688452 623430 514033 409822 459976
40413 459976 636902 740885 680081 565926 533132 612388 757394 865347 823525 668895
40403 668895 612146 743778 838102 670470 412247 415771 666825 788598 612657 406507
40393 406507 427291 555826 554880 452792 442802 547229 613339 589243 606863 765541 957481
40382 957481 976610 769618 520162 443909 529103 574964 496750 443754 533239 638164 607766
40371 607766 553590 680059 923244 1031345 970290 961031 1088699 1157927 1017703 777726
40361 777726 592110 454449 338057 332220 476347 620872 620698 547176 557742 657632 736150
40350 736150 758501 783052 837568 886666 887450 811457 663381 521241 479544 512980 496215
40339 496215 401118 350352 413074 482156 442656 337266 268721 263876 340232 568323 920525
40328 920525 1171214 1119650 844935 586437 436370 315872 202564 183017 267347 331487
40318 331487 309698 313575 465342 685695 752929 577154 346767 343576 615206 900935 935294
40307 935294 759777 627939 646842 674060 582841 449822 404315 448820 532483 659661 801279
40296 801279 834593 725122 648868 751778 887233 811438 582780 516560 723001 926112
40286 926112 831172 490701 187952 91645 159425 292787 438273 558614 629619 693592
40276 693592 837130 1068542 1255890 1246105 1054569 885204 909133 1044714 1036986 772600
40266 772600 427499 246089 258605 315381 337303 387160 492534 548548 472376 358069 373104
40255 373104 535103 685270 690086 594792 540958 583546 650947 667563 640404 603742 552541
40244 552541 487761 465912 518089 567645 543986 548692 747989 1072633 1203486 962681 579220
40233 579220 417870 541847 713745 764279 754282 767455 750027 643457 528393 516177 580422
40222 580422 609673 582085 582664 659502 754032 791981 777869 761615 745353 670670 505611 312998
40210 312998 194903 168818 148748 87582 91528 304173 675455 950843 952205 789976 698498
40199 698498 714372 661979 467866 324482 433799 697923 822582 691521 478573 381824
40189 381824 416972 534584 764881 1095345 1320388 1217666 861279 585211 596877 761366
40179 761366 821017 704082 528652 396597 307413 245502 233939 267237 261563 136252 -66108
40168 -66108 -197621 -174673 -94843 -126678 -294964 -453006 -481618 -425299 -391116 -409616 -456733
40157 -456733 -498045 -410211 11700 788818 1575149 1946852 1858737 1627293 1485824 1391614
40147 1391614 1290892 1286762 1409153 1456940 1273850 1025692 990802 1174166 1335472 1338370
40137 1338370 1266019 1207443 1127576 991447 867773 837330 881939 917877 891145 812972 740686
40126 740686 740294 839772 1007350 1177474 1279321 1245359 1051272 774166 557364 486522 547876
40115 547876 712134 962067 1204745 1283225 1166751 1029322 1028195 1085133 1011703 787628
40105 787628 576102 500586 546198 663414 822200 948723 947307 837623 767146 824464 913592
40094 913592 881267 724915 603274 641000 772411 817794 713761 618194 729613 1022643
40084 1022643 1250239 1229636 1039457 886652 860297 889196 880462 815197 737598 713086 772517
40073 772517 858938 875187 820555 812947 924997 1076364 1159075 1192053 1260447 1364691 1428999
40062 1428999 1415878 1343645 1233001 1121078 1084704 1164653 1305376 1438846 1566385 1677954
40052 1677954 1672052 1473762 1176222 946554 837370 802150 835143 955439 1095106 1155945
40042 1155945 1161404 1208863 1279323 1241348 1057305 851866 748815 750880 801559 862866 913677
40031 913677 961042 1054289 1196322 1261981 1127835 875179 725217 761350 860151 923794 1018152
40020 1018152 1205488 1382382 1399728 1256155 1063016 880897 708026 602347 686051 980394
40010 980394 1308127 1440045 1334339 1165372 1092829 1078846 1004497 889733 855235 896187
40000 896187 877273 780717 761008 870843 933722 825974 698173 730371 826654 779106 619710
39989 619710 563814 670199 793209 837035 842713 850222 872225 965956 1132507 1201742 1043292
39978 1043292 837182 879157 1153225 1370600 1408995 1410202 1437807 1373473 1216390 1157142 1244796
39967 1244796 1283149 1182507 1116741 1182608 1200684 1043404 883993 898807 971028 933982 887302
39956 887302 999447 1171852 1182342 1042456 953057 996492 1105506 1250073 1425921 1530042
39946 1530042 1470142 1344558 1311432 1333123 1249257 1057241 924146 949526 1091155 1289716
39936 1289716 1493311 1592235 1506577 1325744 1211906 1189798 1170318 1134494 1134009 1146160 1091896
39925 1091896 975664 862022 752147 636477 616954 788014 1020577 1062549 866141 640536
39915 640536 563640 610649 691088 784264 889637 988572 1107732 1296264 1498679 1573243 1482499
39904 1482499 1353611 1305092 1316515 1309413 1254688 1155648 1019614 893609 844615 859589 839666
39893 839666 735006 618266 585351 640416 712066 734942 691009 612203 557819 556832 577622
39882 577622 591364 640200 783568 997635 1195893 1335234 1432617 1489389 1473278 1375277 1225563
39871 1225563 1061796 933603 908048 995522 1091469 1075823 965024 887551 905434 930852 838060
39860 838060 617915 412068 398792 608541 847989 889509 766256 759831 1016267 1310716
39850 1310716 1341517 1148243 1033735 1121578 1220380 1152340 1003034 950603 1001632 1021095 941517
39839 941517 833607 802104 879983 1005767 1065695 983152 802617 672089 713410 901984
39829 901984 1080123 1106028 1003622 935168 986083 1030540 913281 724655 721956 952314 1152482
39818 1152482 1117238 973932 939983 982785 928981 786285 721590 786946 889614 991916
39808 991916 1124946 1228150 1190099 1050533 968831 989628 1022673 1043901 1113492 1194912 1175107
39797 1175107 1088375 1100689 1229628 1299223 1230977 1156007 1155618 1116140 964335 846962 925257
39786 925257 1143453 1338676 1446928 1481140 1447689 1409289 1482303 1632718 1628708 1363739 1076538
39775 1076538 1038743 1149731 1104955 900493 863103 1133387 1403920 1327057 991392 791232
39765 791232 918039 1185425 1338231 1336170 1272480 1181830 1064847 1002569 1077478 1210811 1240283
39754 1240283 1163723 1141630 1230287 1296193 1263198 1244270 1305119 1300327 1133451 997938 1105530
39743 1105530 1308698 1292130 1065586 940722 1031523 1124568 1107705 1173933 1433150 1623766
39733 1623766 1463772 1095088 912893 1054816 1299727 1428614 1461587 1509962 1569694 1556232
39723 1556232 1470467 1436118 1553777 1757294 1872857 1828636 1729344 1679674 1635964 1532726
39713 1532726 1451773 1500963 1591289 1533438 1337276 1211845 1249402 1303378 1225252 1051031 900870
39702 900870 843274 895778 1014176 1063016 955962 828587 884771 1072033 1136875 1022223
39692 1022223 944208 1006878 1019145 819646 530758 335990 228950 145310 133262 214952
39682 214952 262671 187754 90788 78896 117820 204840 454792 815699 934379 579031 32544
39671 32544 -209781 -19707 332106 603401 768604 857535 879331 899350 988413 1100644
39661 1100644 1144562 1128195 1106425 1066546 993978 943690 918764 821207 664383 648896 843995
39650 843995 1001928 923283 787501 823684 869561 642005 288870 229238 509613 760309
39640 760309 787980 774160 836174 829681 708861 674181 782753 777795 531768 343437 522473
39629 522473 913264 1110390 993424 798553 757555 873879 999577 986614 812002 638497
39619 638497 664844 857370 965668 874563 768158 836674 1002856 1091618 1103970 1132806 1142909
39608 1142909 1053438 951495 997431 1153379 1216660 1124663 1032481 1050419 1079179 988856 832967
39597 832967 770448 837136 906089 872239 789544 780630 858136 912862 885879 867217 955284 1072708
39585 1072708 1029674 773995 481908 363159 446910 609037 755337 905113 1100741 1296748
39575 1296748 1385113 1329570 1228408 1198965 1227841 1210501 1128355 1075665 1081444 1033502 863798
39564 863798 701148 723678 931195 1171821 1326971 1363362 1280704 1140291 1081954 1172417
39554 1172417 1288248 1285693 1223988 1259959 1377923 1415219 1332698 1264393 1292890 1360422 1420528
39543 1420528 1493808 1540455 1462610 1291936 1205213 1277838 1370088 1339727 1235043 1187919 1227562
39532 1227562 1293612 1349698 1399384 1446335 1498042 1564223 1618965 1609294 1514810 1359965 1188342
39521 1188342 1075133 1103841 1234552 1264324 1062226 797614 765586 1001582 1242516 1275346
39511 1275346 1152718 1043290 1036908 1135205 1284748 1381566 1370453 1347258 1425220 1521759 1460256
39500 1460256 1271071 1171792 1228546 1272125 1203092 1138228 1165165 1188895 1148695 1169577 1336085
39489 1336085 1492558 1446543 1250070 1124444 1189632 1373209 1498175 1394093 1046634 703621
39479 703621 682014 987556 1281955 1310818 1187047 1148363 1232828 1344989 1463037 1595048
39469 1595048 1667055 1638166 1619007 1708782 1814451 1790441 1661608 1551269 1481861 1408446 1366546
39458 1366546 1418975 1510779 1521965 1421037 1259363 1087823 986377 1072187 1333119 1539421
39448 1539421 1482544 1249353 1114137 1198710 1369592 1437940 1344567 1172551 1068024 1117879
39438 1117879 1243665 1274934 1177876 1114350 1206108 1357164 1405477 1338889 1254385 1211252 1234861
39427 1234861 1355620 1524463 1596296 1521250 1448634 1516670 1647045 1680608 1608354 1521967 1432911
39416 1432911 1293066 1118157 955947 808081 698671 720885 890990 1060812 1101923 1065675
39406 1065675 1038288 977378 843186 745742 779268 841006 807528 764747 850511 981216 966349
39395 966349 815104 707458 723130 801730 903640 1011772 1048017 987508 974121 1119440
39385 1119440 1283852 1279210 1181302 1184408 1245619 1169625 980232 892451 945274 982504 998315
39374 998315 1170710 1500401 1726612 1692307 1530117 1403720 1319240 1279697 1370294 1572839
39364 1572839 1716421 1726635 1724781 1785205 1808603 1745706 1726782 1825379 1889349 1771307 1565764
39353 1565764 1448445 1412716 1339409 1233062 1219057 1350350 1542055 1666900 1631178 1404589
39343 1404589 1061784 764712 637514 675267 804803 993516 1255690 1569631 1818398 1837723
39333 1837723 1572053 1193428 981664 1034198 1176313 1212197 1149920 1098028 1083476 1097600
39323 1097600 1176524 1283364 1267847 1123584 1101918 1333078 1533004 1406217 1159068 1203560
39313 1203560 1476749 1544565 1350510 1316061 1596290 1776822 1545209 1191001 1117522 1244859
39303 1244859 1271826 1227728 1349580 1602119 1720455 1637352 1532120 1511528 1530903 1585511
39293 1585511 1707387 1792419 1682690 1432232 1278035 1324332 1436108 1469140 1437741 1408798
39283 1408798 1368910 1270887 1135334 1040320 1028773 1056677 1050578 1023426 1083734 1266797 1415175
39272 1415175 1352954 1149078 1049508 1150489 1314278 1419431 1487812 1520630 1438329 1274000
39262 1274000 1203228 1261486 1249434 1064182 906218 972771 1147888 1219161 1230703 1365715
39252 1365715 1597560 1720997 1672351 1587779 1571721 1601775 1643169 1693358 1732807 1757839 1810851
39241 1810851 1866322 1790917 1565450 1419205 1535033 1726180 1661331 1355260 1160514 1268331
39231 1268331 1486936 1572981 1538530 1524351 1568212 1628572 1685908 1685446 1499531 1100186 704394
39220 704394 600258 832621 1163126 1351445 1389982 1425178 1518904 1577767 1520687 1426285 1438095
39209 1438095 1559708 1641429 1585754 1480525 1477169 1587828 1662275 1559137 1313632 1123901
39199 1123901 1148883 1318404 1408633 1340412 1300828 1471722 1742906 1859843 1786864 1720422
39189 1720422 1770325 1853910 1919499 2034659 2188591 2233693 2121387 1994666 1944310 1875589
39179 1875589 1734205 1653078 1717291 1776052 1677118 1529481 1530593 1655837 1722923 1675637 1614044
39168 1614044 1608013 1649420 1735980 1851626 1907220 1827756 1659098 1499272 1392264 1363374 1449417
39157 1449417 1598048 1657935 1576518 1479276 1443370 1354328 1140359 984352 1093185 1371236
39147 1371236 1541992 1521535 1465341 1489191 1533884 1495825 1352759 1178239 1122255 1307800
39137 1307800 1651593 1890084 1898638 1867688 2025722 2309262 2468032 2391858 2173522 1949607
39127 1949607 1834713 1902344 2067491 2101592 1929812 1787071 1897032 2130312 2191000 2021542
39117 2021542 1798500 1635455 1529932 1520690 1655210 1849404 1979897 2052201 2105165 2067225
39107 2067225 1916641 1849741 2034322 2308038 2392024 2302675 2265650 2315815 2298479 2204513 2174580
39096 2174580 2193788 2101378 1908811 1812549 1878095 1986465 2094959 2268843 2446740 2459738
39086 2459738 2310636 2177251 2130441 2099629 2092365 2161843 2180938 1964729 1611883 1402277
39076 1402277 1368198 1322090 1296124 1525977 1942258 2136203 1977533 1835036 1979523 2171918
39066 2171918 2104415 1889414 1798545 1807043 1729622 1592909 1549180 1568236 1502158 1353056 1241833
39055 1241833 1204093 1210163 1281589 1407921 1457473 1343610 1178083 1110248 1130374 1171903 1266250
39044 1266250 1432739 1554903 1549787 1538338 1657060 1806835 1791249 1629248 1530108 1595896
39034 1595896 1725178 1797637 1804839 1792050 1782261 1775371 1763769 1749913 1764524 1824683 1872036 1832813
39022 1832813 1743249 1710138 1742728 1758568 1766396 1867059 2023650 2026494 1795200 1547440 1525812
39011 1525812 1682766 1786960 1757116 1739211 1877340 2115479 2243985 2119081 1839315 1668391
39001 1668391 1734737 1874332 1863665 1717995 1609093 1580894 1559761 1582149 1754752 2005402
38991 2005402 2138191 2146504 2205362 2334925 2361526 2257879 2216695 2305685 2349793 2253564 2135971
38980 2135971 2036010 1817481 1523678 1486386 1853927 2299453 2445274 2330100 2218414 2193699
38970 2193699 2201712 2267002 2377043 2342266 2067688 1809471 1866992 2137963 2261102 2112345
38960 2112345 1896660 1813833 1878476 2031267 2212337 2339605 2375876 2392218 2451122 2491963
38950 2491963 2435594 2314197 2202799 2127814 2118995 2208475 2304423 2249987 2096385 2096405 2308617
38939 2308617 2457066 2346506 2161737 2149660 2250754 2287467 2289995 2361128 2410983 2313519 2175568
38928 2175568 2180099 2291440 2354774 2346056 2298324 2154610 1942620 1907244 2180317 2485935 2482540
38917 2482540 2254081 2143890 2225652 2273042 2172220 2044936 2007392 2078048 2269387 2530046
38907 2530046 2681330 2648110 2636125 2825328 3027458 2946120 2651167 2469520 2500386 2565549
38897 2565549 2563129 2543494 2493367 2364049 2268591 2349900 2503030 2518834 2438407 2469444 2625542
38886 2625542 2753682 2835549 2939629 2966264 2793100 2593090 2630689 2802382 2772288 2523894
38876 2523894 2370076 2429345 2506372 2506466 2555974 2671632 2709971 2692333 2783507 2900811 2763138
38865 2763138 2402642 2199557 2299836 2422825 2384434 2382174 2571363 2761581 2768699 2720060
38855 2720060 2768886 2814318 2742898 2667908 2695973 2712792 2626567 2583359 2714630 2888476 2931201
38844 2931201 2901881 2941624 3025301 3049437 3008129 2927728 2790578 2653717 2663495 2831757 2985709
38833 2985709 3040114 3100088 3198499 3197849 3084594 3076097 3261811 3418646 3383586 3326782 3414553
38822 3414553 3479970 3327032 3123794 3149594 3326524 3365412 3270322 3328414 3620652 3882656
38812 3882656 3911793 3843648 3911601 4105742 4198178 4043681 3770711 3647982 3753490 3838478
38802 3838478 3638982 3289005 3215857 3577225 4041349 4254914 4291005 4423512 4663464 4806995
38792 4806995 4818451 4850538 4932418 4954899 4973740 5194183 5573292 5800209 5872973 6298708
38782 6298708 7247250 7721229 6280470 2839247 -790462 -2613057 -2407493 -1516649 -1006857
38773 -1006857 -775345 -424760 -112939 -117694 -213534 -62996 176969 189518 116124 278932
38763 278932 546376 569202 457399 601538 941785 1058577 944484 1027214 1388448 1616347
38753 1616347 1554329 1559775 1820700 2014429 1911926 1779778 1870451 1992735 1922800 1819854
38743 1819854 1891955 2018926 2036813 2057969 2192535 2278058 2200441 2166500 2334901 2481844
38733 2481844 2371858 2176388 2173167 2291530 2322540 2346981 2562269 2853456 2919021 2725134
38723 2725134 2514839 2445047 2481959 2571452 2673892 2708710 2658170 2632149 2685209 2719371 2706805
38712 2706805 2800133 3042287 3192846 3066727 2840744 2787197 2891094 2967297 2970172 2938935
38702 2938935 2812172 2558527 2346103 2336972 2447117 2529553 2637501 2867750 3099912 3158799
38692 3158799 3118177 3180120 3336906 3402053 3328633 3273006 3344555 3449504 3400814 3122884 2774726
38681 2774726 2665119 2945023 3404494 3716574 3825465 3883187 3888980 3717713 3469739 3399467
38671 3399467 3467456 3380840 3144718 3116814 3390063 3597028 3516893 3411697 3529235 3723137
38661 3723137 3822253 3933282 4102064 4116797 3934165 3847036 3933074 3833968 3429776 3202250
38651 3202250 3490120 3893282 3923414 3766234 3826949 3963087 3822014 3588399 3705372 4091928
38641 4091928 4298743 4272494 4343785 4579211 4725732 4708981 4663875 4566205 4323674 4120352
38631 4120352 4193614 4393679 4430244 4398181 4559573 4765749 4648949 4285772 4118067 4262231
38621 4262231 4412017 4400680 4372649 4398711 4360472 4227269 4087083 3946841 3822542 3895764
38611 3895764 4227001 4488158 4377255 4115934 4114987 4345757 4497669 4550509 4685585 4809768
38601 4809768 4697182 4465107 4402062 4461909 4421269 4371596 4534470 4753886 4709900 4483142
38591 4483142 4381419 4388414 4326835 4345131 4636057 4896701 4738898 4438009 4555332 4986065
38581 4986065 5153748 5025583 5105324 5455159 5572040 5300115 5060669 5053594 4989827 4773582
38571 4773582 4730718 4968056 5161275 5164641 5223367 5421803 5510428 5421644 5384856 5417173 5273352
38560 5273352 4988925 4886567 4973596 4938850 4799627 4905193 5236598 5385619 5318759 5457590
38550 5457590 5872224 6103008 5952025 5769050 5772934 5756536 5644579 5680448 5871837 5900657
38540 5900657 5761384 5841214 6199289 6418664 6326653 6198353 6120960 5873470 5571348 5658909
38530 5658909 6081057 6251603 6055178 6065634 6512591 6866654 6780738 6633423 6758738 6904772
38520 6904772 6856899 6864184 7035939 7017396 6676714 6442064 6561777 6692290 6598705 6590140 6870948
38509 6870948 7126056 7143519 7201081 7461327 7634040 7596559 7683242 8007038 8177489 8047050
38499 8047050 8035785 8340068 8507915 8172045 7543205 6871969 6137881 5551525 5569060 6090563
38489 6090563 6449056 6481468 6727204 7280916 7467966 7061633 6769885 7014159 7275129 7204771
38479 7204771 7300271 7812031 8060006 7610880 7134918 7274338 7604063 7558426 7475342 7827720
38469 7827720 8263003 8310881 8275200 8560536 8860404 8838851 8862467 9248797 9557299 9419062
38459 9419062 9275401 9508910 9683685 9451752 9325400 9700633 10026051 9833043 9657492
38450 9657492 10000148 10329245 10120235 9924532 10328976 10790904 10633695 10291498 10410944
38441 10410944 10619101 10381438 10192229 10659855 11256679 11243738 11010346 11229138 11533223
38432 11533223 11348140 11179550 11689227 12312981 12218060 11845343 12063363 12572296 12615702 12497677
38422 12497677 12878482 13326205 13128850 12811334 13251214 13992884 14059664 13756424 14019892
38413 14019892 14638670 14782466 14659122 14974838 15386140 15173172 14813841 15199295 15941198
38404 15941198 16148968 16166349 16785635 17510699 17448806 17151964 17651327 18444517 18433603 18065120
38394 18065120 18459635 19218212 19265933 19075022 19776385 20838550 20991302 20710017 21352888
38385 21352888 22557998 22981537 22881008 23419770 24198492 24133483 23947661 24990196 26448820
38376 26448820 26678977 26388256 27364522 28990086 29400329 29176733 30259079 32056628 32503635
38367 32503635 32186040 33336672 35456293 36240040 36177973 37670297 40198275 41236629 41402280
38358 41402280 43500717 46933478 48610983 49035320 51511949 55622555 57948326 59098394
38350 59098394 62960810 68963963 72801239 75048048 80503595 88461722 93197047 95094124
38342 95094124 100624517 109864644 116332613 121325966 133790306 152522899 166471251 178411009
38334 178411009 203606632 228827671 198984123 77537489 -90863024 -212718639 -241540810
38327 -241540810 -213141292 -184265565 -169982364 -154973593 -135413182 -122103642 -116632536
38320 -116632536 -109859405 -99822970 -92966037 -89920275 -84765626 -77084799 -72348059 -71014434
38312 -71014434 -67962199 -62386472 -58733945 -57863527 -55861104 -51841247 -49162811 -48501278
38304 -48501278 -46775574 -43471270 -41559932 -41543141 -40549552 -37984408 -36518834 -36785381 -36290160
38295 -36290160 -34318425 -33049159 -33060656 -32333648 -30470975 -29527956 -29868652 -29366622 -27529192
38286 -27529192 -26430894 -26716904 -26505359 -25132462 -24308310 -24620089 -24405209 -23083540 -22268502
38277 -22268502 -22567216 -22463653 -21375704 -20744341 -21075475 -20885303 -19642309 -18886572 -19325833
38268 -19325833 -19559810 -18803396 -18241334 -18541548 -18562024 -17705565 -17145708 -17520220 -17693374
38259 -17693374 -16986198 -16442579 -16712651 -16796419 -16068650 -15525016 -15833322 -16070933 -15554032
38250 -15554032 -15069903 -15164951 -15020330 -14166783 -13568036 -13850751 -14120926 -13664395 -13216130
38241 -13216130 -13428618 -13636197 -13247198 -12869546 -12977123 -12918471 -12307571 -11955187 -12352175
38232 -12352175 -12638784 -12154016 -11628400 -11748548 -11884358 -11368724 -10768490 -10750899 -10878234
38223 -10878234 -10627898 -10464365 -10821565 -11123333 -10859831 -10565196 -10727680 -10819324 -10405335
38214 -10405335 -10105596 -10412983 -10649369 -10182490 -9634389 -9762660 -10126030 -9993445 -9655529
38205 -9655529 -9696886 -9824532 -9545659 -9213100 -9299089 -9383406 -8936420 -8390472 -8383216 -8620208
38195 -8620208 -8510298 -8262144 -8337403 -8460971 -8188693 -7860903 -8001469 -8321532 -8263371 -7999851
38185 -7999851 -7994642 -8104321 -7984691 -7846148 -7959734 -7970844 -7543833 -7118959 -7181875 -7350612
38175 -7350612 -7044770 -6503118 -6276686 -6253616 -6039371 -5776681 -5763988 -5808116 -5761278 -6088802
38165 -6088802 -7040538 -7885154 -7897187 -7503841 -7489391 -7672155 -7429688 -6980388 -6987696 -7309034
38155 -7309034 -7293195 -7011642 -7068524 -7409421 -7406336 -6995601 -6730111 -6790669 -6855879 -6851257 -6962460
38144 -6962460 -7019291 -6711335 -6308906 -6355486 -6748297 -6904583 -6716942 -6567616 -6527993 -6341817
38134 -6341817 -6107997 -6192909 -6506288 -6582936 -6342958 -6122198 -6042796 -5988527 -6062818 -6410753
38124 -6410753 -6731282 -6629653 -6303424 -6223199 -6322603 -6206795 -5974274 -6066716 -6424254 -6549401
38114 -6549401 -6343189 -6166134 -6138370 -6076021 -6048279 -6290147 -6605173 -6540158 -6130868 -5837957
38104 -5837957 -5794489 -5741373 -5622069 -5592511 -5535648 -5240470 -4973270 -5167843 -5613205 -5670615
38094 -5670615 -5269883 -4970753 -5034246 -5151288 -5128691 -5135814 -5190292 -5066092 -4810028 -4733591
38084 -4733591 -4818299 -4733135 -4495818 -4492010 -4760285 -4877734 -4666526 -4435143 -4407491 -4456804
38074 -4456804 -4497588 -4613324 -4721646 -4629927 -4471591 -4567755 -4835536 -4879910 -4684665 -4629338
38064 -4629338 -4788606 -4821005 -4621542 -4481691 -4505046 -4452863 -4281072 -4253724 -4400314 -4425211
38054 -4425211 -4283866 -4286169 -4485050 -4522194 -4253640 -3999594 -3989689 -4053221 -4030382 -4014939 -4030503
38043 -4030503 -3934613 -3795253 -3896867 -4220241 -4374092 -4199743 -4004575 -4044808 -4198800 -4291521
38033 -4291521 -4333695 -4316230 -4165039 -4001170 -4057375 -4269171 -4342940 -4255764 -4254348 -4345555 -4268372
38022 -4268372 -4010832 -3868315 -3933369 -3993856 -3963625 -3939725 -3849217 -3566791 -3352222 -3575951
38012 -3575951 -4018070 -4083735 -3735296 -3521011 -3625936 -3646332 -3434129 -3379952 -3630167 -3783619
38002 -3783619 -3656019 -3615185 -3827548 -3887960 -3579781 -3317565 -3411919 -3543172 -3412717 -3288930
37992 -3288930 -3421406 -3514685 -3313070 -3149293 -3345968 -3582271 -3458210 -3240885 -3413815 -3837889
37982 -3837889 -3990233 -3779491 -3545265 -3447152 -3378581 -3328628 -3363549 -3378776 -3257178 -3127196
37972 -3127196 -3132579 -3141097 -3009503 -2912709 -3054553 -3258108 -3205446 -2920486 -2691002 -2661958 -2782722
37961 -2782722 -2993851 -3217257 -3326468 -3323399 -3347621 -3373956 -3195902 -2860819 -2743194 -2967390
37951 -2967390 -3164992 -3079472 -2982338 -3142666 -3310712 -3164525 -2906114 -2932297 -3194293 -3358701
37941 -3358701 -3376491 -3429245 -3490409 -3384099 -3156971 -3009990 -2970344 -2948712 -2978499 -3094098
37931 -3094098 -3130024 -2941837 -2681063 -2588196 -2669134 -2789057 -2875460 -2835060 -2555278 -2209504
37921 -2209504 -2222574 -2662198 -3023525 -2924395 -2629457 -2535447 -2562602 -2499562 -2531482 -2871041
37911 -2871041 -3202190 -3094491 -2725844 -2595790 -2715287 -2687221 -2453462 -2349581 -2474993 -2578424
37901 -2578424 -2557301 -2550673 -2533599 -2316690 -1985425 -1889464 -2137904 -2480989 -2705660 -2791122
37891 -2791122 -2704048 -2433024 -2216177 -2343064 -2712598 -2936847 -2879255 -2749261 -2689289 -2630341
37881 -2630341 -2551713 -2532606 -2537925 -2469848 -2414153 -2522752 -2693412 -2693538 -2554658 -2508438 -2586990
37870 -2586990 -2636475 -2661165 -2770534 -2838894 -2636862 -2289272 -2176974 -2356164 -2493449 -2436097
37860 -2436097 -2429542 -2654297 -2926059 -3016407 -2968853 -2940056 -2965684 -3011634 -3066493 -3093643 -3039913
37849 -3039913 -2919650 -2766497 -2564734 -2381787 -2424361 -2722712 -2921841 -2710703 -2324844 -2249062
37839 -2249062 -2523666 -2759591 -2777413 -2777671 -2873296 -2912175 -2843539 -2844991 -2966855 -3009041 -2869027
37828 -2869027 -2692114 -2576253 -2434450 -2241124 -2119584 -2102251 -2083567 -2062707 -2137244 -2222544
37818 -2222544 -2113682 -1881052 -1846753 -2078198 -2262924 -2206985 -2107858 -2179861 -2336741 -2423474
37808 -2423474 -2467444 -2514000 -2483061 -2382456 -2418925 -2690806 -2970712 -2992515 -2798982 -2633271
37798 -2633271 -2611795 -2649683 -2617423 -2470468 -2292042 -2240074 -2370133 -2535340 -2574226 -2524952
37788 -2524952 -2492254 -2414268 -2205229 -2031180 -2132700 -2418677 -2561758 -2481856 -2399756 -2408996
37778 -2408996 -2355636 -2190173 -2082141 -2098320 -2090659 -1992734 -1924270 -1930079 -1924638 -1950765 -2149548
37767 -2149548 -2406211 -2407392 -2162161 -2072130 -2318506 -2561602 -2464689 -2167467 -1987881 -1959321
37757 -1959321 -1942621 -1953385 -2093594 -2318139 -2492730 -2559828 -2508288 -2339858 -2175620 -2198521
37747 -2198521 -2383062 -2495520 -2454911 -2441506 -2544936 -2597916 -2504919 -2432561 -2483570 -2476499 -2283386
37736 -2283386 -2119566 -2223988 -2457831 -2496771 -2276684 -2009419 -1874610 -1897829 -2025007 -2146788
37726 -2146788 -2154174 -2101356 -2187403 -2468026 -2742316 -2833592 -2804019 -2775362 -2733953 -2650341 -2597959
37715 -2597959 -2601742 -2548035 -2390338 -2268060 -2279895 -2317493 -2265044 -2185368 -2166347 -2161228 -2126806
37704 -2126806 -2147984 -2277271 -2404824 -2419659 -2357648 -2290886 -2225661 -2184049 -2206138 -2212320 -2076092
37693 -2076092 -1888247 -1896612 -2109357 -2232802 -2100370 -1882452 -1765470 -1721001 -1714972 -1832307
37683 -1832307 -2045027 -2161509 -2152567 -2212087 -2357780 -2338752 -2113255 -2016749 -2219044 -2413890
37673 -2413890 -2333026 -2175315 -2188089 -2201015 -1980654 -1727708 -1778530 -2048941 -2195074 -2134539
37663 -2134539 -2020520 -1882155 -1672944 -1518802 -1562100 -1703759 -1805435 -1951737 -2196684 -2291931
37653 -2291931 -2042727 -1706739 -1633361 -1722738 -1678170 -1583168 -1727379 -2012374 -2064522 -1869844
37643 -1869844 -1784639 -1931849 -2068234 -2062963 -2045570 -2036273 -1871660 -1577066 -1414091 -1467298 -1541734
37632 -1541734 -1547399 -1629918 -1827164 -1938672 -1858513 -1742860 -1728435 -1743947 -1705243 -1659961 -1642172
37621 -1642172 -1594179 -1511551 -1478908 -1510835 -1533130 -1541340 -1594744 -1650387 -1595569 -1446094 -1330080
37610 -1330080 -1292274 -1290779 -1336869 -1438355 -1469073 -1323743 -1150555 -1195807 -1459749 -1727573
37600 -1727573 -1884613 -1978727 -2043453 -2088853 -2181438 -2303773 -2257802 -1965440 -1710742 -1770164
37590 -1770164 -1957988 -1905085 -1648168 -1527010 -1609076 -1673398 -1691099 -1827275 -1987914 -1882876
37580 -1882876 -1579640 -1479733 -1658146 -1740669 -1570831 -1478113 -1677619 -1898938 -1887973 -1835883
37570 -1835883 -1981290 -2158901 -2105665 -1929805 -1912644 -2042963 -2076173 -1924850 -1719718 -1574199
37560 -1574199 -1495507 -1456999 -1424069 -1392955 -1466580 -1744427 -2092437 -2228766 -2105144 -1973363
37550 -1973363 -1990868 -2013386 -1891708 -1716345 -1619753 -1569813 -1516858 -1531856 -1640978 -1716101 -1674228
37539 -1674228 -1604705 -1578256 -1523164 -1406167 -1335841 -1374965 -1453925 -1563655 -1794834 -2073382
37529 -2073382 -2121603 -1843750 -1515087 -1419012 -1513040 -1618345 -1718557 -1877697 -2043344 -2117106
37519 -2117106 -2087932 -1977781 -1811175 -1716305 -1844667 -2098967 -2177844 -1997587 -1819686 -1847310
37509 -1847310 -1969355 -2035760 -2086192 -2132473 -2015516 -1695206 -1412952 -1345742 -1356673 -1304441
37499 -1304441 -1318414 -1507104 -1662899 -1562056 -1344972 -1297591 -1432178 -1565891 -1648473 -1733637
37489 -1733637 -1769086 -1677506 -1527989 -1414473 -1302193 -1173252 -1137424 -1217077 -1251234 -1209969
37479 -1209969 -1323318 -1649204 -1828816 -1607062 -1298630 -1326912 -1550859 -1518682 -1209290 -1017573
37469 -1017573 -1094337 -1199491 -1201944 -1262416 -1460660 -1634053 -1667754 -1621205 -1511310 -1277899
37459 -1277899 -1016997 -954153 -1122628 -1323481 -1440689 -1541301 -1641617 -1646201 -1561639 -1513393
37449 -1513393 -1504781 -1407697 -1238764 -1192700 -1330079 -1458802 -1410345 -1248561 -1134683 -1139454 -1230681
37438 -1230681 -1313278 -1280910 -1159058 -1147455 -1360166 -1609759 -1664196 -1623531 -1758595 -2031784
37428 -2031784 -2109367 -1872271 -1598932 -1563476 -1720407 -1873502 -1916790 -1818775 -1585050 -1329277
37418 -1329277 -1203375 -1199463 -1189754 -1170389 -1247092 -1365799 -1320230 -1089993 -916323 -948757 -1051117
37407 -1051117 -1064536 -1042705 -1103221 -1237624 -1390088 -1554880 -1685329 -1663108 -1460159 -1195614
37397 -1195614 -967595 -780996 -680917 -755485 -938093 -1024058 -982410 -1033984 -1294305 -1554120
37387 -1554120 -1580637 -1451590 -1400148 -1475031 -1554581 -1590497 -1633861 -1676611 -1651065 -1573389 -1544298
37376 -1544298 -1599162 -1659963 -1653258 -1608419 -1610225 -1672775 -1688792 -1551418 -1338551 -1279542 -1454139
37365 -1454139 -1624805 -1516383 -1187806 -940239 -906897 -956237 -986498 -1058288 -1180216 -1207848
37355 -1207848 -1070289 -911100 -889153 -989247 -1123634 -1272775 -1429813 -1538040 -1567828 -1539873
37345 -1539873 -1431869 -1216627 -1025142 -1061954 -1279086 -1357067 -1139813 -881011 -891640 -1123930
37335 -1123930 -1301613 -1317322 -1277024 -1234226 -1103577 -837131 -535594 -363444 -422418 -684573
37325 -684573 -996265 -1186722 -1207877 -1126216 -999936 -873048 -858415 -1039404 -1273454 -1308749
37315 -1308749 -1148153 -1061146 -1152687 -1195465 -1039920 -902899 -1008470 -1189593 -1154944 -971657
37305 -971657 -939799 -1095740 -1196481 -1160472 -1172027 -1310302 -1397333 -1320210 -1240301 -1336768 -1536148
37294 -1536148 -1650812 -1651454 -1650444 -1688040 -1666095 -1486252 -1189815 -948206 -905665 -1016239 -1086466
37283 -1086466 -1028198 -985908 -1107341 -1275354 -1245484 -1013878 -839018 -872000 -973600 -975852
37273 -975852 -928305 -951386 -1005490 -982062 -922960 -962507 -1100829 -1211873 -1255001 -1295290 -1301177
37262 -1301177 -1124450 -769770 -510430 -582510 -869860 -1060534 -1050710 -1004500 -1032288 -1027660 -894854
37251 -894854 -754257 -784709 -969624 -1135360 -1177357 -1131151 -1070929 -1050996 -1111438 -1238868 -1346598
37240 -1346598 -1368703 -1323660 -1217262 -986681 -668470 -514966 -742825 -1206668 -1528409 -1552846
37230 -1552846 -1478729 -1513430 -1602932 -1584558 -1438809 -1274674 -1167503 -1112021 -1086961 -1110493 -1244520
37219 -1244520 -1513567 -1775932 -1776081 -1455334 -1110272 -1050451 -1186784 -1207921 -1089056 -1087659 -1233874
37208 -1233874 -1223004 -938169 -698762 -765603 -926439 -865776 -685005 -708102 -938275 -1066216
37198 -1066216 -949135 -766337 -711117 -787583 -920580 -1049195 -1094563 -1014881 -907460 -914613
37188 -914613 -1036881 -1162190 -1237915 -1280228 -1270621 -1196685 -1143702 -1186683 -1239642 -1173164 -1033211
37177 -1033211 -977645 -1044027 -1150179 -1269104 -1414177 -1502652 -1445403 -1337392 -1335474 -1372744 -1246417
37166 -1246417 -993905 -900497 -1065855 -1234932 -1182498 -1020886 -957438 -957641 -871256 -750259 -788057
37155 -788057 -984704 -1095009 -945108 -650482 -464536 -508596 -707899 -926832 -1094894 -1214492
37145 -1214492 -1303812 -1360169 -1361947 -1283624 -1122258 -937125 -840173 -887342 -986227 -992023 -906947
37134 -906947 -886766 -1015921 -1191974 -1299681 -1372270 -1465478 -1489277 -1335530 -1108184 -1035666
37124 -1035666 -1154262 -1244617 -1121849 -862916 -695324 -747981 -957029 -1160267 -1251064 -1260423
37114 -1260423 -1283052 -1324708 -1297279 -1195026 -1152220 -1228783 -1263200 -1096128 -848628 -785968 -951313
37103 -951313 -1130887 -1167353 -1113912 -1068477 -1044413 -1041424 -1076013 -1096889 -1017352 -866692 -768726
37092 -768726 -751941 -737298 -726182 -811255 -964574 -1022257 -952678 -936283 -1076835 -1226176 -1220085
37081 -1220085 -1108194 -1011121 -927250 -846627 -885247 -1098230 -1292805 -1253769 -1060899 -955652
37071 -955652 -969740 -934530 -815380 -763102 -813914 -802275 -648108 -501047 -494122 -557707 -603636
37060 -603636 -701062 -904599 -1074468 -1072866 -1017395 -1108626 -1281648 -1282428 -1071261 -885060 -852294
37049 -852294 -807564 -608845 -408926 -423760 -594321 -692743 -663874 -649879 -736230 -878644 -1046676
37038 -1046676 -1232157 -1323904 -1186201 -892067 -687813 -681435 -739878 -733339 -692821 -670910 -644891
37027 -644891 -637394 -734182 -881880 -870168 -643852 -438593 -457163 -600159 -685671 -736933 -838015
37016 -838015 -890745 -783979 -667493 -763954 -991197 -1065049 -935964 -834149 -883385 -947812
37006 -947812 -900462 -798440 -730842 -694412 -670064 -648415 -561340 -369898 -213257 -253812 -381214
36995 -381214 -332293 -129092 -92944 -329937 -517525 -387349 -149833 -179790 -459569 -618304
36985 -618304 -448094 -130831 43962 -5728 -157090 -271179 -321677 -381732 -510706 -664703
36975 -664703 -749698 -741853 -682631 -578135 -422333 -318059 -416512 -685460 -890903 -896495 -847145
36964 -847145 -945593 -1160267 -1288069 -1235123 -1103802 -1032080 -1052917 -1105440 -1108689 -1019803 -866961
36953 -866961 -738867 -730930 -884664 -1136100 -1310581 -1255301 -1046223 -968865 -1183221 -1510754
36943 -1510754 -1708063 -1827251 -2053764 -2271190 -2137965 -1640382 -1214853 -1162650 -1244027 -1083775
36933 -1083775 -747469 -630095 -894810 -1288862 -1479597 -1372076 -1104433 -881494 -822025 -884571
36923 -884571 -954302 -1023660 -1193681 -1459127 -1640760 -1625251 -1528177 -1495077 -1479922 -1377919 -1260285
36912 -1260285 -1287135 -1446542 -1552222 -1481335 -1287693 -1097527 -991282 -966872 -951074 -879352
36902 -879352 -792725 -778085 -800437 -735181 -604506 -595110 -757749 -898236 -897060 -912631 -1075961
36891 -1075961 -1204458 -1082766 -849452 -789642 -866000 -809276 -623845 -623890 -913437 -1177865 -1134123
36880 -1134123 -914553 -818163 -883863 -927022 -879323 -861818 -931670 -946559 -769468 -517732 -475868
36869 -475868 -732807 -1016779 -1008967 -761103 -618191 -717508 -793092 -589123 -255027 -134553
36859 -134553 -312717 -597135 -846771 -1074369 -1267929 -1349566 -1323530 -1278302 -1232188 -1138358
36849 -1138358 -1035195 -1023928 -1100075 -1167556 -1205490 -1248517 -1225136 -1029972 -772141 -722726 -942687
36838 -942687 -1163287 -1139172 -952033 -841420 -870099 -901758 -830591 -693326 -573980 -499663
36828 -499663 -450566 -426345 -468127 -598411 -752868 -830829 -833541 -870310 -974102 -1010699 -874500
36817 -874500 -690577 -679841 -860337 -1016364 -956041 -696994 -411651 -276409 -350732 -530171
36807 -530171 -652318 -691426 -758600 -864151 -846400 -653547 -506843 -587460 -729560 -676637
36797 -676637 -506916 -506073 -704440 -864215 -894372 -953431 -1125789 -1305097 -1440286 -1603853
36787 -1603853 -1762013 -1765504 -1633029 -1553973 -1538500 -1377942 -1056898 -871397 -967091 -1071135
36777 -1071135 -909828 -632068 -562796 -741751 -966330 -1127711 -1240937 -1259299 -1118226 -910201
36767 -910201 -812104 -871255 -1003053 -1132334 -1207566 -1166625 -1030643 -945909 -997585 -1073542 -1045582
36756 -1045582 -978908 -1008113 -1104478 -1137642 -1093346 -1058698 -1042400 -969498 -825549 -676130 -572926
36745 -572926 -542885 -619114 -781943 -928341 -991290 -1014009 -1020988 -929425 -711038 -526878 -544654
36734 -544654 -708637 -844958 -910242 -967994 -996765 -919485 -792523 -782027 -946952 -1181358
36724 -1181358 -1359596 -1414605 -1304757 -1048929 -786689 -673181 -711172 -784517 -829302 -861459
36714 -861459 -870016 -813896 -718111 -664583 -688924 -760403 -830713 -833515 -704411 -492237 -370525
36703 -370525 -435579 -586748 -714849 -868682 -1068783 -1119269 -872618 -578350 -641840 -1047585
36693 -1047585 -1347672 -1277778 -1068662 -1030962 -1132361 -1176478 -1149021 -1134958 -1063641 -815100
36683 -815100 -502445 -388742 -524773 -680312 -669925 -571904 -555400 -626939 -655883 -586591 -518250
36672 -518250 -567114 -712875 -822694 -812235 -734741 -688566 -685159 -672449 -659086 -713859 -826261
36661 -826261 -876855 -806111 -716358 -714170 -735773 -663261 -560975 -613844 -810750 -884458 -677418
36650 -677418 -411074 -412067 -660333 -826022 -739076 -588785 -589708 -666956 -622789 -460510 -356593
36639 -356593 -398876 -530055 -694323 -867176 -976575 -966878 -922398 -961986 -1028233 -956885 -745512
36628 -745512 -562293 -485660 -445412 -442661 -586805 -841898 -976303 -885106 -751107 -749754 -798556
36617 -798556 -758784 -685926 -680881 -667131 -548840 -456983 -583895 -851255 -989508 -914846 -803983
36606 -803983 -797964 -831834 -785959 -652518 -518796 -485611 -599192 -781329 -866990 -798532 -717982
36595 -717982 -771403 -913099 -1020001 -1086039 -1148736 -1141580 -1017314 -919164 -1002418 -1157360 -1150647
36584 -1150647 -988340 -876845 -855936 -766105 -599358 -571809 -757735 -936114 -940671 -910765
36574 -910765 -1009626 -1102704 -955397 -634485 -470592 -633483 -921854 -1015343 -834863 -599956
36564 -599956 -561097 -720864 -857178 -817882 -705901 -707722 -828893 -927433 -951403 -984681 -1075709
36553 -1075709 -1179305 -1269248 -1353812 -1375160 -1261474 -1100256 -1081571 -1220278 -1306870 -1203923
36543 -1203923 -1028789 -952880 -967045 -954686 -881043 -800619 -762540 -798716 -933121 -1130773 -1300782
36532 -1300782 -1392201 -1411940 -1333721 -1111147 -818128 -636663 -634365 -678692 -648985 -610758 -686699
36521 -686699 -862255 -1017890 -1069390 -998587 -839479 -708942 -744159 -922824 -1054485 -1042405
36511 -1042405 -1024216 -1118168 -1152551 -846232 -214892 396113 704904 762586 774554 784347 657869
36500 657869 347742 47753 7370 230329 457324 473195 329727 194036 89847 -63602
36490 -63602 -229259 -269268 -185614 -149698 -240481 -322860 -265338 -136025 -90886 -179637 -344375
36479 -344375 -509243 -594618 -534014 -349130 -140331 25496 129895 117931 -43224 -207009
36469 -207009 -154120 74931 168252 -22152 -249133 -241136 -104500 -130184 -348849 -540580
36459 -540580 -603934 -641119 -684949 -598731 -320337 -20514 86864 -8785 -139397 -171775 -136119
36448 -136119 -163064 -328637 -574645 -787063 -921024 -994746 -990990 -869650 -679644 -532462
36438 -532462 -434273 -275629 -34071 154341 189137 123034 9049 -203637 -509521 -746737
36428 -746737 -801901 -771649 -768971 -718234 -527471 -326928 -309773 -423314 -446574 -325647 -220742
36417 -220742 -249796 -378519 -539595 -678508 -710740 -619058 -562696 -692099 -878748 -846929
36407 -846929 -578432 -361086 -391774 -540747 -583086 -481075 -344880 -261628 -258511 -321599 -373217
36396 -373217 -326700 -219251 -191873 -292197 -406508 -440102 -451009 -527915 -627602 -627003 -495015
36385 -495015 -348976 -352899 -566822 -862604 -1006954 -891539 -663318 -553706 -608211 -682812
36375 -682812 -674662 -617359 -546620 -427535 -268409 -177923 -228252 -344766 -401826 -370464 -321321
36364 -321321 -331180 -422611 -551455 -632731 -622940 -582491 -605235 -690088 -744796 -712507 -628496 -557947
36352 -557947 -544868 -608158 -712903 -763800 -709526 -629363 -622383 -642750 -565736 -397932 -281168
36341 -281168 -281307 -316970 -326195 -361503 -464890 -570687 -598317 -544224 -428341 -248330 -47447
36330 -47447 63137 19642 -119868 -261723 -369087 -431865 -425913 -356415 -280779 -244447 -243507
36319 -243507 -268788 -318243 -349105 -300993 -193714 -119797 -112201 -107453 -74470 -89116 -233959
36308 -233959 -501524 -833277 -1165425 -1393387 -1396222 -1179928 -925523 -807602 -805422 -765539
36298 -765539 -620910 -472219 -442298 -494392 -442117 -176776 134046 176258 -124173 -450772
36288 -450772 -454460 -176017 55568 80745 39081 46735 8183 -153546 -304447 -298548 -215559
36277 -215559 -231985 -359030 -464998 -483385 -452696 -400304 -319487 -235732 -194356 -204686 -262436
36266 -262436 -375091 -502162 -550977 -513608 -512553 -601663 -625782 -435332 -163885 -97448 -286534
36255 -286534 -481264 -479755 -364188 -326190 -410844 -530314 -613732 -631917 -560293 -441008 -426573
36244 -426573 -624503 -904875 -986536 -747294 -356434 -62695 56798 76520 46956 -43984
36234 -43984 -173928 -280510 -369246 -519878 -742581 -912933 -908827 -755614 -582942 -479454
36224 -479454 -430617 -364306 -234837 -101564 -116994 -355004 -655058 -762307 -647223 -534519
36214 -534519 -560165 -585649 -469350 -330305 -350737 -470205 -513615 -513799 -633575 -819565 -828503
36203 -828503 -623086 -470211 -562388 -763863 -838207 -747978 -616522 -536295 -525113 -564814 -591510
36192 -591510 -528814 -390696 -276832 -240840 -254462 -307013 -418042 -538609 -576408 -544095 -547510
36181 -547510 -603391 -611486 -531447 -433095 -342812 -210966 -78565 -94996 -288350 -475674 -493759
36170 -493759 -388643 -296538 -261253 -246473 -218238 -150027 -40762 40327 27367 -28139 -45729
36159 -45729 -85251 -245668 -425356 -420146 -266177 -225555 -393922 -590281 -684945 -738906 -741570
36148 -741570 -544555 -195986 -10967 -119240 -249641 -179279 -91656 -226216 -452341 -495622
36138 -495622 -356245 -194859 -12602 231885 372421 247188 22626 -26700 53685 16410
36128 16410 -143629 -202431 -102178 -6311 14066 50890 122877 130912 48646 -59170 -176009
36117 -176009 -289484 -281533 -87548 114929 112711 -32414 -117419 -131773 -186477 -227626 -138917
36106 -138917 -38249 -128575 -315228 -326997 -177087 -131202 -231690 -247521 -129171 -113071
36096 -113071 -281959 -392583 -274160 -76614 14190 15323 -29692 -178031 -387268 -449852
36086 -449852 -292841 -125070 -138258 -258329 -322248 -310679 -279749 -233909 -178652 -153718 -145843
36075 -145843 -119091 -151940 -347097 -593685 -662240 -567978 -570441 -754932 -900213 -852014 -740450
36064 -740450 -705078 -680668 -602878 -571037 -642977 -691877 -624205 -538879 -533677 -553286 -551085 -594056
36052 -594056 -690366 -725535 -679562 -686455 -779256 -819523 -778568 -815094 -957626 -1007076 -897198
36041 -897198 -839064 -934502 -971256 -816335 -688428 -778398 -900399 -814407 -626500 -558779 -564296
36030 -564296 -490286 -402010 -414787 -405607 -229857 -43897 -68348 -194140 -176323 -73818 -128158
36019 -128158 -317460 -404100 -352873 -341339 -397286 -370180 -250834 -205269 -281039 -346327 -322126
36008 -322126 -250728 -169973 -127789 -232621 -454994 -502390 -180472 235140 312195 50690
35998 50690 -188989 -256428 -307434 -370289 -259949 15478 170583 81080 -43231 -44592 -45650
35987 -45650 -152245 -239777 -204542 -153321 -163549 -102606 117608 317984 295373 131178 58270
35976 58270 134703 229474 253042 241458 249303 279587 310766 326645 325295 318469 306979 273603
35964 273603 229345 217493 225531 172264 51817 -14392 34666 87859 65224 80100 217329
35953 217329 306766 164733 -57219 -46128 220219 477576 590640 677803 822642 928103
35943 928103 893689 733857 511982 325079 307949 478243 662410 751869 881146 1132172
35933 1132172 1278639 1143128 987228 1137660 1417876 1429758 1243491 1268515 1549380 1775466
35923 1775466 1921954 2243555 2642899 2725803 2543025 2582621 2921412 3102008 2994592 3027027
35913 3027027 3381817 3766018 4169213 4932082 5828876 6205296 6399229 7552554 9106718
35904 9106718 8056472 2448666 -5270562 -10357713 -10931654 -9259140 -8047940 -7531789
35896 -7531789 -6754908 -5782291 -5316357 -5254263 -4957843 -4411467 -4086881 -4017115 -3847792 -3555668
35886 -3555668 -3411130 -3415362 -3357286 -3253915 -3235182 -3179158 -2919566 -2622930 -2531533 -2537509 -2427502
35875 -2427502 -2318049 -2400514 -2480436 -2263411 -1916836 -1833077 -1968369 -1948645 -1756564 -1768748
35865 -1768748 -2098175 -2407061 -2447932 -2342626 -2232235 -2071754 -1891729 -1865146 -1955299 -1855934
35855 -1855934 -1472974 -1156375 -1235830 -1568861 -1764539 -1672853 -1461369 -1348371 -1424457 -1634843
35845 -1634843 -1817532 -1840833 -1759098 -1723882 -1730729 -1631795 -1430760 -1343210 -1475922 -1655724 -1692872
35834 -1692872 -1622065 -1555130 -1483562 -1378470 -1315092 -1329682 -1298996 -1131687 -947224 -895131 -927061
35823 -927061 -932395 -974160 -1173436 -1446368 -1576726 -1498993 -1312087 -1071801 -790033 -599320
35813 -599320 -667453 -925268 -1100020 -1064709 -957524 -911569 -880153 -813178 -800263 -906560 -1027867
35802 -1027867 -1053293 -1044002 -1103799 -1181349 -1163270 -1088428 -1101422 -1223871 -1318054 -1272203 -1108439
35791 -1108439 -918336 -794708 -805766 -921115 -974757 -825183 -559181 -414612 -478881 -585068
35781 -585068 -547577 -384684 -245695 -218617 -286688 -394244 -474419 -475715 -438154 -485671 -669765
35770 -669765 -880088 -983671 -980915 -934797 -834828 -666336 -539374 -568158 -658276 -619154 -487817
35759 -487817 -502274 -696433 -789830 -630880 -493340 -676801 -1001721 -1032124 -710961 -416908
35749 -416908 -385413 -435092 -367817 -297631 -386385 -531056 -567412 -578559 -723416 -905056 -900407
35738 -900407 -728966 -606319 -588344 -553939 -514457 -623480 -842353 -907716 -732372 -562311
35728 -562311 -599291 -713397 -694721 -575062 -512571 -536651 -600283 -726119 -895814 -934898 -732993
35717 -732993 -475495 -433870 -604906 -772696 -850003 -918799 -984951 -957913 -878451 -911940 -1062540
35706 -1062540 -1118906 -969923 -785764 -774210 -896360 -942609 -812474 -629031 -604424 -815688
35696 -815688 -1086578 -1129635 -868820 -550045 -427717 -441899 -379171 -257794 -295621 -521399
35686 -521399 -705611 -726033 -724320 -802127 -831412 -721983 -640594 -760363 -968738 -1038809 -967086
35675 -967086 -937841 -1039004 -1196507 -1322060 -1356463 -1220484 -887621 -485884 -203490 -111160
35665 -111160 -157232 -276886 -409126 -470027 -420308 -325664 -278756 -309512 -411619 -563885 -680827
35654 -680827 -668160 -584184 -593786 -697440 -703196 -567499 -521549 -686589 -813474 -654032 -366849
35643 -366849 -245750 -240945 -125838 1073 -176702 -616261 -881024 -742546 -434112 -226917
35633 -226917 -136507 -167663 -450415 -915824 -1174789 -991751 -630794 -476745 -536402 -580382
35623 -580382 -571770 -640064 -762465 -785929 -709058 -674377 -710103 -709856 -644538 -583665 -530669 -442807
35611 -442807 -394044 -505027 -711002 -809936 -763230 -744896 -849382 -947018 -898133 -733262 -539567
35600 -539567 -339058 -185292 -219000 -475361 -745333 -790210 -632230 -485066 -443086 -404771
35590 -404771 -301222 -227642 -279635 -387614 -421020 -383723 -390157 -478395 -564963 -594522 -621783
35579 -621783 -694517 -746761 -688918 -545182 -414792 -340079 -309665 -357008 -525167 -723712 -757642
35568 -757642 -565559 -330779 -271833 -390086 -511746 -529100 -497856 -509098 -565314 -618605 -671571
35557 -671571 -782376 -972512 -1167504 -1259013 -1215155 -1083807 -881675 -563102 -162910 113036
35547 113036 72057 -216603 -492987 -618638 -664534 -683225 -602589 -432185 -367567 -519409
35537 -519409 -689164 -617526 -358295 -191336 -223507 -301893 -307189 -303434 -360737 -436022 -495927
35526 -495927 -579325 -666712 -664585 -606664 -685341 -955211 -1178826 -1137516 -949121 -870900 -905202
35515 -905202 -857979 -730449 -749614 -957094 -1051669 -798255 -388476 -186450 -238376 -262373
35505 -262373 -83390 149057 221478 148601 92470 99705 59215 -101065 -289524 -360312 -291429
35494 -291429 -205259 -224301 -346752 -480806 -573843 -666077 -815842 -1014305 -1190370 -1259101
35484 -1259101 -1146447 -831308 -425089 -157228 -181643 -400682 -565380 -555125 -472929 -455186
35474 -455186 -496063 -511446 -481523 -448400 -435599 -454693 -546459 -724999 -903684 -964488 -901284
35463 -901284 -821333 -794024 -762260 -630881 -399038 -166055 -16121 70957 169692 274564
35453 274564 267780 71618 -204902 -360154 -333604 -243851 -185356 -119473 -18458 27974 -39535
35442 -39535 -114458 -80226 -12666 -59348 -174700 -169418 -22223 49575 -111350 -386334 -553327
35431 -553327 -569725 -578409 -681043 -799003 -771342 -554147 -291962 -166197 -188332 -217496 -196637
35420 -196637 -245539 -431262 -577511 -477458 -226929 -138391 -324131 -561597 -616819 -522713
35410 -522713 -451598 -455115 -447431 -368513 -260988 -204014 -217389 -232189 -178638 -122694 -229704
35399 -229704 -505443 -677504 -499714 -106822 133467 82593 -78231 -195647 -307380 -417905
35389 -417905 -401940 -247327 -136435 -139956 -75105 148055 273049 34705 -420381 -716327
35379 -716327 -743934 -716625 -787895 -860261 -787571 -584995 -398865 -360621 -462050 -525753 -380195
35368 -380195 -124839 -82645 -381341 -743924 -853464 -759085 -706292 -718810 -631752 -451004
35358 -451004 -370325 -441844 -512341 -514338 -557000 -667820 -688072 -525913 -318753 -235894 -272424
35347 -272424 -335548 -403871 -504374 -626127 -728722 -767786 -691149 -499848 -312731 -253717
35337 -253717 -278356 -249946 -180899 -223683 -403211 -556608 -598161 -641858 -758974 -807022 -649467
35326 -649467 -390442 -217094 -127443 -6955 109238 75339 -75432 -102217 107026 339137
35316 339137 327629 122495 23366 157472 294816 167141 -154959 -356943 -298331 -151568
35306 -151568 -106487 -132319 -129694 -145677 -271958 -437839 -486651 -405540 -318560 -290049 -290484 -326744
35294 -326744 -442261 -592144 -666171 -638998 -567260 -452354 -256143 -52543 -6506 -171835
35284 -171835 -429969 -639163 -730035 -670390 -479802 -278583 -183672 -162036 -121917 -111475 -248428
35273 -248428 -480694 -626941 -648993 -657086 -640174 -461117 -177217 -78865 -277195 -499938
35263 -499938 -462694 -238253 -84619 -88491 -164959 -257602 -347227 -378766 -349665 -362833 -440080
35252 -440080 -410622 -160655 125376 177595 18890 -69647 73608 316598 419702 266027
35242 266027 -67772 -365153 -438264 -332602 -291853 -434970 -588605 -565772 -467746 -513793
35232 -513793 -680692 -750652 -663575 -570501 -537866 -448898 -257216 -111509 -113185 -127895 4503
35221 4503 178124 112248 -278262 -734833 -925011 -793825 -580491 -506973 -539172 -502890 -353545
35210 -353545 -213634 -173062 -196524 -246896 -350017 -476445 -500784 -376550 -243700 -263699
35200 -263699 -435021 -648756 -817874 -865165 -713835 -416069 -179542 -129863 -147366 -79047
35190 -79047 -2025 -100874 -365458 -599612 -681952 -642735 -525283 -356857 -237699 -273208 -401698
35179 -401698 -443142 -339628 -218575 -203795 -278161 -340544 -304120 -157813 -25195 -110945 -461420
35168 -461420 -827403 -911424 -712529 -477476 -366761 -358341 -438044 -641884 -880078 -948951
35158 -948951 -797216 -593683 -451970 -278398 -7194 189770 100512 -214570 -468661 -475384
35148 -475384 -316288 -196813 -222724 -328354 -381206 -342368 -314456 -406847 -575120 -656454 -566284
35137 -566284 -395683 -297032 -327706 -432373 -542273 -655460 -805247 -948778 -940379 -701576
35127 -701576 -391533 -261966 -316710 -296468 -82652 94766 12316 -192936 -268379 -272413 -435359
35116 -435359 -695721 -748191 -552563 -419906 -505471 -567419 -395426 -175176 -193368 -401371
35106 -401371 -527277 -479640 -394325 -361730 -335336 -288607 -274201 -305023 -304833 -212864 -69704
35095 -69704 19678 -18072 -153537 -269407 -281302 -242157 -270461 -384987 -492065 -527725 -507707
35084 -507707 -436381 -290858 -116247 -10679 16163 49477 112710 141921 140516 194642 283318
35073 283318 249879 49018 -144298 -181412 -141991 -163677 -209519 -153317 7745 166660 249296
35062 249296 225211 72962 -135207 -209263 -52974 168411 219060 97570 5292 49327
35052 49327 129118 113966 -603 -135979 -230040 -262094 -242760 -209785 -209330 -269873 -385095
35041 -385095 -493485 -491657 -334575 -121126 -4109 -19369 -92549 -189395 -317724 -389789 -279159
35030 -279159 -65256 -14860 -212591 -396970 -307566 -32935 152809 161192 111852 91483 85681
35019 85681 86841 93087 39967 -117938 -295105 -370283 -343725 -285904 -201531 -69667 57275
35008 57275 124412 161442 172095 54777 -195699 -331893 -134841 221297 339421 111036
34998 111036 -186368 -300631 -256032 -152499 21913 257677 405739 347364 162082 4879
34988 4879 -88964 -170781 -233355 -215576 -122764 -60680 -143963 -384841 -650589 -742682 -576062
34977 -576062 -285812 -104779 -132432 -265697 -339206 -279414 -143210 -64152 -135092 -287952
34967 -287952 -332742 -181162 27076 102852 41371 -30911 -68377 -117939 -165960 -137121 -35407
34956 -35407 59361 127201 200433 239538 174505 59025 10595 -1684 -113598 -287283 -296476
34945 -296476 -67126 178386 244467 249005 418012 719119 885704 753054 422218 116484
34935 116484 -8676 64973 232148 343112 329175 236923 112068 -76302 -324574 -489125
34925 -489125 -419503 -170313 45365 120489 153328 249726 347400 328113 228223 214076 357601
34914 357601 543688 624329 572334 442651 281901 156148 175000 356647 518462 451675
34904 451675 195876 -6433 -33896 -3369 -31188 -53412 33245 198236 338429 387123 288401
34893 288401 18118 -272680 -308292 -22357 311906 429580 383042 333168 232375 -22343
34883 -22343 -271568 -248929 4919 182324 140818 12329 -110265 -289135 -493553 -528349
34873 -528349 -325754 -85114 -1981 -31515 -18174 95529 272205 445673 513429 400409
34863 400409 187630 46926 15368 -17531 -77259 -41488 138775 331356 407253 386428 347213
34852 347213 330625 363919 428603 398275 186791 -47645 -65308 90705 157937 97322 145870
34841 145870 350232 418187 218375 77245 296676 650552 691324 371572 32746 -97650
34831 -97650 -74088 28600 226984 469036 610784 596875 504753 405356 314815 258928 251578
34820 251578 243660 217735 277431 505179 788510 933787 901381 785447 625699 412840
34810 412840 237188 234149 367515 435223 335766 200138 202001 330487 424814 400664 378142
34799 378142 542238 873548 1096874 988333 672115 460940 438791 417191 323764 366204
34789 366204 682992 1062057 1197091 1064813 868001 740065 682708 674471 663877 557969
34779 557969 377392 315603 491364 759324 918849 979517 1056671 1149233 1207841 1280116 1389108
34768 1389108 1417479 1329931 1343705 1610063 1879930 1808056 1482799 1302524 1379477 1436110
34758 1436110 1306273 1172015 1209337 1318056 1351474 1367424 1485700 1670092 1800567 1840979
34748 1840979 1821520 1755264 1669246 1640092 1712995 1830896 1906470 1945347 2055095 2308155 2597370
34737 2597370 2698645 2558368 2440852 2628008 3035477 3362396 3572865 3888471 4287323
34728 4287323 4447376 4327550 4341889 4705880 5066690 5115869 5113053 5380207 5720545 5850624
34718 5850624 5996011 6476562 7088065 7536017 8091284 9083170 10137358 10771894 11362481
34709 11362481 12524210 13957419 15145357 16678264 18924641 19345834 13688076 1323592
34701 1323592 -12301054 -20442672 -21462934 -18991224 -16755918 -15397228 -14054801 -12640574
34693 -12640574 -11583550 -10784076 -9925136 -9130248 -8603597 -8148853 -7557330 -6983898 -6519677
34684 -6519677 -5880659 -4932696 -4078233 -3710903 -3670194 -3609059 -3528543 -3569370 -3622242 -3545273
34674 -3545273 -3476072 -3541614 -3526623 -3227140 -2895307 -2904181 -3139667 -3160805 -2874412 -2633220
34664 -2633220 -2673886 -2830575 -2864513 -2771377 -2657210 -2536900 -2384392 -2248796 -2210895 -2277608
34654 -2277608 -2367657 -2377049 -2265988 -2113379 -2055355 -2132932 -2240320 -2254537 -2159149 -2009849 -1856166
34643 -1856166 -1746639 -1735736 -1823335 -1937011 -2006941 -2001206 -1887728 -1670251 -1480703 -1492666
34633 -1492666 -1675297 -1766309 -1590379 -1299328 -1183174 -1320389 -1529848 -1618230 -1565183 -1480453
34623 -1480453 -1459706 -1489414 -1465628 -1321574 -1136643 -1069707 -1183388 -1399341 -1622386 -1814260
34613 -1814260 -1930274 -1890328 -1663061 -1313961 -953854 -707440 -704364 -965499 -1289726 -1406471
34603 -1406471 -1281610 -1128159 -1075636 -1007520 -810705 -603655 -571171 -704597 -864530 -1008601
34593 -1008601 -1196808 -1422518 -1581166 -1593105 -1469422 -1289112 -1178561 -1250474 -1478286 -1686890
34583 -1686890 -1743414 -1689714 -1612882 -1485632 -1259354 -1037067 -993787 -1139751 -1293668 -1299147
34573 -1299147 -1166287 -991104 -831782 -698267 -598255 -541279 -503514 -418203 -249127 -106660
34563 -106660 -223964 -700682 -1291676 -1607737 -1561599 -1455790 -1560890 -1778517 -1841195 -1687276
34553 -1687276 -1470612 -1317413 -1259445 -1323958 -1494347 -1628561 -1599734 -1483406 -1426301 -1370208
34543 -1370208 -1127880 -740941 -521070 -643539 -893964 -957476 -827786 -770271 -939002 -1179799
34533 -1179799 -1228928 -1016455 -723921 -565825 -562387 -564265 -480060 -394299 -423487 -544486 -649227
34522 -649227 -700536 -729082 -730201 -684280 -641100 -658252 -692074 -689189 -743218 -973397 -1256848
34511 -1256848 -1306254 -1072207 -852051 -889784 -1064000 -1122712 -1052169 -1011757 -1029026 -994923 -909435
34500 -909435 -904594 -1014491 -1108996 -1084705 -966460 -798060 -595097 -444259 -477177 -667447
34490 -667447 -805875 -776971 -723397 -817857 -1000740 -1096511 -1085837 -1076605 -1069723 -964857 -792485
34479 -792485 -732099 -852361 -1011686 -1083885 -1113767 -1160555 -1159711 -1076792 -1047651 -1182375 -1334129
34468 -1334129 -1271663 -1029506 -871012 -908090 -973500 -916091 -815295 -794763 -789374 -657589 -440122
34457 -440122 -344951 -477584 -695500 -769203 -647020 -519276 -594298 -821382 -920150 -746510
34447 -746510 -526770 -574798 -839739 -957188 -763536 -508823 -457164 -516952 -456758 -300856
34437 -300856 -261216 -378541 -483479 -479610 -438356 -416528 -391399 -399256 -537758 -778409 -953579
34426 -953579 -995881 -1028984 -1143015 -1236555 -1189740 -1062900 -991799 -978583 -925698 -822909 -762889
34415 -762889 -782110 -805357 -777120 -766025 -880270 -1100053 -1246074 -1155157 -885578 -689309
34405 -689309 -735637 -917173 -1008549 -965490 -937800 -999869 -1029759 -909228 -705153 -564922 -539930
34394 -539930 -606457 -759227 -963598 -1089857 -1031639 -859235 -742947 -747321 -801504 -843220 -875708
34383 -875708 -891590 -857904 -794033 -770961 -814518 -884673 -952391 -1014185 -1034418 -971926 -870161
34372 -870161 -816210 -799043 -727322 -612395 -593515 -717754 -830066 -781064 -630157 -523035
34362 -523035 -464419 -359951 -226341 -205587 -378250 -676669 -971931 -1150999 -1141937 -978260
34352 -978260 -813010 -755961 -734776 -642742 -558272 -628876 -778334 -771394 -585429 -454468 -477107
34341 -477107 -466384 -326546 -286491 -526439 -820526 -855833 -731057 -793879 -1082352 -1286172
34331 -1286172 -1237655 -1094966 -1006746 -921799 -809674 -772905 -831238 -854368 -814184 -846109 -952243
34320 -952243 -928173 -736264 -659349 -870687 -1120232 -1111517 -956174 -946989 -1068387 -1078297 -950883
34309 -950883 -875447 -874999 -785133 -610600 -555352 -641703 -622215 -384043 -167352 -228813 -493147
34298 -493147 -691670 -695004 -576892 -473159 -494893 -680731 -934682 -1085001 -1064490 -955711
34288 -955711 -839276 -720260 -633934 -671150 -825715 -944493 -908660 -765406 -631063 -573963
34278 -573963 -621149 -734864 -748236 -511029 -169232 -85468 -349716 -580415 -416232 -38915
34268 -38915 57760 -258213 -590314 -544281 -201173 32371 -94805 -460270 -770681 -874790
34258 -874790 -842801 -785759 -701020 -561837 -464917 -522913 -634801 -569710 -322384 -167695 -263149
34247 -263149 -420338 -429068 -388512 -482501 -605666 -513987 -250261 -106759 -194693 -354523 -506331
34236 -506331 -774849 -1178494 -1477828 -1487626 -1331820 -1232121 -1211086 -1160082 -1057905 -955334
34226 -955334 -848676 -727367 -666791 -726176 -818311 -818317 -745465 -703073 -693434 -642012 -568124 -565612
34214 -565612 -612757 -564807 -378823 -206445 -190465 -276819 -317681 -284797 -279187 -366702 -501860
34203 -501860 -613021 -682315 -719480 -719897 -693075 -697390 -787104 -916734 -943543 -771472 -495655
34192 -495655 -361835 -534134 -897761 -1134663 -1030111 -685991 -396632 -336274 -427180 -505222
34182 -505222 -521547 -535518 -587489 -659383 -717440 -718882 -620675 -467904 -421550 -574718 -773033
34171 -773033 -771728 -574337 -445428 -549485 -760577 -908539 -1016492 -1149761 -1207912 -1078430
34161 -1078430 -879448 -813931 -845530 -761158 -536254 -389122 -438274 -541666 -555841 -540926
34151 -540926 -588460 -627509 -556797 -437988 -393560 -399176 -336431 -201303 -111761 -126034 -182973
34140 -182973 -232152 -317208 -491091 -704183 -816594 -727165 -502218 -357073 -444914 -660527
34130 -660527 -745136 -613391 -462037 -491350 -648399 -765194 -836081 -980191 -1187047 -1298379
34120 -1298379 -1245073 -1115600 -954918 -690089 -348376 -167402 -316559 -612622 -705540 -516561
34110 -516561 -311711 -323797 -474477 -543617 -469464 -360922 -307923 -318665 -389854 -490423 -498589
34099 -498589 -319172 -83998 -67997 -338760 -644513 -749689 -727071 -766655 -837126 -763156
34089 -763156 -568161 -481042 -583895 -690723 -650799 -563740 -576552 -640933 -623109 -533225 -490380
34078 -490380 -535299 -611197 -672735 -698536 -651481 -536575 -446971 -451314 -490742 -482554 -450805 -441326
34066 -441326 -395907 -264711 -173141 -288596 -546603 -697838 -633841 -486662 -384704 -301685
34056 -301685 -209623 -197754 -327715 -505579 -616774 -687287 -796561 -914995 -952914 -920755
34046 -920755 -922164 -1001927 -1087817 -1081758 -955950 -772985 -647787 -657783 -753538 -799703 -741503
34035 -741503 -672205 -682449 -712141 -641532 -482007 -365569 -357148 -392118 -423626 -518626 -729160
34024 -729160 -941919 -976396 -835374 -744412 -871420 -1082350 -1096013 -863815 -647334 -664333
34014 -664333 -802258 -808785 -656712 -537538 -542246 -556787 -493325 -424497 -414282 -389115 -286203
34003 -286203 -192100 -211975 -310239 -400157 -489709 -608478 -682000 -627185 -505814 -432936 -383987
33992 -383987 -251611 -68049 -9763 -165874 -423358 -594891 -567085 -339962 -30658 175555
33982 175555 189872 122057 114989 123175 1133 -227141 -376262 -381058 -372561 -431990 -465837 -405655
33970 -405655 -351142 -401791 -494060 -526338 -519996 -531987 -517139 -410723 -268534 -204742 -250455
33959 -250455 -363990 -505481 -613346 -594346 -438247 -269978 -206290 -241545 -327559 -428558
33949 -428558 -429767 -197038 130702 139835 -327800 -844910 -914084 -654930 -586399 -816935 -931689
33938 -931689 -732586 -581526 -784061 -1067811 -1024920 -758576 -672933 -807446 -819983 -573832
33928 -573832 -324534 -271018 -283847 -216973 -200238 -418967 -783895 -1024714 -1016422 -848383 -641246
33917 -641246 -462656 -396540 -524568 -786392 -967330 -909101 -695243 -561246 -627242 -778355
33907 -778355 -833876 -783288 -782369 -917763 -1063749 -1035960 -837177 -658150 -635005 -695865 -690337
33896 -690337 -600979 -544818 -587673 -648934 -619390 -498211 -350950 -194096 -28659 40149 -127201
33885 -127201 -463601 -675449 -585287 -379780 -354871 -500353 -548121 -399905 -259785 -291999
33875 -291999 -382764 -361815 -271779 -265916 -377402 -536267 -694685 -793046 -722876 -481372 -254326
33864 -254326 -186799 -187284 -130098 -105817 -230892 -336381 -162953 184415 319100 137727 -37118
33853 -37118 23992 123252 -1173 -255205 -374560 -338829 -342874 -465229 -598299 -652285 -634499
33842 -634499 -558314 -433254 -322202 -280108 -268960 -245297 -276499 -439937 -651952 -735091 -636646
33831 -636646 -469635 -365659 -389347 -548755 -762164 -848390 -686742 -381267 -157751 -114397
33821 -114397 -174303 -244058 -292415 -301078 -272910 -272421 -330724 -342600 -208196 -42118 -49604 -198229
33809 -198229 -233418 -68742 64972 -36856 -268722 -424806 -509182 -633807 -740764 -675747
33799 -675747 -491947 -432449 -574172 -700922 -623386 -457389 -440665 -576870 -637495 -498855
33789 -498855 -309223 -261591 -328267 -336228 -233621 -133511 -103881 -76517 -20736 -51779 -236491
33778 -236491 -400416 -308350 -4054 204989 119856 -145322 -370468 -488790 -551941 -557918
33768 -557918 -447637 -237510 -56391 -39258 -210568 -452257 -577277 -484550 -267108 -125988
33758 -125988 -162903 -303412 -422057 -470790 -477016 -498859 -596263 -755553 -833592 -697061 -446102
33747 -446102 -356422 -531636 -752994 -768136 -593265 -411347 -307642 -265466 -309237 -453256
33737 -453256 -572472 -524256 -371616 -299223 -325236 -293195 -156907 -65888 -117475 -215620 -255014
33726 -255014 -272206 -313345 -312252 -231410 -188972 -282035 -374977 -250899 47706 202630 -6966
33715 -6966 -424929 -683445 -600044 -344678 -214407 -299458 -429109 -433260 -352525 -318330 -320974
33704 -320974 -248971 -125042 -116386 -270407 -413675 -399162 -303704 -270342 -292185 -292060 -302231
33693 -302231 -402621 -560912 -694119 -819155 -974536 -1060070 -953973 -754001 -689199 -793931
33683 -793931 -881843 -857265 -820875 -821265 -755674 -617159 -581634 -685738 -665306 -355100 -50262
33672 -50262 -160396 -610895 -913731 -810672 -537351 -412683 -459331 -529442 -552694 -518508
33662 -518508 -411700 -309805 -371276 -584823 -703936 -595067 -479736 -623934 -932825 -1097163
33652 -1097163 -1030787 -887977 -724297 -469270 -240022 -327755 -750977 -1124903 -1164269 -1068163
33642 -1068163 -1166222 -1378478 -1332135 -930201 -497110 -337393 -402314 -475599 -490145 -525412
33632 -525412 -602996 -629048 -528247 -359206 -274098 -365283 -553016 -658117 -606049 -498452
33622 -498452 -432331 -336296 -104309 167043 241970 60368 -156331 -166209 31165 238227
33612 238227 269516 77767 -231540 -457498 -458407 -301870 -195197 -241567 -351458 -413576 -431140
33601 -431140 -439053 -413050 -340704 -275502 -242236 -195187 -143564 -188213 -337535 -433540 -397516
33590 -397516 -405011 -632451 -943411 -1040407 -858243 -595501 -410428 -307366 -285226 -354317
33580 -354317 -409433 -330357 -223652 -311396 -548632 -636093 -491684 -403540 -561712 -731137
33570 -731137 -622180 -347616 -229536 -321263 -421057 -454014 -533493 -679329 -755047 -700642 -601621
33559 -601621 -511469 -408336 -333986 -367450 -443692 -407011 -272102 -218983 -287488 -303955 -187828
33548 -187828 -105972 -204442 -386481 -496932 -548565 -605352 -601022 -464020 -306382 -292684 -397586
33537 -397586 -474106 -498882 -562553 -654693 -650641 -518647 -376134 -311789 -281176 -206627 -78367
33526 -78367 52294 86635 -90289 -461359 -779133 -787041 -562804 -456618 -615042 -755681
33516 -755681 -560846 -146441 70263 -90948 -384369 -505747 -447550 -390242 -393022 -361796
33506 -361796 -267446 -212455 -241264 -232794 -89095 59272 -16493 -322915 -595141 -608166 -421300
33495 -421300 -245669 -173801 -149503 -133957 -157157 -209301 -210246 -130455 -56811 -85111 -200192
33484 -200192 -310121 -362347 -377268 -383622 -370942 -324887 -282407 -304017 -373814 -379444 -255483
33473 -255483 -106794 -80717 -133068 -84416 50360 -720 -350309 -663596 -544531 -106908
33463 -106908 144290 -14464 -291857 -382442 -364609 -424586 -482136 -375800 -227181 -290687
33453 -290687 -519708 -597277 -401228 -161230 -101743 -176465 -250528 -326016 -441052 -508138 -428637
33442 -428637 -283122 -252467 -384346 -552604 -621986 -556950 -393706 -207643 -109192 -179832
33432 -179832 -378248 -556244 -592301 -492225 -363008 -312806 -366179 -446019 -442854 -326434 -182064
33421 -182064 -117436 -148514 -198693 -189187 -103442 9287 52816 -64756 -331336 -582196 -620028
33410 -620028 -417333 -161619 -69586 -180887 -356102 -448932 -448452 -463344 -586179 -767008 -826402
33399 -826402 -635950 -299458 -92727 -170400 -385272 -481496 -428385 -436033 -627356 -844095
33389 -844095 -874667 -762878 -732918 -842962 -885005 -678780 -336894 -143088 -234325 -495047
33379 -495047 -728905 -839592 -842353 -785468 -707144 -631474 -560546 -474252 -363559 -264790 -235859
33368 -235859 -283267 -333169 -308477 -228479 -186514 -221074 -269735 -282663 -308341 -394801 -472113
33357 -472113 -446914 -376030 -399819 -493889 -446220 -150217 210495 369029 270979 63297 -123555
33346 -123555 -258375 -333094 -339158 -310298 -293109 -284559 -267163 -269749 -316537 -362545 -364412 -357903
33334 -357903 -369361 -330488 -218177 -197158 -427478 -767579 -893711 -732026 -547989 -551268
33324 -551268 -639535 -638609 -579754 -578043 -606877 -579149 -528764 -528657 -528584 -461353 -429604 -586513 -874628
33311 -874628 -1075938 -1102868 -1059975 -1026860 -966841 -871215 -816916 -829770 -833366 -782539 -721773
33300 -721773 -672267 -590563 -482775 -429190 -443377 -436736 -383231 -385940 -500198 -615568 -609284
33289 -609284 -508331 -401531 -299680 -198955 -182845 -314393 -482798 -496530 -311223 -68003
33279 -68003 64029 2882 -226869 -482543 -568306 -435185 -272842 -277070 -376461 -344264 -144639
33268 -144639 23346 35321 -8203 -5611 -37107 -199341 -397945 -461910 -393295 -359917 -463404
33257 -463404 -624829 -699009 -627034 -475836 -373088 -385891 -428914 -335539 -75092 146420
33247 146420 89625 -218572 -469484 -395684 -71730 163829 103036 -72096 -26043 230029
33237 230029 249342 -289362 -1072159 -1473435 -1350109 -1173983 -1290859 -1429989 -1209651 -804497
33227 -804497 -688784 -884150 -944475 -686288 -468583 -607514 -905726 -992782 -834149 -636286
33217 -636286 -472172 -292509 -161865 -194937 -332726 -428033 -493553 -628968 -753484 -674639
33207 -674639 -429808 -305799 -450738 -668808 -689008 -479413 -206151 -14094 53064 9608
33197 9608 -100160 -227883 -356146 -466554 -491243 -389181 -254041 -219728 -262078 -246340 -183241
33186 -183241 -246065 -466920 -615484 -512262 -299842 -236319 -343197 -446306 -481706 -555112
33176 -555112 -723155 -902210 -1007060 -1027982 -954569 -769932 -553049 -447622 -474112 -493431
$$ [...]
##END NTUPLES=NMR SPECTRUM
##END=
