##TITLE=31Pdec_LR-722-R2-C1
 CDCl3, 24 sc
 24.9.2020
##JCAMPDX= 6.0         $$ Bruker NMR JCAMP-DX V2.0
##DATA TYPE= NMR SPECTRUM
##DATA CLASS= NTUPLES
##ORIGIN= UXNMR, Bruker Analytische Messtechnik GmbH
##OWNER= root
$$ XWIN-NMR		Version 3.5
$$ Thu Sep 24 12:32:09 2020 Russian Standard Time (UT+4h)  she@DPX200
##.OBSERVE FREQUENCY= 81.013821
##.OBSERVE NUCLEUS= ^31P
##.ACQUISITION MODE= SIMULTANEOUS
##.ACQUISITION SCHEME= undefined
##.AVERAGES= 24
##.DIGITISER RES= 17
##SPECTROMETER/DATA SYSTEM= spect
##.PULSE SEQUENCE= zgpg30
##.SOLVENT NAME= DMSO
##.SHIFT REFERENCE= (INTERNAL, DMSO, 0, 182.463)
##AUDIT TRAIL= $$ (NUMBER, WHEN, WHO, WHERE, WHAT)
$$ ##TITLE= Audit trail, XWIN-NMR		Version 3.5
$$ ##JCAMPDX= 5.01
$$ ##ORIGIN= Bruker BioSpin GmbH
$$ ##OWNER= she
$$ F:/spectra/data/she/nmr/P31/1/pdata/1/auditp.txt
$$ ##AUDIT TRAIL=  $$ (NUMBER, WHEN, WHO, WHERE, WHAT)
(   1,<2020-09-24 12:30:54.09 +0400>,<she>,<DPX200>,
      <created by zg, POWCHK disabled, PULCHK disabled
       configuration hash MD5:
       00 E9 B6 7A A2 85 ED C7 34 08 36 98 17 FE 4E 26
       data hash MD5: 32K
       82 76 D2 DC 70 4C 78 A5 BE 6D 6C 44 BC E6 1C 81>)
(   2,<2020-09-24 12:30:56.82 +0400>,<she>,<DPX200>,
      <Start of raw data processing
       efp BC_mod = 2 LB = 1 FT_mod = 6 PKNL = 1 PHC0 = -2787.044 PHC1 = 149.6017 SI = 64K 
       data hash MD5: 64K
       26 FE 97 80 D9 F2 84 4F 8D C7 0E AE 4D 08 9A E7>)
(   3,<2020-09-24 12:31:24.34 +0400>,<she>,<DPX200>,
      <pk PHC0 = 44.29866 PHC1 = -78.59995 
       data hash MD5: 64K
       B7 DA 87 3B DA 52 EE 0D 24 AB 01 1D 64 47 EC 27>)
(   4,<2020-09-24 12:31:28.53 +0400>,<she>,<DPX200>,
      <abs ABSG = 5 
       data hash MD5: 64K
       A9 92 2A 26 55 D1 66 5B 2F 99 3C 6A B5 7F 0A 66>)
$$ ##END=
$$ 
$$ hash MD5
$$ E3 10 25 70 CD 9C 5B 72 BB 3D 2C B2 4B C9 C2 DC
##$RELAX= 
##$RELAX= 
##$RELAX= 
##$RELAX= 
##$RELAX= 
##$RELAX= 
##$RELAX= 
##$RELAX= 
$$ Bruker specific parameters
$$ --------------------------
##$DU= <F:/spectra>
##$EXPNO= 1
##$NAME= <P31>
##$PROCNO= 1
##$TYPE= <nmr>
##$USER= <she>
##$AMP= (0..31)
100 100 100 100 100 100 100 100 100 100 100 100 100 100 100 100 100 100 
100 100 100 100 100 100 100 100 100 100 100 100 100 100 
##$AQSEQ= 0
##$AQ_mod= 1
##$AUNM= <au_zg>
##$AUTOPOS= <>
##$BF1= 81.014009
##$BF2= 200.13
##$BF3= 200.13
##$BF4= 200.13
##$BF5= 200.13
##$BF6= 200.13
##$BF7= 200.13
##$BF8= 200.13
##$BYTORDA= 1
##$CFDGTYP= 0
##$CFRGTYP= 5
##$CHEMSTR= <none>
##$CNST= (0..31)
1 1 145 1 1 1 1 1 1 1 1 1 1 1 1 1 1 1 1 1 1 1 1 1 1 1 1 1 1 1 1 1 
##$CPDPRG= <waltz16>
##$CPDPRG1= <>
##$CPDPRG2= <waltz16>
##$CPDPRG3= <>
##$CPDPRG4= <mlev>
##$CPDPRG5= <mlev>
##$CPDPRG6= <mlev>
##$CPDPRG7= <mlev>
##$CPDPRG8= <mlev>
##$CPDPRGB= <>
##$CPDPRGT= <>
##$D= (0..31)
0 1 0 0 0 0 0 0 0 0 0 0.03 2e-05 3e-06 0 0 0 0 0 0 0 0 0 0 0 0 0 0 0 0 
0 0 
##$DATE= 1600936253
##$DBL= (0..7)
120 120 120 11 120 120 24 19 
##$DBP= (0..7)
150 150 150 150 150 150 150 150 
##$DBP07= 0
##$DBPNAM0= <>
##$DBPNAM1= <>
$$ [...]
##$SUBNAM3= <"">
##$SUBNAM4= <"">
##$SUBNAM5= <"">
##$SUBNAM6= <"">
##$SUBNAM7= <"">
##$SUBNAM8= <"">
##$SUBNAM9= <"">
##$SW= 369.568048894756
##$SWIBOX= (0..15)
0 1 3 0 0 0 0 0 0 0 0 0 0 0 0 0 
##$SW_h= 29940.119760479
##$TD= 32768
##$TD0= 1
##$TE= 0
##$TE2= 300
##$TE3= 300
##$TEG= 300
##$TL= (0..7)
0 120 53 12 22 120 120 120 
##$TP= (0..7)
150 150 150 150 150 150 150 150 
##$TP07= 0
##$TPNAME0= <>
##$TPNAME1= <>
##$TPNAME2= <>
##$TPNAME3= <>
##$TPNAME4= <>
##$TPNAME5= <>
##$TPNAME6= <>
##$TPNAME7= <>
##$TPOAL= (0..7)
0.5 0.5 0.5 0.5 0.5 0.5 0.5 0.5 
##$TPOFFS= (0..7)
0 0 0 0 0 0 0 0 
##$TUNHIN= 0
##$TUNHOUT= 0
##$TUNXOUT= 0
##$USERA1= <user>
##$USERA2= <user>
##$USERA3= <user>
##$USERA4= <user>
##$USERA5= <user>
##$V9= 5
##$VALIST= <valist>
##$VCLIST= <CCCCCCCCCCCCCCC>
##$VD= 0
##$VDLIST= <DDDDDDDDDDDDDDD>
##$VPLIST= <PPPPPPPPPPPPPPP>
##$VTLIST= <TTTTTTTTTTTTTTT>
##$WBST= 1024
##$WBSW= 4
##$XGAIN= (0..3)
0 0 0 0 
##$XL= 0
##$YL= 0
##$YMAX_a= 48501
##$YMIN_a= -47650
##$ZGOPTNS= <>
##$ZL1= 120
##$ZL2= 120
##$ZL3= 120
##$ZL4= 120
##$ABSF1= 182.463
##$ABSF2= -187.1042
##$ABSG= 5
##$ABSL= 3
##$ALPHA= 0
##$AQORDER= 0
##$ASSFAC= 0
##$ASSFACI= 0
##$ASSFACX= 0
##$ASSWID= 0
##$AUNMP= <proc_1d>
##$AZFE= 0.1
##$AZFW= 0.5
##$BCFW= 0
##$BC_mod= 2
##$BYTORDP= 0
##$COROFFS= 0
##$CY= -3
##$DATMOD= 1
##$DC= 0
##$DFILT= <>
##$DTYPP= 0
##$F1P= 0
##$F2P= 0
##$FCOR= 1
##$FTSIZE= 65536
##$FT_mod= 6
##$GAMMA= 0
##$GB= 0
##$INTBC= 1
##$INTSCL= 5.30512e-09
##$ISEN= 30
##$LB= 1
##$LEV0= 0
##$LPBIN= 0
##$MAXI= 10000
##$MC2= 0
##$MEAN= 0
##$ME_mod= 0
##$MI= 50
##$NCOEF= 0
##$NC_proc= -3
##$NLEV= 6
##$NOISF1= 182.463
##$NOISF2= 159.3651
##$NSP= 0
##$NTH_PI= 0
##$NZP= 0
##$OFFSET= 182.463
##$PC= 4
##$PHC0= -2742.745
##$PHC1= 71.00175
##$PH_mod= 1
##$PKNL= yes
##$PPARMOD= 0
##$PSCAL= 0
##$PSIGN= 0
##$REVERSE= no
##$SF= 81.0140089999434
##$SI= 65536
##$SIGF1= 159.3651
##$SIGF2= -187.1042
##$SINO= 113.3802
##$SIOLD= 16384
##$SREGLST= <1H.CDCl3>
##$SSB= 0
##$STSI= 65536
##$STSR= 0
##$SW_p= 29940.119760479
##$SYMM= 0
##$S_DEV= 0
##$TDeff= 32768
##$TDoff= 0
##$TI= <>
##$TILT= no
##$TM1= 0
##$TM2= 0
##$TOPLEV= 0
##$USERP1= <user>
##$USERP2= <user>
##$USERP3= <user>
##$USERP4= <user>
##$USERP5= <user>
##$WDW= 1
##$XDIM= 65536
##$YMAX_p= 386150245
##$YMIN_p= -3151112
$$ End of Bruker specific parameters
$$ ---------------------------------
##NTUPLES= NMR SPECTRUM
##VAR_NAME=  FREQUENCY,     SPECTRUM/REAL,   SPECTRUM/IMAG
##SYMBOL=    X,             R,               I
##VAR_TYPE=  INDEPENDENT,   DEPENDENT,       DEPENDENT
##VAR_FORM=  AFFN,          ASDF,            ASDF
##VAR_DIM=   65536,         65536,           65536
##UNITS=     HZ,            ARBITRARY UNITS, ARBITRARY UNITS
##FACTOR=    0.456856943014862, 1,           1
##FIRST=     14782.0589164792, 0,            0
##LAST=      -15158.0608439998, 0,           0
##MIN=       -15158.0608439998, -3151112,    0
##MAX=       14782.0589164792, 386150245,    0
$$ Real data points
##PAGE= N=1
##DATA TABLE= (X++(R..R)), XYDATA
$$ [...]
##PAGE= N=2
##DATA TABLE= (X++(I..I)), XYDATA
41861F27703k56531k19120P3701L03774K05302p5270j56790N0756K11402N4364
41851H19291k13917k17044J5651J06538o0699j60237K4853K19805Q5973k27278
41841C92936l00921p2592J23656J03716N4786J50828K70696K39704J04941K948
41831A070698o3728j49679k04324j51941m4804J276l6588r2070j03278l6162R6001
41820B85401J82241J05224n7191q1068O7473J42633O328j15056R659J97275J11583
41809H54502j76580k68492n9880J06896K031j48166o5741J36618J80261O8890
41799F30339J4260M4760l781j49458k04672q6559N4819R1184R3708J46640J53299
41788G84539j1447k47950l03587r4811J68596K24429N2806j25560j17812L7077
$$ plain form
41861 627703 371172 152052 225753 529527 734829 659559 502769 553525 764927 819291
41851 819291 605374 388330 403981 510519 449820 289583 314436 534241 620214 392936
41841 392936 92015 19423 143079 246795 301581 452409 723105 962809 1067750 1070698
41831 1070698 1006970 857291 652967 501026 456222 457498 420910 328840 225562 189400 285401
41820 285401 467642 572866 515675 434607 502080 644713 651041 535985 545644 742919 854502
41809 854502 677922 409430 349550 456446 458477 310311 244570 381188 561449 630339
41799 630339 644599 689359 685578 536120 331448 244889 299708 390892 484600 631240 784539
41788 784539 773092 525142 221555 126744 295340 519769 572575 447015 329203 366280
41778C66280J54215J40510O9611K3339l2910j44022k22553j45111L7344J32789
41768C79492P2063l570K6126Q6319O7736L0712Q8909J71334R6461j27248k65914
41757F22420j72122K7709J30667J00006J3513r8013k17931k40005p0945J84447
41747B79746K93231J68972l8757j49579j37951q1133k7789J7410M7121N4785N2757
41736D78813N2236N2994O1930P8220O2200j6228r8730r3303j9059N157n4602q9826
41724D19802l2862K2807k1658r7780p1220N5342J57478J55622O6699m9671r9462
41713E05097M499J85088J89198q7880l58083k59152J24858L39002J76642p1939
41703G47330r0919L0178K9267r5677j43157o2407N932j2217m3548k9082N140L3227
$$ plain form
41778 366280 520495 661005 730616 753955 721045 577023 354470 209359 246703 379492
41768 379492 451555 447985 474111 560430 628166 658878 747787 919121 1015582 888334 622420
41757 622420 450298 478007 608674 708680 722193 624180 406249 166244 95299 279746
41747 279746 572977 741949 703192 553613 415662 334529 306740 324150 371271 426056 478813
41736 478813 531049 584043 645973 724193 786393 770165 671435 578132 559073 564230 509628 419802
41724 419802 386940 409747 388089 290309 219089 274431 431909 587531 654230 604559 505097
41713 505097 509596 694684 883882 796002 437919 178767 303625 642627 819269 747330
41703 747330 656411 686589 715856 620179 477022 414615 420547 408330 364782 335700 340840 374067
41691C74067N3791N0735L7255Q1839J75496J65560k1087j88628j16070Q4571J06431
41680H03960q4564j98881p4405R6125Q5154n7093j37324q0020O5902K15519K39516
41669H73889M3197k35435k92910n8031J65502J10163r2577j54615n5304K2155
41659C26034M0620J12995K21373K06749M0296j19432j60009j25432q4175m9264
41649D09755l2106l0831J9326J44521K24480J43671p659o6415o1959j24158j88569
41638D30056p5345J48680J96789O797j40968n5356R3503P9709m4113r1514k6276
41627E21962O7543J38736J46217L8240j16119j38056m046Q0997J581q4500l2634
41616F19921M3371Q414l2763M9195J31087M6195r8096r7677n60J6777j5345L4582
$$ plain form
41691 374067 427858 478593 515848 597687 773183 938743 917656 729028 612958 697529 803960
41680 803960 719396 520515 446110 542235 627389 570296 432972 352952 418854 634373 873889
41669 873889 917086 681651 388741 330710 496212 606375 513798 359183 303879 326034
41659 326034 366654 479649 701022 907771 948067 828635 668626 543194 459019 409755
41649 409755 377649 346818 366144 510665 735145 878816 871157 804742 742783 618625 430056
41638 430056 354711 503391 700180 706977 566009 510653 604156 683865 639752 548238 521962
41627 521962 589505 728241 874458 912698 796579 658523 654477 735474 737055 652555 619921
41616 619921 663292 671706 638943 688138 819225 865420 767324 669647 669087 685864 670519 705101
41604G05101Q4698j8630j47989o9270J03987N7918j44987j10549K06506L59838
41594A026623J14050j75558j40172N8168Q3744j8685r280O8249L903j51538j76953
41583F82551r4222j04088j65780l3908K67798L86546J54456j54013k25632j13141
41573F00567n7568j01745r1906L6203J62639J55043J8409j24455j44736k2705
41563D29746J14193J11578k3039j12522l5163J09348J31013K919j05644n1331
41553E71098J00413J55298K6419j57719k03876q6654K7061K732q1914n3927R8882
41542C97813J99205J22158m1580j23747r2168l5494J909M6502P9752L7633m7249
41531E44734m5740N3932P3400q7251k32490j16135J69703K88957J39007k6766
$$ plain form
41604 705101 789799 771169 623180 553910 657897 715815 570828 460279 666785 1026623
41594 1026623 1140673 965115 824943 883111 966855 948170 938890 1007139 1011042 859504 682551
41583 682551 588329 484241 318461 284553 552351 938897 1093353 939340 713708 600567
41573 600567 542999 441254 349348 385551 548190 703233 721642 597187 452451 429746
41563 429746 543939 655517 632478 519956 484793 594141 725154 728073 622429 571098
41553 571098 671511 826809 853228 695509 491633 404979 432040 434772 352858 298931 397813
41542 397813 597018 719176 677596 553849 461681 426187 428096 474598 554350 591983 544734
41531 544734 498994 552926 626326 539075 306585 190450 360153 649110 788117 761351
41521G61351j4442M8044O494k9750O9089J36603n0458l43836l74844r3928J65292
41510B79615J75434O2428J2246K6131O0120J36972J99793J00273j35523k58225
41500F59264j47727R652L7534K4287Q7276J22525J5042j03601n5243Q9086J53373
41489H91468J47099J68163J60729L4173r9550q2112k210n8397k15087k70572j89828
41478D83876r2870N089J45859K06597N8604j19122n0306J56989J41688j03424
41468H32980k02742l4500P9782l3064r7925P3406J98188J5498k16588j27307J49477
41457F37205K05762R723j23074q9604q1879j45460q5922J30856K56956J49789
41447H64352j7989n8712k7585m4007o7701j3257O1342L7615p8047j72901j79577
$$ plain form
41521 761351 746909 794953 801447 771697 840786 977389 926931 583095 208251 114323 279615
41510 279615 455049 517477 529723 555854 615974 752946 952739 1053012 917489 659264
41500 659264 511537 521189 558723 583010 670286 792811 807853 704252 649009 738095 891468
41489 891468 1038567 1206730 1367459 1401632 1302082 1219970 1217760 1159363 944276 673704 483876
41478 483876 391006 396095 541954 748551 807155 688033 637727 794716 936404 832980
41468 832980 630238 595738 675520 642456 544531 617937 816125 831623 615035 487728 637205
41457 637205 842967 852690 729616 640012 558133 412673 326751 457607 714563 864352
41447 864352 846363 787651 760066 716059 648358 635101 696443 734058 656011 483110 303533
41436C03533j24202n8531k857N6854J31092J78118J30242P963n6199J3852J12159
41425F92024R8067N07n7524o8920j03403j10928J7403J96611J97750O017j08611
41414G58993J1742J66242J08092q4726j64516j04804q5968j49977j30912M1473
41404C65639J97664J83039Q4499P0412J20168P2304j03376k38602j94686l8905
41394E18156O6670P1567N1459O1113O7404L2627j2774j4009L4696Q8125R3843
41383A058877K7496p8721j34569o7768P9977J81110J63874P1083l4240j35729
41373A131390j97295j35845M5571J75727R2496j28358k41548j29570P0910J55849
41363H39327Q0459l1743m8456L3069Q6822L130j55978k00445n4314J20185J25468
$$ plain form
41436 303533 179331 120800 117943 174797 305889 484007 614249 622212 566013 579865 692024
41425 692024 790091 790598 733074 664154 560751 449823 467226 663837 861587 867604 758993
41414 758993 770735 936977 1045069 960343 795827 691023 605055 455078 324166 365639
41404 365639 563303 746342 830841 901253 1021421 1093725 990349 751747 557061 518156
41394 518156 584826 656393 707852 768965 836369 868996 856222 842213 876909 965034 1058877
41383 1058877 1086373 1007652 873083 805315 885292 1066402 1230276 1301359 1267119 1131390
41373 1131390 934095 798250 843821 1019548 1112044 983686 742138 612568 683478 839327
41363 839327 919786 888043 839587 872656 959478 962608 806630 606185 551871 672056 797524
41352G97524j1969j00850n3314M5350J08554J35042J18288K5795r2142j10892
41342H61386m046J06159J19404O8631J6564m0516j06518j34379j07550p4624m8671
41331F55840J8453J05356R3778m3926j52424r3724O1088J43906J00978m996j05534
41320G78795j36883m5017J04717J29492l0586j80508j23076O2656J58956J19723
41310H38269N2035j4012j06275j30464K5816K25745J94858o2025k18657q6637
41300G18653J23117J22846o9825k22339k06526p5850O6211J38962J03367J3104
41290G11720j6583M3921J00966Q5945L1354l4616j25422j83539j05595M9706P5549
41279F33406n9753j19102K9412J71579Q3442j03618j32102l1922k301k4089O0194
$$ plain form
41352 797524 785555 684705 631391 676741 785295 920337 1038625 1064420 972278 861386
41342 861386 857340 963499 1082903 1151534 1168098 1127582 1021064 886685 779135 704511 655840
41331 655840 674293 779649 873427 829501 677077 583353 644441 788347 889325 884329 778795
41320 778795 641912 596895 701612 831104 800518 620010 496934 559590 718546 838269
41310 838269 890304 876292 770017 639553 665369 891114 1085972 1023947 805290 718653
41300 718653 841770 964616 894791 672452 465926 390076 456287 595249 698616 711720
41290 711720 695137 739058 840024 925969 957323 922707 797285 613746 508151 557857 633406
41279 633406 573653 454551 483963 655542 738984 635366 503264 471342 469041 444952 505146
41268E05146J65525N1739k11471k60215p69K07431Q9580j42456j42336O7097J95565
41257E24836J24117j0885q3245j02668j01472o3106K7781J54846K77545L24972
41247A072721K37150N5044r9621j65308j75946j44640m3796P0574P5377k2437
41237H59118p2081k6238j0786o5277m3400R2312J23530p0387k43511j39109P8651
41226D82822P5208j08281j29710Q7036K42131J53290N840N55N2638L621r4401
41215G70749q8017K8830J29463J31970O2677O261L4938J17677J13356l6461j58698
41204A112745o8550J12155J04009p5205j13098Q1375K05538N7882j27405q1851
41194A207595N3568M851j40857r8124R1166J05498j03834k04612j2240K15381
$$ plain form
41268 505146 670671 722410 510939 250724 249955 457386 546966 404510 262174 329271 524836
41257 524836 648953 638068 554823 452155 350683 287577 315358 470204 747749 1072721
41247 1072721 1309871 1364915 1265294 1099986 924040 779400 735604 806178 881555 859118
41237 859118 787037 760799 750013 684736 641336 733648 857178 786791 543280 404171 482822
41226 482822 558030 449749 320039 407075 649206 802496 808336 808891 861529 865150 770749
41215 770749 682732 711562 841025 972995 1035672 1041933 1076871 1194548 1307904 1271443 1112745
41204 1112745 1044195 1156350 1260359 1185154 1072056 1153431 1358969 1416851 1289446 1207595
41194 1207595 1261163 1266014 1125157 1027033 1118199 1223697 1119863 915251 903011 1118392
41184A118392J75881m3768j39658l1546Q3206M1582r8756j77037j18412P126O3266
41173H80276o810r8355o2151P6255J09437p1512k86922k84254q3517N7474J8101
41162B48022l5665M8513J47461P2285r1613r8221N0830R3627m8458j13456N7876
41151C31201K01498K5332k83069l00520j3555J77756R7980K2371J52888K66235
41141F78117J19740j09521j03639Q8875J57468K4105r1006o2738k6013j09242
41131E66146k29483k26820o0339J77109L40228L20263J45718k1378p5197r8066
41121H38181j92491k62734j40814J08825K16660O9521j30968j37300M6554K09888
41111F25322J89602J6538j43087j58160o5864j6861o1434o4363Q6829K70995K65545
$$ plain form
41184 1118392 1294273 1250505 1110847 1079301 1162507 1204089 1105333 928296 809884 817010 880276
41173 880276 873466 775111 712960 789215 898652 827140 540218 255964 172447 229921 248022
41162 248022 212357 260870 408331 480616 389003 290782 341612 435239 386781 273325 331201
41151 331201 532699 558031 274962 -25558 -39113 138643 236623 258994 411882 678117
41141 678117 797857 688336 584697 673572 831040 855145 764139 701401 675388 566146
41131 566146 336663 109843 49504 226613 566841 887104 1032822 1011444 936247 838181
41121 838181 645690 382956 242142 350967 567627 637148 506180 368880 415434 625322
41111 625322 814924 831462 688375 530215 464351 447490 386056 321693 408522 679517 945062
41100I45062M5834j88564k65435j82958k2553J30325J76681O7785q9481j15437
41090E01259K2531J77398K23493J77659J04636K0871p2294j53903k08204k11913
41080E81533j10472R5610K64863K42796O9682o8900r3130q7016j05574r1860k2280
41069F75252K5930J2509j607Q153l3597j45548j93933o1834J65367K84550K05248
41058I40490K7637q3852o2485J3437K6243k7760l8810L7664R8276O3466J6949
41047A011255M3422M5528q7417k25680j58238M4578R9040o0134j93343j45497
41037C73514m3827j7126J5215J32907K19536J46898j0585r6621p6732l989Q6789
41026G25979J46668J04906j4459r2513r3285r5259j03401k0186J35529J93008
$$ plain form
41100 945062 990896 802332 536897 353939 331386 461711 638392 706177 616696 501259
41090 501259 523790 701188 924681 1102340 1206976 1227847 1155553 1001650 793446 581533
41080 581533 471061 566671 831534 1074330 1144012 1075112 981982 894966 789392 697532 675252
41069 675252 701182 713691 712084 720237 686640 541092 347159 285325 450692 735242 940490
41058 940490 968127 884275 821790 835227 861470 833710 794900 832564 930840 994306 1011255
41047 1011255 1054677 1100205 1012788 787108 628870 673448 772488 712354 519011 373514
41037 373514 329687 312561 327776 460683 680219 827117 816532 719911 643179 639190 725979
41026 725979 872647 977553 963094 870581 777296 682037 578636 558450 693979 886987
41016H86987R4746j8118o5002j26723j94623j03958J37533K46272P9598j21271
41006H15441j18829k9334l7536m5861Q7477K14705J43033m079j9982p74j18145
40995H86116k07205k4059K34499J61022j80178l04625n6416J84788J34315j9669
40985H08588k7441L7876J8580l1298j4311k602p1824j18832k9450J24977K01699
40974H95962J66518O4069n8430j36810j39569j51607k40380k61367m0223K62697
40964C60860K86731J9389j39287J8912J98036Q8353j60592k26346j06496k0981
40954C18579j9009O566M8090K0550k0436L6288J24017R6678J682J0183J13669
40943G36857J34954L6123k0782M4841J00948K7364r2187j01279O622R0974N0333
$$ plain form
41016 886987 981733 963615 898613 771890 577267 473309 610842 857114 936712 815441
41006 815441 696612 667278 629742 583881 671358 886063 1029096 1025017 1005035 1004261 886116
40995 886116 678911 654852 889351 1050373 870195 565570 509154 693942 828257 808588
40985 808588 781147 819023 837603 806305 791994 789392 717568 598736 569286 694263 895962
40974 895962 1062480 1126549 1068119 931309 791740 640133 399753 138386 98163 360860
40964 360860 647591 666980 527693 546605 744641 832994 672402 446056 339560 318579
40954 318579 299570 306136 354226 374776 354340 390628 514645 611323 613005 623188 736857
40943 736857 871811 907934 887152 931993 1032941 1060305 968118 866839 873461 964435 1014768
40932A014768n5748p6097M8597J89867J65448l0210k06695k15427j15342m8013
40922F71148m1464k3806L5025Q8289Q7757L1796l5764m6819K4077J02432R5560
40911I88231L3714K4241N9545J7982j07425j54884n2037M4596m851r3819m8347
40900G06946Q5145J18118J5368p0561l9813K8910O620j17680k03199p6713K48419
40889G01560M74102K97805j52440l72357j12361K58975K50863p3913k39479p5097
40879I57658Q8176k2830k29204k30129n3119N9281M3261L8404Q9012O9407o4946
40868G44971j54255o1750J08821J54904N9188k0444j9107m2483j30635j32494
40858E06716N0376K44558K21478L7166o2895k0505j072o9133r6726l6164j5095
$$ plain form
40932 1014768 959020 882923 931520 1121387 1286835 1256625 1049930 834503 719161 671148
40922 671148 629684 605878 640903 729192 816949 848745 812981 766162 790239 892671 988231
40911 988231 1021945 1046186 1105731 1123713 1016288 861404 809367 853963 849112 755293 706946
40900 706946 792091 910209 925577 855016 815203 844113 850733 733053 529854 453141 701560
40889 701560 1175662 1473467 1321027 948670 836309 1095284 1346147 1272234 1032755 957658
40879 957658 1045834 1023004 793800 563671 510552 569833 613094 651498 740510 809917 744971
40868 744971 590716 528966 637787 792691 851879 831435 812328 769845 639210 506716
40858 506716 557092 801650 1023128 1060294 997399 976894 975822 906689 809963 773799 758704
40847G58704p2403n8791P5773J44393L0601r7929o6992K5957J6390m1477k1268
40836F92958J8219l2972r4370l8628N4948M5119L446P6023J83201J48259L7845
40825A094048O4339K00015K05028L0728j10432j02755p1130j16735j64747j44126
40815H84233j03403q5458o9814p2597j26505j52441l9008J50155K40391K01888
40805H27441J39830O8455o3984j61447p2716J11587J50880M7477K5918R8671K0940
40794A193052k38085l63865j96491m439m2645j54841p7497J21775J95412J12045
40784E44421K8126N631J363K1876P3211O0703o3926j53801n4684J38667J89253
40773G90840K9843j67042j95769k0009J82354J71695n4964j75755M2008L18936
$$ plain form
40847 758704 686301 627510 703283 847676 878277 780348 713356 739313 755703 714226 692958
40836 692958 711177 678205 583835 545207 600155 645274 648720 724743 907944 1056203 1094048
40825 1094048 1158387 1358402 1563430 1594158 1483726 1380971 1309841 1193106 1028359 884233
40815 884233 780830 695372 625558 552961 426456 274015 235007 385162 625553 827441
40805 827441 967271 1035726 971742 810295 737579 849166 1000046 1047523 1073441 1172112 1193052
40794 1193052 954967 591102 394611 390172 347527 192686 115189 236964 432376 544421
40784 544421 572547 578178 579541 601417 674628 735331 671405 517604 462920 601587 790840
40773 790840 820683 653641 457872 437863 620217 791912 736948 561193 603201 922137
40763I22137K00952j99683k75465J43481M60920K09285k38677k93440m4104L1592
40753I16998p9761k0021J77451J07085k45054m00489j51121J38040J42221n386
40743E79963r3020j67998k71011k42113m2612Q3811J5707k2118J04895J36668
40733H2172j17257l25878o9547M75810P24528M66151O5354j08441p8990k5919
40723A087983K3985J11189J62916Q1685p6932j50066o5736P7229J20234N394j69024
40712A208857k44664j56669J4227J35048J38086N4191k3266p773R2178J52914
40702A363129O5128j15441k16138j47142K0815J68915K24788J51975l1309k02331
40692A282389k25003j23650m7691l8111K2230J71577K49397J26312p6679j40161
$$ plain form
40763 922137 1123089 923406 647941 791422 1252342 1461627 1222950 929510 885406 916998
40753 916998 837237 817216 994667 1101752 856698 456209 305088 443128 585349 579963
40743 579963 486943 318945 47934 -194179 -236791 -152980 -137273 -159391 -54496 82172
40733 82172 -35085 -360963 -430510 45300 769828 1235979 1301333 1192892 1113902 1087983
40723 1087983 1111968 1223157 1386073 1467758 1390826 1240760 1175024 1252253 1372487 1377881 1208857
40712 1208857 964193 807524 821751 956799 1094885 1149076 1125810 1118037 1210215 1363129
40702 1363129 1428257 1312816 1096678 949536 970351 1139266 1364054 1516029 1484720 1282389
40692 1282389 1057386 933736 886045 847934 870164 1041741 1291138 1417450 1340771 1200610
40682A200610l9329M7588j4703j70914k61286j88424n233J37890J51053R3952
40672I51204O1407M0030j0977j0580J19161K23095P3771k17133k61460K6245K44034
40661A238797R4939j60324j41361M4777L5756j39085j19729J32512K29096j6920
40651A198458k83947k41219r910J03118O4878M8719Q9372P1837k6870j08757j23871
40640G81808r5790j7825J17931K14629J49809l0601j27179k9968J45692K05442
40630A313948R3163p9665j79405j72635j07015k1356P3606J33448Q1066p3741
40620A061414j77379r1233J14629K23883J29383o2924j85525j69866n1321P8347
40610H69408J03263k0164j62585j27715R0396K63366K07701Q425j16360q6096
$$ plain form
40682 1200610 1161281 1208869 1194166 1023252 761966 573542 568309 706199 857252 951204
40672 951204 1012611 1052641 1041664 1031084 1150245 1373340 1447111 1229978 968518 994763 1238797
40661 1238797 1333736 1173412 1032051 1076828 1112584 973499 853770 986282 1215378 1198458
40651 1198458 914511 673292 663382 766500 831378 880097 969469 1041306 1014436 905679 781808
40640 781808 686018 668193 786124 1000753 1150562 1119961 992782 962814 1108506 1313948
40630 1313948 1407111 1327446 1148041 975406 868391 847035 920641 1054089 1135155 1061414
40620 1061414 884035 792802 907431 1131314 1260697 1197773 1012248 842382 791061 869408
40610 869408 972671 952507 789922 662207 752603 1015969 1223670 1232095 1115735 1029639
40600A029639K241M0168J4002k4896k3530K0559L6987m1689j58054j63244j5977
40589G16206J42096J71288R9130K5369l1239q2200o5354O1179J84728J55321P344
40578A383868q5610o2046k5820m4309n3098k939M1830K0515k2175k8348k8606
40567A093262p0599j20293j19405q5948p2115o1599J872R9622J37717P3551k4060
40556H52005o9088o5064p7170j21085j28792l9893J02164J82173J48443Q7055
40546H70748J26615K65845L32837J62733j77394l97013k78679N4295K57242J68940
40536A386169j4638m0226N3646M1467j12821j99930r9547M0728M5339m3613p9859
40525I76715l8012M897R969k4566j10526j93787j29651J21646L55174L33254Q7538
$$ plain form
40600 1029639 1031880 1072048 1086050 1061154 1037624 1058183 1095170 1053481 895427 732183 716206
40589 716206 858302 1029590 1128720 1154089 1122850 1040650 975296 1036475 1221203 1376524 1383868
40578 1383868 1298258 1236212 1210392 1166083 1112985 1110046 1151876 1172391 1150216 1121868 1093262
40567 1093262 1022663 902370 782965 697017 624902 563303 565175 664797 802514 876065 852005
40556 852005 782917 717853 640683 519598 390806 350913 453077 635250 783693 870748
40546 870748 997363 1263208 1596045 1758778 1581384 1184371 905692 959987 1217229 1386169
40536 1386169 1371531 1331305 1384951 1426418 1313597 1113667 1014120 1054848 1100187 1056574 976715
40525 976715 938703 943600 953569 929003 818477 624690 495039 616685 971859 1305113 1392651
40514A392651j28793j45073o557J35733J42396l4987k57647k69065j0465K37224
40504A055417K06348J6008m0481L9202K3321j03030j13202J8641L2929j52597
40494I82556k52623o3032K04209K49089R7554l6607r2360j29710j28010m8931
40484G82135K5695K1019J7555R5495J60536J03792J487k8319l0026p8995r0542
40473I79832K2625J35995R3514j1419J6013J34591J34117k0466j56572j66333
40463A161897r3640O146Q9060O5684p2453j43543n987J91303K16875J02264J6569
40452A534175o8857k51934l49912j00742L11899L86070K4870k93712k04652P9000
40442A066205J72350L8141j22025j99034j65371J7919K56545L01259Q3462j26213
$$ plain form
40514 1392651 1263858 1118785 1112228 1247961 1390357 1355370 1097723 828658 818193 1055417
40504 1055417 1261765 1277773 1237292 1276494 1299815 1196785 1083583 1102224 1135153 982556
40494 982556 729933 666901 871110 1120199 1217753 1181146 1088786 959076 831066 782135
40484 782135 807830 828849 846404 941899 1102435 1206227 1207714 1179395 1149369 1070374 979832
40473 979832 1002457 1138452 1231966 1220547 1236560 1371151 1505268 1484802 1328230 1161897
40463 1161897 1068257 1074403 1163463 1229147 1156694 1013151 1007164 1198467 1415342 1517606 1534175
40452 1534175 1465318 1213384 863472 762730 1074629 1460699 1485569 1191857 987205 1066205
40442 1066205 1238555 1276696 1154671 955637 790266 808185 1064730 1365989 1449451 1323238
40432A323238r3021M9915N2745o3644j05883m1091L55m3938j15697j33120l2162
40421G97697J65391K62428P1919k34159k48685O5787K39998r696l12788k03621
40411E94271J71624L28722J77202O635p9473k03622k84432j01042K11675K46490
40401A068050k6812j84797m3216O4611r2051k13959J0948L37244L11733l6576
40391A195175k56346j17596J50580K40116J05810r0767j77948q9450Q0510J41528
40381A181612L2827o2486M3828K51689K87105Q5313j28218j66296j04539r1887
40371A328948r6540M581J67874J97930K7682j70636k13542j23563l3198J8057
40361A107593O4737Q0086K6050r619Q2351K04456J44813p4583j81689o6609M3896
$$ plain form
40432 1323238 1230217 1280132 1332877 1269233 1163350 1122259 1122614 1078676 962979 829859 797697
40421 797697 963088 1225516 1297435 1063276 814591 880378 1120376 1110680 797892 594271
40411 594271 765895 1094617 1271819 1278454 1198981 995359 710927 609885 821560 1068050
40401 1068050 1041238 856441 813225 877836 785785 571826 582774 920018 1231751 1195175
40391 1195175 938829 821233 971813 1211929 1317739 1226972 1049024 959574 1040084 1181612
40381 1181612 1214439 1151953 1195781 1447470 1734575 1819888 1691670 1525374 1420835 1328948
40371 1328948 1232408 1236989 1404863 1602793 1630475 1459839 1246297 1122734 1089536 1107593
40361 1107593 1172330 1252416 1278466 1268847 1351198 1555654 1700467 1625884 1444195 1377586 1421482
40350A421482l1780j26005k0766J63371J60151o564q5906j6550K3684m5626j07538
40339A327953r1045n8107k9369M2231J08522O5796l2968m0879N310o4885k10129
40328A022430j83010M8131J91354P5162q5008m2021J09077J29383J9331k9293
40318A255536N0331J37012J16999r55j20510j24901K1197J88834K06712R3742
40308A823997K4774M1416k033j46904k17979j10252M2307J17595J87252K82983
40298B043156K32909l9663k76889k21087j3711L2540q1972j04372K2028J02307
40288A695246M8726k2719o2865j54674k60284j89509P5984K64005J52793j37913
40278A408790l20030k71989r1483P8584J62644J51652Q3852J5255k2676k6104
$$ plain form
40350 1421482 1389702 1263697 1242931 1406302 1566453 1559889 1473983 1457433 1481117 1435491 1327953
40339 1327953 1236908 1178801 1149432 1191663 1300185 1365981 1333013 1292134 1297444 1232559 1022430
40328 1022430 839420 887551 1078905 1154067 1069059 1027038 1136115 1265498 1284829 1255536
40318 1255536 1305867 1442879 1559878 1558923 1438413 1313512 1334709 1523543 1730255 1823997
40308 1823997 1848771 1890187 1888154 1741250 1523271 1413019 1455326 1572921 1760173 2043156
40298 2043156 2276065 2236402 1959513 1738426 1724715 1757255 1675283 1570911 1592939 1695246
40288 1695246 1743972 1721253 1658388 1503714 1243430 1053921 1129905 1393910 1546703 1408790
40278 1408790 1088760 816771 725288 803872 966516 1118168 1202020 1217275 1194599 1168495
40268A168495n04K0018k3651j24023j66988p6936M4095L9174p6563j46085j09001
40257E48031n8733n1571j7394Q5234J60041J03558m4012j56615j70115j08886
40247B89538j7575O6687J03250P0698J348m1479l0269m368k2601q4852j19043
40236B11334o1962O8532K06094L01644L11528J84171m2190j84159j03930P1452
40226I62514J00518r515j5611J46176K28356P7095r9706p3247L2707k3487j75140
40215A150660j67299P015J10325N4422j1048J736J1951j2828P641O6790M1305
40204A260670q0439j46125p3106M8576J25888J54707J18728o297j20655q0818
40194A201129N4819P5407n0634j25988n6493J9190Q764J1020O9262M6198j00140
$$ plain form
40268 1168495 1167991 1188009 1164358 1040335 873347 796411 840506 879680 803117 657032 548031
40257 548031 489298 437727 420333 505567 665608 769166 725154 568539 398424 289538
40247 289538 271963 338650 441900 512598 513946 472467 442198 437830 415229 330377 211334
40236 211334 149372 217904 423998 725642 1037170 1221341 1179151 994992 891062 962514
40226 962514 1063032 1053517 1037906 1184082 1412438 1489533 1389827 1316580 1349287 1325800 1150660
40215 1150660 983361 990376 1100701 1155123 1144075 1145811 1157762 1144934 1152575 1219365 1260670
40204 1260670 1180231 1034106 961000 1009576 1135464 1290171 1408899 1402602 1281947 1201129
40194 1201129 1255948 1331355 1280721 1154733 1098240 1117430 1126194 1137214 1206476 1252674 1152534
40183A152534j64800j0115J86010J99023P9747j988m6424j22950j51868m9215
40173A069954M6026l8880k00929k16433j13934r3682j37805l6282J92639K51220
40163G21894K2891k15685j91302J58J02586P9514P5081J20527J00411k5780j44126
40152F46169j38744j2360J48794K44531K02615M0484j05454r2517N7210J58010
40142A148738P1860j21062k10698r9252R5398J86262J19688k028o3840m4999O532
40131A086599L9621K5202k4561m1742K9073J21481Q8740q9051k24674j43919Q0701
40120I47470K31950K32021J80852J36744M0155j06407j64232o6985M0576P293
40110A479437r2635r2109j3075k4864j51313k19998j28876J7885R4293J05123
$$ plain form
40183 1152534 987734 977619 1163629 1362652 1442399 1440411 1393987 1271037 1119169 1069954
40173 1069954 1115980 1077100 876171 659738 545804 452122 314317 278035 470674 721894
40163 721894 744785 529100 337798 337956 440542 520056 595137 715664 816075 790295 646169
40152 646169 507425 495065 643859 888390 1091005 1131489 1026035 933518 990728 1148738
40142 1148738 1220598 1099536 888838 789586 884984 1071246 1190934 1188906 1125066 1080067 1086599
40131 1086599 1126220 1151422 1126861 1085119 1114192 1235673 1324413 1235362 1010688 866769 947470
40120 947470 1179420 1411441 1592293 1729037 1769192 1662785 1498553 1431568 1472144 1479437
40110 1479437 1386802 1294693 1281618 1256754 1105441 885443 756567 774452 868745 973868
40100I73868Q4302J3319n6981K0816K44455L46177J24519k21957l19922j10148
40090A098448J23588J71205Q8589j8961j32378j89061p8891J38036K38586J55830
40080A594991O6351P0141M4772n7984o6102P0535R2144j48472l52641k04455J03003
40069A212283J72338M7210P9948K54834J77204k23560m98289l43964j7823J31653
40059I91834J48095K06819K20808N2210j33904q9912R9764J60174O4977M021p823
40048A717063j39159l62575m06715j74438P2858R1573k246M5571K10364K24773
40038A277069N629j72669l3460K97370M11723J41320k10051k55357j6597J47649
40028A592626M7352j27579j34540m601P4409M7328J1422K6860M4743jj04433j86235
$$ plain form
40100 973868 1058170 1071489 1014508 1035324 1279779 1625956 1750475 1528518 1208596 1098448
40090 1098448 1222036 1393241 1481830 1462869 1330491 1141430 1062539 1200575 1439161 1594991
40080 1594991 1661342 1731483 1776255 1718271 1652169 1722704 1814848 1666376 1313735 1109280 1212283
40069 1212283 1384621 1431831 1511779 1766613 1943817 1720257 1221968 878004 860181 991834
40059 991834 1139929 1346748 1567556 1619766 1485862 1395950 1495714 1655888 1720865 1724886 1717063
40048 1717063 1577904 1215329 808614 634176 707034 798607 796361 841932 1052296 1277069
40038 1277069 1282698 1110029 1076569 1373939 1785662 1926982 1716931 1461574 1444977 1592626
40028 1592626 1639978 1512399 1377859 1373258 1447667 1494995 1506417 1533277 1578020 1578019 1473586 1287351
40016A287351j33379O7003K39433J84230l1215j08822O4289K20092R1932j71815
40006A709099k14549M043J71003J04660n313N9495J94150J40813j17455l29167
39996A716779l08068j33683K027K3838q410k6533j8297O16R522j0223l9423j5288
39984A192857P4123J21827L0981j02239p6498J14560K30537J13312r0052j57622
39974A451786r7493n6176n1004j344O1857M1874k0387q220M5383J9989l9119J7932
39962A365078J40675J09238r4502k17837j12148P2530J53814J38731Q4178k5884
39952A613873j48253j49914l4581J1552p8314j23450m988J21177Q7645j3189q543
39941A273015P5861J04960O3656K4667L59l1663n4947o3405p4659m8132N6527
$$ plain form
40016 1287351 1153972 1220975 1460408 1644638 1613423 1504601 1568890 1788982 1880914 1709099
40006 1709099 1494550 1498593 1669596 1774256 1768943 1828438 2022588 2163401 2045946 1716779
39996 1716779 1408711 1275028 1277055 1300893 1292483 1265950 1247653 1248269 1257791 1247568 1208145 1192857
39984 1192857 1266980 1388807 1419788 1317549 1241051 1355611 1586148 1699460 1609408 1451786
39974 1451786 1354293 1298117 1247113 1245769 1307626 1349500 1329113 1320893 1366276 1386265 1347146 1365078
39962 1365078 1505753 1614991 1520489 1302652 1190504 1263034 1416848 1555579 1639757 1613873
39952 1613873 1465620 1315706 1281125 1292677 1214363 1090913 1085925 1207102 1294747 1281558 1273015
39941 1273015 1348876 1453836 1517492 1542159 1542518 1510855 1455908 1392503 1317844 1269712 1326239
39930A326239J25641J7754j41678q0530J64403K55423R2778m9001l8880q5865
39920A586284k32870j70030J51484K57028q2557l45655o8779L23093J79539k68088
39910A329449k70332J92099L89040L8033l13499k28560M4864J60215J75111J88814
39900A705234N3317k33474l35421j05645J16263M7574r4274k2895J09896J6576
39890A257151k00726k15899J1346K26407K59463J51066O505o3999K7734K04219
39880A663267K29693J8030k03011j88910m496J00884K5893j17124j75991r1645
39870A256590O2594J22272J0201j25010r5012K9652J9273j29787j74270j6575
39860I59928J60585K08769J84815J41631L6026p7665n6930M5268J3590j38208
$$ plain form
39930 1326239 1451880 1469634 1327956 1247426 1411829 1667252 1760030 1711029 1672149 1586284
39920 1586284 1353414 1183384 1334868 1591896 1509339 1163684 1094905 1417998 1597537 1329449
39910 1329449 1059117 1251216 1640256 1678289 1364790 1136230 1181094 1341309 1516420 1705234
39900 1705234 1758551 1525077 1189656 1084011 1200274 1247848 1153574 1130679 1240575 1257151
39890 1257151 1056425 840526 851872 1078279 1337742 1488808 1495313 1431314 1459048 1663267
39880 1663267 1892960 1910990 1707979 1519069 1514573 1615457 1641350 1524226 1348235 1256590
39870 1256590 1319184 1441456 1451657 1326647 1231635 1261287 1280560 1150773 976503 959928
39860 959928 1120513 1329282 1514097 1655728 1691754 1614089 1557159 1602427 1616017 1477809
39850A477809j55499j1358J2201j49091j71325Q2868K60300R2148j34038n1249
39840A252766J86735K02471J5514p3612j7592r194p1508o0826J1978J4085l1447
39829A419370p543M3343R500n0367k9416p691q4838j24151K7407K06993J60870
39818A563477k4202p0224J9315J4396r1669q5800M1413P3385j3717P263J89006
39807A622643K76827J09112j39346k27849j30077M2704J86509K01911M3260j65640
39797A820054k31008j33387j5956N2128J07638J18636J4085j11749p0552J12181
39787A662070J93491O6721r6998j21044m0629J8672J0202m5878j02745q0999M7433
39776A510296J65959J39077J0499p1987q3774r7832q8703J5739J19814M5741j57738
$$ plain form
39850 1477809 1322310 1310952 1323153 1174062 1002737 1085605 1345905 1438053 1304015 1252766
39840 1252766 1439501 1641972 1657486 1583874 1566282 1557088 1485580 1424754 1436732 1450817 1419370
39829 1419370 1411827 1455170 1464670 1414303 1384887 1377196 1292358 1168207 1195614 1402607 1563477
39818 1563477 1539275 1469051 1488366 1502762 1411093 1325293 1366706 1440091 1426374 1433637 1622643
39807 1622643 1899470 2008582 1869236 1641387 1511310 1554014 1740523 1942434 1985694 1820054
39797 1820054 1589046 1455659 1439703 1491831 1599469 1718105 1732190 1620441 1549889 1662070
39787 1662070 1855561 1922282 1825284 1704240 1663611 1682283 1692485 1646607 1543862 1462863 1510296
39776 1510296 1676255 1815332 1825831 1753844 1670070 1572238 1483535 1499274 1619088 1664829 1507091
39765A507091k32100o8944J60535K65955K22463P6403j14905k18674j20872P2145
39755A549097J29670K3679n0374J994O7712P7437J02855J38773N6795j21954j69450
39744A806234k668J48263Q6043n9523p1841J0365J0893o6820p5426K500L7768
39733A825788j1068l7119J8527N9098j7658j50788j75929l2378J52520K11993
39723A842986J30617K4588m2415j14682k00235k07642r7940K4063O1315M9999
39713A470654M4224J7067j6597M8779J90260J83208n2862k31992q5487K04670
39703A771924K60827N9990j03001r5540l7866R480Q3116R4824n2128j67791p40
39692A823095K68482K11638j47316l08858p3901J59613O2023j47328j51515l8514
$$ plain form
39765 1507091 1274991 1206047 1366582 1632537 1855000 1931403 1816498 1597824 1476952 1549097
39755 1549097 1678767 1702446 1652072 1654066 1721778 1799215 1902070 2040843 2097638 1975684 1806234
39744 1806234 1803566 1951829 2037872 1978349 1906508 1916873 1927766 1860946 1785520 1788020 1825788
39733 1825788 1814720 1777601 1796128 1855226 1837568 1686780 1510851 1478473 1630993 1842986
39723 1842986 1973603 1998191 1955776 1841094 1640859 1433217 1335277 1359340 1420655 1470654
39713 1470654 1514878 1531945 1515348 1564127 1754387 1937595 1884733 1652741 1567254 1771924
39703 1771924 2032751 2092741 1989740 1894200 1856334 1865814 1948930 2043754 1991626 1823835 1823095
39692 1823095 2091577 2303215 2155899 1847041 1773140 1932753 1994776 1847448 1695933 1657419
39682A657419k4773l3676R0785K26132J79657L9856k518M359q0710j74897j09177
39671A772457M8539R6331J9070n1059q9423j43612j39364K3644K40488K91731
39661B068802J35311o2226j42999p5561P1179J58425Q0354o8037o3829J10629
39651B212048J98174N6586j06429o9172N6487M5286o7156q8422O243J04715J75519
39640B523879K14578J19668j31337l20320k67426j25241j24450j88774j19992
39631A580585q776p8753k27547j48628J21014K11166J9772j20782K632J57717
39621A508400Q9528o0237j3892J87706K56392O6322k14148l38715j97791J17887
39611A401452L68179L47589R9554j20947j50222q3770q2626j33290j09152J3574
$$ plain form
39682 1657419 1632646 1598970 1689755 1915887 2095544 2135400 2132882 2137241 2056531 1881634 1772457
39671 1772457 1820996 1917327 1936397 1885338 1795915 1652303 1512939 1536583 1777071 2068802
39661 2068802 2204113 2141887 1998888 1923327 1994506 2152931 2233285 2165248 2101419 2212048
39651 2212048 2410222 2466808 2360379 2291207 2347694 2392980 2325824 2237402 2243645 2348360 2523879
39640 2523879 2738457 2858125 2726788 2406468 2139042 2013801 1889351 1700577 1580585
39631 1580585 1571809 1493056 1265509 1116881 1237895 1449061 1468833 1348051 1350683 1508400
39621 1508400 1597928 1537691 1523799 1711505 1967897 2034219 1820071 1481356 1283565 1401452
39611 1401452 1769631 2117220 2216774 2095827 1945605 1861835 1779209 1645919 1536767 1550341
39601A550341J28368J56283J24834Q4274K6791o9684j53561j20275M5591J91212
39591A964174J41995p0439k25593j92477p6388k0035J1036J15354K35092K27600
39581B110319J08282L6738O2812O0940m8906j70950j87395j16966m4631M841L6839
39570A851923J3015q3679j50808n3785J67806K80232J19242j71684k70130n6413
39560A645719K34088K99703J20859q2962j66715j75348j74733j46698q8468n8320
39550A407125n2538L0323K15429L50545K80401N4273j26964j30663l121J04488
39540B129298Q5999j9071p4324j9521N5329O0438L6916L5080j6494j52322k06685
39529A914643m7163J36724Q1827r0214l7703J98057J96212j51751m09122k47471
$$ plain form
39601 1550341 1678709 1834992 1959826 2044100 2070891 2001207 1847646 1727371 1772962 1964174
39591 1964174 2106169 2035730 1810137 1617660 1541272 1521237 1532273 1647627 1882719 2110319
39581 2110319 2218601 2255339 2318151 2379091 2330185 2159235 1971840 1854874 1810243 1815084 1851923
39570 1851923 1864938 1781259 1630451 1576666 1744472 2024704 2143946 1972262 1702132 1645719
39560 1645719 1879807 2179510 2300369 2217407 2050692 1875344 1700611 1553913 1465445 1407125
39550 1407125 1354587 1384910 1600339 1950884 2231285 2285558 2158594 2027931 2024810 2129298
39540 2129298 2215297 2196226 2121902 2102381 2157710 2218148 2255064 2290144 2273650 2121328 1914643
39529 1914643 1867480 2004204 2086031 1995817 1958114 2156171 2352383 2200632 1791510 1544039
39519A544039Q2442J96734J25142R4770Q4632m0896j87132j72279m6184L7542
39509A718810R8901K00229K28141J00444n975N5328R1479r8237k87672j36655
39499A964793K11714K99446M7717j63551j03575M2160O2868Q811j580L7500J05701
39488B512004J77366J30798j11221l48859k92563L29J63697L5335j54320j69472
39478A943094o5807M191L9145J00636J48186J02846j0675p4439k549J51828K08240
39467B544696N6375j40603j02007J50926K62239N7563j77863j47417J3242L0817
39457B547968l5923J5707J01375J7466j35021j17635j78r177p1050L2109J79482
39446B525123R4908q0978L5257L50698L45275r1966m51161l71970j00071J6965
$$ plain form
39519 1544039 1626481 1823215 1948357 2043127 2127759 2086863 1899731 1727452 1681268 1718810
39509 1718810 1817711 2017940 2246081 2346525 2340550 2395878 2487357 2389120 2101448 1964793
39499 1964793 2176507 2475953 2523670 2360119 2256544 2298704 2361572 2370383 2368803 2406303 2512004
39488 2512004 2689370 2820168 2708947 2360088 2067525 2067854 2231551 2266886 2112566 1943094
39478 1943094 1877287 1881478 1920623 2021259 2169445 2272291 2261616 2187177 2184628 2336456 2544696
39467 2544696 2601071 2460468 2358461 2509387 2771626 2829189 2651326 2503909 2517151 2547968
39457 2547968 2512045 2527752 2629127 2646593 2511572 2393937 2393759 2384582 2313532 2345641 2525123
39446 2525123 2620031 2539053 2574310 2925008 3270283 3178317 2727156 2355186 2255115 2272080
39436B272080J3289N5959J17855J30142J36880J27823K0450q9900l258J86603
39426B967923J56522j01143k26308q8460K3747m9904q7095L2869P5543p6450j63265
39415B463979l6577L8618j18592k30460l2883K55844L03171J69379R1676O3827
39405B967982j9419p3434j3910K0011o0462o6001J18343K36878N7771j97558j75992
39394B794209P3747K30223J76263L9435o9496q9204L7255K07190J72528q3738
39384C488412k52226j82081j22700k33644k53157J300K04482L2933k51645k23733
39374B207941L450L7059p5711K6406L14279L74675R1137j92190k09230n0708J08800
39363B635908J88032J08191j28131k85653j45065J41581K52657J69316J10935
$$ plain form
39436 2272080 2285369 2341328 2459183 2589325 2726205 2854028 2874478 2784578 2781320 2967923
39426 2967923 3124445 3023302 2796994 2708534 2732281 2682377 2595282 2628151 2703694 2627244 2463979
39415 2463979 2427402 2466020 2347428 2116968 2084085 2339929 2643100 2812479 2904155 2967982
39405 2967982 2948563 2875129 2861219 2881230 2820768 2754767 2873110 3109988 3167759 2970201 2794209
39394 2794209 2867956 3098179 3274442 3313877 3244381 3155177 3192432 3399622 3572150 3488412
39384 3488412 3236186 3054105 2931405 2697761 2444604 2445904 2650386 2683319 2431674 2207941
39374 2207941 2211391 2248450 2172739 2199145 2513424 2888099 2979236 2787046 2577816 2527108 2635908
39363 2635908 2823940 2932131 2804000 2518347 2373282 2514863 2767520 2936836 3047771
39354C047771J00467j8766j95575k02655m5036L4302l6776q7173m3883j8930m5598
39343B488148l2150J6130O959k7712J911K4436n9959j16171K7383K07878J34847
39332B671700r6280j19152Q7978J51197o8813k36687r0300J48340J36200q4836
39322B499347j86600j6882K29435K67246O2680j08602J459K38987K10151j23724
39312C073497l17503r8002J94028J42679q8109q4547R9917J02409m9988n436K11845
39301C180790J91598j22978k87617q8179J34866R5823p910O2999J61866P4581
39291C395839q5936j11015m9586n2792q6936m4745M2820J08623J88908K87269
39281C592449K71233O8996j79911l02518k78462j58005L0985J99478K05028N2939
$$ plain form
39354 3047771 3148238 3129472 2933897 2731242 2686206 2720508 2683732 2596559 2552676 2533746 2488148
39343 2488148 2455998 2472128 2479087 2451375 2453286 2477722 2417763 2301592 2328975 2536853 2671700
39332 2671700 2575420 2456268 2544246 2695443 2626630 2389943 2299643 2447983 2584183 2499347
39322 2499347 2312747 2295865 2525300 2792546 2855226 2746624 2748083 2987070 3197221 3073497
39312 3073497 2755994 2657992 2852020 2994699 2906590 2822043 2921960 3024369 2974381 2968945 3180790
39301 3180790 3372388 3249410 2961793 2873614 3008480 3104303 3096393 3159392 3321258 3395839
39291 3395839 3309903 3198888 3149302 3096510 3009574 2964829 3007649 3116272 3305180 3592449
39281 3592449 3863682 3932678 3752767 3450249 3171787 3013782 3044767 3244245 3449273 3502212
39271C502212p1373o1456k0907n9810j30860j49916j19090n4534N6068J60610
39261C050944J56647N5648k845N8320J69709K26675J65664k8557k44381k49905
39251C357919K3436K85260K15386q1936k25671j01608M9849O3072L4116N4702
39241C674525P1510O2079P7046P2841l3034j32580m0879J56904J82835M991j26935
39230C969303j08230r4222j41748r7886O5902J55947J00825O6028J14427Q0177
39220D110523r0005j88592r1983L4152K7878k9225q471O4719J29824J95498K32726
39209D387044J74614P7345N8355N9677o2814k16251j55632Q6896J99704O4757
39199D673695j09717j75639k04428k07014p4677J26873J81922J10475J38608K36633
$$ plain form
39271 3502212 3430839 3369383 3348476 3288666 3157806 3007890 2888800 2834266 2890334 3050944
39261 3050944 3207591 3263239 3260394 3318714 3488423 3715098 3880762 3852205 3607824 3357919
39251 3357919 3381355 3666615 3882001 3800065 3574394 3472786 3522635 3585707 3619823 3674525
39241 3674525 3746035 3808114 3885160 3958001 3924967 3792387 3751508 3908412 4091247 4096238 3969303
39230 3969303 3861073 3766851 3625103 3527217 3593119 3749066 3849891 3915919 4030346 4110523
39220 4110523 4020518 3831926 3739943 3774095 3801973 3772748 3764277 3828996 3958820 4154318 4387044
39209 4387044 4561658 4639003 4697358 4757035 4694221 4477970 4322338 4409234 4608938 4673695
39199 4673695 4563978 4388339 4183911 3976897 3902220 4029093 4211015 4321490 4460098 4696731
39189D696731J36403j21367j64585N8655J42668p0477j98714K564K13577J38820
39179D834275Q629Q8554J62767j7323j76267N5003M48839M73382R7501k09261
39169E766099j92781p4107j03900k31249k71615j63708j1884J4253j44213l12774
39159D274121k63218m3934Q0137N1906R0314K51814K82220P5944q0074K9184J63350
39148D911764J2143k91501l65196j14510J99763L13766J75883p7412k18471j23468
39138D422761N4472O8583n3958p3458L9908Q3090M1661J25141L03984K65279k1260
39127E256203j56279N7626K79700J83057o4871j51099p5929J1813R7404J62766
39117E600391R2436n8324l3158J92718L05133J51482l8166q9685j11929j28116
$$ plain form
39189 4696731 4833134 4711767 4547182 4605837 4748505 4678028 4479314 4481878 4695455 4834275
39179 4834275 4842904 4931458 5094225 5076902 4900635 4955638 5404477 5877859 5975360 5766099
39169 5766099 5573318 5499211 5395311 5164062 4892447 4728739 4716855 4731108 4586895 4274121
39159 4274121 4010903 3966969 4047106 4099012 4189326 4441140 4723360 4799304 4719230 4748414 4911764
39148 4911764 4923907 4632406 4267210 4152700 4352463 4666229 4842112 4764700 4546229 4422761
39138 4422761 4477233 4545816 4491858 4418400 4458308 4541398 4583059 4708200 5012184 5277463 5256203
39127 5256203 5099924 5157550 5437250 5620307 5555436 5404337 5328408 5340221 5437625 5600391
39117 5600391 5692827 5634503 5601345 5794063 6099196 6250678 6212512 6122827 6010898 5882782
39107E882782L0690K81292K66938j0438j00798J20423K07544m7096k26636o8228
39097F336473N6308j24688k43622J633K50771J47211j3581J10826K55501J17829
39087F894661p604J78946L32912J07082j25280N6441K72638k644m32958l53111
39077F921083R4432K64156J16311J02516J96329l6721n35094p57347n40882k22781
39067E602002J655J81673K19203J9190j35050L4880K67694K06570O4316J88676
39057F650809L29757R7217k06992n2982L26778L01016n7913j52882N6247Q9698
39047G380753p2459M619K93789L15207M6086n2596Q1951M9437j88045k37098n0733
39036G570911J5216n8898O8343L67896M33268K24088J06507J58770J23789J0014
$$ plain form
39107 5882782 5913472 6194764 6461702 6451264 6350466 6470889 6678433 6631337 6404701 6336473
39097 6336473 6392781 6268093 6024471 6026104 6276875 6424086 6410505 6521331 6776832 6894661
39087 6894661 6887057 7066003 7398915 7505997 7380717 7437158 7709796 7707152 7274194 6921083
39077 6921083 7015515 7279671 7395982 7498498 7694827 7658106 7123012 6365665 5824783 5602002
39067 5602002 5603657 5785330 6004533 6023723 5888673 5923553 6191247 6397817 6462133 6650809
39057 6650809 6980566 7077783 6870791 6817809 7144587 7445603 7387690 7234808 7291055 7380753
39047 7380753 7308294 7312913 7606702 7921909 7967995 7915399 7997350 8046787 7858742 7621644 7570911
39036 7570911 7586127 7527229 7595572 7963468 8396736 8620824 8727331 8886101 9009890 9019904
39026I019904N7980J82786J20220L235J15321K55674P0144k06357j01605K40881
39016I758183L47683K71707L33133L40109j6255l39060r8577L16053J89929k17967
39006A0884938j33892K93005K82436r5182o7829L62813M53949J43848Q6374L13661
38996A2524121K25140j13571l5563L71887L63299k3210l7285K93519K30830j32505
38986A3666662K4409N70961N08794j51249l06833K49969N09522J65055P1013M45517
38976A5753820M32396j09128j92694M10532O69652K22034J1220M20828N78685
38967A8197345J45454j4009M05712N34514J21145Q3698O16477O83602Q6970J3348
38957B0874256P65828J055006L92269K3164N45830Q21821K87226Q3978P61590
$$ plain form
39026 9019904 9077884 9260670 9380890 9384125 9499446 9755120 9825264 9618907 9517302 9758183
39016 9758183 10105866 10377573 10710706 11050815 11034560 10695500 10596923 10912976 11102905 10884938
39006 10884938 10751046 11044051 11326487 11231305 11163476 11526289 11980238 12124086 12210460 12524121
38996 12524121 12749261 12635690 12600127 12972014 13335313 13312103 13274818 13568337 13799167 13666662
38986 13666662 13691071 14262032 14770826 14619577 14312744 14562713 15072235 15237290 15308303 15753820
38976 15753820 16186216 16077088 15884394 16294926 16964578 17186612 17197832 17618660 18197345
38967 18197345 18342799 18328790 18734502 19269016 19390161 19473859 20090336 20773938 20860908 20874256
38957 20874256 21640084 22695090 23087359 23110523 23656353 24478174 24765400 24849378 25610968
38948B5610968J135654O30997M43590J118877J357557N62887J38479Q47808J370365
38939C3217182R23378P32637J417251J644194R29412Q74586J991764K409350J464133
38930D5603887J204880K445270L013836K035909J922632L688645M661009L589798
38922F8165866L281113N043141N796414M294461M250607P000556P901531N355380
38914A11089069N510505J1109220J4856895J3049449J4307565J9839433O647753
38907A96409889m4911072j09554038j31261315q8065140k0262773J8811400K0497089
38900a58335960J2837632J3243522J4288912R035099M435259O114952Q474296
38893h9906288O305174L449584M082333N347466M040018K565263L343836L968541
$$ plain form
38948 25610968 26746622 27377619 27821209 28940086 30297643 30860530 30999009 31846817 33217182
38939 33217182 34140560 34873197 36290448 37934642 38864054 39738640 41730404 44139754 45603887
38930 45603887 46808767 49254037 52267873 54303782 56226414 59915059 64576068 68165866
38922 68165866 71446979 76490120 82286534 86580995 90831602 97832158 105733689 111089069
38914 111089069 116599574 127708794 142565689 155615138 169922703 189762136 196409889
38907 196409889 151498817 41944779 -89316536 -177381676 -197644449 -178833049 -158335960
38900 -158335960 -145498328 -132254806 -117965894 -108930795 -104495536 -98380584 -89906288
38893 -89906288 -83601114 -80151530 -76069197 -70721731 -66681713 -64116450 -60772614 -56804073
38885e6804073K360451J015117K080065L241559K235826R37530J447032K197633
38877d1288860J345122L71962J048740K035819J590278P74392J092685J567052
38869c1462810Q90464R3302M84397J125390P70150K68659P42608J300277P93811
38860b4993752O8175L29107R19786P38885L13470N33322Q05944L32813j76788
38851b1129038J53803O52725M17980M1185L64217P96384N10387Q8220L52458P28665
38841a7023014L79285j42343M0654M58684K58722j49252M7778M74236L41637k9519
38831a5343132Q4432L82993K19874o4359J50490M72513K41449j60630l5683L08510
38821a3743543K30549K9097K73356N72785L06294r9903P5858M66738K96004j62611
$$ plain form
38885 -56804073 -54443622 -53428505 -51348440 -48106881 -45871055 -44933525 -43486493 -41288860
38877 -41288860 -39943738 -39571776 -38523036 -36487217 -34896939 -34122547 -33029862 -31462810
38869 -31462810 -30572346 -30479044 -29994647 -28869257 -28099107 -27830448 -27087840 -25787563 -24993752
38860 -24993752 -24925577 -24596470 -23676684 -22937799 -22624329 -22091007 -21285063 -20952250 -21129038
38851 -21129038 -20975235 -20322510 -19904530 -19863345 -19499128 -18702744 -18192357 -18104137 -17751679 -17023014
38841 -17023014 -16643729 -16786072 -16745418 -16286734 -16028012 -16177264 -16129486 -15655250 -15313613 -15343132
38831 -15343132 -15258700 -14875707 -14655833 -14720192 -14569702 -14097189 -13855740 -14016370 -14052053 -13743543
38821 -13743543 -13512994 -13483897 -13210541 -12637756 -12331462 -12431365 -12355507 -11888769 -11592765 -11755376
38811a1755376j22681K60505K81055L4641R2775K83749P5500k44937m4835L82335
38801a0757269K80582j71500j85250K03525K77479l695j8245K85312L46430J03842
38791i638789N2738K43649K42324L3570P444J22878J2701j79272O731M11313M33074
38780h251639O1332j54685q0366o1075j10238P0291L26001K05545j45583j27019
38770h267436K73451M35247J48968j15309o7982L5458Q28k0598L5671L0805J374
38759g509523J14297K51726J64238l0040k4276J20327J33687P9987J70910K45207
38749f283460N5643j42157M7546M17260M58230J88202k7954k28401o30903q98971
38739g044965n28766J69809L96317R7365l9269J94420K77567K0005r2914J57243
$$ plain form
38811 -11755376 -11878057 -11617552 -11336497 -11301856 -11209081 -10925332 -10849832 -11094769 -11139604 -10757269
38801 -10757269 -10476687 -10648187 -10833437 -10629912 -10352433 -10356128 -10374373 -10089061 -9742631 -9638789
38791 -9638789 -9586051 -9342402 -9100078 -9066508 -9059064 -8936186 -8923485 -9102757 -9096026 -8684713 -8251639
38780 -8251639 -8190307 -8344992 -8425358 -8486433 -8596671 -8526380 -8200379 -7994834 -8140417 -8267436
38770 -8267436 -7993985 -7558738 -7409770 -7525079 -7593061 -7557603 -7556775 -7577373 -7541702 -7510897 -7509523
38759 -7509523 -7395226 -7143500 -6979262 -7009302 -7033578 -6913251 -6779564 -6699577 -6528667 -6283460
38749 -6283460 -6227817 -6369974 -6322428 -5905168 -5446938 -5258736 -5286690 -5515091 -6145994 -7044965
38739 -7044965 -7573731 -7403922 -7007605 -6910240 -6949509 -6755089 -6477522 -6457517 -6550431 -6393188
38729f393188L06085M4515k71170k72342j07579k1977L7968J37518J56594Q4501
38719f299075Q4261J46606R7230k0487j5877L2522p4347j76537J0076K82031K09475
38708e724122q7133j26993M5396m6205l55169l13590J31226L58345J27417o3495
38698f054323Q1658J93199K8581o4780J40491L02272J70989L5512J10365J20462
38688d935574r3380j82354N8473K46017Q5295p5960J24090L87846K55572j38764
38678d268739l33555k29796n1821Q4184J51521M9709j70681k06173M7493K53550
38668d674308J59916J5076J06897K42269R9196j97195k78975j00540Q5496J46152
38658d396016J30706O9540q605n950P5198O4854r1803j99088j29233k6594j9265
$$ plain form
38729 -6393188 -6087103 -6042588 -6313758 -6586100 -6693679 -6715656 -6677688 -6540170 -6383576 -6299075
38719 -6299075 -6214814 -6068208 -5970978 -5991465 -6007342 -5974820 -6049167 -6225704 -6215628 -5933597 -5724122
38708 -5724122 -5811255 -5938248 -5892852 -5939057 -6294226 -6607816 -6476590 -6118245 -5990828 -6054323
38698 -6054323 -5972665 -5779466 -5750885 -5815665 -5675174 -5372902 -5201913 -5166401 -5056036 -4935574
38688 -4935574 -5028954 -5211308 -5152835 -4906818 -4821523 -4897483 -4773393 -4385547 -4129975 -4268739
38678 -4268739 -4602294 -4832090 -4883911 -4799727 -4648206 -4598497 -4769178 -4975351 -4927858 -4674308
38668 -4674308 -4514392 -4499316 -4392419 -4150150 -4050954 -4248149 -4527124 -4627664 -4542168 -4396016
38658 -4396016 -4265310 -4195770 -4204375 -4210325 -4135127 -4070273 -4162076 -4361164 -4490397 -4516991 -4536256
38647d536256l497R5352J38963N9876L3518J46736J90992K2734j56559j26302
38637d134443J6251Q2130Q8716J00814M1555j03714j54932l5207O0290R346m601
38626d033795J60916L08761K09136m0643k05274k30932j66802j4716J42769J25337
38616c745243l9687p0924J21666K53010J27556m4269l1612M6507L844p3927n3451
38605c506530k5029p4853o8824P2265J66797R4398K5840Q7127J18617J7800l4690
38594c127082M3338K2557j69835k01866Q0275K71607N5682k04446n2554K74243
38584c008081K49489o5147j94770q0371p0451k16414k24548o0232O695m1520O0790
38573c644560K98359L17202K2465k39078k05853p970J43825K07884J76795L6628
$$ plain form
38647 -4536256 -4539753 -4444401 -4305438 -4245562 -4212044 -4065308 -3874316 -3851582 -4008141 -4134443
38637 -4134443 -4118192 -4036062 -3947346 -3846532 -3804977 -3908691 -4063623 -4098830 -4038540 -4029194 -4033795
38626 -4033795 -3872879 -3564118 -3354982 -3395625 -3600899 -3831831 -3998633 -4013349 -3870580 -3745243
38616 -3745243 -3784930 -3855854 -3734188 -3481178 -3353622 -3397891 -3429503 -3382996 -3379152 -3453079 -3506530
38605 -3506530 -3531559 -3606412 -3675236 -3602971 -3436174 -3341776 -3315936 -3228809 -3110192 -3092392 -3127082
38594 -3127082 -3083744 -3061187 -3231022 -3432888 -3352613 -3081006 -3025324 -3229770 -3282324 -3008081
38584 -3008081 -2758592 -2823739 -3018509 -3098880 -3169331 -3385745 -3610293 -3670525 -3663830 -3705350 -3644560
38573 -3644560 -3346201 -3028999 -3006534 -3245612 -3451465 -3459435 -3315610 -3107726 -2930931 -2894303
38563b894303p8947j0406J27168Q3154r8511j41958k2856L792j15972j39765J0937
38552c277667J01050J6491k9816J07027K35782J52888l1779q8293J1627J22164
38542b680526J18947k7505k23631k60025l0996K38897K15455p6135k61973j43149
38532c130641P4277J54928J44820J64042J56231M1386p8578o9277J2511J5815
38522b514486p9084j68457j80766j18479j2773Q4858J28013J37390J66106J91581
38512b366097J48741P6486Q4825J45969Q8176j27155k87079k09166j4485L6795
38502b422990q8610j62579k7122J85589K36093R5648l1524K919R9558P7341o2163
38491b097840j61508j45522p8274q94J10206K07735J87960Q8121P1659J48032
$$ plain form
38563 -2894303 -2973250 -2983656 -2856488 -2773334 -2871845 -3013803 -3036659 -3032867 -3148839 -3288604 -3277667
38552 -3277667 -3176617 -3160126 -3189942 -3082915 -2847133 -2694245 -2726024 -2814317 -2802690 -2680526
38542 -2680526 -2561579 -2589084 -2812715 -3072740 -3103736 -2864839 -2649384 -2725519 -2987492 -3130641
38532 -3130641 -3056364 -2901436 -2756616 -2592574 -2436343 -2394957 -2473535 -2542812 -2530301 -2514486
38522 -2514486 -2593570 -2762027 -2942793 -3061272 -3074045 -2989187 -2861174 -2723784 -2557678 -2366097
38512 -2366097 -2217356 -2140870 -2056045 -1910076 -1821900 -1949055 -2236134 -2445300 -2459785 -2422990
38502 -2422990 -2511600 -2674179 -2701301 -2515712 -2279619 -2183971 -2215495 -2212576 -2113018 -2035677 -2097840
38491 -2097840 -2259348 -2404870 -2483144 -2484038 -2373832 -2166097 -1978137 -1890016 -1818357 -1670325
38481a670325J22653p2372k26417j74684n0535l1026m5067M1542J42322J08348
38471a855561J5381K4426Q0203K1531j08525j37443o7383l2667k4470N9035J40168
38460a885305M0365j76587k32550m4926J45752J18545o7036k11269k02130n8559
38450b573700J08130J51098K8540j18153j33667m3261M1527J12745J93809J87455
38440b045477J7723j57193j19163P1292J55528O5569j4991K8428R9252Q5326r828
38429a823534j41229k45401k09635r436J59972R6751j05212j86796j02271j6549
38419b583340K4787J26428K51961K13298L77j61065j49230q3014m8474M4656K23764
38408b139852L11346J69426q3369k25220j79749l2327Q7940R1284k948o0827K853
$$ plain form
38481 -1670325 -1547672 -1620044 -1846461 -2021145 -2071680 -2102706 -2147773 -2106231 -1963909 -1855561
38471 -1855561 -1840180 -1815754 -1735551 -1714020 -1822545 -1959988 -2027371 -2060038 -2084508 -2025473 -1885305
38460 -1885305 -1844940 -2021527 -2254077 -2299003 -2153251 -2034706 -2101742 -2313011 -2515141 -2573700
38450 -2573700 -2465570 -2314472 -2285932 -2404085 -2537752 -2581013 -2539486 -2426741 -2232932 -2045477
38440 -2045477 -2027754 -2184947 -2304110 -2232818 -2077290 -2011721 -2026712 -1998284 -1899032 -1813706 -1823534
38429 -1823534 -1964763 -2210164 -2419799 -2429235 -2269263 -2172512 -2277724 -2464520 -2566791 -2583340
38419 -2583340 -2558553 -2432125 -2180164 -1966866 -1966489 -2127554 -2276784 -2359798 -2408272 -2363616 -2139852
38408 -2139852 -1828506 -1659080 -1742449 -1967669 -2147418 -2179745 -2091805 -2000521 -2003469 -2064296 -2061443
38397b061443Q6082M9921n6598r1805p1476j12908j86270j59580n4980j1950k0816
38386b691823M8612J71266J92105J17805R6330J06410j6851k16479k11332N3542
38376b350415K70681K08244M517j07865j12438r6359n7624J5127M6686q769r4135
38365b282350j62595k13028j84673j0506J96305K24545O7208p4670j03336r5979
38355b639079o5218N8734J82462J09136j01965j74202q4315j20328l46985m12834
38345c594594j01059K89461L82691K45033J74223K11777J77300L2369p0800k7514
38335b281113J17840K39987K10282K3557j15218j8846J54511P8729j99530k59934
38325b049735L8729L04510K12800l2082j09175q1846j39784j66306K2142K39093
$$ plain form
38397 -2061443 -1975361 -1925440 -1982038 -2073843 -2145319 -2258227 -2444497 -2604077 -2659057 -2671007 -2691823
38386 -2691823 -2643211 -2471945 -2279840 -2162035 -2065705 -1959295 -1976146 -2192625 -2403957 -2350415
38376 -2350415 -2079734 -1871490 -1866973 -1974838 -2087276 -2183635 -2241259 -2226132 -2179446 -2188215 -2282350
38365 -2282350 -2444945 -2657973 -2842646 -2853152 -2656847 -2432302 -2365094 -2439764 -2543100 -2639079
38355 -2639079 -2704297 -2645563 -2463101 -2353965 -2455930 -2630132 -2714447 -2834775 -3181760 -3594594
38345 -3594594 -3695653 -3406192 -3023501 -2778468 -2604245 -2392468 -2215168 -2182799 -2253599 -2281113
38335 -2281113 -2163273 -1923286 -1713004 -1689447 -1804665 -1823511 -1669000 -1590271 -1789801 -2049735
38325 -2049735 -2011006 -1706496 -1493696 -1525778 -1634953 -1716799 -1856583 -2022889 -2000747 -1761654
38315a761654J62373j33074k69517j11456J23571K32630J98028M7940j63412k70570
38305a945141j47610P5792J54426M5643q6526j19260n9057L7667Q5078R490j05061
38294b054559n8235J52488K52970Q6897j30466j46929k8678M4770R3123J72555
38284a616064J49039m4959j56032K7696K62729J93848o2164j10985O6759J25051
38274a165082l7013j43619n1065M1950j6720r8013o2610K3827M9400J102j00733
38263a558576k03127j59837R3370L29695K68697j694j37350n4920l498j00063
38253a527303j49461j7412J37440J33297J0335j05260j58496j09564N1958J77166
38243a557300Q4918j24199j42772Q5695K62169J81748O985l9658P346Q414l8317
$$ plain form
38315 -1761654 -1599281 -1732355 -2001872 -2113328 -1989757 -1757127 -1559099 -1511159 -1674571 -1945141
38305 -1945141 -2092751 -2016959 -1862533 -1816890 -1903416 -2022676 -2081733 -2044066 -1958988 -1949498 -2054559
38294 -2054559 -2112794 -1960306 -1707336 -1620439 -1750905 -1897834 -1926512 -1881742 -1788619 -1616064
38284 -1616064 -1467025 -1511984 -1668016 -1640320 -1377591 -1183743 -1245907 -1356892 -1290133 -1165082
38274 -1165082 -1202095 -1345714 -1396779 -1354829 -1371549 -1469562 -1532172 -1508345 -1458945 -1457843 -1558576
38263 -1558576 -1761703 -1921540 -1828170 -1498475 -1229778 -1231472 -1368822 -1423742 -1427240 -1527303
38253 -1527303 -1676764 -1694176 -1556736 -1423439 -1413104 -1518364 -1676860 -1786424 -1734466 -1557300
38243 -1557300 -1472382 -1596581 -1739353 -1653658 -1391489 -1209741 -1202756 -1242414 -1235068 -1226654 -1264971
38232a264971p0377q7176o3291P6407K69035L03474J32276j7428L447K4820j35827
38221h29611l31896l01152p8727O2077O671r6797r9437j7118O6943J07455R0508
38210a421084L5703J0899N9842J24484J11352J4663r2203j57909j77872j46853
38200a638978n9659N0323J26239J37338Q8797Q710m8606k4992P3235J51892J14989
38189a020712k7345j54444j40387K7242K15979K48429O8919j81502k78563j22783
38179a365167J51656K74891Q8053k68585m57421l02195L566J47341R2301N0741
38169a584819J04872J03739j7285q4638J3382J13441M5221q7778r6527j805O7746
38158a424451J08576J49234Q3843j46859l40518k69579l3325Q7531L6407k0933
$$ plain form
38232 -1264971 -1335348 -1422524 -1485815 -1409408 -1140373 -836899 -704623 -722051 -718604 -693784 -829611
38221 -829611 -1161507 -1462659 -1541386 -1479309 -1472638 -1569435 -1668872 -1685990 -1619047 -1511592 -1421084
38210 -1421084 -1385381 -1374482 -1314640 -1190156 -1078804 -1064141 -1156344 -1314253 -1492125 -1638978
38200 -1638978 -1698637 -1648314 -1522075 -1384737 -1295940 -1287230 -1335836 -1360828 -1287593 -1135701 -1020712
38189 -1020712 -1048057 -1202501 -1342888 -1315646 -1099667 -851238 -782319 -963821 -1242384 -1365167
38179 -1365167 -1213511 -938620 -850567 -1119152 -1576573 -1878768 -1875202 -1727861 -1635560 -1584819
38169 -1584819 -1479947 -1376208 -1393493 -1478131 -1464749 -1351308 -1306087 -1393865 -1490392 -1492197 -1424451
38158 -1424451 -1315875 -1166641 -1082798 -1229657 -1570175 -1839754 -1873079 -1785548 -1749141 -1770074
38148a770074j2331M732M5334J46427J76887j528k25229j86611J12862L56919
38138a352612L52999J95600R850j65556k36987j09118Q2599P8862j19189k37062
38128a500614j33340M1616J26545J33844J18370R5590J05543J44544P5056j56078
38118i48924l01891j26017J69967K01701j840q7633N3j4243j58467j46739M4507
38107a369526R8667j9952M4256L30945L54570r0485m86884l55319L8696J83021
38097a272011Q5544N4045P7201m4922k08604j51499P2923J93194J51624P6536
38087i65969j3582j35153j45609L8153K06641J64049O2909J05539J48000k4289
38077e59311k52724k47152p7645j2681m7572j2480K9083o9804j58515j6758J90977
$$ plain form
38148 -1770074 -1782405 -1777673 -1732339 -1585912 -1409025 -1410553 -1635782 -1822393 -1709531 -1352612
38138 -1352612 -999613 -804013 -794163 -959719 -1196706 -1305824 -1223225 -1144363 -1263552 -1500614
38128 -1500614 -1633954 -1592338 -1465793 -1331949 -1213579 -1117989 -1012446 -867902 -792846 -948924
38118 -948924 -1250815 -1376832 -1206865 -1005164 -1007004 -1094637 -1094584 -1108827 -1267294 -1414033 -1369526
38107 -1369526 -1270859 -1290811 -1246555 -915610 -561040 -651525 -1138409 -1493728 -1455032 -1272011
38097 -1272011 -1186467 -1132422 -1055221 -1100143 -1308747 -1460246 -1387323 -1194129 -1042505 -965969
38087 -965969 -979551 -1114704 -1260313 -1222160 -1015519 -851470 -788561 -683022 -535022 -559311
38077 -559311 -812035 -1059187 -1136832 -1149513 -1197085 -1209565 -1180482 -1250286 -1408801 -1425559 -1234582
38066a234582J66605L4003J23531L26402K37428j18268k96005j72399p5766j17193
38056a126244j0850K84561L47755j6931l85789l26448R243K12796J87540Q4931
38046g39436k5430j20686j01822K6737O2955q1869j89588o8294J31097J55124
38036i51212J9782p5910n2490K9570J13826J44290N1269j17596j89509j05772
38026a133752j3923k0312l3724L5858J18530J40274J39147J20157J4762j12173
38016g45156p5627Q6298Q2262j55038k95036j39587K7656o3470j73403K5023L17403
38005a108675K60100n9590j46316Q1717J83432k7021j72149J0435J94875Q534
37995g74658l41710l88423j02042J38465J42256Q6054J28180J88698J70829J31319
$$ plain form
38066 -1234582 -1067977 -1033974 -910443 -584041 -346613 -464881 -760886 -933285 -1009051 -1126244
38056 -1126244 -1137094 -852533 -504778 -521709 -907498 -1233946 -1224703 -1011907 -824367 -739436
38046 -739436 -764866 -885552 -987374 -960637 -897682 -979551 -1169139 -1237433 -1106336 -951212
38036 -951212 -931430 -1007340 -1059830 -1030260 -916434 -772144 -720875 -838471 -1027980 -1133752
38026 -1133752 -1147675 -1167987 -1201711 -1165853 -1047323 -907049 -767902 -647745 -632983 -745156
38016 -745156 -820783 -734485 -652223 -807261 -1102297 -1241884 -1214228 -1277698 -1451101 -1426078 -1108675
38005 -1108675 -848575 -908165 -1054481 -972764 -789332 -816353 -988502 -978067 -783192 -774658
37995 -774658 -1116368 -1504791 -1606833 -1468368 -1326112 -1240058 -1111878 -923180 -752351 -621032
37985f21032J28797R4014m0592k10512l06071k95135j99849m6134J05300J67426
37975a223788J27819O6802L2676j0604p0351p9778l5896m9411j47028j57920M2446
37964a505033K85079L05615J22288n365L4025R2785N5895q20p957l0626j00481
37953g54595j19998m5277J8396J1649K0557O3195q120k26591l44007j62845J34456
37942a413180K28199J00702j2887n668K6951K6507L6030N6700M9853M7296P7489
37931g82008M8768j02677k38007k04185r4153p1649n2326J29836L28141K30131
37921h08129j15152l03036j60972L8752N3201k805M3297J17666R5478L6981K6887
37910i77832J643p3428o6545Q4436J94127R7276p3762r4344Q264L4650o1555j36110
$$ plain form
37985 -621032 -492235 -398221 -438813 -649325 -955396 -1250531 -1450380 -1496514 -1391214 -1223788
37975 -1223788 -1095969 -1029167 -996491 -1007095 -1077446 -1157224 -1193120 -1242531 -1389559 -1547479 -1505033
37964 -1505033 -1219954 -914339 -792051 -797416 -763391 -670606 -614711 -615531 -623488 -654114 -754595
37953 -754595 -874593 -919870 -901474 -889825 -869268 -806073 -814193 -1040784 -1384791 -1547636 -1413180
37942 -1413180 -1184981 -1084279 -1097166 -1102834 -1075883 -1049376 -1013346 -956646 -906793 -859497 -782008
37931 -782008 -733240 -835917 -1073924 -1278109 -1372262 -1443911 -1496237 -1366401 -1038260 -808129
37921 -808129 -923281 -1226317 -1387289 -1348537 -1295336 -1298141 -1254844 -1137178 -1041700 -1004719 -977832
37910 -977832 -976189 -1049617 -1116162 -1031726 -837599 -740323 -814085 -908429 -900165 -865515 -927070 -1063180
37898a063180r0733J7253P6561L3250n7694m7031J44230L42931K68912p0186l21821
37887g67508k40155J77R4210K1226l1379n649J972k9108q654R1043J84682J84413
37875e04730O8485j05991j93165p3639J38924J62468n9929k13571m5136K32419
37865e93865K26356o1349k45804j13392J28953K03218J06518O688j8754j0159
37855c71590p732k4870q0756j70549k30191j92956p2941M8367J21543J78411K48823
37844e54441K55698Q4857k05011l56848k13709M7022J38133N2785K2528J19912
37834f09074J60832M2568p9241n3249M8622R3280P2854J5476r6133k00480j51343
37823g55888L7966J45407O3134m3956l5053q393o1805r8712o4674j03790k50851
$$ plain form
37898 -1063180 -1153913 -1136660 -1060099 -1026849 -1084543 -1131574 -987344 -644413 -375501 -445687 -767508
37887 -767508 -1007663 -1007486 -913276 -892050 -923429 -929078 -927106 -956214 -964868 -873825 -689143 -504730
37875 -504730 -436245 -542236 -735401 -809040 -670116 -507648 -567577 -781148 -826284 -593865
37865 -593865 -367509 -428858 -674662 -788054 -659101 -455883 -349365 -342677 -361431 -371590
37855 -371590 -379322 -404192 -484948 -655497 -885688 -1078644 -1151585 -1103218 -981675 -803264 -554441
37844 -554441 -298743 -213886 -418897 -775745 -989454 -942432 -804299 -751514 -728986 -609074
37834 -609074 -448242 -405674 -484915 -538164 -489542 -396262 -323408 -307932 -404065 -604545 -755888
37823 -755888 -717922 -572515 -509381 -553337 -588390 -596783 -658588 -757300 -821974 -925764 -1176615
37812a176615k56591p69K14719J28992q741J43777L85207K60339j69386l90879
37802h69947k21689M799N1700N8064J25397J15836L596j1050J03036J08139m4371
37791e76490p0686J32653K45071M4975k06882k06186p7531o4076n7375J53232
37781f83295L89663K92434q7734l24166k24566m5765n2744j65241j50260L4779
37771a016895K07316J77110n2901k64231k28878J9811K03059J45377j4971o4519
37761h89722j6128j0466m5927j7999M9963L7406m1402m3205O3275J45401J16785
37750f52019M0823l042j6561j5313J3055N1136N3450K3954L1l6685j23847j98690
37738h63708j48142J221P8374M46j09677j01446J1713J13012J44795J22456N5687
$$ plain form
37812 -1176615 -1433206 -1433975 -1219256 -1090264 -1099005 -955228 -570021 -309682 -479068 -869947
37802 -869947 -1091636 -1086837 -1035137 -977073 -851676 -735840 -732244 -743294 -640258 -532119 -576490
37791 -576490 -647176 -514523 -269452 -224477 -431359 -637545 -715076 -779152 -836527 -683295
37781 -683295 -293632 -1198 -88932 -413098 -637664 -683429 -736173 -901414 -1051674 -1016895
37771 -1016895 -809579 -632469 -685370 -949601 -1178479 -1158668 -955609 -810232 -825203 -889722
37761 -889722 -905850 -916316 -962243 -980242 -930279 -892873 -934275 -977480 -914205 -768804 -652019
37750 -652019 -611196 -614238 -630799 -646112 -633057 -581921 -528471 -504517 -504486 -541171 -665018 -863708
37738 -863708 -1011850 -1010629 -932255 -931809 -1041486 -1142932 -1131219 -1018207 -873412 -750956 -695269
37727f95269m1401r8437n0522N1125Q0624Q572m9695k93Q7883Q8010J3545o362
37715f12220N1123M9758o7014j27139K9618K57367K58127R794j83957j18703N6888
37704c96358J18940Q8109R3202Q7055n6585k50000k55850m1843J54995J56757
37694c01578M3687k9690l5007n145O5989J49464J40990J3645r8815q9583m5378
37683a91421r3824j83678j76567p9551n217M2737J34073J89872M6881k16088k81083
37672h13866m1177J96241J44779l6139j3146J80119K03467l8971k50224j96847
37662f65764j1463P9177P2178P4235P6498K8376j5191N465K8221p002l9050l7005
37650d11325j10258k79850l08861j4833L75420M73075K53467L6530j2115l4932
$$ plain form
37727 -695269 -736670 -835107 -885629 -834504 -753880 -745308 -795003 -795296 -707413 -619403 -605858 -612220
37715 -612220 -561097 -511339 -578353 -705492 -675874 -418507 -160380 -150586 -334543 -453246 -396358
37704 -396358 -277418 -189309 -96107 -9052 -65637 -315637 -571487 -613330 -458335 -301578
37694 -301578 -257891 -287581 -322588 -327733 -261744 -112280 28710 42355 -56460 -146043 -191421
37683 -191421 -285245 -468923 -645490 -725041 -730258 -687521 -553448 -363576 -316695 -532783 -813866
37672 -813866 -855043 -658802 -514023 -550162 -563308 -383189 -179722 -218693 -468917 -665764
37662 -665764 -677227 -598050 -525872 -451637 -375139 -346763 -361954 -356489 -328268 -335270 -374320 -411325
37650 -411325 -521583 -801433 -1110294 -1125127 -749707 -276632 -23165 13365 1250 -33682
37640c3682j31816j93358j56674j18453r4187L3394K04289J41983j87558l88056
37630i24118j68418J93965K43765K830j25824J1601J68509J50166N0977j3156
37620d09703q4152j64053j18481O7796J66626K3381j74551j49955O2009J80028
37610f01055Q6721m4213m0482M3264O6352K5279J9710P0067R0700L0524n7821
37599c10954j05558j09417r5692o3854q778M4734P3139Q6134R3045P9935N5251
37588b62015N7578O8836K456j37848j81343j0779K12947K29058M4720q7173o2764
37577a26327n5948j82223k83485j95552j7397P6930J16062J97379K27044O6201
37567a77316j54024j58747N1548J93424J35261N7822J08454J71172J17433M3020
$$ plain form
37640 -33682 -165498 -358856 -515530 -633983 -728170 -694776 -490487 -348504 -536062 -924118
37630 -924118 -1092536 -898571 -654806 -651976 -777800 -766199 -597690 -447524 -396547 -409703
37620 -409703 -493855 -657908 -776389 -708593 -541967 -518586 -693137 -843092 -781083 -601055
37610 -601055 -514334 -558547 -599029 -555765 -489413 -464134 -444424 -374357 -283657 -253133 -310954
37599 -310954 -416512 -525929 -621621 -685475 -694253 -649519 -576380 -490246 -397201 -317266 -262015
37588 -262015 -204437 -135601 -133145 -270993 -452336 -463115 -250168 -21110 23610 -63563 -126327
37577 -126327 -182275 -364498 -647983 -843535 -860932 -784002 -667940 -470561 -243517 -177316
37567 -177316 -331340 -490087 -438539 -245115 -109854 -52032 56422 227594 345027 388047
37557C88047O7090Q8689l4854k05813k21178j04825o3220j48861k08423j66654
37547f10002j17956q9415L7916K59472L30229J02504j91783k22015j1390J33211
37537c79229P7972k0141m6309q5320j64107j17636J15363K87957J65939j04372
37527b69883k03285j07037o9882j81412k40797j13039O3238J25522J13961J14441
37517g68173P4465n5709j54129r0904M2600N8227m0424p8741J0452J06033J01791
37506g94512L6295j1176k7882k6223O351O5527J04342Q6738K3210n3879r7947
37495f89156m4930J10366K31905J48966j07780k80368j79146O9333J76556N1845
37485e12409j15329j31544k7237M4976L1430P40J0585N6666J19501J58843R2594
$$ plain form
37557 388047 455137 543826 508972 303159 81981 -22844 -86064 -234925 -443348 -610002
37547 -610002 -727958 -817373 -779457 -519985 -189756 -87252 -279035 -501050 -512440 -379229
37537 -379229 -301257 -321398 -367707 -453027 -617134 -734770 -619407 -331450 -165511 -269883
37527 -269883 -473168 -580205 -650087 -831499 -1072296 -1185335 -1122097 -996575 -882614 -768173
37517 -768173 -693708 -749417 -903546 -994450 -951850 -893623 -934047 -1012788 -1002336 -896303 -794512
37506 -794512 -758217 -769393 -797275 -823498 -817147 -751620 -647278 -560540 -537330 -591209 -689156
37495 -689156 -734086 -623720 -391815 -242849 -350629 -630997 -810143 -740810 -564254 -512409
37485 -512409 -627738 -759282 -786519 -741543 -710113 -709373 -698788 -642122 -522621 -363778 -271184
37474b71184r3790k34987j42298J07892K23715R9485l4076J4928R0050k7790k02875
37463d70930j26626J61856K87630J03053r6970m3752J17038J02173p2315j73933
37453b12776j29212o5385m3405J6637J39295K07523J20117p7044k53068l10690
37443f08008k28615n6466J06233J70222J25199M4746K0007P7122J42785J10371
37433i6404l1513j69966k06622j65966r9466K5953K15095L09207J59337j06091
37423a66436k05844r0905K6475L6678N4431J20638P8998j18923k55892j68840
37413f89620O168Q3962R6053J18069O9615q7432j75195p6495K6263m0623j11928
37402g81163K2824K01276J37145p7281j30894l5751n6632j65022o2140K27731
$$ plain form
37474 -271184 -364974 -599961 -742259 -634367 -410652 -311167 -345243 -330315 -240265 -268055 -470930
37463 -470930 -597556 -435700 -148070 -45017 -141987 -185739 -68701 33472 -38843 -212776
37453 -212776 -341988 -407373 -450778 -434141 -294846 -87323 32794 -44250 -297318 -608008
37443 -608008 -836623 -893089 -786856 -616634 -491435 -446689 -426682 -349560 -206775 -96404
37433 -96404 -127917 -297883 -504505 -670471 -769937 -743984 -528889 -219682 -60345 -166436
37423 -166436 -372280 -463185 -436710 -400032 -345601 -224963 -145965 -264888 -520780 -689620
37413 -689620 -683452 -599490 -503437 -385368 -315753 -403185 -578380 -654875 -628612 -669235 -781163
37402 -781163 -758339 -557063 -419918 -497199 -628093 -663844 -720476 -885498 -947638 -719907
37392g19907L01488M6076j27071N3298K60930J08880k09226k24783P4769K51185
37382a84361Q1802j68059j89759m1286K5884m6002r0760p452R2265O8714l4232
37371d93246p9123p2822j34266k15786r2238K48802M39736J91378k49287l88153
37361h45005j25546J97863L22088K89388J71028m2210k18410j31098J44400K24625
37351a2877k8368k70688j94176K9105P4195l5210n7394L3891O6187m152p3605
37340d73092j18330j74406j56877L9622K89491L32158J29923p6406r4065J3239
37330b88743P4486K1371r2935j75879j58347m6582O9674J02218M6793m1871j06457
37319e96272r1614K5000J59243J71764N2319m6487k3253L8276K6064l2613n4389
$$ plain form
37392 -719907 -418419 -372343 -499414 -446116 -185186 -76306 -285532 -510315 -435546 -184361
37382 -184361 -102559 -270618 -460377 -501663 -475779 -521781 -612541 -619993 -527728 -459014 -493246
37371 -493246 -572369 -645191 -779457 -995243 -1087481 -838679 -398943 -207565 -456852 -845005
37361 -845005 -970551 -772688 -450600 -161212 9816 -32394 -250804 -381902 -237502 -12877
37351 -12877 -41245 -311933 -506109 -477004 -402809 -438019 -495413 -461522 -395335 -399487 -473092
37340 -473092 -591422 -765828 -922705 -883083 -593592 -261434 -131511 -207917 -301982 -288743
37330 -288743 -214257 -192886 -285821 -461700 -620047 -666629 -596955 -494737 -447944 -489815 -596272
37319 -596272 -687886 -662886 -503643 -331879 -279560 -326047 -349300 -311024 -284960 -317573 -371962
37308c71962l1423J3870P6835Q4673o8151k78026k32621J49802M76154L46386
37298A65537p1924k52810k9141K32837J91397n4911k04197j48909j996R5836O9744
37287h537o2940j70375j18725L9576J17475P4158P4521J88219K20948P376k72669
37276H9027k89088j7681K14613J61967m8991j39428m5436O3596N2782m0368j19867
37265a18874j43490r2238M5121J92242K03641N9390n7073O56J11906O2854j12817
37254A51318j76662o2701J9019p5569j91736j19860Q4981J93812J24134O972l4147
37243h0439l0854p0098j31709r6499O9382J95441Q7593j55480j86430J09594L77951
37232H8452K69391l4002j11881J1755n9615l65677m67912j84228Q9991M8795l9515
$$ plain form
37308 -371962 -403385 -389515 -312680 -228007 -296158 -574184 -806805 -657003 -180849 165537
37298 165537 93613 -159197 -188338 44499 235896 180985 -23212 -172121 -174117 -78281 -8537
37287 -8537 -71477 -241852 -360577 -321001 -203526 -129368 -54847 133372 354320 361696 89027
37276 89027 -200061 -217742 -3129 158838 109847 -29581 -75017 -11421 41361 993 -118874
37265 -118874 -262364 -354602 -309481 -117239 86402 145792 88719 89375 201281 264135 151318
37254 151318 -25344 -88045 -69026 -144595 -336331 -456191 -371210 -177398 -53264 -46292 -80439
37243 -80439 -111293 -181391 -313100 -409599 -340217 -144776 -57183 -212663 -399093 -289499 88452
37232 88452 357843 323841 211960 223715 164100 -201577 -669489 -853717 -763726 -714931 -754446
37221g54446J23890K94836J26770j74106j68092R3246K04866R7905M5268Q8041
37211b1822Q959j61657j53042J6687L2917j45716k14497r2230m6484j34400n8942
37200i70227K22837K90518m2672l18647j11375K95445L61529J09327o843J37606
37190c2502K09368N061k65900l41008k24981o5766N7297J30859J43775J00963
37180b82834L2162k6018k3698O8851J74627J53293J106j04801m8462O1835P5593
37169H1654J4283k1897l3706o2471o2567P109N6882r654j21038j36146m6950N4981
37157b79520J34692J89597J50965k1729k03223k23547r2242L8328Q5198O5767
37147a55714k3583j81101k80190j67588R5796K53615J62630l8462j16918o709
$$ plain form
37221 -754446 -630556 -335720 -208950 -383056 -551148 -457902 -253036 -155131 -109863 -21822
37211 -21822 -12863 -174520 -327562 -310875 -277958 -423674 -638171 -730401 -776885 -911285 -970227
37200 -970227 -747390 -456872 -499544 -818191 -929566 -634121 -272592 -163265 -170108 -32502
37190 -32502 176866 181927 -83973 -424981 -649962 -715728 -658431 -527572 -383797 -282834
37180 -282834 -250672 -276690 -300388 -231537 -56910 96383 97489 -7312 -55774 6061 81654
37169 81654 95937 74040 40334 -22137 -84704 -77595 -20713 -30367 -151405 -287551 -334501 -279520
37157 -279520 -144828 44769 195734 174005 -29218 -252765 -345007 -306679 -221481 -155714
37147 -155714 -179297 -360398 -640588 -808176 -712380 -458765 -296135 -334597 -451515 -458224
37137d58224J65185K38619J57602q701j41072j70884j14915l1149K0601o259q8636
37126d37833r9651M9649K19320J52702j53550l70686k57970P606J06072L2605
37116g51736L2143J61361K11574Q5485l2900O450O5943m0205k08043j72656P0558
37105e72026K03039J6051k66470k67649J5160J90097K7055k02985j33862J34902
37095h56688J96522j3885j16928Q2953K62638J09810j48044j07699J41565J62303
37085b87453r5331j76130J70935N79141N76284K09674j11262j92939j72266j55266
37075C45387o6463J08482K01747J13155l220L0359J18511L4469j86321k38257
37065D57849K308K43260J65299j17354k21863m3119J33724P8060q8954j33043
$$ plain form
37137 -458224 -293039 -54420 103182 94481 -46591 -217475 -332390 -363539 -342938 -349197 -437833
37126 -437833 -537484 -487835 -268515 -115813 -269363 -640049 -898019 -890413 -784341 -751736
37116 -751736 -719593 -558232 -346658 -261173 -294073 -287623 -221680 -261885 -469928 -642584 -572026
37105 -572026 -368987 -352936 -619406 -887055 -871895 -681798 -654743 -857728 -991590 -856688
37095 -856688 -660166 -674051 -790979 -708026 -445388 -335578 -483622 -591321 -449756 -287453
37085 -287453 -382784 -558914 -387979 191162 767446 977120 865858 672919 500653 345387
37075 345387 278924 387406 589153 702308 699088 729447 847958 882427 696106 457849
37065 457849 460157 703417 868716 751362 529499 486380 620104 698164 609210 476167
37055D76167l2768O3212N8367l0424j25156j21613J4290J40593Q2005q7087j10963
37044C26623M0032R8911m5407j34402J5059J62525M1936j63969j26467O1709N8858
37033C35408j18518j34971O2034J61718N0533j8656O6635N4972j85390l59686
37023h5921j94566J20788K34141J31381M6865N5351M4086k0960n7850l6328Q623
37012B45610O8679J20896Q3201n1639j42745r7458k0174k3463l1502N6194J44663
37001C52262R3087k8774n2511R964K4412N15O2412J89171K18112J06449j6506
36990I58593o4640p3152n8210J0603Q1650M6397q3059j83434k11161k12035j52896
36979E8656M1690K69419L04577J29479k0886k2648k6035j40602k14492j05967
$$ plain form
37055 476167 443399 506611 564978 534554 409398 287785 302075 442668 524673 437586 326623
37044 326623 366655 465566 420159 285757 300816 463341 505277 341308 214841 276550 335408
37033 335408 216890 81919 143953 305671 356204 337548 404183 459155 273765 -85921
37023 -85921 -280487 -159699 74442 205823 252688 308039 352125 331165 273315 236987 245610
37012 245610 314289 435185 518386 466747 324002 226544 206370 182907 151405 207599 352262
37001 352262 445349 416575 364064 374028 398440 398955 461367 650538 868650 975099 958593
36990 958593 893953 820801 762591 773194 854844 901241 818182 634748 423587 211552 58656
36979 58656 100346 369765 674342 803821 782935 760287 734252 593650 379158 273191
36969B73191N4778R7077J01799K00107K54953O6955k09576k22424K3090J36446
36959G76396n7269k48866j48098N9729K7893k00366k78121r4219R5921Q9814O987
36948B9801L9496J41958J26536m0528j91858j85816p0678Q62l6421r4564n3717
36937c34929Q2467J89454J77243Q7174P080m4192q6939r6763m6681P21m5899j58129
36925b69393k08005j47483n8413J119P9576K00565K58770J49902n4459j64686
36915b12507r2009O1096J28785N4098p1598j19552o4439M858K8780P2450J99173
36904a0865L00163J96127q0422k63628j83991J7871J03703M0710l2666m2867k9938
36893A4197j6313K1738O8911Q0097O4585O0465N0841R513q606M9170R2466j2008
$$ plain form
36969 273191 327969 425046 526845 726952 981905 1048860 839284 616860 639950 776396
36959 776396 719127 470261 322163 381892 409785 209419 -68702 -162921 -67000 22814 29801
36948 29801 69297 211255 337791 297263 105405 -80411 -151089 -150227 -186648 -281212 -334929
36937 -334929 -252462 -63008 114235 201409 208489 164297 77358 -19405 -66086 -65365 -111264 -269393
36925 -269393 -477398 -624881 -683294 -682175 -602599 -402034 -143264 6638 -47821 -212507
36915 -212507 -304516 -243420 -114635 -60537 -132135 -251687 -316126 -311268 -282488 -210038 -10865
36904 -10865 289298 485425 405003 141375 -42616 -24745 78958 119668 87002 44135 14197
36893 14197 -2116 19622 88533 168630 233215 293680 344521 354034 345428 394598 487064 475056
36881D75056k03629k67124j45385l1907o5990j11930P082J91419J94334J5407
36871E7333p1741O9542K15960J09851j48154k37748q1449O9096L6206l1283O4041
36860E1654K27395K11464p614k10224k46820j67935n6389O2384J25777N7397o6339
36849a9250o6993N7517J02018j7785j10417j131K04973K92947K12089M1704j58219
36838E37453l08633k75278m4075J87948K48820J90242J13162k7636k53287l72053
36828c337k11531Q0800K16566J51407N7534J2107l6490p5335n4275l6188p8329
36817B2929n3946J43745L19567K06418r6395k43451j51307m4106k7981Q891P3342
36806A57706L1899o5732j4809J36459J07575j04749j64574K7439J40335j1975
$$ plain form
36881 475056 271427 4303 -141082 -172989 -238979 -350909 -343827 -152408 41926 57333
36871 57333 -14408 55134 271094 380945 232791 -4957 -86406 -17310 18896 -12387 51654
36860 51654 279049 490513 482899 272675 25855 -142080 -198469 -136085 -10308 47089 -19250
36849 -19250 -86243 -28726 73292 55507 -54910 -56041 148932 441879 653968 695672 537453
36838 537453 228820 -46458 -90533 97415 346235 536477 649639 622003 368716 -3337
36828 -3337 -214868 -134068 82498 233905 291439 303546 267056 191721 137446 101258 22929
36817 22929 -31017 112728 432295 638713 542318 298867 147560 103454 75473 84364 157706
36806 157706 189605 123873 109064 245523 353098 248349 83775 111214 251549 239574
36796B39574j43792j0610J64619J05933m1991k7639L6858p1332k23371j65008
36786a36759l477j8691j36720o0132J61188J76527m5127j20219J18130L26040
36776B60760J86762j03915j60305J7884R8548n0285j72142j8246K67433L14574
36766F41068K4233k72864k33781N4642K22696J31550k839n778K1067l1465n1890
36755D96639N4139J23194k0251k39026k64566r0068P0234J23925J43570J31742
36745E29532J5270j39108j56832l0170N2260j2003j11565j17945m8606J7274N7422
36734E5529R1148J32409J81130K02571J36289j1047j29826j38341q7749o0582
36724C71531m7303j2466J1617n53L522N1883Q4406Q2947J20643J81020J17193
$$ plain form
36796 239574 95782 85172 249791 355724 313733 286094 322952 251620 28249 -136759
36786 -136759 -140236 -158927 -295647 -355779 -194591 -18064 -63191 -183410 -65280 260760
36776 260760 447522 343607 183302 201186 299734 249449 77307 59061 326494 641068
36766 641068 665301 392437 158656 213298 435994 567544 564705 558927 579994 548529 496639
36755 496639 550778 673972 653721 414695 150129 60061 130295 254220 397790 529532
36745 529532 544802 405694 248862 218692 270952 258949 147384 29439 -19167 -1893 55529
36734 55529 146677 279086 460216 662787 799076 788029 658203 519862 432113 371531
36724 371531 324228 311762 323379 322826 326348 378231 462637 545584 666227 847247 964440
36713I64440p1351j44038R398J43354M9674p6232J1416J31239k6729l04459k77521
36702D09191K5903J37934r1990k79952j67410M942n223k7305J39094K99969J86821
36691F31974o1155j04866O6638J62820O2375n6660m3252L5454P3658R7130J66471
36680A030587K27875J64143k9031j94523j89937q2773p2074j93521k42092q1994
36670C36660J18827J30724L118n9768n2246j18004k14372j45249O9964J80946
36660B50600J08793N3782J19794J40104M704j26752j04499l1749m7364q0519j3087
36649B73807Q8644R0040J540p7948j13674j11459o0057R923L2565K9535P6476
36638B39392J19013K7941j29567j32838J7686P0317l2323k2374K03065L19134
$$ plain form
36713 964440 893089 749051 758449 901803 951477 875245 886661 1017900 991171 686712 409191
36702 409191 435094 573028 481038 201086 33676 38618 33395 6090 145184 445153 631974
36691 631974 570819 465953 532591 695411 757786 701126 657874 693328 766986 864116 1030587
36680 1030587 1258462 1422605 1393574 1199051 1009114 926341 854267 660746 418654 336660
36670 336660 455487 586211 589329 529561 477315 359311 144939 -310 69654 250600
36660 250600 359393 413175 532969 673073 677777 551025 446526 414777 367413 286894 273807
36649 273807 362451 452491 454031 376083 262409 150950 90893 100816 133381 162916 239392
36638 239392 358405 386346 256779 123941 141627 211944 179621 157247 360312 679446
36628F79446P2745k67059k93721n5756R1461L9161l7433o2404j12013j58273r7732
36617b01578N385O797l1544N9373K11502J89257n787j14607l4508M7072m422p2362
36605E4578k9763O1584J03830J14766J20738P5689r781k1774O9853J29166O7578
36594G36464p087J6604M7689n1970j98877j75296L0779J70631Q2145p2448m7908
36583E30726J16187J63599K8591n8360N0913J67871P3450j07569j05068M0127
36573I00467M4063j26585j83220k580J60377R3666m7901m6943J4252m8433j62499
36562E94664j17131Q3433K36855K35837J37015P259j15755j73115j48505j12458
36552F28099q6342J9532K05190K75574J09992j09028j32437J7298J41158J66754
$$ plain form
36628 679446 752191 485132 191411 135655 227116 266277 228844 166440 54427 -103846 -201578
36617 -201578 -196193 -189396 -220940 -161567 49935 239192 233405 118798 84290 131362 126940 54578
36605 54578 24815 86399 190229 304995 425733 501422 491641 469867 539720 668886 736464
36594 736464 729377 745981 793670 741700 542823 367527 398306 568937 651082 578634 530726
36583 530726 646913 810512 839103 780743 831656 999527 1072977 965408 860340 900467
36573 900467 944530 817945 634725 632145 792522 886188 838287 791344 805596 757163 594664
36562 594664 477533 560966 797821 1033658 1170673 1177932 1062177 889062 740557 628099
36552 628099 541757 561289 766479 1042053 1152045 1043017 910580 927878 1069036 1235790
36542A235790J44395O2012j03063k36606k12313r3780k4390p138K5438M1342O012
36531H37699J4890J13561J34045m2756k15988j46640L2302K7885r2482K2170M24936
36520A109622P37847O64717L36025N5777n1793n0090k9243k5334m892Q2335J82858
36509C007829J66405N3381M6199K02386K92120J67401K5592O2040J31240O1802
36499D216395K7095K22095M37956L91908K29998K30841K71888J29477M4531L54260
36489F556444P84787Q16729N71153N63705P42742O39501L52040M08631P39394
36480A2175126Q84694J100845J750895J482248j920467p804872j1649962r715068
36472a3696561l689764J219020K248123J150230O15484R69485J097766P27815
$$ plain form
36542 1235790 1380185 1442197 1339134 1102528 890215 796435 772045 764907 790345 831687 837699
36531 837699 852589 966150 1100195 1057439 841451 694811 727113 754998 662516 684686 1109622
36520 1109622 1847469 2512186 2848211 2903988 2852195 2802105 2772862 2747528 2742636 2824971 3007829
36509 3007829 3174234 3227615 3273814 3476200 3768320 3935721 3961313 4023353 4154593 4216395
36499 4216395 4243490 4465585 4903541 5295449 5525447 5756288 6028176 6157653 6202184 6556444
36489 6556444 7341231 8157960 8729113 9292818 10035560 10675061 11027101 11435732 12175126
36480 12175126 13059820 14160665 15911560 17393808 15473341 7668469 -3981493 -13696561
36472 -13696561 -17386325 -16167305 -13919182 -12768952 -12153468 -11183983 -10086217 -9358402
36464i358402M45834M52980N11003O14967Q29379Q38519L96984r1301r7517K06905
36454e250649K68541N7996K0403K56715L86444K27883N7143R1751J78771J49211
36444c555791J05111J63519K11445J30830M6373J18299K37683J73614m3537j30302
36434b542756L8022K39883K29231P4299J5119R5179J42196P4727O15j3812m2488
36423a689785r3096l6149J30786J80852Q743j34084n582K13356J85035l8502j00627
36412a379053P8636J91043N1607j40691j69119j07192r3482o8364N4153J55058
36402a427404Q1124p8652r9397O2453K28830K41547J13320l9794j17668j01715
36392a137356o3238q3490j35003r6851P7403K72298L33896K23258J6612j76177
$$ plain form
36464 -9358402 -8912568 -8459588 -7948585 -7333618 -6504239 -5665720 -5268736 -5360037 -5457554 -5250649
36454 -5250649 -4982108 -4924112 -4903709 -4646994 -4260550 -4032667 -3975524 -3883773 -3705002 -3555791
36444 -3555791 -3450680 -3287161 -3075716 -2944886 -2898513 -2780214 -2542531 -2368917 -2412454 -2542756
36434 -2542756 -2504734 -2264851 -2035620 -1961321 -1946202 -1851023 -1708827 -1634100 -1633485 -1647297 -1689785
36423 -1689785 -1782881 -1819030 -1688244 -1507392 -1498649 -1632733 -1638315 -1424959 -1239924 -1278426 -1379053
36412 -1379053 -1300417 -1109374 -1057767 -1198458 -1367577 -1474769 -1568251 -1636615 -1582462 -1427404
36402 -1427404 -1346280 -1424932 -1524329 -1461876 -1233046 -991499 -878179 -917973 -1035641 -1137356
36392 -1137356 -1200594 -1284084 -1419087 -1515938 -1438535 -1166237 -832341 -609083 -592471 -768648
36382g68648k55144j68024L4721K21957K92805K34186P4393j43914l27449l54207
36372a159324j86373P2207K54985K52945Q3534j08278j51142k4190R5403M2677
36362h27556j14806j70194n7545Q7028J31726Q5961K6278R256O8397J80164K26790
36351c54501J12853p8933j74512j45061j10502j12113o3569M2272P3245k1058
36341h31879j02432n3047O0585J28612J55218J70190J28933K2579m7473l6292
36331d05006o1258j88702k50887p7255J90633K52100P6629o3372p102R0461N5546
36320c88213k5097J2173J01524M5756j40187k12690n6850J38693J58234M6920
36310c19737k0989l1943q9794j53094o3584J42509K00525n00k14449j75467L2488
$$ plain form
36382 -768648 -1023792 -1191816 -1157095 -935138 -642333 -408147 -333754 -477668 -805117 -1159324
36372 -1159324 -1345697 -1273490 -1018505 -765560 -682026 -790304 -941446 -965636 -870233 -827556
36362 -827556 -942362 -1112556 -1170101 -1083073 -951347 -865386 -839108 -829852 -761455 -581291 -354501
36351 -354501 -241648 -320581 -495093 -640154 -750656 -862769 -926338 -884066 -810821 -831879
36341 -831879 -934311 -987358 -926773 -798161 -642943 -472753 -343820 -321241 -368714 -405006
36331 -405006 -466264 -654966 -905853 -983108 -792475 -540375 -463746 -527118 -534220 -443759 -388213
36320 -388213 -413310 -401137 -299613 -253857 -394044 -606734 -663584 -524891 -366657 -319737
36310 -319737 -340726 -372669 -462463 -615557 -679141 -536632 -336107 -336607 -551056 -726523 -694035
36299f94035J39011R1689O9352J57896K42576K17952J10223k7807j79643k97511
36289a70297l10386k23664j02882L1894J77308K44896J44173l8399j00954J7046
36279c31265J72218K13539J13376p8045k60197k84571r6113J35963J92348Q8043
36269a34704N094j7698r5201k08723j80175J7197J78539J76304J13586Q7622M1433
36258a6726m8052p1816J903M2619l351j8439K8514j0489j57178j92635l7395M5758
36246d37287j20595k75931j15261J95691K69422R8377J0949J13975J82045R6400
36236A7785J6041M6958O6142j8595r6739o0393K7006P0620P4236M5417n5384j83304
36224e0210j93938o0045M5953m869j04031p5470O7834J67854J49738P6832J6658
$$ plain form
36299 -694035 -555024 -463335 -393983 -236087 6489 224441 334664 306857 127214 -170297
36289 -170297 -480683 -704347 -807229 -775335 -598027 -353131 -208958 -247357 -348311 -331265
36279 -331265 -159047 54492 167868 89823 -170374 -454945 -551058 -415095 -222747 -134704
36269 -134704 -129610 -147308 -242509 -451232 -631407 -614210 -435671 -259367 -145781 -58159 -16726
36258 -16726 -64778 -136594 -134691 -92072 -95423 -113862 -85348 -95837 -253015 -445650 -483045 -437287
36246 -437287 -557882 -833813 -949074 -753383 -483961 -385584 -374635 -260660 -78615 17785
36236 17785 33826 80784 146926 128331 31592 -28801 -1795 68825 143061 188478 133094 -50210
36224 -50210 -244148 -304193 -258240 -263109 -367140 -442610 -374776 -206922 -57184 19648 36306
36213C6306k5347m1868k752O7345P1125l6635j51932j36299k0057K1258o3066
36202b81922q6701Q7790K66142J46984k03620l65932j22025K47446L55586J84956
36192B28704r947r7318j35678j55747j10806j1514P1657J19874J41944Q7438p2129
36181E6478k23040k16008n8340J20042K34148K56912J51025n6217k00741j50210
36171h5951O550Q4799M9134j5185p9798j38988r6376R2232K40030J39569r7828
36160I8188j72230l9736M6667m8100j62529j32457j2720Q0518J34993J60393J23477
36149G6464M3340n947l1903r6363j36138k2663J66180J78754k5740j67532m4401
36138f5949J75934K11549L8618j46181j97328j15260J9226R3803M6118l3809j315
$$ plain form
36213 36306 10959 -30909 -33661 33684 104809 68174 -83758 -220057 -240114 -218856 -281922
36202 -281922 -368623 -280833 -14691 132293 -71327 -437259 -559284 -311838 43748 228704
36192 228704 218757 121439 -14239 -169986 -280792 -292306 -220649 -100775 41169 128607 56478
36181 56478 -166562 -382570 -440910 -320868 -86720 170192 321217 265000 64259 -85951
36171 -85951 -79401 5398 54532 39347 -40451 -179439 -275815 -183583 56447 196016 98188
36160 98188 -74042 -113778 -67111 -115211 -277740 -410197 -422917 -342399 -207406 -47013 76464
36149 76464 119804 113857 81954 -14409 -150547 -173210 -7030 171724 145984 -21548 -65949
36138 -65949 109985 321534 360152 213971 16643 -98617 -79391 14412 60530 26721 25406
36127B5406J04196R2017n3371r9291O8265K28805J52247m9165j06310L165O0157
36116D26121n5539k25176k70667j39254P3388J98497J32208m3776j41761r9711
36106a45670k9713r533J9629Q9712J15280N8759J8506N0766P2552M1600M2407
36095C24295Q2449K5355j28236j40425Q6340K82487K12752N7665P8818J33046
36085A014546p2275l91601l82150q306K57389J23959j34874j48729L7399J38433
36075D33791P2013j1837o737M1787M4205l4024j40701j62279m8630Q5410Q6677
36064C59675k2045r0926q6452j08381j63901j32644K812R6862P5782L6305L5454
36053B541j4341j39181j92905q8202L2687Q903r7568j21816m3111K8707K0942
$$ plain form
36127 25406 129602 221619 168248 68957 137222 366027 518274 469109 362799 365964 426121
36116 426121 370582 145406 -125261 -264515 -191127 7370 139578 95802 -45959 -145670
36106 -145670 -175383 -184916 -165287 -75575 39705 98464 116970 167736 240288 281888 324295
36095 324295 406744 432099 303863 163438 249778 532265 745017 802682 881500 1014546
36085 1014546 942271 550670 168520 160214 417603 541562 406688 257959 295358 433791
36075 433791 505804 493967 487230 529017 573222 539198 398497 236218 187588 272998 359675
36064 359675 337630 246704 160252 51871 -112030 -244674 -241862 -145000 -69218 -32913 2541
36053 2541 -11800 -150981 -343886 -432088 -399401 -390498 -488066 -609882 -652993 -624286 -603344
36042f03344o3204j77681k10281m7334K33767L70538K33594K581r9111q3091n3332
36031d96898K9341K06305K93043Q6786k62940l86041j92464K9898N1334k5569
36021f67205q380R8007J69663J60919J01916K1350l2745l087P0768O7056l1879
36010e3617q9776k3624P0699Q5312N6261M5517M129j05376j66948o1960J14608
35999a24775J62660N5810n3129p2449m7755j3062N4793J15899P6707l3057n6642
35988F5000M5543J04104j712j30850p2018J35430K33515P8761j90672l36510k69530
35977c38939q9089N0903P3127J4714k5467J7595J17738J89731J70742P3966k1269
35966B33752m0468j239r114j14052j97396j00874J26047K36782J06080q5295r0183
$$ plain form
36042 -603344 -666548 -844229 -1054510 -1101844 -868077 -497539 -263945 -261364 -360475 -443566 -496898
36031 -496898 -467557 -261252 31791 118577 -144363 -530404 -722868 -692970 -641636 -667205
36021 -667205 -675585 -577578 -407915 -246996 -145080 -123730 -156475 -159562 -88794 -21738 -53617
36010 -53617 -143393 -167017 -96318 -11006 45255 90772 94901 -10475 -177423 -239383 -124775
35999 -124775 37885 93695 40566 -31883 -79638 -92700 -37907 77992 154699 121642 65000
35988 65000 110543 214647 212935 82085 10067 145497 379012 457773 267101 -69409 -338939
35977 -338939 -428028 -377125 -303998 -289284 -314751 -297156 -179418 10313 181055 255021 233752
35966 233752 193284 192045 182931 68879 -128517 -229391 -103344 133438 239518 154223 64040
35955F4040P9937K08129J82219Q6903O781q7266k12073k75687j94073k6249Q6289
35944h1050Q1935L1256M0626J25065J77520Q6444j03036k03911j15898K6933K6797
35933I2681j15721k26245k02363r7101K3323J49411K41654K25194J12787P555
35923B11175m7380r2155j04467O97J71449K00306Q709k05594k29526j07740j9694
$$ plain form
35955 64040 143977 352106 534325 621228 628009 540743 328670 52983 -141090 -167339 -81050
35944 -81050 885 32141 72767 197832 375352 461796 358760 154849 38951 65884 92681
35933 92681 -23040 -249285 -451648 -548749 -525426 -376015 -134361 90833 203620 211175
35923 211175 163795 71640 -32827 -32130 139319 339625 348334 142740 -86786 -194526 -214220
$$ [...]
0I65
##END NTUPLES=NMR SPECTRUM
##END=
