##TITLE=31Pdec_LR-722-C3
 CDCl3, 24 sc
 28.10.2020
##JCAMPDX= 6.0         $$ Bruker NMR JCAMP-DX V2.0
##DATA TYPE= NMR SPECTRUM
##DATA CLASS= NTUPLES
##ORIGIN= UXNMR, Bruker Analytische Messtechnik GmbH
##OWNER= root
$$ XWIN-NMR		Version 3.5
$$ Wed Oct 28 11:50:18 2020 Russian Standard Time (UT+4h)  she@DPX200
##.OBSERVE FREQUENCY= 81.013821
##.OBSERVE NUCLEUS= ^31P
##.ACQUISITION MODE= SIMULTANEOUS
##.ACQUISITION SCHEME= undefined
##.AVERAGES= 24
##.DIGITISER RES= 17
##SPECTROMETER/DATA SYSTEM= spect
##.PULSE SEQUENCE= zgpg30
##.SOLVENT NAME= CDCl3
##.SHIFT REFERENCE= (INTERNAL, CDCl3, 0, 182.463)
##AUDIT TRAIL= $$ (NUMBER, WHEN, WHO, WHERE, WHAT)
$$ ##TITLE= Audit trail, XWIN-NMR		Version 3.5
$$ ##JCAMPDX= 5.01
$$ ##ORIGIN= Bruker BioSpin GmbH
$$ ##OWNER= she
$$ F:/spectra/data/she/nmr/P31/1/pdata/1/auditp.txt
$$ ##AUDIT TRAIL=  $$ (NUMBER, WHEN, WHO, WHERE, WHAT)
(   1,<2020-10-28 11:49:45.73 +0400>,<she>,<DPX200>,
      <created by zg, POWCHK disabled, PULCHK disabled
       configuration hash MD5:
       00 E9 B6 7A A2 85 ED C7 34 08 36 98 17 FE 4E 26
       data hash MD5: 32K
       FB AE 6B F3 C7 F1 D7 94 45 71 23 B1 25 CE 35 AB>)
(   2,<2020-10-28 11:49:48.40 +0400>,<she>,<DPX200>,
      <Start of raw data processing
       efp BC_mod = 2 LB = 1 FT_mod = 6 PKNL = 1 PHC0 = -2373.635 PHC1 = 60.6007 SI = 64K 
       data hash MD5: 64K
       58 F8 E8 DD 2B E9 87 7C BE 0A 7B F1 B3 DF FB EB>)
$$ ##END=
$$ 
$$ hash MD5
$$ F1 C3 3A E7 02 A9 15 96 C1 D0 3B 03 55 0F A3 9C
##$RELAX= 
##$RELAX= 
##$RELAX= 
##$RELAX= 
##$RELAX= 
##$RELAX= 
##$RELAX= 
##$RELAX= 
$$ Bruker specific parameters
$$ --------------------------
##$DU= <F:/spectra>
##$EXPNO= 1
##$NAME= <P31>
##$PROCNO= 1
##$TYPE= <nmr>
##$USER= <she>
##$AMP= (0..31)
100 100 100 100 100 100 100 100 100 100 100 100 100 100 100 100 100 100 
100 100 100 100 100 100 100 100 100 100 100 100 100 100 
##$AQSEQ= 0
##$AQ_mod= 1
##$AUNM= <au_zg>
##$AUTOPOS= <>
##$BF1= 81.014009
##$BF2= 200.13
##$BF3= 200.13
##$BF4= 200.13
##$BF5= 200.13
##$BF6= 200.13
##$BF7= 200.13
##$BF8= 200.13
##$BYTORDA= 1
##$CFDGTYP= 0
##$CFRGTYP= 5
##$CHEMSTR= <none>
##$CNST= (0..31)
1 1 145 1 1 1 1 1 1 1 1 1 1 1 1 1 1 1 1 1 1 1 1 1 1 1 1 1 1 1 1 1 
##$CPDPRG= <waltz16>
##$CPDPRG1= <>
##$CPDPRG2= <waltz16>
##$CPDPRG3= <>
##$CPDPRG4= <mlev>
##$CPDPRG5= <mlev>
##$CPDPRG6= <mlev>
##$CPDPRG7= <mlev>
##$CPDPRG8= <mlev>
##$CPDPRGB= <>
##$CPDPRGT= <>
##$D= (0..31)
0 1 0 0 0 0 0 0 0 0 0 0.03 2e-05 3e-06 0 0 0 0 0 0 0 0 0 0 0 0 0 0 0 0 
0 0 
##$DATE= 1603871385
##$DBL= (0..7)
120 120 120 11 120 120 24 19 
##$DBP= (0..7)
150 150 150 150 150 150 150 150 
##$DBP07= 0
##$DBPNAM0= <>
##$DBPNAM1= <>
##$DBPNAM2= <>
##$DBPNAM3= <>
##$DBPNAM4= <>
##$DBPNAM5= <>
##$DBPNAM6= <>
##$DBPNAM7= <>
##$DBPOAL= (0..7)
0.5 0.5 0.5 0.5 0.5 0.5 0.5 0.5 
##$DBPOFFS= (0..7)
0 0 0 0 0 0 0 0 
##$DE= 6
##$DECBNUC= <off>
##$DECIM= 4
##$DECNUC= <off>
##$DECSTAT= 4
##$DIGMOD= 1
##$DIGTYP= 9
##$DL= (0..7)
0 0 52 120 120 21 21 25 
##$DP= (0..7)
$$ [...]
##$SUBNAM2= <"">
##$SUBNAM3= <"">
##$SUBNAM4= <"">
##$SUBNAM5= <"">
##$SUBNAM6= <"">
##$SUBNAM7= <"">
##$SUBNAM8= <"">
##$SUBNAM9= <"">
##$SW= 369.568048894756
##$SWIBOX= (0..15)
0 1 3 0 0 0 0 0 0 0 0 0 0 0 0 0 
##$SW_h= 29940.119760479
##$TD= 32768
##$TD0= 1
##$TE= 0
##$TE2= 300
##$TE3= 300
##$TEG= 300
##$TL= (0..7)
0 120 53 12 22 120 120 120 
##$TP= (0..7)
150 150 150 150 150 150 150 150 
##$TP07= 0
##$TPNAME0= <>
##$TPNAME1= <>
##$TPNAME2= <>
##$TPNAME3= <>
##$TPNAME4= <>
##$TPNAME5= <>
##$TPNAME6= <>
##$TPNAME7= <>
##$TPOAL= (0..7)
0.5 0.5 0.5 0.5 0.5 0.5 0.5 0.5 
##$TPOFFS= (0..7)
0 0 0 0 0 0 0 0 
##$TUNHIN= 0
##$TUNHOUT= 0
##$TUNXOUT= 0
##$USERA1= <user>
##$USERA2= <user>
##$USERA3= <user>
##$USERA4= <user>
##$USERA5= <user>
##$V9= 5
##$VALIST= <valist>
##$VCLIST= <CCCCCCCCCCCCCCC>
##$VD= 0
##$VDLIST= <DDDDDDDDDDDDDDD>
##$VPLIST= <PPPPPPPPPPPPPPP>
##$VTLIST= <TTTTTTTTTTTTTTT>
##$WBST= 1024
##$WBSW= 4
##$XGAIN= (0..3)
0 0 0 0 
##$XL= 0
##$YL= 0
##$YMAX_a= 54705
##$YMIN_a= -55708
##$ZGOPTNS= <>
##$ZL1= 120
##$ZL2= 120
##$ZL3= 120
##$ZL4= 120
##$ABSF1= 0
##$ABSF2= 0
##$ABSG= 0
##$ABSL= 0
##$ALPHA= 0
##$AQORDER= 0
##$ASSFAC= 0
##$ASSFACI= 0
##$ASSFACX= 0
##$ASSWID= 0
##$AUNMP= <proc_1d>
##$AZFE= 0.1
##$AZFW= 0.5
##$BCFW= 0
##$BC_mod= 2
##$BYTORDP= 0
##$COROFFS= 0
##$CY= -3
##$DATMOD= 1
##$DC= 0
##$DFILT= <>
##$DTYPP= 0
##$F1P= 0
##$F2P= 0
##$FCOR= 1
##$FTSIZE= 65536
##$FT_mod= 6
##$GAMMA= 0
##$GB= 0
##$INTBC= 1
##$INTSCL= 5.30512e-09
##$ISEN= 30
##$LB= 1
##$LEV0= 0
##$LPBIN= 0
##$MAXI= 10000
##$MC2= 0
##$MEAN= 0
##$ME_mod= 0
##$MI= 50
##$NCOEF= 0
##$NC_proc= -3
##$NLEV= 6
##$NOISF1= 182.463
##$NOISF2= 159.3651
##$NSP= 0
##$NTH_PI= 0
##$NZP= 0
##$OFFSET= 182.463
##$PC= 4
##$PHC0= -2373.635
##$PHC1= 60.6007
##$PH_mod= 1
##$PKNL= yes
##$PPARMOD= 0
##$PSCAL= 0
##$PSIGN= 0
##$REVERSE= no
##$SF= 81.014009
##$SI= 65536
##$SIGF1= 159.3651
##$SIGF2= -187.1042
##$SINO= 113.3802
##$SIOLD= 16384
##$SREGLST= <1H.CDCl3>
##$SSB= 0
##$STSI= 65536
##$STSR= 0
##$SW_p= 29940.119760479
##$SYMM= 0
##$S_DEV= 0
##$TDeff= 32768
##$TDoff= 0
##$TI= <>
##$TILT= no
##$TM1= 0
##$TM2= 0
##$TOPLEV= 0
##$USERP1= <user>
##$USERP2= <user>
##$USERP3= <user>
##$USERP4= <user>
##$USERP5= <user>
##$WDW= 1
##$XDIM= 65536
##$YMAX_p= 536171319
##$YMIN_p= -3749507
$$ End of Bruker specific parameters
$$ ---------------------------------
##NTUPLES= NMR SPECTRUM
##VAR_NAME=  FREQUENCY,     SPECTRUM/REAL,   SPECTRUM/IMAG
##SYMBOL=    X,             R,               I
##VAR_TYPE=  INDEPENDENT,   DEPENDENT,       DEPENDENT
##VAR_FORM=  AFFN,          ASDF,            ASDF
##VAR_DIM=   65536,         65536,           65536
##UNITS=     HZ,            ARBITRARY UNITS, ARBITRARY UNITS
##FACTOR=    0.456856943014862, 1,           1
##FIRST=     14782.0589164895, 0,            0
##LAST=      -15158.0608439895, 0,           0
##MIN=       -15158.0608439895, -3749507,    0
##MAX=       14782.0589164895, 536171319,    0
$$ Real data points
##PAGE= N=1
##DATA TABLE= (X++(R..R)), XYDATA
$$ [...]
40176 264992 226285 251128 399407 601709 806850 1018101 1194647 1277754 1333550 1502555
40166 1502555 1757656 1869210 1682289 1298299 922873 669565 570040 619875 725604 750335
40156 750335 706946 766193 974760 1115181 970075 591826 185566 -133324 -323193 -314842
40146 -314842 -125555 34862 -18070 -186408 -239245 -151511 -91845 -124960 -145874 -94893 -22736
40135 -22736 71542 259453 493001 577767 408050 95958 -184942 -363809 -445174 -444807 -399447
40124 -399447 -339555 -233951 -66970 45351 -25642 -182139 -175181 28272 154298 975
40114 975 -272833 -380154 -279434 -147243 -88637 -66040 -62062 -122720 -231946 -296536 -294501
40103 -294501 -322989 -441054 -541861 -455384 -161920 145643 235937 74134 -137776 -175787
40093 -175787 -27677 126001 137834 27375 -104226 -192883 -204873 -104897 80868 211429
40083 211429 135343 -132710 -387546 -418862 -217420 24048 130140 136365 204905 354475
40073 354475 386130 145657 -238548 -491445 -496877 -347354 -159555 2154 65583 1321
40063 1321 -71158 -6538 133375 155914 50949 3901 57838 20394 -186858 -338892 -237848
40052 -237848 -21577 61989 14274 -7621 -4609 -98940 -259345 -311989 -209897 -87760 -49138
40041 -49138 -69541 -107725 -158248 -195286 -200685 -233398 -336730 -402788 -282733 -27543 126947
40030 126947 29635 -242930 -502888 -596639 -459233 -159248 111235 206745 182823 184529 221643
40019 221643 177835 5121 -226592 -442795 -592774 -604515 -461734 -298073 -269175 -361055
40009 -361055 -458124 -532335 -598859 -573628 -397775 -232615 -269671 -395130 -340715 -147429 -134392
39998 -134392 -367038 -526450 -421787 -265547 -254129 -224376 8930 270082 296788 176293
39988 176293 166416 234613 128726 -167366 -383127 -360498 -221410 -113721 -35521 37633 54500
39977 54500 -10505 -96012 -143704 -154100 -145121 -143028 -191460 -278602 -305839 -234103 -188271 -280443
39965 -280443 -407320 -391964 -260298 -178652 -160460 -61026 133939 242659 162271 16854
39955 16854 -35955 19411 137012 300671 452861 480017 365405 239749 196171 169147 81625
39944 81625 -7249 -10907 26875 9046 -44905 -33922 51697 114994 115841 145139 288983 480233
39932 480233 554473 448195 279001 191629 176269 124507 39667 55557 209188 343356 329946
39921 329946 248959 207074 120374 -113882 -334670 -279496 -7165 123574 -52219 -294735
39911 -294735 -336943 -225835 -138986 -74808 74289 280607 410983 415716 331735 177165 -11467
39900 -11467 -116060 -61667 58113 116319 140962 223323 314825 288991 156917 44268 -14241
39889 -14241 -77029 -113356 -16948 183313 320516 343532 394444 566704 753478 821522 781453
39878 781453 687112 518955 297624 176874 256157 393173 379003 241155 191438 304088
39868 304088 443809 529541 663821 912087 1123788 1119006 953434 839482 842568 806518 595731
39857 595731 286170 58505 -16460 -11653 -5980 4250 47556 93343 75783 -11419 -96341
39846 -96341 -129034 -157692 -248739 -354473 -347986 -208611 -78975 -78338 -142501 -139817 -75257 -51593
39834 -51593 -67905 -12409 135587 251573 258031 224221 204328 124116 -59607 -218019 -221479
39823 -221479 -158504 -208657 -348044 -368459 -189232 24598 93248 22582 -83359 -177642 -252167
39812 -252167 -260787 -164106 -13409 81342 55405 -64787 -190840 -233599 -173981 -84586 -47030
39801 -47030 -57914 -65187 -67373 -89548 -82341 32697 203710 264295 153129 -2396 -78656
39790 -78656 -106721 -150232 -159835 -75153 18880 -18189 -179620 -322009 -348224 -267627 -103664
39779 -103664 132598 373403 506016 478212 331379 140430 -10680 -26933 117860 300975
39769 300975 349567 232139 74131 -8943 -2218 67821 160084 181870 65974 -81827 -61473
39758 -61473 128301 225419 41435 -269804 -425166 -387547 -349084 -403256 -438005 -355638 -207569
39747 -207569 -65270 75619 193240 194378 68588 -41679 -39904 -33070 -155637 -329586 -366508
39736 -366508 -259134 -195423 -285454 -434684 -511425 -492252 -399471 -236171 -54046 32169 -16321
39725 -16321 -94402 -95218 -37940 13606 68542 157243 235854 233748 143530 -3614 -181662 -321007
39713 -321007 -311252 -151939 -12329 -26314 -112142 -124026 -91188 -140302 -252639 -294545 -252410
39702 -252410 -231476 -231764 -143032 17705 92708 66318 129500 355029 529342 469559 320279
39691 320279 326216 444183 423802 214410 46588 87602 222259 253599 169218 97520 91314
39680 91314 82363 30076 1817 62318 153796 164899 93961 46559 56284 23974 -97818 -179857
39668 -179857 -103090 27417 32779 -38912 15839 195476 260267 121957 9301 105959 251893
39657 251893 210808 61281 67697 253581 364955 248579 36341 -93976 -151552 -228353
39647 -228353 -287187 -187346 95580 369678 406587 211352 35555 63535 166529 102608
39637 102608 -98708 -170916 -46679 6718 -185602 -392799 -309839 -13069 184233 207976
39627 207976 256238 403664 475221 358005 194534 180611 340311 563585 722064 706026
39617 706026 495575 244960 161810 256908 338484 287246 197335 196771 267683 315559 300888
39606 300888 226739 88343 -94586 -262388 -376150 -431513 -399432 -245416 -30866 104167
39596 104167 98265 26890 -21066 -34515 -19910 55746 214917 425269 628580 760799 758463
39585 758463 629486 500107 487200 536580 502287 368713 255040 207964 156203 91280 116523
39574 116523 258348 389808 418250 407129 432128 451634 407472 329413 249930 134805 -7795
39563 -7795 -67127 14024 125027 139969 99466 134434 282399 477204 650556 749370 722267
39552 722267 589271 469806 448864 461675 391824 236141 92771 24740 8023 -9234 -42997
39541 -42997 -45428 68541 310406 537619 581407 468678 400026 477785 587641 596737 523105
39530 523105 434681 328347 211805 171618 241942 321561 335934 361755 465806 548588 507706
39519 507706 448865 547406 762906 873766 771464 567501 420696 386789 426040 448660
39509 448660 370515 218958 149405 263297 456316 545898 492725 384206 257751 75303
39499 75303 -157754 -371237 -510231 -546954 -462078 -314313 -262328 -388580 -549769 -530735
39489 -530735 -305960 -32180 157430 220518 143924 -15722 -84934 46869 230268 222638
39479 222638 27909 -126502 -134956 -107854 -100236 3785 243267 437208 431621 326421 302064
39468 302064 342724 296227 135033 -2659 -12961 53718 79362 8944 -109090 -165431 -85105
39457 -85105 78675 166682 78139 -97990 -164578 -33397 180987 304259 304492 302657 388216
39446 388216 497162 518555 457139 404640 396593 412573 485803 657673 820428 786620 564907
39435 564907 384281 368981 389163 347658 390486 636748 886684 846783 525459 171902
39425 171902 -63812 -163490 -57965 278057 611486 654325 469659 366058 396213 314933
39415 314933 83857 26098 314434 647626 677127 493986 417564 487990 464690 239383
39405 239383 -18067 -120618 -79003 -30010 -65407 -155876 -200042 -160191 -139497 -240508 -362372
39394 -362372 -299596 -75144 26873 -134870 -320373 -243977 12054 140460 70143 41972
39384 41972 233521 522206 682898 674702 643932 719419 888960 1060960 1181970 1250079 1231405
39373 1231405 1052656 741041 496013 494424 650008 706140 569588 405052 374500 436833
39363 436833 459473 388699 245536 78254 -22746 14592 121440 156186 125762 175649 323507
39352 323507 406920 364013 334977 376031 327113 136284 61398 296996 604766 615264 358202
39341 358202 177241 203669 244799 177755 134683 239892 421164 558507 611338 535588 281983
39330 281983 -38663 -176276 -36582 187188 273487 233180 210900 242881 236755 127979 -47728
39319 -47728 -205285 -261375 -162482 75180 355072 555134 595047 468713 250979 66165
39309 66165 3367 54456 154490 256343 329333 327313 228125 87417 -8174 -29706 -3908
39298 -3908 42888 82467 69771 5520 -21739 61208 195807 264252 251540 238747 250560 216458
39286 216458 97298 -38029 -89542 -24464 106057 196105 144567 -44743 -229183 -265770
39276 -265770 -181007 -127558 -171197 -210063 -134589 14530 110893 118456 121715 170507 167551 -11740
39264 -11740 -300147 -447628 -313429 -55880 86094 122902 245951 462979 541670 381625
39254 381625 209630 256642 421379 442300 277651 115748 84986 142136 206277 239763 225188
39243 225188 199642 269710 455171 570128 418172 73868 -188903 -235668 -190319 -218929
39233 -218929 -331322 -407787 -317556 -19028 363838 598554 580145 464817 461343 559480 602627
39222 602627 553059 506158 492427 462007 441392 502780 579175 515089 322908 185339 157218
39211 157218 65949 -207576 -518347 -629365 -470910 -148686 186287 392293 373591 171795
39201 171795 -29581 -60618 98566 337625 501981 460531 191539 -159703 -380439 -379606
39191 -379606 -235288 -69443 51714 110742 125181 142481 177095 170012 83284 -5110 3746
39180 3746 78152 106129 64625 30257 54961 137443 271234 402284 396793 197899 -28915
39169 -28915 -63145 85544 209519 192850 115403 90203 149285 275753 412408 467796 441160
39158 441160 478082 654507 795560 702583 480817 420603 613799 912822 1198036 1423121
39148 1423121 1454187 1170648 725006 413314 274196 96384 -170596 -325080 -273041 -171431
39138 -171431 -142083 -124209 -77525 -57537 -34278 81366 191489 105397 -78627 -42183 231239
39127 231239 390258 285045 194120 313710 435484 368524 290308 385614 483762 380959
39117 380959 224733 239074 325769 282213 188399 227065 311329 244897 103182 114846 275793
39106 275793 391275 409107 428725 463067 451102 434506 498361 612833 711093 804373 856663
39095 856663 721167 395115 141205 135051 196559 107794 -31164 -40908 -22255 -148250 -301063
39084 -301063 -266365 -107342 15934 213958 644311 1072466 1108729 806546 588023 616378
39074 616378 672561 637556 650205 739296 720453 556724 451745 472384 416206 184386 -12194
39063 -12194 38507 279489 541834 751212 873520 859700 746619 643239 552242 381140
39053 381140 178973 161484 411994 718452 807723 641988 417778 336037 403764 441599
39043 441599 320340 178541 265868 552654 730335 691162 703856 912314 986978 609584
39033 609584 42444 -192524 -24847 189761 269604 344754 473069 557168 630337 826891
39023 826891 1057630 1074048 866288 671911 602139 571603 549491 548421 435379 119936 -142466
39012 -142466 -32879 307859 454552 336166 251056 294803 269122 160419 197424 383290
39002 383290 467461 445125 574663 811229 758489 337857 -4469 45324 270329 380985
38992 380985 418114 473723 435401 262391 152905 205241 237115 129278 22621 11193 -25921
38981 -25921 -134661 -159819 -39606 101752 242850 484011 714360 671061 399299 213567
38971 213567 145644 -65679 -360117 -307688 166617 579757 616352 510560 499232 464490
38961 464490 356731 390337 543080 438177 24553 -199951 38217 368140 455383 501686
38951 501686 689283 732928 433505 134394 173212 370443 465605 545886 652064 519267
38941 519267 134727 -11498 323506 693356 699787 579983 618312 613916 427405 402025 697594
38930 697594 848761 544858 202749 207106 269887 127744 135011 517208 792986 633566
38920 633566 529423 882403 1243351 1211403 1224304 1629005 1890031 1636249 1528846 2081296
38910 2081296 2620658 2521124 2412297 2950369 3508310 3443196 3501767 4465857 5618063 6198811
38900 6198811 7060109 9014222 11009713 12119618 13742277 17265510 21315142 24457904
38892 24457904 28722866 36587763 46821981 58896972 79212337 113740666 152633593
38885 152633593 171692028 155966960 116808081 79283305 56850196 45021229 35789876
38878 35789876 28220347 24033124 21499627 18088035 14534307 12582254 11553114 9949439
38870 9949439 8176133 7260328 6681281 5541855 4390551 4074008 4072228 3558159 2935628
38861 2935628 2877597 2919613 2378278 1693535 1564570 1632338 1252563 775695 857205 1195045
38851 1195045 1113389 810699 920397 1310834 1356550 1035701 844057 919645 1029903 1126918
38841 1126918 1239068 1139608 735414 427586 521410 681451 526462 315512 442435 680474
38831 680474 567275 182636 -58020 -65156 10543 192403 487458 610753 389610 118507
38821 118507 80996 105113 15696 58325 382211 595525 402405 203982 435307 752341
38811 752341 577166 74909 -145394 -7106 89036 63037 167346 350805 305389 72725
38801 72725 -4663 132072 265406 381528 598039 732190 506770 103790 -28562 150906
38791 150906 311063 360638 484014 635036 551129 263340 85443 96159 98980 67521 152198
38780 152198 267803 161343 -109353 -234268 -188587 -244667 -441887 -522458 -431356 -409788
38770 -409788 -521106 -524418 -309239 -58444 99123 226836 317195 259241 114498 67754
38760 67754 81841 -29383 -188375 -129097 104625 185829 75614 96841 342835 487988
38750 487988 340400 131232 60638 -15403 -208076 -300424 -119310 111657 90130 -127159
38740 -127159 -270905 -257682 -204973 -189951 -191267 -172171 -95601 39973 114007 -21615 -306599
38729 -306599 -495366 -469011 -357643 -309544 -306838 -243824 -36565 332881 717895 824594
38719 824594 551358 221229 197658 372167 380021 215103 176068 251642 105617 -255622
38709 -255622 -367593 -49512 265393 206437 -9668 -46078 11460 -44453 -92305 49447
38699 49447 228142 256707 315592 601009 825281 576122 13202 -307257 -227441 -114067
38689 -114067 -199138 -276500 -144753 64161 156843 159385 156634 96355 -73729 -244616 -271304
38678 -271304 -153775 -3661 75623 27850 -126006 -251935 -207713 -30424 83549 32700
38668 32700 -54861 -1546 184597 327968 296467 130264 -30517 -97690 -88859 -46878 36894
38657 36894 173744 294366 300373 193963 74010 6590 -7568 54578 228578 440527 530194
38646 530194 449027 315196 218893 103421 -86536 -266402 -322777 -269166 -197931 -150925 -111532
38635 -111532 -56268 40711 184669 312628 355372 353706 391634 414986 286620 46798 -80185
38624 -80185 803 138980 210306 285597 417521 489114 424208 336518 306726 227468 54805
38613 54805 -15439 143165 316683 266880 130160 180276 341365 303667 50925 -103766
38603 -103766 -17189 91058 9280 -193046 -353513 -436884 -467811 -441020 -391642 -394603 -423705
38592 -423705 -357276 -174433 -776 79326 103708 90217 -20288 -218564 -374354 -401593
38582 -401593 -355539 -305657 -223962 -58951 168275 381099 490391 427515 229851 68483
38572 68483 68137 129254 73702 -73484 -137634 -103152 -129981 -238295 -243542 -103057 -71946 -342623
38560 -342623 -726619 -896946 -807352 -664319 -582404 -488288 -330625 -179865 -92488 -23968
38550 -23968 78093 193053 278435 331921 369768 393194 403722 418538 446066 462635 434125
38539 434125 362337 294890 267550 242572 151095 14037 -46226 29692 128783 111912 16070
38528 16070 -13824 30684 -3670 -187287 -379124 -409982 -289910 -157551 -101168 -106388 -127452
38517 -127452 -138040 -133091 -118241 -82210 16053 186195 347636 407974 389353 377941 353245
38506 353245 201544 -73420 -304044 -392609 -443199 -549650 -587929 -383398 -2036 305141
38496 305141 418399 439942 467226 449691 330049 187363 140780 194127 267719 324496 371537
38485 371537 381169 321223 254268 290973 412251 443890 282764 68736 22266 146574 213865
38474 213865 60032 -218147 -403768 -403039 -280418 -126968 10457 99272 113547 73171 41704
38463 41704 62485 107282 95454 -21629 -180318 -242145 -157473 -46818 -33087 -41098 91683
38452 91683 324512 432370 360592 339751 523733 717989 658708 403098 211215 147560
38442 147560 55158 -119616 -227170 -154233 40780 258127 447923 547474 490482 311767
38432 311767 114264 -69346 -251764 -360209 -301326 -138123 -17959 60638 204399 359630
38422 359630 335990 131269 -18499 13084 88774 99400 157031 344959 504765 477761 386943
38411 386943 452660 634750 678088 472925 191983 69635 162239 333211 409982 356142
38401 356142 294713 323788 355295 257341 115693 154154 378897 534190 488400 427322 529860
38390 529860 668001 610787 361902 113295 -1863 54881 297735 640888 867085 849146
38380 849146 716439 667801 734471 848974 983952 1067887 952914 670130 525581 688668
38370 688668 863277 677791 262232 78203 248107 436096 401800 295805 316787 408272
38360 408272 446969 469830 537774 566259 467541 333200 321139 437206 541839 525522 407907
38349 407907 301747 311760 428256 509496 399045 36516 -560863 -1314961 -2005567 -2320092
38339 -2320092 -2159624 -1802069 -1577440 -1470269 -1252500 -915970 -694654 -681750 -704295 -605446
38329 -605446 -400704 -120836 243153 575571 663745 485124 262007 151201 78962 -48114
38319 -48114 -188656 -312248 -479698 -665290 -705655 -557510 -422678 -474478 -611141 -613838
38309 -613838 -426072 -172836 -18704 -74335 -307820 -499042 -439356 -210808 -80258 -100684
38299 -100684 -69540 76085 135999 26637 -45149 38635 75489 -85792 -251899 -235955 -202688
38288 -202688 -330294 -400772 -136416 255629 329401 83701 -55544 90987 241289 163065
38278 163065 301 -27990 69164 183476 271483 271651 100714 -152062 -253689 -165053 -130763
38267 -130763 -309194 -529357 -565987 -458456 -377856 -344118 -280449 -228436 -284787 -377227 -316641
38256 -316641 -85194 102995 90211 -2465 58859 293231 460827 363583 90052 -119882
38246 -119882 -188369 -241512 -345815 -374874 -222362 -9468 53398 -66448 -213763 -240655
38236 -240655 -113394 98493 234608 136558 -145902 -334552 -249870 -60519 -43321 -201731
38226 -201731 -331606 -374536 -445071 -542362 -514426 -343322 -214732 -231001 -267643 -200528 -90805
38215 -90805 -49218 -69805 -92170 -110654 -147002 -203688 -277395 -333526 -283959 -110478 25710
38204 25710 -44041 -247212 -370228 -362010 -324179 -251492 -63090 118529 45656 -240165 -394710
38193 -394710 -271757 -118109 -135941 -179132 -77530 44135 13418 -86101 -114641 -144685 -260269
38182 -260269 -306088 -133619 86109 105381 2982 27740 164984 189885 66789 -37174
38172 -37174 -89718 -219287 -410052 -471850 -338794 -139073 48565 256777 430913 423965
38162 423965 238883 57112 -14845 -25260 13686 170054 401194 532246 486387 358134
38152 358134 225400 77674 -46420 -62682 -23393 -84397 -244600 -337982 -337371 -418977 -628230
38141 -628230 -729820 -546721 -247661 -114954 -168448 -195000 -56318 183623 377958 429622
38131 429622 342757 207040 99475 2315 -113572 -174722 -116220 -54698 -143872 -286005 -247742
38120 -247742 -72840 -68924 -309657 -487110 -408652 -302054 -398919 -531221 -447310 -267242
38110 -267242 -264329 -385890 -377363 -256516 -261710 -383329 -347603 -87878 133603 141402 56609
38099 56609 1481 -91045 -236560 -249688 -24005 239725 265937 25449 -304665 -555099
38089 -555099 -620115 -463131 -211899 -106106 -202683 -267637 -111417 116834 162524 58629
38079 58629 37428 124740 101533 -119368 -340820 -383817 -321581 -294806 -283037 -219707 -185391
38068 -185391 -282260 -399563 -327593 -93827 29839 -96831 -294013 -341809 -267859 -208159
38058 -208159 -137736 40938 228911 212359 18746 -64775 88279 232569 103227 -205394
38048 -205394 -399273 -389200 -325694 -313700 -315770 -310084 -329769 -334636 -243686 -127338 -166093 -351411
38036 -351411 -426903 -241164 19084 104933 65374 124071 285477 310800 99375 -126336
38026 -126336 -106851 137124 385219 503244 517723 475808 380472 254710 140493 14607
38016 14607 -181480 -395701 -467410 -342894 -184888 -169649 -254519 -259961 -119000 85028 279572
38005 279572 443345 500533 347783 24635 -283721 -452948 -499274 -438815 -249721 -30899
37995 -30899 8192 -163303 -304032 -247406 -163598 -278072 -485574 -494025 -254634 10844 151478
37984 151478 188291 108748 -137728 -400280 -378385 -28770 317738 384126 288009 297793 430409
37973 430409 495084 423186 339230 335056 347133 278582 135103 13095 6044 126216 290335
37962 290335 396694 424669 420512 390462 283359 91978 -116064 -295215 -458001 -581106
37952 -581106 -582627 -455817 -330309 -319089 -376322 -386338 -333100 -298421 -332275 -400658 -443567
37941 -443567 -431701 -375087 -303064 -229568 -146784 -78468 -103096 -260341 -466715 -601972 -640766
37930 -640766 -609648 -481846 -257815 -90080 -135795 -308765 -382991 -329129 -314373 -370970 -353090
37919 -353090 -272203 -351826 -623793 -787938 -659138 -458068 -432257 -473303 -384518 -262189
37909 -262189 -281770 -333145 -241920 -172361 -397428 -784251 -937229 -800574 -691626 -737709
37899 -737709 -714471 -513285 -354158 -389623 -449417 -356083 -205292 -154747 -179240 -203147 -259711
37888 -259711 -360486 -398795 -322864 -224935 -146237 4200 217826 290397 102319 -200589
37878 -200589 -439268 -600918 -663157 -469486 -6554 391834 379530 24082 -311847 -404038
37868 -404038 -287962 -71955 144672 247259 211011 182460 287795 423871 398584 203511
37858 203511 -13361 -163325 -238073 -204224 -65285 37830 -27879 -194951 -309065 -354239
37848 -354239 -385597 -337204 -130907 87130 81385 -108986 -193150 -46824 129712 142536 83554
37837 83554 163812 406028 616197 597135 337963 37784 -62774 65199 193283 124200
37827 124200 -51178 -115085 -52284 -23079 -59487 -23247 122941 230349 205043 135752 113246
37816 113246 101507 63717 48060 65182 37917 -38008 -32502 122872 314140 418673 468231
37805 468231 531360 557557 465530 295353 154948 84197 64506 85603 113964 80517 -2213
37794 -2213 3093 170745 355577 354841 179135 27554 10885 33475 -24864 -121359 -115675 26588
37782 26588 176150 207003 170846 228442 397176 466870 253485 -131658 -389480 -377481 -213363
37771 -213363 -53651 65597 140478 126235 40867 11007 107840 224103 209143 63637 -75695
37760 -75695 -91817 27803 202892 306849 257775 104827 -21303 -52905 -19639 39085 91163
37749 91163 63512 -79361 -215706 -196225 -95286 -120388 -244240 -195909 80234 247697
37739 247697 59938 -233244 -236798 12393 132145 -39419 -278908 -357601 -304574 -252168
37729 -252168 -241015 -240635 -212470 -119725 10665 55662 -44263 -139089 -43631 187064 339373
37718 339373 355652 352067 343111 201119 -65478 -234790 -171922 -16552 37087 -12299 -54967
37707 -54967 -59428 -58197 -44035 11944 104824 224606 364707 455657 391837 190110 27170
37696 27170 40051 160255 216068 141865 23915 -20314 37711 115405 106433 10167 -61747
37685 -61747 -51751 -52566 -140621 -202442 -86496 134570 249655 226525 228015 316003 374240 353105
37673 353105 342954 342945 213186 -42906 -198873 -138170 -27922 -12095 21974 181332 310906
37662 310906 238191 74782 15806 12703 -75433 -157027 -47773 170275 256419 221107 298149
37651 298149 514779 614198 461513 243178 171203 219119 249869 222641 185106 197664 307404
37640 307404 470611 515474 345688 140490 135820 248729 199819 -942 -33525 202152
37630 202152 400840 346668 237322 282870 308205 78026 -227539 -236203 55027 298390
37620 298390 304355 199976 107842 -10180 -157257 -229273 -204278 -185536 -204926 -179107 -90514
37609 -90514 -8548 87919 273727 428234 301744 -66601 -278761 -103784 172084 156517
37599 156517 -89492 -200157 -90463 -54128 -274599 -542974 -564841 -333295 -69969 57617
37589 57617 33960 -84449 -218092 -281923 -251540 -193301 -178870 -206051 -239458 -268548 -275573
37578 -275573 -213908 -86996 13657 30284 37354 116744 191738 126979 -26810 -55929 109184
37567 109184 267455 215532 11626 -149382 -217920 -286747 -366679 -354928 -241789 -176645 -254250
37556 -254250 -360043 -323102 -138585 57384 168286 185460 101127 -94314 -314921 -395863
37546 -395863 -271386 -71459 26386 5612 3397 112084 268111 361874 386509 413787 462153
37535 462153 475863 437458 412820 444200 469723 412084 296632 209397 174404 151690 130593
37524 130593 133461 132143 53409 -114874 -294135 -401607 -401370 -281248 -75144 92037 100671
37513 100671 3993 -19826 81496 166874 140210 96781 127106 132457 -4114 -188910 -255288
37502 -255288 -240546 -301736 -401782 -331536 -71188 109574 4195 -265839 -448793 -469222
37492 -469222 -412500 -336186 -248840 -195649 -217298 -259153 -238266 -177924 -176620 -256696 -327185 -292453
37480 -292453 -139851 60893 190799 147337 -49944 -236582 -258901 -151910 -97205 -189420
37470 -189420 -298799 -209083 114609 435080 469334 213330 -32132 -20247 137463 149256
37460 149256 -38339 -197852 -197709 -177659 -246764 -240557 22037 403229 605541 573645 501351
37449 501351 491809 457606 357740 295053 324341 358433 331351 290455 263501 187339 33595
37438 33595 -137337 -305146 -521432 -747847 -824479 -694635 -518449 -461930 -503087 -539388
37428 -539388 -540049 -481539 -292276 -8965 162218 117994 56406 196565 420560 449882 304325
37417 304325 285134 484850 607061 383976 -52941 -367899 -425441 -344168 -259483 -201635
37407 -201635 -166440 -164052 -183726 -189706 -169648 -152843 -178192 -250958 -312734 -267542 -93681 73339
37395 73339 53223 -151422 -315945 -236884 38656 278993 317371 180998 12502 -64495
37385 -64495 -7963 149653 334484 464055 473307 348985 165030 49263 56348 83855 -22789
37374 -22789 -277420 -521508 -588279 -440566 -152284 159936 366756 380598 236058 62143
37364 62143 -59269 -148106 -219487 -216875 -108996 34171 143836 258719 432105 589074
37354 589074 593021 434467 244777 120878 36254 -58375 -145099 -195230 -240302 -322234 -411407
37343 -411407 -434044 -368944 -273827 -219268 -231599 -300444 -398747 -470253 -435298 -270051 -80334
37332 -80334 -27331 -140356 -260392 -234118 -119192 -105692 -254880 -427306 -483715 -440108 -371963
37321 -371963 -273202 -103358 94669 228568 280022 309608 355982 406080 454726 516533 568199
37310 568199 541700 404167 217555 99597 123498 240356 297271 171945 -82215 -258732
37300 -258732 -206026 2294 133568 23336 -270475 -516337 -513712 -288857 -78612 -61767
37290 -61767 -129790 -33117 245272 419705 270678 -71099 -325868 -410228 -420974 -393236 -294628
37279 -294628 -209095 -286079 -476153 -527059 -324273 -72196 -33666 -211109 -394082 -428343
37269 -428343 -316502 -110189 158731 420198 534825 397660 75595 -205241 -260272 -133109
37259 -133109 -26519 -41104 -70436 4524 128584 174711 136201 88474 39456 -27297 -25053
37248 -25053 132604 328727 342996 161089 -11523 -65394 -105524 -204238 -263682 -233195 -256074
37237 -256074 -442067 -653320 -692269 -587780 -515712 -506559 -404056 -98033 320947 636107
37227 636107 674196 441881 142167 -1793 26734 62321 11946 -53924 -90883 -170195 -294985
37216 -294985 -326147 -220469 -147873 -212647 -260709 -168054 -113580 -288497 -504463 -430283 -123622
37205 -123622 30775 -112998 -306277 -335372 -263816 -179563 -37178 123315 106072 -121552
37195 -121552 -295547 -225807 -79173 -100438 -254272 -361379 -415176 -512230 -584084 -458154
37185 -458154 -147538 129038 207065 101546 -97616 -301393 -409029 -361992 -219523 -91457
37175 -91457 -21897 -17041 -116528 -316153 -483546 -499568 -447731 -508534 -675907 -732972 -535513
37164 -535513 -197803 37110 26163 -181166 -391735 -415623 -255943 -135093 -227386 -399233
37154 -399233 -368850 -119834 38203 -110113 -384073 -454290 -260319 -20894 88457 83376
37144 83376 20694 -105494 -262918 -334737 -283797 -255722 -378930 -528902 -470716 -234524 -141121
37133 -141121 -356170 -605236 -523597 -168814 68588 27811 -40334 79551 229403 169499
37123 169499 -19564 -89126 -43841 -117415 -359309 -522206 -413395 -141098 70179 138861
37113 138861 114315 52393 6371 38369 146712 251673 306077 334183 322075 192365 -37005
37102 -37005 -190092 -141557 -3125 13330 -139153 -316767 -373856 -282578 -112575 14182
37092 14182 -4224 -125418 -159577 2596 205477 198085 -39351 -271146 -300273 -155544 14653
37081 14653 91073 3573 -242784 -496666 -546786 -362470 -144293 -66623 -93480 -137191 -245062
37070 -245062 -462932 -631771 -546990 -286794 -161569 -316422 -583629 -768702 -866468 -902268
37060 -902268 -782140 -480218 -211948 -196843 -338016 -359422 -210434 -99943 -135901 -180577
37050 -180577 -124279 -69089 -117559 -171117 -103906 1627 -24884 -174928 -295855 -338661 -387673
37039 -387673 -457201 -440074 -297344 -151316 -118860 -155095 -141344 -62286 -15478 -69974 -179828
37028 -179828 -247705 -242002 -224639 -264975 -363446 -488677 -635172 -759212 -710605 -398116 -36635
37017 -36635 -9529 -370297 -692974 -614529 -337315 -309338 -540933 -614714 -360574 -118281
37007 -118281 -205148 -473539 -610136 -596079 -606649 -662421 -674498 -701600 -858985 -1036391 -997988
36996 -997988 -757278 -586191 -610984 -633908 -432965 -44717 342508 612225 734229 700446
36986 700446 575953 516417 604628 728211 738257 689660 791601 1103872 1396313 1385773
36976 1385773 1065537 714620 574868 599857 578123 438480 321290 356916 499654 624358
36966 624358 679345 680062 653224 669066 829452 1119007 1358601 1431722 1473765 1679813 1978440
36955 1978440 2075313 1821971 1392738 1079974 1031936 1188163 1344900 1284968 976759 655250
36945 655250 585620 752017 910000 923997 881762 874262 858136 783632 685151 588201 483865
36934 483865 437448 548220 754192 867345 860540 909096 1069442 1147270 999281 735292
36924 735292 487760 232086 8337 45204 405136 742825 725663 509191 470036 633498
36914 633498 734870 720400 772364 900590 946762 993691 1310337 1803778 1976252 1602741
36904 1602741 1052836 720761 511115 176026 -169178 -235422 -49007 112918 145925 151021
36894 151021 141118 34337 -109721 -146043 -123375 -234002 -472440 -599679 -492288 -302238
36884 -302238 -202173 -163829 -77142 55491 135116 94895 -30141 -105646 8874 285225
36874 285225 495440 474699 351744 356911 464330 442675 240873 74264 86664 167576 188080
36863 188080 193363 245154 277318 249481 265230 383651 475600 432528 363137 392744 409006
36852 409006 234424 -49679 -197554 -161728 -115341 -133577 -107319 -3617 33822 -70867
36842 -70867 -186489 -189315 -144304 -148060 -141535 -31739 106347 112535 -26222 -163273 -183166
36831 -183166 -93885 40688 146358 133491 -36403 -263460 -378483 -321028 -184332 -79079
36821 -79079 -26934 -687 9854 5931 -5684 -36639 -100120 -141543 -54413 177068 406424
36810 406424 481765 454094 528341 775423 985286 900112 555596 265388 233856 309400 230463
36799 230463 23095 -31930 176058 402384 380128 171959 43689 112306 295875 515191
36789 515191 725418 794798 601300 274652 110758 186140 279528 252668 257350 420438 571581
36778 571581 512286 366643 393826 575238 668952 601850 526511 520444 505830 470733 503248
36767 503248 580394 580771 539082 616449 770439 758452 561338 473503 607861 646857 346835
36756 346835 -2630 28114 357409 523686 367933 189475 220287 312868 251453 87341
36746 87341 17451 114131 296753 439568 427891 233529 2138 -52062 103672 285224
36736 285224 344597 330182 344679 381398 386210 371687 373155 365621 306880 208430 98712 -34206
36724 -34206 -200911 -341954 -350880 -165721 163711 486879 656189 650446 563295 453670 296279
36713 296279 128953 109841 296088 488375 477868 346428 300485 297426 129838 -143667
36703 -143667 -186039 124942 492086 614445 543286 473547 433013 374125 360654 438463 482792
36692 482792 394930 317305 432165 653937 742731 645789 515898 448729 405881 366703 369028
36681 369028 402812 406847 360984 275761 139561 -13254 -53424 93060 310798 434081 440625
36670 440625 385497 261098 91852 47454 239034 485007 524203 415589 467169 768280
36660 768280 1048649 1051903 827146 577328 408987 321133 291045 278714 241231 187375 137374
36649 137374 45325 -111953 -198639 -52147 241331 395636 291398 112140 54442 83957
36639 83957 74039 27318 30366 88030 121225 83762 13746 -1268 99404 254821 292623 134145
36627 134145 -41897 19302 312427 569232 594832 443239 248356 73271 -24111 28985
36617 28985 184381 279787 271965 307145 462361 580620 502492 335474 336270 594127 957147
36606 957147 1223437 1300712 1211456 1029594 814215 585318 384162 319314 455587 671497
36596 671497 751491 630185 425301 234243 56074 -72608 -56588 78663 161267 113890
36586 113890 69125 157378 324138 447412 495438 474670 362086 195219 105409 157829 262106
36575 262106 313505 300454 216853 32782 -166605 -198895 -60501 -4601 -193586 -440002
36565 -440002 -469942 -299339 -147402 -88745 -15269 112493 196488 194674 211130 336546 497133
36554 497133 527035 369489 166638 107783 184538 193650 52284 -30104 136730 377880 389683
36543 389683 235780 259092 504763 622033 430444 194302 164681 212540 148608 83134
36533 83134 186803 355812 402495 364116 348847 273759 33689 -241379 -369950 -417578 -568185
36522 -568185 -838848 -1157083 -1582097 -2200590 -2883430 -3333978 -3326537 -2835795 -2082842 -1487309
36512 -1487309 -1333000 -1428525 -1369911 -1136870 -1036323 -1056454 -834807 -382915 -201450 -431337
36502 -431337 -554437 -272981 5059 -22553 13357 377509 632605 462039 359373 764916
36492 764916 1245977 1349816 1508967 2174819 2855219 3075837 3449804 4571509 5781967
36483 5781967 6484333 7618474 10007296 12535222 14643463 19431941 30117428 43001125
36475 43001125 48471953 41436575 27626734 16825132 12422774 10808300 8714492 6687617
36467 6687617 5777494 5084008 3769972 2661610 2493850 2521566 2005624 1492147 1587639
36458 1587639 1797224 1545056 1222534 1319732 1472344 1208272 823171 752924 787986 590847
36448 590847 351666 326203 325902 201917 231491 516965 608350 232432 -187627 -233578 -130040
36437 -130040 -189752 -215312 6679 173617 2716 -198910 -71630 142668 49514 -212019
36427 -212019 -290490 -244420 -294659 -317332 -134622 20080 -124849 -341234 -269480 -41925
36417 -41925 -7035 -99524 -35569 88923 -45362 -378521 -537884 -400093 -150618 89873
36407 89873 291096 313268 85697 -152827 -157987 -54748 -60194 -65429 103367 254897 134676
36396 134676 -55858 44964 304725 274146 -73016 -302747 -197004 11317 82883 20330
36386 20330 -137437 -376302 -555438 -547534 -504731 -641259 -816171 -712354 -369440 -128675
36376 -128675 -83089 -7692 162169 207389 26683 -219142 -413234 -579939 -645686 -468472
36366 -468472 -159853 -29924 -145823 -259480 -213252 -93603 50459 294561 580731 699034
36356 699034 602978 453569 311137 91208 -146584 -206313 -101858 -54160 -90661 -8867
36346 -8867 191791 235416 50891 -62922 64431 170402 -16429 -350390 -518064 -471513
36336 -471513 -364159 -245305 -61459 160557 325885 385872 324267 134405 -99076 -209098
36326 -209098 -112419 128507 424399 704100 851135 781853 597572 470246 376819 153655
36316 153655 -194193 -471754 -578044 -568783 -459025 -247473 -113585 -246494 -459432 -348740
36306 -348740 99200 445672 440928 320784 314422 281873 81859 -80970 17668 239535 321224
36295 321224 252287 156313 34589 -111896 -139197 -6214 58263 -98087 -258872 -173988
36285 -173988 31886 93134 39999 57584 78817 -99002 -387417 -476951 -314461 -174566
36275 -174566 -229502 -337100 -316112 -198191 -124671 -154607 -243090 -308590 -289600 -197561 -106067
36264 -106067 -51409 1302 66858 117179 181545 325165 476313 450970 231898 37138 11549
36253 11549 48565 33861 50541 193991 384978 514423 570312 496104 186166 -217261 -328249
36242 -328249 -46052 222550 139052 -80145 -77255 67934 88526 76432 271870 499692
36232 499692 368722 -43732 -240198 -34516 262494 426335 593775 844186 963745 818345
36222 818345 608531 565078 664805 785884 884971 906758 773426 565104 464798 452280
36212 452280 322927 74972 -36585 61166 89783 -149508 -462152 -560027 -427576 -213512
36202 -213512 7457 182999 213391 123484 111288 248285 323446 168219 -51367 -69302
36192 -69302 113753 300273 395988 440266 442173 370297 236474 65121 -127735 -237797 -113848
36181 -113848 181866 335510 170881 -93963 -171347 -113348 -152962 -275973 -248990 -20114
36171 -20114 198609 262072 250674 249425 204189 99996 87048 270462 487688 469065 194041
36160 194041 -62143 -74201 61125 97322 4308 -7920 152822 278297 166589 -49245
36150 -49245 -94635 17755 18187 -172832 -307148 -191979 38866 160954 156847 128764 93797
36139 93797 39280 40070 136410 197629 85947 -118478 -225110 -210239 -220144 -323211 -414990
36128 -414990 -383933 -254911 -135306 -85467 -70364 -20179 64906 94510 22108 -39114 51345
36117 51345 222399 236757 12140 -253395 -336601 -223689 -27314 166142 277513 233448
36107 233448 101426 65861 146329 121310 -104509 -251978 -30097 391140 558465 334625
36097 334625 46291 23807 238010 453515 541283 541773 548175 615481 712426 719668 541806
36086 541806 246906 34735 48386 257330 515826 691846 762909 834650 1036423 1357795
36076 1357795 1635188 1740751 1716137 1670606 1637368 1602318 1575808 1540159 1421383 1225484
36066 1225484 1114024 1217218 1443170 1592657 1591655 1499224 1381736 1313121 1393441 1601378
36056 1601378 1724120 1618691 1453208 1480610 1656845 1730915 1658532 1641106 1751497 1816069
36046 1816069 1735310 1646220 1645911 1590727 1329539 958019 678897 545117 489987 491403 548322
36035 548322 581955 514460 392404 301194 205381 11839 -229235 -330304 -213065 -48508
36025 -48508 -70228 -277659 -408092 -244874 99610 303242 231023 78300 56243 91360
36015 91360 -1832 -167922 -173692 -1748 76887 -102694 -347929 -381552 -209415 -65223 -86252
36004 -86252 -191040 -234633 -167559 -52120 7054 -41655 -136746 -167451 -110619 -47876 -36324
35993 -36324 -45066 -45702 -68088 -113911 -104982 10116 159819 221823 147115 -17903 -169387 -188326
35981 -188326 -40181 133794 134391 -36481 -156821 -95107 -826 -68904 -241908 -306639 -194641
35970 -194641 -4704 211097 469895 670681 609755 269058 -73433 -136562 60570 281386
35960 281386 359966 294006 139715 -21466 -36499 215702 610058 803276 590404 156295
35950 156295 -144124 -195577 -166541 -177389 -130266 57757 239012 219227 52555 -38439 373
35939 373 -7570 -171903 -354080 -362700 -195370 16974 207351 388045 518233 490924 277212
35928 277212 4808 -152261 -137531 -43710 286 -57215 -190439 -360903 -526479 -605349
35918 -605349 -523642 -333795 -201170 -213076 -279724 -294700 -292038 -327169 -306653 -124559 83543
35907 83543 47788 -251878 -516783 -509913 -320697 -166426 -110702 -98047 -106151 -113809 -44633
35896 -44633 102754 178871 98681 25892 150211 361305 367045 106842 -175263 -275163 -221248
35885 -221248 -84731 153987 426377 481103 177735 -241009 -383197 -172176 102560 176643
35875 176643 66229 -85057 -218193 -325513 -356239 -290847 -225336 -254490 -326617 -332702 -288182
35864 -288182 -287552 -310031 -234678 -62321 44488 3131 -54493 19304 174907 261129 240423
35853 240423 188620 149431 117647 131076 256033 473883 654880 652902 412354 35021 -241125
35842 -241125 -231614 -25948 98728 51889 62466 318298 645033 741026 596452 438073
35832 438073 352130 237377 93514 67416 183738 281769 269650 219097 170971 83889 25368
35821 25368 155708 427452 544374 344565 13821 -198506 -260643 -235254 -118191 26781
35811 26781 866 -241097 -422504 -309686 -92748 -128508 -394590 -484370 -143909 414097
35801 414097 772795 731171 426375 149875 81707 161955 221046 216967 245949 320440 319215
35790 319215 237500 290253 609837 994230 1137471 997239 761733 561476 399744 277618
35780 277618 195155 89020 -63453 -141426 -35130 173917 340020 466589 622678 744198
35770 744198 712855 563003 432541 380169 402981 512680 615198 477997 62290 -273332
35760 -273332 -205792 55801 63747 -191779 -329080 -250029 -272763 -510281 -611124 -333899
35750 -333899 36044 133044 50094 109586 331034 457705 370852 185109 21599 -67545
35740 -67545 -22638 150119 280254 204764 -3787 -150173 -200390 -270043 -370597 -366614 -199669
35729 -199669 11289 135986 176596 197306 202658 149063 37242 -57498 -56034 33653 125193
35718 125193 180786 291386 560982 936239 1248866 1426303 1557549 1739339 1960473 2147128
35708 2147128 2207297 2025106 1560046 990661 610679 519235 541550 499825 405178 322323
35698 322323 232729 143887 158441 286439 338061 170864 -76452 -167451 -81518 26153 75291
35687 75291 78250 -3720 -191781 -315496 -149450 246326 528591 478354 241840 93394
35677 93394 107137 161555 149239 53472 -119483 -351485 -554748 -603227 -469053 -283661 -211193
35666 -211193 -269672 -326910 -283767 -196686 -166934 -172537 -115441 -7168 29802 -32913 -66052
35655 -66052 9033 83778 48130 5136 141004 426604 613522 544561 332574 179543 129134
35644 129134 87990 22099 6429 73525 127758 81386 -692 -952 48725 10845 -111270 -152394
35632 -152394 -75829 -86641 -310821 -544444 -538671 -390012 -373495 -482037 -455253 -244615 -102016
35621 -102016 -143421 -160523 743 175858 176202 88981 74109 81242 335 -81181 -14065 139156
35609 139156 181007 40846 -205522 -462798 -604216 -481621 -145816 79032 -39314 -314454
35599 -314454 -396617 -235494 -44106 88822 254926 437873 465170 281749 41178 -119570
35589 -119570 -214511 -291835 -342114 -339567 -251337 -38055 226062 316687 124860 -123741 -134950
35578 -134950 40270 112458 18808 -18976 96856 188265 124791 12270 -40514 -80323 -114467
35567 -114467 -10103 251498 436869 363785 177020 133900 243074 302360 205396 32484
35557 32484 -114332 -210249 -253122 -225825 -127116 13601 146275 207601 162967 65758 25009
35546 25009 85285 172875 168161 4501 -270979 -485730 -453731 -186003 79088 163532 175196
35535 175196 291120 424673 354346 133217 74086 289039 525394 550869 442979 369258
35525 369258 322355 245785 225464 359932 573163 722162 778256 768800 671878 511862 423193
35514 423193 458147 457111 285204 85500 102474 333558 550073 611085 569312 498935 405909
35503 405909 312813 269224 248788 162446 6517 -101452 -68789 58527 153363 138579 55266
35492 55266 23474 120755 288841 396063 391335 330022 249603 127743 -7405 -48079 48121
35481 48121 190479 297549 397013 508631 543672 421700 199352 -5195 -137062 -193390
35471 -193390 -189642 -190015 -243992 -248892 -56694 215179 225644 -87889 -310517 -99658 291298
35460 291298 363228 86070 -113513 -8651 178386 210234 149011 129315 124385 87693 87791
35449 87791 152943 180331 139477 183631 413376 689271 825569 829523 806213 759397 639027
35438 639027 473373 306533 112769 -77319 -83149 201789 572376 706768 566369 405633
35428 405633 397596 461805 498434 575674 767137 957334 964790 788793 602325 530384 542377
35417 542377 550006 512575 436879 356913 336070 415760 525038 506561 293662 25221 -82593
35406 -82593 29976 217485 313013 297272 260769 258707 268271 271449 305820 399293 497908 514610
35394 514610 439411 338558 229606 35294 -271089 -534864 -551848 -328343 -92519 -18233
35384 -18233 -54686 -80188 -88359 -116438 -110851 -22250 39185 -81341 -338918 -521122 -517407 -404450
35372 -404450 -272640 -143855 -78166 -164740 -334753 -361659 -159959 55617 35754 -182797
35362 -182797 -352030 -336907 -235618 -203467 -261923 -298981 -219097 -78768 -46072 -186934 -341742
35351 -341742 -307330 -100712 79121 109001 8111 -196328 -443528 -501921 -155068 405581
35341 405581 674091 455379 118144 49727 151754 131800 24788 71470 250397 311039
35331 311039 201045 111248 113909 76965 -41790 -108235 -72063 -58786 -132157 -179964 -109544
35320 -109544 18345 103429 100211 -18739 -225479 -355949 -255771 -28233 50604 -110412
35310 -110412 -329329 -436299 -442243 -394729 -287530 -174240 -162833 -224729 -203650 -73968 23314
35299 23314 65579 216225 494130 640727 503638 325165 409703 669478 761296 575226
35289 575226 330655 225841 226365 215944 165083 96957 15674 -73793 -144396 -174330 -157529
35278 -157529 -97243 -26860 -6259 -55284 -129936 -199547 -281976 -351268 -296442 -67793 193546
35267 193546 281583 161815 -3347 -51113 31275 135031 138292 -2178 -204803 -319918
35257 -319918 -289598 -232716 -303711 -479108 -567080 -446682 -220866 -82741 -82415 -100564 -39669
35246 -39669 45240 45778 -40566 -133719 -216436 -341887 -486525 -521947 -397094 -243092 -203290
35235 -203290 -237720 -199488 -44042 144622 286617 357774 353024 306918 309444 390441 429801
35224 429801 301066 68466 -77712 -48203 91875 239291 297308 180048 -67097 -221799
35214 -221799 -143076 -3849 -50242 -204061 -184686 10850 90569 -25510 -44149 206677
35204 206677 448960 353227 19833 -199613 -187127 -101551 -57937 -28281 -6989 -36934 -69555
35193 -69555 15473 223457 404295 424072 299968 161429 125650 193254 244136 183820 94797
35182 94797 144146 329246 457723 428843 375478 440405 572682 667399 754791 891663 988793
35171 988793 931273 795523 769485 895537 1044833 1121273 1152024 1182580 1199899 1173942 1104527
35160 1104527 1025019 992249 1039391 1117917 1149888 1153562 1218842 1334428 1373849 1305680 1262925
35149 1262925 1314620 1328784 1192801 1025722 1006841 1101458 1132682 1056572 1001938 1077187 1272046
35138 1272046 1512598 1698594 1730302 1604744 1444414 1351761 1302055 1248725 1224867 1242855
35128 1242855 1221127 1146345 1183875 1450570 1767911 1833098 1588987 1252637 1013121 869247
35118 869247 749304 630931 528067 474117 519904 659876 785426 799258 736836 685150
35108 685150 635333 522087 362924 247577 218271 249148 305239 340953 291407 151502 19296
35097 19296 -10990 48443 131109 196627 215698 172195 124307 145717 167084 34887 -212752
35086 -212752 -323806 -189153 -20199 -26912 -110634 -53082 153997 347832 416895 326028 87374
35075 87374 -131704 -69581 265138 493582 352466 68352 -6760 90930 102784 26218 54844
35064 54844 176761 214113 177103 210664 255536 132861 -79398 -129568 -28559 -24938 -145343
35053 -145343 -151350 5288 78977 -22813 -58074 137152 367935 382615 208792 30682
35043 30682 -67192 -97222 -73960 -31802 -15601 -5912 29800 30580 -57009 -121186 -27134 140914
35031 140914 209287 217164 315474 427509 335950 85679 -45492 5726 15588 -111416 -204326
35020 -204326 -175238 -168044 -257892 -314288 -269061 -229769 -230209 -152212 16340 125489 135899 162377
35008 162377 200687 132536 42255 155414 391409 382507 51042 -251108 -322605 -385686 -576439
34997 -576439 -622418 -330240 6135 39974 -103644 -90313 104393 285785 426261 617465
34987 617465 800085 844713 785563 749013 775405 864717 1012893 1076129 857292 468944 293463
34976 293463 407697 424358 148531 -31474 228092 600465 558216 168456 -91458 -94201
34966 -94201 -101851 -172170 -69968 232039 436565 374413 206957 114729 91770 98853 152059
34955 152059 218104 243917 291679 435585 563515 515116 375758 378924 534118 604077 462899
34944 462899 251177 151132 199094 340985 507390 613627 612114 545171 463395 350540
34934 350540 213639 141490 161834 161205 71779 3841 58724 162474 233653 343041 528014
34923 528014 627120 513111 332011 287233 333094 310132 239183 236610 265416 219876 149823
34912 149823 161797 198434 148969 82137 137775 269513 312173 234957 145108 124828 219452
34901 219452 464600 764732 888747 756300 580637 570227 662669 706370 689861 618236
34891 618236 412715 145095 110053 413563 738746 780767 658766 626052 654382 622770
34881 622770 639122 810080 935259 806450 595361 577832 686979 708091 697874 824831
34871 824831 998337 1039146 1018544 1061884 1042042 843274 674358 716667 734867 475249 165419
34860 165419 137399 240516 155222 12548 123611 338907 288290 53372 -14882 45731
34850 45731 -32396 -117422 119295 522133 657805 573050 647581 817735 699318 405878
34840 405878 457982 888004 1214339 1325846 1588069 1989796 2003982 1483000 944987 749091
34830 749091 661397 445080 231043 99778 -79870 -208728 28553 532653 785448 639427
34820 639427 498562 571853 596852 463588 438915 573400 544221 295303 190317 335628
34810 335628 402629 302505 353631 591048 629844 433297 475144 879969 1146039 1012799
34800 1012799 865700 968926 1038342 916527 933824 1225019 1397490 1254618 1151682 1267570
34790 1267570 1240727 916169 729846 929199 1111756 964074 773233 783301 729842 442441
34780 442441 241495 323007 402474 334022 398245 646653 703749 538577 624597 1008263 1100106
34769 1100106 750320 591488 910287 1166719 1073107 1098625 1402197 1377195 849574 598189
34759 598189 1019808 1419405 1339318 1394024 1964992 2289291 1804901 1241681 1348571 1642584
34749 1642584 1474996 1245683 1461222 1663325 1423365 1335737 1871037 2317425 2039553 1692257
34739 1692257 1978895 2349145 2185861 2081818 2598411 3000278 2648097 2364713 2904792
34730 2904792 3408407 3008023 2583244 3140937 3861868 3678465 3371527 4036794 4904173
34721 4904173 4888400 4852000 5964843 7290710 7524863 7618278 8991222 10729351 11447709
34712 11447709 12246785 14663849 17517968 19282355 21601033 26523698 32433735 37237741
34704 37237741 43234396 53600916 66711055 80175987 97488012 123097797 155265969
34697 155265969 195361063 259714589 361575128 474856121 536171319 501444733 393106091
34690 393106091 276831457 197663024 153268017 122550713 97149942 79216332 66805187
34683 66805187 55028979 44306788 37652568 33655413 28863870 23770596 20809592 19210691
34675 19210691 16705872 13940226 12820765 12519212 11044109 9002406 8207570 8147600 7186165
34666 7186165 5831149 5613637 5975576 5327023 4124785 3974208 4559261 4269600 3185054
34657 3185054 2773682 3130119 3010286 2266895 1943614 2168690 2057883 1555913 1453793
34648 1453793 1706785 1510827 931795 805031 1134036 1143152 794299 767517 1060387 1031735
34638 1031735 718072 737963 1009281 894992 508460 558776 987248 1051859 714691 667917
34628 667917 973690 927372 372411 -5814 148885 431008 550594 692772 872735 806779
34618 806779 542126 433081 447435 250951 -37659 46922 472245 722556 632063 490632
34608 490632 391456 195847 54594 230118 493529 420882 167403 212467 483038 506702
34598 506702 296220 272594 419562 335504 44100 -61300 -7592 -159361 -416246 -325557
34588 -325557 48602 201899 99484 164669 383999 301603 -69408 -207754 -14151 87836
34578 87836 47090 276301 725192 785406 335932 4901 124841 265895 108841 -29611
34568 -29611 105045 236306 167331 178078 437056 648360 643464 721431 1055419 1347878 1408911
34557 1408911 1487588 1685703 1637277 1157762 661134 534134 598457 562930 501483 505040 371492
34546 371492 58179 -38143 305227 676239 622798 313784 168892 200626 182206 147967
34536 147967 256828 399969 373985 257882 255252 340276 378594 414427 535895 627110 533612
34525 533612 328867 190910 161526 197305 279646 335405 261109 140885 189456 384308 464024
34514 464024 392331 447556 700970 818990 603450 325897 262398 284388 206878 164285 299380
34503 299380 421409 339360 232498 317331 423285 287140 30556 -45730 54230 113028
34493 113028 92064 71401 -27998 -287522 -496323 -387508 -76828 74372 -37792 -200209
34483 -200209 -250988 -206958 -82387 130210 326378 381982 348380 349503 349998 243322 103666
34472 103666 116369 287058 424154 398467 263099 145829 152804 321907 546062 612091
34462 612091 433750 168557 4850 -56257 -99943 -114449 -47600 67234 173613 277642
34452 277642 366157 365140 283856 257622 334835 371575 256538 87983 8026 18767 78296
34441 78296 204104 352035 372730 234005 121381 181926 333538 446928 526648 588043
34431 588043 564447 473699 458115 518476 449910 198826 15537 57932 121484 1849 -144987
34420 -144987 -88143 73695 104647 29111 21781 68165 44322 -8910 14250 50564 19362
34409 19362 57650 298558 553543 538453 308352 154214 167902 225236 304131 479016 655126
34398 655126 641912 473890 362703 346736 270041 99063 -9513 36460 168769 300053
34388 300053 355973 228139 -76486 -312606 -271620 -102312 -89277 -197424 -153712 69137
34378 69137 199288 107869 -29042 -68655 -97357 -193109 -253271 -185099 -80193 -87984 -233308
34367 -233308 -407676 -447098 -242196 107552 309562 201480 -16832 -49842 94066 188879
34357 188879 177652 201796 302968 381624 430151 526280 596376 465245 167893 -46625 -58785
34346 -58785 6254 29913 37081 60028 86269 157619 311895 435715 397263 298096 345551
34335 345551 505526 553436 438560 297354 137628 -135433 -376054 -283984 86338 299338
34325 299338 155694 -46096 -42739 -14244 -192141 -390881 -280003 78106 302266 209371
34315 209371 -13924 -107421 5046 227405 402810 421637 305745 163847 50704 -37656
34305 -37656 -36278 149683 438182 590136 511725 362169 285625 228862 125299 63021 130925
34294 130925 256510 328523 341022 304835 169474 -46834 -198507 -206664 -171856 -182175 -162235
34283 -162235 -34708 122524 213650 273374 347090 372562 321270 308913 413136 521749 517424
34272 517424 470695 480028 463039 308246 121085 101038 242193 359314 374124 397269 544079
34261 544079 811351 1113644 1328006 1352693 1235873 1179345 1291752 1419743 1369981 1211941
34251 1211941 1171007 1273903 1317546 1198894 1069181 1091690 1207589 1247838 1178615 1122501
34241 1122501 1170577 1264764 1283878 1200866 1115814 1132164 1233165 1307318 1273945 1151675 1028562
34230 1028562 1001019 1101794 1239940 1273938 1216097 1275778 1576783 1923453 2027115 1891793
34220 1891793 1744156 1628531 1375279 1005377 825319 964791 1114417 954448 622168
34211 622168 487998 618722 738095 640462 392893 161184 53630 127001 349125 530688
34201 530688 449817 91460 -321046 -539819 -481024 -242460 -11903 81979 94273 184989
34191 184989 365934 434167 250929 -31577 -161635 -111586 -48998 -54141 -45484 39421 156920
34180 156920 257659 336603 368966 312122 187762 66880 -36259 -169186 -334652 -459791
34170 -459791 -485305 -426286 -337784 -262322 -206057 -136250 -18332 131530 270691 409464 591208
34159 591208 779068 863835 820778 747479 696835 601722 440671 339662 395595 516026 558629
34148 558629 524422 484487 423788 308825 215431 220343 237440 139117 -3928 19487 272597
34137 272597 582573 735241 647738 382628 110697 18276 121500 211326 110707 -71372
34127 -71372 -99443 30666 94482 -11218 -137937 -154293 -145885 -240475 -382253 -419227 -337420
34116 -337420 -274243 -312380 -360826 -275566 -53435 147347 193249 138744 144009 245208 298042
34105 298042 179400 -42928 -203185 -238174 -232170 -301260 -473788 -648329 -660268 -455034
34095 -455034 -194305 -92669 -147595 -161702 -45274 70329 65521 -3506 -46632 -57959 -4414
34084 -4414 191666 435237 453205 182505 -56949 5045 191007 167770 -55462 -226751
34074 -226751 -291622 -381646 -458825 -345237 -89936 41001 -32503 -119969 -108474 -90574 -100707
34063 -100707 -37788 67069 11979 -221534 -353735 -203425 38492 104064 15345 -22644
34053 -22644 71179 236610 430832 622785 713175 618873 395395 172966 19872 -59634
34043 -59634 -65462 -21551 2428 -40609 -122486 -185089 -188376 -112155 10603 66398 -30222 -196272
34031 -196272 -254317 -144551 50248 265759 479732 580192 414679 34026 -286375 -350537
34021 -350537 -226816 -72232 61136 159913 158924 45274 -67947 -88915 -65522 -55933 5043
34010 5043 185510 393959 474255 411981 327646 295416 274411 216616 164317 215567 409074
33999 409074 645396 745312 628597 413374 277026 245307 205443 107103 36508 76974 196164
33988 196164 301669 338424 316773 297119 334112 390592 361427 244325 189356 271716 333910
33977 333910 218804 47039 45104 187244 273155 311653 521091 926634 1259023 1339111
33967 1339111 1304449 1348351 1458537 1523866 1501095 1371468 1112037 803346 604417 558886
33957 558886 586181 672530 847327 965657 813023 489703 369242 557708 719874 604026
33947 604026 404854 376321 399330 239906 -4354 -54003 106013 240027 230230 166990 133598
33936 133598 121338 113865 94275 29855 -40806 -20868 53751 19243 -105907 -56780 252178
33925 252178 493351 369564 65504 -35085 111078 268197 356860 475165 589557 557685
33915 557685 416374 336490 320774 229753 75533 10421 44921 46380 5227 43190 158568
33904 158568 204864 127630 13847 -74280 -118763 -60205 86005 107380 -150706 -473505 -503892
33893 -503892 -233814 22666 101455 107505 80882 -91241 -369200 -504460 -399599 -249362
33883 -249362 -220597 -246185 -236313 -245152 -308776 -335535 -275448 -211198 -182679 -98059 94710 313076
33871 313076 483031 614264 684121 617204 425935 211068 2344 -235254 -448872 -548256
33861 -548256 -582313 -638436 -609406 -343831 2483 107111 -14088 -17472 192654 303714
33851 303714 140023 -38318 16005 164220 202607 210370 289253 270867 18081 -239064 -221329
33840 -221329 -51462 -37606 -174260 -218928 -141250 -128573 -210447 -226665 -151951 -135274 -197348
33829 -197348 -169028 21494 227672 299240 238255 118359 13067 10033 133140 245342
33819 245342 181642 -23785 -187954 -235682 -242978 -237590 -139657 66390 252319 288902 170105
33808 170105 -19136 -166178 -173312 -46947 63352 23461 -98944 -120907 -7777 77009
33798 77009 3425 -157247 -236114 -160759 -5830 109595 148706 176728 234318 227636 53988
33787 53988 -164393 -152537 124912 331485 188030 -118757 -185037 46714 234854 136918
33777 136918 -87462 -133682 72218 337362 421582 236186 -85035 -282919 -217950 -16156
33767 -16156 105346 104856 77803 16365 -179077 -438810 -506272 -274847 46441 229454 326300
33756 326300 503619 698057 661327 338792 4623 -57877 112368 245035 190584 57038
33746 57038 6073 52858 138984 285293 521552 716408 671978 423887 262280 354700 506462
33735 506462 439796 181463 -12222 -30345 3467 -16356 -52614 -74493 -127612 -187140 -120085
33724 -120085 95459 249313 132695 -186079 -443569 -491401 -410446 -344140 -341001 -379536 -442062
33713 -442062 -501711 -500250 -418496 -345625 -394787 -536141 -593363 -454711 -224508 -95676 -123493
33702 -123493 -214419 -293439 -357964 -380992 -308233 -181526 -125802 -159946 -156611 -63718 -24972
33691 -24972 -164427 -365666 -406767 -245759 -45106 35373 -39412 -204563 -326641 -265865
33681 -265865 -28026 187265 199377 60183 -49277 -62479 -29141 55998 238673 435114
33671 435114 466014 299338 109823 44661 51667 -4043 -152911 -307445 -359165 -242000 34702
33660 34702 364222 587440 596702 402040 123745 -63873 -47286 103630 179722 68508
33650 68508 -112195 -193091 -185298 -215724 -299239 -327763 -257810 -159132 -82771 -20011 6711 -47947
33638 -47947 -137398 -146053 -50845 53032 99386 105687 72942 -33253 -174497 -248596 -252405 -305521
33626 -305521 -446019 -520611 -373159 -69878 153966 142003 -46695 -231543 -298406 -281408
33616 -281408 -260748 -219315 -82104 103778 168330 68824 -7159 82146 195765 132213 -32837
33605 -32837 -60928 83489 238773 353435 487368 530294 275710 -152413 -305046 -10276
33595 -10276 336935 317010 65883 32193 329904 643341 704001 574850 446714 375333
33585 375333 288505 124983 -94118 -279124 -349113 -324151 -303280 -323365 -311641 -217952 -98399
33574 -98399 -8551 77392 159858 143451 -12385 -171511 -181947 -84823 -32845 -63465 -88200
33563 -88200 -60101 -12144 49997 165820 328099 468433 536904 531294 467796 380409 308798
33552 308798 229365 65976 -151202 -223702 -14564 306679 399254 140549 -234775 -406566
33542 -406566 -290803 -67281 39136 -30431 -140557 -124970 20405 138363 115293 19517
33532 19517 -10808 49457 113939 117387 64296 -23348 -129511 -230862 -316388 -399487 -468334
33521 -468334 -462087 -345517 -171603 -27828 42805 45285 20187 44717 149786 210132 55586
33510 55586 -243817 -371438 -170589 102578 118951 -62219 -110563 75592 261233 262646
33500 262646 168419 103968 23348 -131777 -257594 -237944 -142578 -117040 -163127 -181756 -169956
33489 -169956 -213970 -312704 -369285 -376444 -460014 -665803 -812105 -666167 -233022 220248 424905
33478 424905 333576 94323 -115705 -205456 -189467 -146092 -127613 -91532 27977 165287 139540
33467 139540 -102244 -354295 -385166 -235345 -137472 -183303 -244146 -220946 -187234 -231784 -319077
33456 -319077 -378750 -399630 -365367 -229576 -34361 73006 29444 -51661 -57090 -23419 -30415
33445 -30415 -75140 -141737 -258698 -386738 -400331 -301905 -295193 -494256 -715578 -739916 -632813
33434 -632813 -591899 -606660 -520255 -340237 -223351 -196970 -151393 -85292 -102022 -162458 -104552
33423 -104552 55002 95199 -56362 -174622 -50906 226753 419024 418431 294952 184769
33413 184769 207839 375676 522842 455544 211789 24959 -17065 -87964 -302854 -475620
33403 -475620 -366580 -45178 185338 169474 38021 -22705 3406 4018 -84193 -204474 -273418
33392 -273418 -299095 -355755 -439063 -436528 -313074 -233232 -356331 -562853 -566783 -301429 -6049
33381 -6049 110298 101327 103388 110748 63841 17098 55932 130192 119853 21777 -49656 -16673
33369 -16673 102056 247539 346740 322613 172964 14505 -35880 -721 17259 6855 60130
33358 60130 205700 324453 280441 88995 -95270 -145847 -80612 1311 69743 204579 473513
33347 473513 807137 1036184 1050731 913264 830048 999671 1430224 1891043 2111613 2051069
33337 2051069 1898826 1806440 1753432 1714232 1765021 1901364 1937793 1779815 1630156 1680426
33327 1680426 1745082 1521822 1129388 1006541 1261855 1508956 1452299 1273928 1256380 1343943
33317 1343943 1333840 1258028 1284945 1399638 1460139 1473817 1559457 1684616 1670325 1449546 1145068
33306 1145068 895843 744725 676270 634071 524781 329551 185609 233946 407208 491796
33296 491796 393111 225746 136558 141976 164445 153203 132392 160491 257549 368605 414730
33285 414730 380821 321537 285443 278096 288544 294468 259366 192218 175491 246425 302008 241726
33273 241726 143724 140098 181751 137403 72482 155193 293592 192782 -155824 -378235 -255621
33262 -255621 -44651 -61164 -228098 -285745 -212891 -157102 -123596 -17634 120141 169559 134336
33251 134336 90015 29104 -62632 -89750 21849 194126 339262 483335 618296 629707
33241 629707 525007 513909 702788 959098 1230856 1676864 2297091 2837006 3295733 4035343
33231 4035343 5087352 6038041 7140610 9659037 13953753 17760996 17928833 14041604
33223 14041604 9042093 5884386 4756363 4142427 3327945 2713146 2454784 2152505 1720066
33214 1720066 1522553 1593836 1507743 1127692 829318 835907 882506 720732 510494 504386 673315
33203 673315 830607 889830 862384 779829 705310 682696 653153 554685 462053 462426 465690 348297
33191 348297 211753 248469 399051 411836 228665 48385 5526 47296 140899 325987
33181 325987 512468 495856 263076 54705 36686 125086 218927 373894 617853 803113
33171 803113 806251 720360 691029 690271 616318 517082 535009 669412 750265 659446 470226 337081
33159 337081 315434 334594 321086 290208 283191 260986 158379 46145 101320 342305 530068
33148 530068 465311 269552 197409 261456 264399 161618 140748 308027 525174 637504 666810
33137 666810 673790 604508 412443 206604 131551 174123 210847 195663 197116 280317 428281
33126 428281 556130 559021 392369 149998 9024 43636 138501 134757 14736 -113359 -177298
33115 -177298 -222893 -333905 -503286 -603898 -508688 -247706 1162 115655 161689 249992
33105 249992 329407 250726 7695 -227507 -317275 -281530 -201548 -137931 -161936 -317148 -505230
33094 -505230 -554715 -458486 -395238 -450762 -485731 -383832 -262253 -277004 -349281 -278205 -58732
33083 -58732 94605 20599 -232753 -504490 -648657 -594398 -407133 -272050 -298804 -372436
33073 -372436 -328218 -231380 -299023 -538901 -673967 -511173 -217030 -96733 -209782 -342172
33063 -342172 -295250 -72071 190757 354897 344011 178570 -21757 -126776 -106895 -26771
33053 -26771 54052 115863 122794 12559 -218482 -459859 -554668 -421047 -118390 174303 263860
33042 263860 97239 -166861 -293252 -202298 -23920 83545 86896 23800 -94083 -240149
33032 -240149 -331611 -352781 -445899 -718667 -998089 -967868 -577370 -134472 68282 45486
33022 45486 -49381 -190893 -411007 -603937 -625207 -533694 -527762 -640917 -686456 -542482 -333783
33011 -333783 -258647 -343267 -440465 -407550 -241755 -90482 -139861 -424821 -740112 -819365 -620432
33000 -620432 -358522 -248711 -309012 -436814 -565813 -680361 -752568 -744051 -644747 -480530
32990 -480530 -314923 -238297 -282642 -342507 -274748 -99180 4640 -58702 -172754 -194511 -160525
32979 -160525 -205850 -352245 -487882 -517760 -442228 -317967 -220750 -214766 -286031 -342618 -345914
32968 -345914 -379003 -492116 -552687 -397412 -107599 32149 -121528 -409714 -599127 -628358
32958 -628358 -554059 -401590 -205927 -92978 -142466 -216781 -109892 137169 261985 163036
32948 163036 48800 90225 123561 -89064 -435585 -571256 -434863 -354851 -557108 -822081
32938 -822081 -797847 -472464 -136021 13452 23495 4921 -15946 -66269 -174981 -339813
32928 -339813 -464195 -400182 -162215 8663 -46869 -144715 -19982 240268 305470 109160
32918 109160 -66658 -56071 -36940 -173189 -323973 -300730 -181507 -148323 -183859 -152903 -59755
32907 -59755 -13470 -29942 -57154 -111915 -208976 -231828 -61560 214552 384046 351650 168995
32896 168995 -94616 -358477 -499303 -493009 -511469 -695887 -913511 -940084 -806277 -735167
32886 -735167 -797029 -875296 -931867 -1029974 -1103789 -1003167 -808489 -809744 -1090629 -1402203 -1544578
32875 -1544578 -1607250 -1724132 -1882481 -2127289 -2637455 -3344907 -3749507 -3453650 -2721404 -2167105
32865 -2167105 -1983710 -1822302 -1401962 -881126 -548840 -444424 -429421 -435048 -477795 -539586
32855 -539586 -555801 -471806 -266043 11270 209153 199311 62435 30020 188237 359339
32845 359339 345929 175753 13207 -65076 -88231 -64319 27435 147300 212814 196495 118574
32834 118574 -31214 -257292 -454233 -462951 -263701 -15028 137708 196490 207045 141277
32824 141277 -5294 -85862 60348 345605 466701 263593 -70092 -223212 -128378 21657
32814 21657 61247 18296 -5278 13892 44131 84922 152612 223889 259528 265913 286036 339814
32802 339814 402355 425580 363505 209322 33979 -53744 -27171 17522 -9497 -67817 -70092
32791 -70092 -53211 -147391 -354520 -475794 -342767 -54391 113065 15433 -217322 -346973
32781 -346973 -264160 -45191 159115 244308 198890 84399 -30793 -142304 -306022 -539272
32771 -539272 -739203 -744442 -497566 -124632 168615 275475 255353 232742 248301 223822 79368
32760 79368 -130072 -232954 -121406 112972 267250 238970 96390 -53894 -178440 -257054
32750 -257054 -213186 -19777 168573 134410 -119803 -328528 -276519 -65236 32142 -82501
32740 -82501 -255605 -323987 -283516 -185011 -14079 218385 370395 305471 101302 -24368
32730 -24368 -299 32542 -20824 -46536 75059 234237 228260 72293 -8172 101112 256306
32719 256306 277002 169959 51853 -35770 -130971 -244466 -344763 -402390 -376434 -218888
32709 -218888 22533 169165 91989 -101513 -165341 12252 316765 556633 604590 427031
32699 427031 113011 -120571 -95921 110675 242124 194011 139326 241364 386386 355157
32689 355157 173512 96996 240720 399338 316547 19578 -229501 -266268 -186925 -166622
32679 -166622 -219225 -211694 -68936 129059 259963 287305 239931 135163 -8526 -125896
32669 -125896 -156103 -128761 -125510 -158566 -163753 -123566 -113532 -186947 -278022 -274596 -153945 -4561
32657 -4561 64703 9084 -132427 -273036 -351367 -386457 -440681 -520678 -547370 -439562 -199844
32646 -199844 90616 328058 431172 380967 244047 123986 68806 51911 42334 39155 26891
32635 26891 -28265 -97168 -74655 79739 233853 206373 -4573 -192906 -170219 30500 211918
32624 211918 239028 155236 75425 34126 -602 -4908 100136 303101 464267 488537 443575
32613 443575 419456 370824 229591 86339 80408 160148 155836 70681 71580 179628 230033 200156
32601 200156 288604 532095 633106 390467 53139 -33600 69696 73725 -20435 35578 249421
32590 249421 352021 272361 262261 456407 660121 707556 696172 686793 496704 49648 -333864
32579 -333864 -308736 3653 196768 127736 -7995 -56658 -53251 -29575 25910 16957 -162106
32568 -162106 -346219 -216815 207011 475808 271645 -162243 -354366 -195888 35090 131887
32558 131887 172760 270564 345774 264179 77835 -5968 122379 343549 461552 437819 407998
32547 407998 466749 525323 454241 300667 237706 311192 381102 351093 311002 361851 420305
32536 420305 330142 101497 -93307 -133993 -52587 55245 109658 53697 -105335 -258647
32526 -258647 -303410 -293778 -379522 -579279 -726804 -680604 -485341 -274288 -105061 40779
32516 40779 170235 267257 322903 321739 242086 110975 1703 -67459 -163594 -308413 -385756
32505 -385756 -262863 34067 333214 476449 427095 281444 220827 365828 605763 670608
32495 670608 469344 245227 256792 420545 468941 372508 343726 447040 496928 392652
32485 392652 261435 159017 -71119 -440268 -590315 -231708 362748 636748 451361 187482
32475 187482 166370 297149 366406 370837 406415 452612 449633 438766 460298 435336 313308
32464 313308 233022 356903 606678 737357 647225 462453 331687 287653 312798 389452
32454 389452 451425 418154 330299 347631 558177 869988 1124886 1229423 1152403 924470
32444 924470 702870 697587 921107 1123824 1107967 998834 1037824 1199405 1238511 1084843
32434 1084843 937626 932742 968057 954533 992335 1133431 1193137 1029846 838346 882691 1052593
32423 1052593 1009787 735214 579857 716231 877777 788959 562287 455649 463941 408646
32413 408646 281070 225813 256708 236765 122476 25642 31335 115555 230852 323419 296091
32402 296091 125241 -8131 105562 393555 558370 469725 297268 198477 88789 -154119
32392 -154119 -427851 -516746 -381952 -198419 -138824 -214985 -303049 -260891 -56296 173876
32382 173876 232604 60475 -223765 -480775 -654895 -712181 -617511 -445241 -384820 -528534
32372 -528534 -745282 -866895 -907794 -980888 -1079686 -1094471 -1005233 -912385 -878645 -860723 -807493
32361 -807493 -724913 -627427 -509139 -384324 -295628 -270861 -315743 -435009 -603246 -732598
32351 -732598 -739829 -643087 -534004 -461978 -403832 -335206 -266513 -213132 -190782 -232816 -347063
32340 -347063 -459801 -473410 -388876 -306547 -287645 -273116 -172162 3811 130979 97176 -71918
32329 -71918 -228497 -272924 -288070 -427959 -665071 -764452 -583229 -294204 -192275 -343160
32319 -343160 -554728 -650515 -620643 -517100 -366149 -223708 -180455 -248240 -335096 -373192 -374678
32308 -374678 -329422 -173064 71979 236126 186643 3604 -120560 -106705 -32854 -235
32298 -235 -42479 -141841 -260390 -365436 -469383 -616393 -790183 -883115 -812054 -619775 -408094
32287 -408094 -231697 -128429 -174665 -383878 -589614 -574746 -327879 -51428 95866 132043
32277 132043 102935 -33245 -273134 -457843 -450200 -347589 -353419 -468095 -485119 -318706 -161414
32266 -161414 -222752 -435864 -551083 -453429 -259326 -125668 -87032 -95071 -115107 -137454 -152637
32255 -152637 -155796 -145397 -105568 -26380 56852 93012 86078 79646 66609 -14108 -171050 -325987
32243 -325987 -421185 -486436 -549550 -553969 -442314 -274939 -182789 -216990 -302922 -330180 -245518
32232 -245518 -79582 75003 131443 87331 12398 -55265 -146984 -277386 -399783 -489065 -576219
32221 -576219 -636925 -555653 -307854 -80816 -74479 -252255 -430540 -536665 -599138 -553310 -303580
32210 -303580 14570 89054 -169188 -491142 -619357 -618109 -677660 -787636 -795179 -672682 -527101
32199 -527101 -396744 -218315 15394 206722 266174 174765 -48957 -345195 -595789 -710463
32189 -710463 -720889 -711029 -688443 -618036 -538538 -518885 -522726 -460154 -376384 -429545 -634062 -781620
32177 -781620 -716008 -561291 -534021 -604835 -528205 -219082 76086 88792 -105683 -195995 -77520
32166 -77520 6254 -162264 -436024 -512883 -378607 -305501 -423377 -549594 -527047 -483587 -578951
32155 -578951 -689519 -595435 -371973 -311867 -470329 -556722 -350822 -7197 177667 141410
32145 141410 50600 18373 -11499 -112701 -228267 -221739 -46896 167079 231798 112692 -27536
32134 -27536 -45596 -3297 -35178 -105892 -74461 25491 -5390 -188534 -266083 -85041 118812
32123 118812 37950 -242800 -364486 -222452 -88600 -157839 -240990 -65240 301602 532233
32113 532233 463388 241961 63177 -49989 -148015 -187640 -94811 65415 118085 -4576
32103 -4576 -171319 -226913 -194298 -228171 -391991 -562551 -578277 -426409 -239545 -134997 -112895
32092 -112895 -120776 -165243 -298889 -496529 -616201 -548013 -371617 -279433 -337295 -414231 -382785
32081 -382785 -282522 -207114 -132783 7319 143687 135094 4301 -61182 19660 107693 68405
32070 68405 -39607 -104369 -156511 -281017 -422602 -446874 -363722 -329872 -411392 -473003 -352787
32059 -352787 -63328 229112 372796 340810 210571 70548 -51107 -163353 -231737 -184463
32049 -184463 -38930 44879 -72294 -317698 -469783 -412792 -250298 -159199 -205499 -318512
32039 -318512 -375111 -284581 -56363 175242 236658 67862 -221106 -456201 -545040 -521729
32029 -521729 -478822 -464071 -435823 -332208 -182477 -96624 -119657 -167935 -166130 -167458 -245107
32018 -245107 -336139 -319892 -203880 -91060 2825 135965 258930 234850 70739 -54062
32008 -54062 -44930 435 7176 49592 156259 186982 60435 -69073 -51835 -10594 -144160
31997 -144160 -375402 -450393 -335659 -257350 -335277 -409068 -284003 22603 330038 458657
31987 458657 340146 106242 49601 318939 666671 708262 430945 195191 200343 247834
31977 247834 143133 17255 36278 61675 -107863 -345184 -371788 -216961 -165826 -288636
31967 -288636 -356995 -264520 -211792 -355134 -535930 -531721 -382194 -270823 -218864 -113788 21908
31956 21908 12884 -188843 -379972 -355394 -179902 -93977 -188242 -302861 -280386 -190451 -193395
31945 -193395 -267044 -242289 -94816 1131 -29642 -16316 172433 374746 364034 197425 100062
31934 100062 91105 -1464 -182227 -241733 -120735 -44792 -178519 -373534 -405781 -279030 -142640
31923 -142640 -69421 -70904 -184433 -371591 -451468 -309908 -74224 81177 183091 323516
31913 323516 400952 253507 -15957 -130326 -60496 -86637 -371606 -712440 -826112 -686690
31903 -686690 -453299 -235126 -80063 -59131 -180842 -292618 -228421 -20899 161948 255141
31893 255141 334676 430662 446190 299025 40510 -209594 -365727 -379452 -238361 -41045
31883 -41045 661 -245237 -642521 -895991 -874008 -729159 -653183 -620768 -489273 -276870
31873 -276870 -164694 -211162 -244582 -131091 -2830 -68464 -283040 -385290 -248123 -27597
31863 -27597 68137 17676 -68916 -129770 -178447 -212851 -197230 -132708 -85185 -120557 -223137
31852 -223137 -291045 -235932 -100206 -35792 -125016 -264339 -293189 -201829 -119585 -120399 -157118
31841 -157118 -192633 -262760 -360373 -375125 -228964 6024 191545 254853 186841 6688 -190421
31830 -190421 -245683 -112196 44328 36879 -98446 -169353 -99090 6268 47381 39300 7429
31819 7429 -79799 -213743 -301187 -299105 -295663 -357176 -375511 -203402 89178 243928 137644
31808 137644 -45736 -54277 101915 185726 74001 -87411 -128328 -119816 -250303 -495476 -595845
31797 -595845 -402722 -93526 49919 -33708 -191566 -292622 -313135 -246908 -104146 2070
31787 2070 -63000 -243979 -311866 -162165 35399 78672 2120 -27468 12059 4315 -49648
31776 -49648 28940 336178 691522 805108 591062 240780 2225 -58761 -66812 -132338 -179275
31765 -179275 -33983 302701 567029 512978 221855 -7113 -49623 -59340 -150630 -198520 -88932
31754 -88932 21220 -81220 -294661 -305158 -46731 185969 137545 -107787 -313544 -391326
31744 -391326 -394418 -369143 -356203 -419571 -530191 -527168 -345080 -174595 -213973 -345352 -282015
31733 -282015 -7589 172978 62817 -162740 -216330 -51836 163608 300820 348085 311262
31723 311262 174794 -40739 -261169 -404683 -421549 -321411 -188124 -126727 -168630 -262610
31713 -262610 -354749 -406103 -337104 -79175 265170 433089 273981 -60518 -291354 -311822
31703 -311822 -216813 -104415 9725 97514 83575 -44417 -177003 -195174 -107864 -41345 -101682
31692 -101682 -257155 -355201 -272467 -56007 119598 155294 136446 193022 302005 310019 138978
31681 138978 -110279 -275133 -291134 -205468 -77343 77189 234740 306989 198958 -53831
31671 -53831 -262612 -262669 -86791 102721 219326 290073 313274 225807 46737 -90036 -120141
31660 -120141 -141246 -234711 -319832 -300275 -240192 -251441 -299698 -283973 -233524 -244126 -268295
31649 -268295 -170667 15850 91947 -17028 -156180 -185062 -157692 -178419 -231649 -264632 -319238
31638 -319238 -456017 -625391 -731123 -770556 -805235 -822308 -726630 -479317 -182437 -4739
31628 -4739 -34923 -202435 -346938 -387878 -403305 -492945 -600711 -574711 -399629 -245041 -240964
31617 -240964 -316928 -328861 -248638 -147925 -76979 -52707 -104745 -234011 -359531 -389848 -324796
31606 -324796 -225796 -123462 -21034 52681 72753 69333 70415 20716 -152619 -398994 -554015
31595 -554015 -510813 -330873 -169762 -118598 -110142 33720 414651 880046 1104263 933092
31585 933092 587472 405395 425966 396004 193796 37505 159107 438536 560105 460297
31575 460297 396056 540699 719119 668861 428160 285938 387353 564429 591898 467096
31565 467096 352888 344345 402604 463822 493602 445328 275786 28666 -175149 -260101 -250786
31554 -250786 -187790 -60433 136474 335416 439954 414958 309879 222351 251079 431450
31544 431450 679697 837349 807509 624199 377734 129643 -67329 -138392 -54768 99666
31534 99666 204186 231573 241534 259229 236174 143365 35939 -10275 10814 41024 35746 13505
31522 13505 29413 98797 144545 49933 -197527 -435015 -460467 -249802 17654 161415 151842
31511 151842 30633 -207074 -535072 -773792 -726653 -462013 -293743 -399710 -597451 -613471
31501 -613471 -451054 -328489 -340707 -382079 -369191 -328935 -258233 -113800 9811 -88390 -409748
31490 -409748 -680303 -704878 -612650 -608159 -666582 -662015 -625657 -646694 -652392 -541144 -436031
31479 -436031 -538529 -791487 -951735 -950532 -906965 -822898 -584048 -281457 -199439 -394701
31469 -394701 -581370 -548969 -425306 -394746 -414094 -364771 -257557 -125623 71991 281745
31459 281745 307964 109565 -62561 -10315 128832 133129 22073 -81007 -198315 -360644
31449 -360644 -422875 -303334 -232781 -446577 -766584 -827334 -617787 -447686 -441981 -438557 -372637
31438 -372637 -386045 -504016 -549864 -471419 -440525 -519232 -524061 -363613 -235437 -300174 -385227
31427 -385227 -232152 108972 343133 312228 145431 55741 96888 124167 -34493 -352763
31417 -352763 -586569 -554199 -376813 -308540 -386103 -437259 -407534 -438761 -582126 -665677 -546322
31406 -546322 -314158 -145102 -92311 -101266 -100750 -25073 123598 215650 153074 77908 205111
31395 205111 447855 488881 271420 98520 135155 155520 -29448 -236901 -270930 -300665
31385 -300665 -532160 -758876 -654988 -353426 -287129 -519045 -666145 -508793 -263743 -157290
31375 -157290 -99740 50538 202119 211403 122552 29764 -115204 -355544 -540618 -507496 -357648
31364 -357648 -331041 -444803 -469031 -274171 -10954 115589 89340 308 -145550 -373168
31354 -373168 -562870 -524417 -274376 -68343 -74857 -167297 -163034 -123381 -219004 -396780 -437266
31343 -437266 -323343 -277702 -382618 -436442 -307894 -174994 -224256 -330068 -273064 -115670
31333 -115670 -87949 -196933 -233059 -135411 -79537 -169798 -277084 -255187 -136952 -31166 34874
31322 34874 84999 112919 111731 113532 136775 138956 61736 -99073 -271096 -334661 -214617 12249
31310 12249 155270 119400 18206 7255 85146 156408 194068 196496 73821 -226066 -525879
31299 -525879 -575896 -409404 -321393 -443069 -553393 -418833 -136722 10986 -76807 -261278
31289 -261278 -398481 -472786 -508676 -489376 -412053 -345811 -366681 -453374 -503981 -470597 -424860
31278 -424860 -442710 -476616 -437277 -367133 -386130 -460669 -419020 -265936 -263328 -539504 -818233
31267 -818233 -775830 -522686 -437177 -593690 -674733 -466087 -141658 23934 -20809 -169167
31257 -169167 -335046 -452325 -461359 -395356 -342698 -272685 -79191 145764 115447 -241655 -584276
31246 -584276 -554832 -221103 63019 108917 3032 -139795 -305618 -478473 -592888 -619448
31236 -619448 -582696 -483828 -303878 -90158 51679 75166 44397 50029 108168 152005 108990
31225 108990 -15063 -136229 -188955 -191296 -180080 -139908 -77384 -102359 -296280 -526619 -558181
31214 -558181 -365965 -175653 -155440 -230374 -258984 -224617 -159863 -35135 154038 297325
31204 297325 282279 127220 -64670 -200801 -214943 -114430 -51957 -188343 -417656 -416141
31194 -416141 -76843 286184 316400 40902 -241867 -352325 -321338 -213108 -65739 50553
31184 50553 83238 60768 -6818 -193395 -492158 -705666 -670819 -496499 -404533 -426103 -432975
31173 -432975 -375838 -296759 -186977 -37194 37858 -67916 -249552 -320974 -288559 -288975 -318698
31162 -318698 -258230 -123437 -53484 -71576 -89947 -125407 -259691 -403247 -371662 -207236 -144858
31151 -144858 -228372 -254972 -159201 -139152 -289726 -419255 -398280 -404972 -598946 -788611 -696652
31140 -696652 -400956 -231193 -300291 -391555 -307388 -132173 -101636 -317933 -632978 -784789
31130 -784789 -664627 -447826 -391081 -507277 -563974 -420210 -203861 -93787 -91565 -109265
31120 -109265 -134530 -185536 -223057 -226971 -255067 -324578 -353071 -316531 -327436 -437387 -513060
31109 -513060 -456470 -398739 -493177 -648930 -678648 -601485 -570068 -578767 -495956 -346808 -304341
31098 -304341 -384871 -394217 -237073 -75752 -90929 -234739 -312581 -214408 -10978 105107 -32977
31087 -32977 -385052 -684586 -714350 -572563 -517519 -581678 -549650 -341256 -182214 -287253
31077 -287253 -557554 -730748 -701598 -563913 -437830 -382066 -404745 -457179 -470267 -453175 -470665
31066 -470665 -489629 -401694 -274807 -388151 -855135 -1378862 -1597553 -1545159 -1519559 -1592630
31056 -1592630 -1562748 -1379008 -1278508 -1406857 -1587086 -1623316 -1609131 -1744851 -2012920 -2223829
31046 -2223829 -2256246 -2071811 -1618376 -933364 -261081 149905 320570 421644 453749 297316
31036 297316 47260 -7673 190392 340314 211084 -33574 -108432 -5951 83979 100162
31026 100162 119269 129903 38809 -123935 -216843 -206943 -194287 -208196 -165156 -65754 -49219
31015 -49219 -170490 -275270 -209548 -48789 2726 -114017 -246272 -221624 -31005 183577
31005 183577 277733 228022 124358 58568 45258 56660 82557 109852 90763 5343 -74426
30994 -74426 -66764 -7803 -4314 -63200 -69240 46931 210286 307234 316157 290374 266571 232369
30982 232369 154633 19243 -135407 -229051 -215136 -131646 -46005 13439 28912 -36248 -152562
30971 -152562 -174836 -6653 216889 254027 67233 -124978 -128982 14244 133474 130633 36421
30960 36421 -51933 -52735 22782 76758 63865 74232 185720 309023 321116 274837 286535 284982
30948 284982 114597 -151854 -291007 -317499 -463230 -709565 -709461 -334163 53167 106652
30938 106652 -27331 -34373 37095 -76474 -363082 -569962 -623776 -653359 -646507 -443590 -90262
30927 -90262 125851 65910 -76866 -55136 162305 434291 579732 451774 71190 -297636
30917 -297636 -392276 -280998 -246881 -347492 -338757 -84376 219039 339321 309532 281279 252743
30906 252743 121073 -97415 -263532 -292793 -229716 -168964 -168064 -215964 -253520 -245308 -224031
30895 -224031 -221929 -195596 -100708 -3868 -10483 -108705 -208325 -309509 -484590 -696493 -797440
30884 -797440 -738003 -631754 -570398 -505177 -358060 -137099 97352 276997 312122 146888
30874 146888 -137439 -365770 -432155 -344447 -141318 115104 297162 310747 226313 178254
30864 178254 168311 118487 59441 68183 69395 -62991 -233923 -223095 -50878 41159 2324
30853 2324 48859 253282 382427 276431 90102 819 -43374 -118221 -144322 -93967 -96889
30842 -96889 -147450 -11652 336418 508591 249035 -109526 -120328 96706 98005 -139569
30832 -139569 -229178 -69147 -5161 -215087 -388404 -209832 173088 386732 310806 118856
30822 118856 -13410 -63433 -94701 -149685 -191549 -132858 37945 193245 209436 127076 70557
30811 70557 67089 60694 41156 31057 8970 -34095 -50370 -67095 -222105 -503076 -624044
30800 -624044 -400165 -83889 -31174 -172910 -174020 -17559 -13677 -247671 -451917 -482558 -501539
30789 -501539 -569974 -469222 -109543 239973 340293 292379 253089 147299 -96605 -301314
30779 -301314 -300908 -223641 -258639 -344906 -345740 -334501 -435050 -548507 -515595 -409030 -397195 -444698
30767 -444698 -407236 -298989 -207665 -77445 143073 270158 125655 -90978 -28445 259108
30757 259108 346417 56019 -300974 -387239 -242045 -100748 -59686 -62468 -38053 69434 269033
30746 269033 438320 403936 166470 -87408 -231761 -306318 -346210 -294938 -153678 -39413
30736 -39413 -7483 28070 116552 170231 126836 51921 -17077 -161321 -391350 -529215 -443401
30725 -443401 -279370 -277439 -437885 -536940 -432134 -198664 18783 156553 229976 276473
30715 276473 307486 267793 80759 -209485 -406559 -361465 -152188 27457 103652 140709
30705 140709 176482 177275 142541 121362 113534 71704 16419 26607 86250 72692 -39153 -88569
30693 -88569 48275 244316 269348 101841 -53963 -48711 71509 229631 442646 675971
30683 675971 729812 464670 71022 -100875 16941 148592 100431 14082 61291 111829
30673 111829 -46322 -289619 -269968 64558 345787 264476 -53603 -271137 -258241 -142774
30663 -142774 -76626 -110270 -220216 -323559 -314939 -190219 -72843 -30926 36037 203965 315083
30652 315083 144384 -258528 -575572 -586341 -380393 -176442 -75072 -53728 -86415 -167023
30642 -167023 -263076 -319776 -300150 -202560 -65014 46212 91036 92090 72503 -13399 -202569
30631 -202569 -389449 -385868 -155212 102391 154411 -33387 -305019 -479403 -459904 -259692
30621 -259692 -5478 120156 25550 -190020 -316806 -217020 69043 351693 408844 143367
30611 143367 -309456 -658499 -700422 -487076 -229319 -66238 29601 147537 302475 410635
30601 410635 365662 129776 -227915 -568534 -761079 -742278 -542788 -285211 -118623 -89678
30591 -89678 -87978 17474 198947 305857 272140 183117 121163 66780 165 -22726 25700
30580 25700 71695 56693 19612 -28132 -176270 -427260 -570132 -442497 -219065 -193792 -325625
30569 -325625 -287174 10690 247292 166617 -48542 -83241 35773 46060 -78690 -69828 194709
30558 194709 448634 374228 33870 -204346 -129208 83700 147479 39542 -32476 13017
30548 13017 10652 -142391 -248440 -76848 243860 361019 206104 90885 227071 417082
30538 417082 378997 163206 32428 66421 108999 38030 -105300 -221554 -234811 -105122
30528 -105122 112688 268534 285065 253662 256699 212862 48103 -117152 -157211 -190273 -382140
30517 -382140 -603220 -588937 -386643 -295311 -353678 -263313 88386 395261 392634 230356 172548
30506 172548 207923 211420 245951 403213 528687 425841 217680 194608 372396 496352
30496 496352 444352 335762 249679 124329 -30949 -97983 -92262 -189215 -407651 -501093 -308748
30485 -308748 -25084 50598 -100336 -248280 -239296 -123176 -11234 44975 48763 45776 105011
30474 105011 215099 216313 -47638 -487656 -784609 -712532 -386103 -114378 -49367 -78374
30464 -78374 -63531 -56088 -177176 -370465 -430755 -282983 -90925 -40657 -137174 -279761 -415907
30453 -415907 -523228 -547134 -478972 -412728 -400464 -335120 -119018 133066 233252 201822 211323
30442 211323 287525 294247 220322 229043 350047 365614 144312 -111311 -134999 24908 101194
30431 101194 4949 -78283 13243 189524 234775 76909 -123774 -143977 53787 268074
30421 268074 305559 245965 331439 580038 692156 450971 60034 -90958 101089 402373
30411 402373 599110 683186 680145 524752 215138 -59323 -85434 129420 370187 444160
30401 444160 341526 195309 136816 187397 264434 286015 257282 236866 246369 262040 277249
30390 277249 302848 301670 198700 -10834 -218306 -302897 -238068 -74565 130250 321615
30380 321615 424643 374912 179674 -72981 -267091 -322489 -234514 -70711 84827 192012
30370 192012 247732 235615 135378 -11204 -109652 -123353 -115489 -131213 -102204 45783 231487
30359 231487 276594 130927 -60594 -140928 -98535 -6012 98417 196634 239713 205871 158153
30348 158153 152710 131724 5506 -190524 -323664 -325368 -220542 -26212 243255 476905
30338 476905 527748 403233 254877 145288 -19954 -280522 -515829 -631008 -670985 -649923
30328 -649923 -470906 -169173 -25033 -207298 -476253 -508981 -373409 -357716 -435656 -293893
30318 -293893 115676 456091 524672 512059 586910 580681 324420 434 -136756 -169146 -332937
30307 -332937 -588291 -698883 -649280 -655002 -772162 -796195 -600072 -333339 -199180 -204396 -214756
30296 -214756 -143313 -20451 52201 -2063 -128706 -159299 -7858 202320 297531 263021 174706
30285 174706 21240 -219397 -393549 -300824 -20626 114546 -61678 -340188 -432204 -323463
30275 -323463 -229438 -302679 -485456 -600145 -527334 -328750 -202277 -265867 -410953 -446988
30265 -446988 -344738 -217422 -106265 49273 235091 331911 289261 178492 53997 -80106
30255 -80106 -157099 -95237 11585 -33818 -210158 -263153 -110600 -7805 -141925 -300333
30245 -300333 -184593 124237 296869 247880 204697 313280 446477 443279 317601 160098
30235 160098 7901 -102906 -89713 72542 273807 368171 311522 169162 32743 -43982
30225 -43982 -64097 -66403 -76017 -85276 -90304 -105067 -116827 -85236 -22085 -2343 -45292 -67235
30213 -67235 -25334 -19613 -148543 -338869 -438972 -419542 -355028 -267898 -142982 -51674 -88180
30202 -88180 -194257 -222472 -183251 -245963 -453420 -621519 -610081 -529176 -548558 -624957 -574163
30191 -574163 -354409 -130344 -55711 -98351 -111244 -22763 78540 47259 -136912 -318526
30181 -318526 -334292 -205337 -94931 -89855 -117357 -89644 -22601 37307 107469 213651 306390
30170 306390 313949 240608 145674 54246 -53513 -186416 -319837 -408627 -400448 -283423 -148490
30159 -148490 -133638 -248116 -321266 -211707 -13496 55232 -54060 -157186 -86540 98483
30149 98483 199906 112966 -84906 -239612 -270740 -234061 -255958 -388645 -531108 -536331 -399780
30138 -399780 -270008 -236910 -191949 11615 308394 452775 310461 9893 -234494 -348732
30128 -348732 -387085 -396163 -402732 -470105 -626517 -755018 -692294 -451125 -215952 -89854 14502
30117 14502 174542 296973 270388 167292 155848 276767 433569 544391 571327 458505
30107 458505 206919 -11037 11780 240343 408285 346199 161352 40510 13798 -4115
30097 -4115 -56592 -134942 -249677 -412166 -585211 -718834 -797953 -813250 -742982 -610881 -501778
30086 -501778 -470038 -486098 -505137 -511390 -459419 -279684 -16413 143817 86589 -64872 -108178
30075 -108178 -18520 70910 85454 67724 52115 24997 11551 71028 180737 232405 173264
30064 173264 59078 -57250 -193555 -352687 -451945 -401852 -219230 -25657 47060 -47729
30054 -47729 -227970 -339849 -307376 -212761 -172203 -166021 -90860 38245 77736 -16939 -91751
30043 -91751 -9861 137208 149001 -16164 -213153 -321917 -368833 -426279 -492154 -512390 -461446
30032 -461446 -357065 -234376 -143631 -141661 -236091 -344364 -352127 -226179 -41125 120101 253795
30021 253795 381043 436050 296839 -37573 -370880 -489022 -395840 -295722 -335963 -436074
30011 -436074 -410405 -215739 -15570 12861 -102516 -153198 -10487 191682 209997 11398
30001 11398 -171697 -144769 5541 64033 -14408 -98375 -116508 -133640 -188006 -208894 -142211
29990 -142211 -35140 58544 154792 267221 350508 366758 324851 217772 24733 -177997
29980 -177997 -230613 -94091 67761 105260 82918 152595 309056 394105 295451 46912 -214139
29969 -214139 -313415 -157335 112487 189533 -34705 -286425 -265539 -81796 -91862 -351356
29959 -351356 -519804 -358177 -47025 116839 117961 140488 242120 307165 257705 147815
29949 147815 61796 25773 17199 1780 -27722 -30399 23675 79869 73218 70086 194065 381226
29937 381226 386500 125425 -160626 -217473 -105302 -40632 -42645 39372 214074 301329 204556
29926 204556 34378 -74498 -111776 -118878 -109535 -114312 -187732 -311582 -371869 -279740 -69832
29915 -69832 128379 177422 30742 -184131 -240290 -72777 97069 28718 -213058 -369474
29905 -369474 -364708 -352893 -405825 -406500 -305423 -241888 -306854 -389582 -379796 -342413 -365868 -403989
29893 -403989 -400138 -408105 -449976 -412473 -241924 -93820 -115801 -214642 -216672 -132739 -75834 -39245
29881 -39245 37567 95561 67040 51803 147407 214740 90842 -57118 77200 429824 609616
29870 609616 487484 375595 503345 662144 572304 323511 202315 271581 357848 325254
29860 325254 160315 -99729 -338256 -374211 -195945 -75597 -247924 -558264 -642578 -404595
29850 -404595 -100485 26731 -17159 -118420 -222106 -288675 -243106 -64888 156949 321448
29840 321448 402199 398349 274733 11088 -325271 -602866 -720220 -672157 -534392 -383725
29830 -383725 -240103 -106476 -31487 -48637 -60861 82831 343786 463895 287920 6616
29820 6616 -61289 142681 389526 470276 379571 220788 82678 19255 26784 22243 -62242
29809 -62242 -165894 -168776 -58357 62768 105731 39828 -135681 -340087 -391443 -200482 50023
29798 50023 90803 -92748 -284493 -371018 -424154 -449504 -322749 -54772 133288 125906 79847
29787 79847 131112 159614 37913 -89009 -20139 151397 178312 69219 84924 341263 660080
29776 660080 835976 835919 697662 441483 164235 43157 126026 227665 142389 -109004 -323981
29765 -323981 -352793 -217029 -34540 105191 193925 265275 315995 291953 176742 56279
29755 56279 37380 123080 225828 278082 264552 181082 54146 -21476 25189 108961 58466
29744 58466 -156623 -364644 -391903 -243784 -61569 19476 -52694 -218828 -324283 -254308
29734 -254308 -90285 -34316 -134565 -197846 -49405 227691 416915 445152 407118 367490
29724 367490 283233 121927 -64244 -210480 -296139 -301421 -190843 6885 155157 111576
29714 111576 -125380 -397868 -522162 -440077 -247659 -83753 1368 60601 151561 260565
29704 260565 331066 331573 277775 216034 199136 246171 311914 329868 293016 244039 182567 63679
29692 63679 -81596 -127093 -31520 51715 -38780 -235582 -329733 -263426 -176914 -153688 -93177
29681 -93177 86656 270400 302073 228499 230913 346697 415510 329129 199391 196481 308842
29670 308842 376377 329027 266249 268134 242338 58637 -225936 -409102 -406466 -332256 -275589
29659 -275589 -154523 82974 242948 77160 -345077 -669523 -693720 -573505 -518607 -484473
29649 -484473 -323521 -91029 14485 -45990 -115097 -100696 -89081 -160793 -256351 -299254 -327693
29638 -327693 -411975 -525670 -588799 -584302 -554083 -519744 -476153 -432929 -399167 -349753 -265072
29627 -265072 -186779 -174355 -210000 -204764 -119524 -41802 -101635 -305314 -482956 -448908 -226000
29616 -226000 -50729 -100289 -268838 -316290 -211681 -181622 -376069 -628450 -652647 -384755
29606 -384755 -13800 255699 340219 228877 -34760 -305504 -412961 -345741 -270747 -321868
29596 -321868 -450435 -533026 -539969 -518101 -471011 -361682 -220942 -157976 -230534 -357925 -403133
29585 -403133 -318982 -180372 -83829 -54522 -60591 -75611 -86245 -65362 -1969 41172 -27271
29574 -27271 -192502 -307716 -254666 -83216 62541 109765 81288 -1829 -148028 -328126
29564 -328126 -457679 -467252 -358181 -200389 -104910 -156106 -313209 -418615 -368847 -230434
29554 -230434 -112164 7213 203823 418541 501445 432969 344184 312774 295322 267494 249656
29543 249656 168360 -95098 -445372 -580427 -380924 -91670 35667 74874 193100 280220
29533 280220 108780 -233523 -394549 -247805 -49490 -44794 -164593 -223312 -216162 -264314 -384456
29522 -384456 -461543 -404219 -233124 -42051 76489 95989 71601 59149 27461 -82003 -215929
29511 -215929 -224951 -45830 204707 344004 280454 62112 -164607 -257753 -214918 -178439 -224837
29500 -224837 -218137 -22243 199890 127387 -255911 -576855 -543639 -289578 -113994 -75647
29490 -75647 -34118 48103 72943 16530 -29508 -17794 7028 19165 44238 79723 88467 73214
29478 73214 73209 92558 96463 53912 -64224 -262676 -431543 -382913 -98881 151104 100310 -175365
29466 -175365 -380297 -399199 -361946 -343405 -261119 -119011 -93418 -250134 -386850 -322325 -176826
29455 -176826 -176339 -305210 -369975 -332869 -341934 -427818 -401454 -142356 177673 291650 170507
29444 170507 29221 35213 135587 193772 191714 218011 301693 353138 284545 118206 -59388
29433 -59388 -190306 -243829 -188352 -50643 39315 -28995 -190131 -276364 -243941 -198299 -180471
29422 -180471 -92820 89402 198880 108193 -47629 -58193 42310 49992 -60388 -99928 942
29411 942 62926 -49548 -218155 -286398 -298275 -344972 -333824 -143225 92152 116171 -56344
29400 -56344 -147374 -43566 53279 -590 -27115 179787 490005 597484 432524 188882
29390 188882 10698 -114589 -180117 -124074 -12002 -36005 -238882 -405382 -332753 -78984
29380 -78984 159273 296089 367205 388274 333826 210787 54951 -106157 -219046 -202276
29370 -202276 -63856 50038 22969 -79632 -132282 -153340 -250453 -411071 -505747 -488464 -436981
29359 -436981 -383204 -269688 -126935 -132154 -378975 -693764 -809557 -672795 -464246 -341355
29349 -341355 -279436 -194390 -124827 -206598 -481339 -798903 -945373 -843411 -590950 -320474
29339 -320474 -79080 140464 313497 380553 310983 139925 -44467 -149945 -160046 -169688
29329 -169688 -279450 -447639 -533695 -502801 -464689 -466068 -403703 -247016 -178764 -336474 -546520
29318 -546520 -539119 -338375 -188555 -150022 -58875 109193 147311 -29407 -225458 -284812 -304017
29307 -304017 -369014 -342691 -133237 56181 17516 -98517 -11803 213867 252819 21763
29297 21763 -221645 -293609 -288884 -311808 -294759 -198199 -135235 -146145 -71628 164652 336288
29286 336288 204371 -100259 -232643 -111160 6072 -79450 -268485 -385868 -422755 -426670
29276 -426670 -321618 -39594 243686 225232 -138204 -523907 -602684 -388396 -140704 -28653
29266 -28653 -26382 -74695 -170679 -284656 -338111 -319182 -312229 -361183 -403354 -390537 -367118 -358598
29254 -358598 -296849 -156983 -66126 -145780 -318966 -414075 -409186 -423012 -486757 -479557 -307083
29243 -307083 -21493 253310 408277 360167 108539 -186961 -310827 -229287 -129847 -179105
29233 -179105 -336659 -459329 -487546 -447240 -342825 -148227 119131 388974 610443 806817
29223 806817 1051265 1374068 1680208 1803489 1692123 1485095 1321126 1138962 806269 397553
29213 397553 144848 98108 50754 -122271 -264654 -207045 -42438 49805 100112 242132
29203 242132 409016 388962 162672 -42496 -56586 68988 227287 383691 475470 382051
29193 382051 117709 -90343 -54014 141253 277454 293904 296471 332666 314142 170592 -39054
29182 -39054 -201145 -255504 -209779 -115698 -51881 -66697 -112920 -94795 -4606 46751 -25807
29171 -25807 -158462 -214563 -153338 -65231 -47088 -89587 -97874 -2112 154405 233600 133644
$$ [...]
##END NTUPLES=NMR SPECTRUM
##END=
