##TITLE=31Pdec_LR-722-C1
 CDcl3, 24 sc
 22.9.2020
##JCAMPDX= 6.0         $$ Bruker NMR JCAMP-DX V2.0
##DATA TYPE= NMR SPECTRUM
##DATA CLASS= NTUPLES
##ORIGIN= UXNMR, Bruker Analytische Messtechnik GmbH
##OWNER= root
$$ XWIN-NMR		Version 3.5
$$ Tue Sep 22 12:05:02 2020 Russian Standard Time (UT+4h)  she@DPX200
##.OBSERVE FREQUENCY= 81.013821
##.OBSERVE NUCLEUS= ^31P
##.ACQUISITION MODE= SIMULTANEOUS
##.ACQUISITION SCHEME= undefined
##.AVERAGES= 24
##.DIGITISER RES= 17
##SPECTROMETER/DATA SYSTEM= spect
##.PULSE SEQUENCE= zgpg30
##.SOLVENT NAME= CDCl3
##.SHIFT REFERENCE= (INTERNAL, CDCl3, 0, 182.463)
##AUDIT TRAIL= $$ (NUMBER, WHEN, WHO, WHERE, WHAT)
$$ ##TITLE= Audit trail, XWIN-NMR		Version 3.5
$$ ##JCAMPDX= 5.01
$$ ##ORIGIN= Bruker BioSpin GmbH
$$ ##OWNER= she
$$ F:/spectra/data/she/nmr/P31/1/pdata/1/auditp.txt
$$ ##AUDIT TRAIL=  $$ (NUMBER, WHEN, WHO, WHERE, WHAT)
(   1,<2020-09-22 12:03:50.29 +0400>,<she>,<DPX200>,
      <created by zg, POWCHK disabled, PULCHK disabled
       configuration hash MD5:
       00 E9 B6 7A A2 85 ED C7 34 08 36 98 17 FE 4E 26
       data hash MD5: 32K
       BE FB 90 6E 2F 10 B1 0D B1 96 CB FC 49 E5 EA 22>)
(   2,<2020-09-22 12:03:52.75 +0400>,<she>,<DPX200>,
      <Start of raw data processing
       efp BC_mod = 2 LB = 1 FT_mod = 6 PKNL = 1 PHC0 = -3072.874 PHC1 = 807.802 SI = 64K 
       data hash MD5: 64K
       C9 51 F1 79 3C 08 11 20 5A 92 F4 42 71 2F 21 89>)
(   3,<2020-09-22 12:04:20.87 +0400>,<she>,<DPX200>,
      <pk PHC0 = 334.4363 PHC1 = -746.4003 
       data hash MD5: 64K
       FB FB 44 D2 F3 C9 B4 26 A2 DB A8 34 67 E2 98 D6>)
$$ ##END=
$$ 
$$ hash MD5
$$ E8 25 D8 2D 33 63 9D C1 9E 9F 7C FF 37 C6 81 1D
##$RELAX= 
##$RELAX= 
##$RELAX= 
##$RELAX= 
##$RELAX= 
##$RELAX= 
##$RELAX= 
##$RELAX= 
$$ Bruker specific parameters
$$ --------------------------
##$DU= <F:/spectra>
##$EXPNO= 1
##$NAME= <P31>
##$PROCNO= 1
##$TYPE= <nmr>
##$USER= <she>
##$AMP= (0..31)
100 100 100 100 100 100 100 100 100 100 100 100 100 100 100 100 100 100 
100 100 100 100 100 100 100 100 100 100 100 100 100 100 
##$AQSEQ= 0
##$AQ_mod= 1
##$AUNM= <au_zg>
##$AUTOPOS= <>
##$BF1= 81.014009
##$BF2= 200.13
##$BF3= 200.13
##$BF4= 200.13
##$BF5= 200.13
##$BF6= 200.13
##$BF7= 200.13
##$BF8= 200.13
##$BYTORDA= 1
##$CFDGTYP= 0
##$CFRGTYP= 5
##$CHEMSTR= <none>
##$CNST= (0..31)
1 1 145 1 1 1 1 1 1 1 1 1 1 1 1 1 1 1 1 1 1 1 1 1 1 1 1 1 1 1 1 1 
##$CPDPRG= <waltz16>
##$CPDPRG1= <>
##$CPDPRG2= <waltz16>
##$CPDPRG3= <>
##$CPDPRG4= <mlev>
##$CPDPRG5= <mlev>
##$CPDPRG6= <mlev>
##$CPDPRG7= <mlev>
##$CPDPRG8= <mlev>
##$CPDPRGB= <>
##$CPDPRGT= <>
##$D= (0..31)
0 1 0 0 0 0 0 0 0 0 0 0.03 2e-05 3e-06 0 0 0 0 0 0 0 0 0 0 0 0 0 0 0 0 
0 0 
##$DATE= 1600761829
##$DBL= (0..7)
120 120 120 11 120 120 24 19 
##$DBP= (0..7)
150 150 150 150 150 150 150 150 
##$DBP07= 0
##$DBPNAM0= <>
##$DBPNAM1= <>
##$DBPNAM2= <>
##$DBPNAM3= <>
##$DBPNAM4= <>
##$DBPNAM5= <>
##$DBPNAM6= <>
##$DBPNAM7= <>
##$DBPOAL= (0..7)
0.5 0.5 0.5 0.5 0.5 0.5 0.5 0.5 
##$DBPOFFS= (0..7)
$$ [...]
##$SUBNAM2= <"">
##$SUBNAM3= <"">
##$SUBNAM4= <"">
##$SUBNAM5= <"">
##$SUBNAM6= <"">
##$SUBNAM7= <"">
##$SUBNAM8= <"">
##$SUBNAM9= <"">
##$SW= 369.568048894756
##$SWIBOX= (0..15)
0 1 3 0 0 0 0 0 0 0 0 0 0 0 0 0 
##$SW_h= 29940.119760479
##$TD= 32768
##$TD0= 1
##$TE= 0
##$TE2= 300
##$TE3= 300
##$TEG= 300
##$TL= (0..7)
0 120 53 12 22 120 120 120 
##$TP= (0..7)
150 150 150 150 150 150 150 150 
##$TP07= 0
##$TPNAME0= <>
##$TPNAME1= <>
##$TPNAME2= <>
##$TPNAME3= <>
##$TPNAME4= <>
##$TPNAME5= <>
##$TPNAME6= <>
##$TPNAME7= <>
##$TPOAL= (0..7)
0.5 0.5 0.5 0.5 0.5 0.5 0.5 0.5 
##$TPOFFS= (0..7)
0 0 0 0 0 0 0 0 
##$TUNHIN= 0
##$TUNHOUT= 0
##$TUNXOUT= 0
##$USERA1= <user>
##$USERA2= <user>
##$USERA3= <user>
##$USERA4= <user>
##$USERA5= <user>
##$V9= 5
##$VALIST= <valist>
##$VCLIST= <CCCCCCCCCCCCCCC>
##$VD= 0
##$VDLIST= <DDDDDDDDDDDDDDD>
##$VPLIST= <PPPPPPPPPPPPPPP>
##$VTLIST= <TTTTTTTTTTTTTTT>
##$WBST= 1024
##$WBSW= 4
##$XGAIN= (0..3)
0 0 0 0 
##$XL= 0
##$YL= 0
##$YMAX_a= 48262
##$YMIN_a= -46063
##$ZGOPTNS= <>
##$ZL1= 120
##$ZL2= 120
##$ZL3= 120
##$ZL4= 120
##$ABSF1= 0
##$ABSF2= 0
##$ABSG= 0
##$ABSL= 0
##$ALPHA= 0
##$AQORDER= 0
##$ASSFAC= 0
##$ASSFACI= 0
##$ASSFACX= 0
##$ASSWID= 0
##$AUNMP= <proc_1d>
##$AZFE= 0.1
##$AZFW= 0.5
##$BCFW= 0
##$BC_mod= 2
##$BYTORDP= 0
##$COROFFS= 0
##$CY= -3
##$DATMOD= 1
##$DC= 0
##$DFILT= <>
##$DTYPP= 0
##$F1P= 0
##$F2P= 0
##$FCOR= 1
##$FTSIZE= 65536
##$FT_mod= 6
##$GAMMA= 0
##$GB= 0
##$INTBC= 1
##$INTSCL= 5.30512e-09
##$ISEN= 30
##$LB= 1
##$LEV0= 0
##$LPBIN= 0
##$MAXI= 10000
##$MC2= 0
##$MEAN= 0
##$ME_mod= 0
##$MI= 50
##$NCOEF= 0
##$NC_proc= -3
##$NLEV= 6
##$NOISF1= 182.463
##$NOISF2= 159.3651
##$NSP= 0
##$NTH_PI= 0
##$NZP= 0
##$OFFSET= 182.463
##$PC= 4
##$PHC0= -2738.438
##$PHC1= 61.40167
##$PH_mod= 1
##$PKNL= yes
##$PPARMOD= 0
##$PSCAL= 0
##$PSIGN= 0
##$REVERSE= no
##$SF= 81.0140089999434
##$SI= 65536
##$SIGF1= 159.3651
##$SIGF2= -187.1042
##$SINO= 113.3802
##$SIOLD= 16384
##$SREGLST= <1H.CDCl3>
##$SSB= 0
##$STSI= 65536
##$STSR= 0
##$SW_p= 29940.119760479
##$SYMM= 0
##$S_DEV= 0
##$TDeff= 32768
##$TDoff= 0
##$TI= <>
##$TILT= no
##$TM1= 0
##$TM2= 0
##$TOPLEV= 0
##$USERP1= <user>
##$USERP2= <user>
##$USERP3= <user>
##$USERP4= <user>
##$USERP5= <user>
##$WDW= 1
##$XDIM= 65536
##$YMAX_p= 292029703
##$YMIN_p= -2790932
$$ End of Bruker specific parameters
$$ ---------------------------------
##NTUPLES= NMR SPECTRUM
##VAR_NAME=  FREQUENCY,     SPECTRUM/REAL,   SPECTRUM/IMAG
##SYMBOL=    X,             R,               I
##VAR_TYPE=  INDEPENDENT,   DEPENDENT,       DEPENDENT
##VAR_FORM=  AFFN,          ASDF,            ASDF
##VAR_DIM=   65536,         65536,           65536
##UNITS=     HZ,            ARBITRARY UNITS, ARBITRARY UNITS
##FACTOR=    0.456856943014862, 1,           1
##FIRST=     14782.0589164792, 0,            0
##LAST=      -15158.0608439998, 0,           0
##MIN=       -15158.0608439998, -2790932,    0
##MAX=       14782.0589164792, 292029703,    0
$$ Real data points
##PAGE= N=1
##DATA TABLE= (X++(R..R)), XYDATA
$$ [...]
44536 407852 484362 379118 253128 145609 -47342 -289934 -354418 -149120 109402 190458
44526 190458 138036 104092 65359 -75161 -231446 -232614 -111624 -48105 -58718 2903 142761
44515 142761 183377 62225 -68903 -100990 -91028 -57731 100203 364999 504092 366952
44505 366952 100960 -71423 -125693 -146929 -139590 -89044 -65632 -99708 -80598 61737 203441
44494 203441 216538 180014 225849 302089 284267 211759 205670 238647 191660 67383 -50154
44483 -50154 -173942 -345456 -457646 -370656 -159970 -27311 6032 95109 278303 415020
44473 415020 423990 370089 293731 158896 2219 -63260 -38501 -55273 -159253 -244275 -243675
44462 -243675 -218571 -205479 -138877 9106 151311 212366 219264 219383 212203 194483 181154 172034
44450 172034 178713 245452 335701 274136 -31559 -381390 -508199 -466087 -547088 -818142 -1006240
44439 -1006240 -887392 -544437 -176848 113664 280212 303480 288645 377599 499072 433331
44429 433331 187670 43685 132623 237734 156097 -11514 -101127 -156416 -253776 -290234 -180864
44418 -180864 -75506 -137376 -261620 -245619 -103844 8598 61317 119738 163001 142215 123078
44407 123078 175755 219923 160780 70092 51096 45450 -32170 -91488 -2797 182123 342007
44396 342007 481127 603258 560133 291897 62753 143616 382502 431788 304626 316641
44386 316641 513961 584130 397140 237433 353742 604875 728148 695174 617357 513360
44376 513360 359757 217473 145042 100495 43676 16995 32128 11443 -58278 -49047 114168
44365 114168 292802 290478 98488 -110740 -182972 -104851 30174 130259 199065 313488
44355 313488 475779 555825 472092 346686 330753 348056 212329 -39200 -161826 -62937
44345 -62937 82005 110655 51927 -25674 -119425 -176838 -100262 39630 12856 -233560 -451796
44334 -451796 -428770 -249785 -97284 12219 130287 200169 164311 106361 113749 123444 57528
44323 57528 -21663 -44208 -73995 -153225 -165435 -50351 4221 -170595 -393831 -351010 -66704
44312 -66704 130125 88671 -9343 -8390 -3416 -96508 -166612 -53621 167506 266225 153548
44301 153548 -23219 -63893 85911 311196 446603 412313 262447 118190 54020 34608
44291 34608 -51628 -274622 -544868 -651429 -491521 -229290 -115166 -169491 -199584 -131842
44281 -131842 -114779 -219174 -269357 -138826 -15035 -134938 -389859 -459696 -276254 -85221
44271 -85221 -54818 -84899 -58544 -46943 -146329 -277452 -286920 -163107 -42752 -40101 -131547
44260 -131547 -191346 -128086 -10965 -30572 -270046 -552294 -614043 -413477 -155865 -22051
44250 -22051 3602 19079 48571 55691 19832 -57214 -155774 -211493 -149328 15510 162087
44239 162087 182098 75750 -81432 -216455 -287088 -280427 -211848 -113935 -30873 -23032 -120330
44228 -120330 -238110 -218302 -29645 146431 133094 -1589 -48204 48162 147003 152299 136898
44217 136898 204902 361045 546060 689776 710752 577087 385564 272041 243038 220008
44207 220008 229199 362978 535562 500570 204989 -75000 -88335 72405 170694 190694 287034
44196 287034 462548 534428 414342 220401 75379 -39977 -169448 -249244 -185872 508
44186 508 181975 242637 162277 21426 -48451 36389 218754 322770 206487 -96774 -390995
44175 -390995 -474409 -304739 -32261 136164 122822 22950 -40863 -64960 -116572 -173312 -110758
44164 -110758 110765 328925 341851 162405 9708 31570 137614 167463 129687 158056
44154 158056 277774 354409 284324 114607 -53329 -161759 -160228 -4218 232646 365326
44144 365326 319124 242629 284942 359062 272793 25816 -181242 -199619 -56307 138346 267513
44133 267513 230912 44987 -105335 -68018 55785 65361 -4837 69521 315936 477243 386445
44122 386445 197559 126273 166889 210566 259141 345952 391929 329011 256064 286740 333166
44111 333166 233903 33971 -58989 31316 184081 300875 408863 519760 554503 476648
44101 476648 378889 357386 377820 336814 208044 68741 7088 49845 173201 341645 505259
44090 505259 571562 448343 176076 -26270 42275 313043 500200 434671 233068 89922
44080 89922 40085 22693 47652 141487 204502 96968 -143242 -311570 -280563 -125100 11139
44069 11139 79813 132179 227111 358872 441222 373449 164204 -34885 -74103 34807 152931
44058 152931 181333 141144 113362 152740 243392 305918 280465 219476 229432 294578 263729 74849
44046 74849 -124488 -181167 -147919 -157532 -188731 -131414 -21258 -18097 -165455 -342169 -454862
44035 -454862 -521386 -554827 -518966 -422504 -322104 -217916 -83703 -4568 -116531 -373126
44025 -373126 -538746 -476080 -289079 -114978 60561 274782 424825 389765 233204 132685
44015 132685 134061 95198 -118812 -457766 -719951 -741641 -561607 -393689 -399060 -501084 -496177
44004 -496177 -336619 -195642 -225007 -356040 -401804 -279553 -76467 42858 -43278 -311214
43994 -311214 -569034 -614286 -459659 -325149 -365012 -492240 -527683 -428407 -292405 -215766
43984 -215766 -227558 -304948 -376581 -360684 -261621 -179633 -183099 -241414 -320791 -439944 -564677
43973 -564677 -569635 -415810 -261681 -261499 -334874 -287326 -95198 98759 232119 370594 500904
43962 500904 472000 215539 -123595 -366181 -492652 -567507 -579531 -485766 -351377 -304688
43952 -304688 -360248 -406312 -387642 -387607 -469501 -530496 -421645 -176444 418 -8150 -87351 -57962
43940 -57962 96919 250892 315318 305786 271054 258464 317296 420978 412078 169712 -164916
43929 -164916 -294865 -145162 30638 4716 -128607 -145351 -39488 13344 -34145 -34027 110589
43918 110589 303658 405188 399188 361544 349719 372162 403526 396499 331763 273558 310333
43907 310333 413832 428661 260609 34363 -9338 217170 531618 672450 585609 457629
43897 457629 444132 453914 302572 27195 -115487 2397 189239 187837 4498 -137170
43887 -137170 -95107 62687 180763 154026 -22186 -236338 -321815 -220793 -53398 43221
43877 43221 68120 60399 -31175 -219302 -320945 -160738 105371 125342 -158860 -404721 -339614
43866 -339614 -108307 -8753 -70485 -85380 56197 247175 332561 255457 66849 -104366
43856 -104366 -129309 -17798 64737 -2030 -135349 -175928 -101170 -8965 45729 79480 94650
43845 94650 86362 101324 176891 253691 256523 219634 213841 202187 116739 37609 115840 322657
43833 322657 457816 427258 331980 252075 145562 26320 27919 173450 275389 210237 116868
43822 116868 158357 264410 310801 375713 553114 662062 478035 173197 144788 397063
43812 397063 493067 225481 -54983 16308 289062 393385 287301 175225 83024 -111139
43802 -111139 -330986 -356985 -195506 -64887 -23712 63803 181821 129387 -95120 -214035
43792 -214035 -107741 -25381 -180261 -403959 -421282 -253338 -115362 -82450 -83300 -85964 -69842
43781 -69842 60336 307501 442607 271482 -46061 -191158 -136901 -142077 -313927 -444413
43771 -444413 -332148 -51244 179444 241923 170714 75551 53077 89257 54895 -111873 -268296
43760 -268296 -242275 -87552 2466 -12654 -9981 44650 56350 17213 35796 120214 155272
43749 155272 137595 195441 307289 255682 -22453 -283737 -332292 -300563 -382627 -486784 -395411
43738 -395411 -134297 68238 113161 89884 48352 -65985 -249422 -398259 -452028 -437885
43728 -437885 -366580 -220932 -59449 -704 -73725 -182205 -236438 -234354 -205016 -163134 -132582
43717 -132582 -130571 -113981 -21431 113577 168773 83130 -56971 -111609 -26469 141129 294248
43706 294248 365277 335864 222592 58222 -115923 -263495 -381764 -494866 -584532 -562478
43696 -562478 -378901 -133694 9001 6301 -60359 -150453 -296083 -457158 -504920 -405344 -270873
43685 -270873 -165042 -17558 178801 268676 170314 44423 53305 102198 29388 -78222 -17122
43674 -17122 165144 216630 81106 -24612 25654 83046 -6852 -168259 -249119 -236675 -192000
43663 -192000 -115678 -17485 -1408 -124926 -245451 -161012 119400 375178 450112 422704 462796
43652 462796 592205 659889 545366 320207 159905 128957 135085 99376 62860 69061 53834
43641 53834 -35016 -93874 7311 189724 227939 64284 -89253 -20272 222869 407569
43631 407569 386978 239155 173149 316749 566980 667646 488562 196804 68235 154992
43621 154992 250266 186630 51384 51367 230875 386824 274262 -95239 -388013 -277698 141650
43610 141650 421507 318303 103231 149274 398631 511992 414220 340383 373169 309990
43600 309990 58864 -178151 -247083 -264633 -340760 -360647 -236602 -122608 -153147 -187456 -54764
43589 -54764 137548 195518 167870 208369 251322 126434 -93638 -163389 -37413 106896 187845
43578 187845 276412 342127 237758 -16854 -204947 -235790 -246965 -302257 -248311 -12138 189435
43567 189435 132446 -78038 -149646 18587 271810 438836 467630 365227 168092 -19678
43557 -19678 -82891 -21209 50581 35463 -67355 -203184 -313566 -350826 -303872 -213273 -113077
43546 -113077 26894 233371 419748 448676 332654 258933 333465 399153 246727 -49579
43536 -49579 -190424 -61585 106721 77261 -78193 -153214 -146751 -210888 -343636 -380261 -276223
43525 -276223 -163079 -101473 -10658 108125 117965 86 -78327 -67048 -154541 -415451 -579449
43514 -579449 -398558 -57949 67532 -54834 -130459 -27013 56003 -64826 -288474 -384315
43504 -384315 -257055 -11980 135041 28127 -230825 -311582 -34016 355435 478866 331164
43494 331164 249748 411405 627785 671811 553936 402779 288161 241661 265420 256984 105453
43483 105453 -97408 -146302 -58118 -73470 -256596 -370493 -276288 -177186 -269965 -400435 -318670
43472 -318670 -94019 3059 -78979 -143824 -87126 -15842 -26404 -70903 -80992 -72032 -77920 -86173
43460 -86173 -77843 -71675 -106467 -200959 -319647 -380204 -345017 -292027 -303037 -298394 -129743 149767
43448 149767 292756 195308 36374 -13447 -24592 -117699 -231146 -251606 -219197 -223145 -228982
43437 -228982 -177834 -115045 -55043 107563 355075 413428 122781 -239975 -319923 -205806
43427 -205806 -226755 -354856 -261057 55329 178718 -65109 -299369 -161292 169133 271782
43417 271782 67568 -176339 -254629 -181740 -39463 118291 248380 340931 415960 429458
43407 429458 280674 -19022 -305679 -460828 -516193 -505908 -398619 -262432 -277909 -441551
43397 -441551 -472776 -211143 94218 130746 -20433 -62321 21145 -9806 -185279 -250398 -100107
43386 -100107 42188 -2128 -96524 -63024 -4284 -135394 -423346 -604597 -513839 -239480
43376 -239480 17728 110618 -4876 -249382 -428609 -367376 -86089 205543 319513 255250
43366 255250 135811 32520 -85088 -235797 -338813 -294177 -123194 41350 116692 157656
43356 157656 247936 363291 405903 338580 212299 76772 -59920 -178715 -231557 -205514
43346 -205514 -152172 -118223 -83189 -1481 117387 206382 212153 144043 53646 -11305 -21698
43335 -21698 43063 178654 314395 334217 196505 13115 -65217 -40797 -52758 -144714 -167258
43324 -167258 1028 231760 280031 99500 -107011 -144988 -20159 128983 176169 72698
43314 72698 -119103 -240196 -198670 -131663 -252694 -498698 -522891 -161272 268819 331816
43304 331816 24675 -258514 -257252 -97306 -1976 5502 18410 55285 81881 99220 96532
43293 96532 22886 -90110 -88250 100516 321351 389951 347778 368001 481850 574599 605749
43282 605749 641361 680881 643351 537871 460577 397988 234211 4116 -77385 62565 211100
43271 211100 188096 115005 177891 285767 207762 -38492 -185607 -85478 134770 294996
43261 294996 343564 280067 80747 -209658 -431714 -455834 -328937 -227625 -280161 -430906
43251 -430906 -469911 -253964 72252 184838 -10845 -220975 -158720 47561 70062 -103067
43241 -103067 -165075 26264 275878 395981 412201 344466 103994 -235938 -362860 -138323
43231 -138323 147355 165096 -17329 -138416 -179191 -287901 -414828 -371203 -194532 -119930
43221 -119930 -184459 -171552 4117 149215 123409 60103 119682 230417 234603 139330 59142
43210 59142 14396 -58254 -155001 -197785 -154435 -72501 -7153 22517 23579 21666 44211 81664
43198 81664 90106 50980 -3886 -39783 -55631 -66036 -87013 -138784 -212712 -239800 -158751 -24258
43186 -24258 22948 -78056 -223248 -248289 -84947 184832 383886 360372 125026 -121815
43176 -121815 -163443 16877 237716 329470 280847 187804 140368 171497 244738 278147 241011
43165 241011 220248 312157 458196 491784 357848 176516 64871 9319 -45732 -99932 -148032
43154 -148032 -216571 -270695 -188651 69368 351253 486087 502758 549445 638635 622210 431513
43143 431513 203223 101536 109945 89571 -4899 -71004 -27491 51587 31174 -98277 -199277
43132 -199277 -147215 45691 265009 390843 362524 231810 165541 290392 497117 521152
43122 521152 286431 32269 -11875 66618 47354 -63918 -89392 -11095 19168 -14616 48543
43111 48543 242227 387563 387806 356003 343845 201511 -126992 -397370 -367517 -137098 30271
43100 30271 80544 135027 198047 154016 2827 -136963 -236804 -352334 -418966 -281219 32364
43089 32364 263941 234332 43776 -115313 -211311 -328903 -457829 -459690 -260547 -8066
43079 -8066 32565 -220359 -503057 -451158 -36949 360799 408720 216781 142608 301251 476074
43068 476074 487130 422185 439365 517872 520680 408788 285534 260624 328305 363226 226228
43057 226228 -82194 -368338 -407211 -182389 86674 183342 115510 64244 141357 252413
43047 252413 227178 59875 -56065 24072 195810 266686 255378 340150 508772 502723 213094
43036 213094 -97083 -144255 -8164 57166 33752 82653 180701 129669 -90033 -271491 -318709
43025 -318709 -359763 -460332 -482093 -330451 -124473 -2987 52512 91518 74181 2155 -554
43014 -554 118750 212859 152214 46308 82357 235501 311240 227131 94974 34712 38451
43003 38451 42264 43922 100302 226678 331973 299769 154463 72874 153244 255694 208739
42992 208739 98410 144978 319314 337359 90633 -167282 -180885 -23160 84024 93593
42982 93593 96455 99472 29661 -116130 -268295 -366932 -356023 -199923 3210 58517 -63579
42971 -63579 -144736 -21972 181755 273935 268878 266109 222153 73296 -52311 -1928 123364
42960 123364 119845 29863 57206 180607 153479 -92472 -317998 -310323 -124104 64566 144576
42949 144576 67868 -139661 -316263 -295830 -135384 -28420 14323 161873 408317 498672
42939 498672 316569 89845 57000 152347 197594 198839 240266 255863 155507 61973 163189
42928 163189 386143 464794 316716 118454 -7681 -138724 -306664 -341613 -130452 118054
42918 118054 87331 -209670 -415103 -284514 20968 197849 196796 182810 203771 144212 9215
42907 9215 -6415 164380 297504 196410 -7195 -73301 -21926 -37336 -117283 -103036 -7845
42896 -7845 -18157 -160901 -254288 -226923 -201777 -197820 -46735 273324 506663 489772 395994
42885 395994 418300 452765 335956 180405 185281 271142 215441 59333 68132 315398 586335
42874 586335 698964 670699 552872 350932 156772 128028 257310 355290 335314 324777
42864 324777 411133 473730 391220 243170 150122 52825 -162888 -408001 -460658 -284673 -103189
42853 -103189 -105878 -202956 -149054 142087 476203 570404 338159 -26240 -243707 -218476 -94319
42842 -94319 -57164 -133557 -211730 -213696 -178192 -177047 -216628 -255250 -273999 -279356 -254723 -166351
42830 -166351 -23434 114223 199475 225252 186347 85508 1627 56585 240967 354903
42820 354903 230329 -40927 -215899 -195200 -85038 -6057 8866 -47665 -144081 -135717 94541
42809 94541 390170 435957 193719 -5576 71323 228915 162729 -88664 -247483 -210119
42799 -210119 -104143 -26997 17037 -24596 -202122 -385321 -368061 -157661 45126 148901
42789 148901 233835 306766 243613 39498 -108359 -66817 62334 129948 135881 144753 154765
42778 154765 151310 168900 211284 214791 154646 82220 20712 -47007 -67258 33130 148876
42767 148876 64750 -198041 -335592 -192817 -13013 -73452 -279642 -354167 -262136 -183635
42757 -183635 -178620 -156594 -112810 -119844 -112246 48783 284144 331977 128649 -79662 -87023
42746 -87023 23312 88465 134481 281980 505297 639965 579240 362049 105615 -77735
42736 -77735 -133994 -91422 -7165 115842 297311 466945 485350 312022 63726 -126715
42726 -126715 -216464 -192941 -38088 178582 292564 231325 117364 85188 87782 7116 -124164
42715 -124164 -167015 -104576 -68053 -130509 -217924 -255166 -270571 -300451 -302075 -242621 -191169 -222546
42703 -222546 -274849 -208100 -3970 183190 208131 102321 1612 -55750 -168673 -386147
42693 -386147 -563917 -501829 -207091 79986 155317 64035 -8633 19594 83478 114195 110022
42682 110022 74617 5732 -26985 96362 381914 655906 734717 611790 414299 228944
42672 228944 55313 -100186 -184109 -162843 -60164 89560 266276 419167 456921 338862
42662 338862 156060 67224 134615 249743 254378 129433 13970 9702 31561 -57761 -203061
42651 -203061 -194536 15796 194759 130207 -83696 -215525 -231981 -250537 -232755 -6537 377585
42640 377585 594235 467890 216589 109700 91596 -34272 -208406 -178059 108183 426491
42630 426491 593285 634394 626932 582530 527719 509025 461060 246202 -103512 -349961 -344140
42619 -344140 -215246 -172420 -250111 -350539 -412885 -419078 -329781 -140025 64190 199939 274819
42608 274819 308420 257507 110293 -32712 -69003 -4704 124834 330157 558592 646424
42598 646424 535157 414732 464595 559439 458023 203532 67478 122980 165860 96871
42588 96871 85724 241995 388355 336284 181709 126896 162701 138599 42751 2875 66615
42577 66615 164246 250478 321098 330461 259216 229520 371291 583253 614684 408877 187330
42566 187330 143169 217658 254049 218920 169016 125272 97909 139508 246970 276938 85880
42555 85880 -272273 -584575 -695718 -617392 -462061 -350092 -351854 -439246 -507784 -497972 -453196
42544 -453196 -408576 -308585 -133233 -17617 -95242 -276747 -357449 -316879 -314288 -381735 -349682
42533 -349682 -148216 39392 52790 -8152 11358 45986 -47970 -197169 -199184 -44666 87554
42522 87554 132254 188318 252808 165963 -90124 -271535 -199033 -29101 -29774 -213764 -372107
42511 -372107 -382158 -294895 -165382 9480 176681 220487 120029 -9575 -83181 -143433
42501 -143433 -236150 -299842 -275193 -239678 -303545 -410445 -389722 -224878 -119051 -208975 -340747
42490 -340747 -278186 -60409 40938 -78940 -206394 -133292 53406 143667 115792 94000
42480 94000 102392 75175 53950 142657 271121 237135 30411 -100587 14073 252961 422905
42469 422905 503659 544926 493529 300790 87375 19508 80347 111677 36883 -82648 -167781
42458 -167781 -182405 -115243 -6433 43245 -24498 -155421 -276750 -381269 -448101 -394790 -219328
42447 -219328 -78166 -86591 -143081 -99313 2098 34451 29444 102062 206688 201706 122860
42436 122860 155183 331426 481610 499983 448201 371008 233158 84932 67005 177613
42426 177613 239326 176085 124124 183985 269279 305528 368992 494160 543952 434744 312242
42415 312242 323066 371812 303980 187355 184928 255039 221384 80692 400 32077 59234
42404 59234 46003 118528 335903 554480 603338 476046 290106 161713 161544 278592 375351
42393 375351 291443 56729 -102604 -44430 104652 140330 62588 33234 106981 165500 126986
42382 126986 66553 62111 48271 -59630 -175308 -123896 97963 283807 273375 133406 31276
42371 31276 31930 93028 170802 237316 257856 240572 250607 293325 258644 82416 -116535 -184157
42359 -184157 -138303 -84718 -10264 149784 298721 265156 94743 15240 77586 75690 -99369
42348 -99369 -264934 -236626 -109418 -87471 -188682 -284177 -311955 -287225 -185485 28915 295201
42337 295201 482073 498290 343702 118985 -9264 27459 70970 -58443 -231703 -139686
42327 -139686 193674 342926 84222 -248028 -260334 -75111 -69906 -254725 -309483 -135793
42317 -135793 31960 51428 38736 62711 -2023 -217459 -431462 -488659 -400573 -238056 -39412
42306 -39412 111901 93802 -98934 -338450 -531267 -665670 -697788 -566999 -341725 -179493
42296 -179493 -125251 -110779 -140776 -274596 -416039 -350963 -48808 272044 431347 452180
42286 452180 407566 317329 249335 298850 390928 321865 86067 -56277 58443 281152 411438
42275 411438 456655 488634 457540 334370 263660 369187 529135 531502 362838 185060 111523
42264 111523 150890 290135 487098 636073 658644 588821 502948 437380 419521 469346 521569
42253 521569 479363 391919 412408 522797 506645 288844 75645 23423 7775 -96470 -149348
42242 -149348 -6375 167342 142353 26279 93698 313271 381964 201271 3670 -16937
42232 -16937 75687 155168 202950 222544 191145 159007 217608 316759 282927 72800 -145899
42221 -145899 -215234 -147551 -31869 69038 84774 -47360 -263754 -387642 -322521 -146198
42211 -146198 12989 95674 95354 38412 3212 51396 124506 117311 54634 62423 153611 198115
42199 198115 144412 109747 173567 227428 143659 -12951 -71493 3666 78313 41023 -68508
42188 -68508 -145614 -169091 -211488 -315693 -420690 -451340 -441944 -488161 -583576 -610325 -521247
42177 -521247 -418853 -393942 -392812 -321330 -180820 -22149 125996 199503 103082 -113644 -220766
42166 -220766 -87924 132157 244981 280931 336305 323941 140498 -57349 -45170 95046
42156 95046 110755 20949 70918 263998 313392 115186 -85228 -100537 -51995 -86882 -143792
42145 -143792 -143857 -143865 -151693 -50151 145947 219840 101742 21722 132814 254591 211518 156860
42133 156860 282218 430716 317596 -14369 -262094 -280149 -163320 -9747 130989 146705
42123 146705 -41198 -305676 -444260 -429067 -352856 -231215 -64670 22201 -51458 -125804
42113 -125804 -39770 41469 -142005 -460026 -506918 -203417 86467 113035 63586 188641
42103 188641 415293 530248 513307 476434 437815 357939 286405 294574 332926 292493 155652
42092 155652 -6868 -124537 -143693 -43766 90021 104401 -32479 -170509 -181346 -121031
42082 -121031 -104390 -128630 -135252 -145785 -190936 -174204 26405 333317 499622 402297 196030
42071 196030 117608 206065 281499 174342 -81039 -292221 -318965 -208779 -122094 -152743 -244970
42060 -244970 -266450 -133886 113758 330878 373560 236362 68193 14493 69024 127797
42050 127797 148372 176070 234688 284323 291778 263710 206107 129315 94807 168159 311379
42039 311379 405835 395996 325856 230241 105765 14421 76785 285775 447532 416649 299387
42028 299387 297355 415960 476449 390941 263519 188194 99287 -82883 -263312 -265895 -80854
42017 -80854 116565 209642 271311 388089 478216 420392 289841 286686 432867 528724 469419
42006 469419 421401 562311 796909 900030 836587 750705 708252 664774 664770 835716 1126523
41995 1126523 1251138 1001463 488164 -20627 -385976 -627409 -766380 -765764 -599488 -315157
41985 -315157 -45010 40387 -128782 -398842 -508397 -385700 -236761 -264255 -399121 -428016
41975 -428016 -318991 -268671 -417823 -644888 -707798 -532163 -282893 -149716 -127854 -70658
41965 -70658 69897 164550 110211 -1169 -24385 16862 1085 -57311 -38052 38606 21585
41954 21585 -73300 -22176 225185 350519 67122 -435079 -690752 -535731 -242485 -96766
41944 -96766 -84435 -62061 -20864 -26710 -17141 155923 478247 700642 589313 203715 -150631
41933 -150631 -247749 -146777 -41064 6771 75215 184929 244565 215136 188811 244914 335938
41922 335938 375996 342409 237409 64638 -93610 -108364 620 43189 -54301 -94939 93097
41911 93097 352567 412556 308610 321838 526854 676461 587180 393462 309178 329843 311454
41900 311454 211704 113383 89371 153644 279698 376891 317264 84363 -153003 -206975 -78728
41889 -78728 73941 139973 141159 135645 128445 99628 60892 46290 65875 90283 77382 5222
41877 5222 -119396 -270768 -407359 -476957 -457381 -399413 -382521 -406720 -383065 -266463 -132520
41866 -132520 -65248 -38310 9548 51698 43826 61784 214472 428056 477023 266702 -46511
41855 -46511 -256082 -299033 -208048 -18143 193049 295546 245377 147523 94052 35172 -89271
41844 -89271 -190865 -141476 23594 150796 181202 190054 236281 295476 333726 335851 265686
41833 265686 105956 -66313 -149375 -152803 -151688 -125380 3265 156969 120876 -146250 -382580
41822 -382580 -339069 -105720 32630 -17175 -94205 -78494 -60488 -166867 -354007 -460005
41812 -460005 -396167 -226299 -94811 -108213 -245805 -362107 -316943 -120122 90736 213580
41802 213580 260613 273477 251065 196396 149492 119538 57880 -43835 -103957 -68528 -4484
41791 -4484 6888 -2534 37083 101228 127284 135889 161280 123803 -58817 -273913 -325902 -236215
41779 -236215 -208107 -265558 -187430 94074 291742 159897 -111851 -159570 30631 146497
41769 146497 45979 -67881 -11697 99057 58292 -121309 -253490 -233451 -119580 -13203
41759 -13203 36898 29041 -8673 -18657 54352 203145 338439 357628 258331 164280 185948 265471
41747 265471 245297 103673 5857 66404 186191 222398 197110 197911 178879 41955 -148629
41736 -148629 -224967 -159175 -70693 -17793 28721 23595 -124654 -345217 -436915 -351720 -246791
41725 -246791 -209242 -144609 -7533 83314 67975 68109 152804 182699 51256 -93392 -49753
41714 -49753 152026 335763 417868 392469 218655 -74900 -279428 -211200 33223 197893
41704 197893 177228 55796 -66491 -125099 -69331 38107 17273 -150528 -197638 32681
41694 32681 235385 34011 -393544 -498927 -157302 167108 136242 -22019 12906 137005
41684 137005 82834 -91291 -129525 -32898 -46729 -258437 -488131 -564952 -491805 -340182 -172038
41673 -172038 -80139 -150447 -351003 -546903 -619569 -511377 -223392 125529 309680 207878
41663 207878 -28785 -142874 -74022 15961 -19372 -173676 -355160 -458464 -386109 -130860
41653 -130860 158105 300809 280407 218076 174530 92792 -64511 -237946 -351455 -384329
41643 -384329 -356987 -316000 -315311 -338221 -279869 -100063 65602 73095 -9383 -5826 87227 112233
41631 112233 21997 -71345 -129201 -238426 -377612 -369242 -171571 550 -9130 -56912 50694
41620 50694 229789 248048 66492 -152445 -298473 -377593 -378932 -273186 -125949 -51127 -62508
41609 -62508 -94604 -121228 -119099 4872 263128 429946 266442 -107491 -296913 -114073
41599 -114073 236923 488708 588448 576094 430647 184039 2471 -10623 34059 -8825
41589 -8825 -110297 -163165 -161554 -149658 -111193 -51221 -69004 -194221 -267831 -163592 -21368
41578 -21368 -56347 -222883 -299000 -250715 -252598 -339807 -301416 -4965 374581 560595 471672
41567 471672 226143 -26888 -192785 -244097 -229075 -209236 -160734 -17368 184159 318939
41557 318939 348823 347692 328172 206350 -1497 -117752 -41303 100466 155187 164514 239823
41546 239823 339371 338967 246708 175023 139988 51120 -109079 -239041 -267438 -239641 -233187 -261709
41534 -261709 -274063 -202272 -28615 152694 185198 16734 -231759 -410436 -478029 -443811
41524 -443811 -295524 -97094 -38008 -217030 -451337 -475940 -281000 -76291 23438 66521
41514 66521 48355 -124429 -413044 -613396 -619936 -534308 -442030 -285087 -59669 61582 -42395
41503 -42395 -247605 -376865 -448546 -564096 -666560 -610287 -407106 -218276 -131018 -99141
41493 -99141 -80238 -82502 -87725 -63277 -42843 -74157 -106207 -58868 15440 -10180 -116580 -134067
41481 -134067 10751 192005 279753 300299 329740 351062 314367 250327 222003 218017 179819
41470 179819 101172 36881 39738 122882 234982 246385 45462 -292376 -520132 -489320 -323746
41459 -323746 -219470 -161743 -7041 201384 220636 -35154 -319044 -357737 -195339 -70762
41449 -70762 -46621 32391 220300 324623 178094 -89181 -194036 -55371 129298 147464
41439 147464 -8369 -201808 -324448 -349877 -292022 -189412 -103988 -71349 -55377 4572 101258
41428 101258 149745 81141 -68630 -172049 -120965 55736 191591 142587 -42238 -167657
41418 -167657 -141064 -102997 -234949 -494882 -659891 -615716 -469494 -342641 -190183 74586
41408 74586 368021 483042 329419 28864 -222390 -304714 -208057 -21242 99316 54215
41398 54215 -69949 -87284 32973 104702 -10038 -179427 -168936 33156 203679 184983
41388 184983 54373 -33173 -40260 -21442 -6600 1552 -22597 -94802 -174692 -218224 -238173 -250210
41376 -250210 -210703 -99566 -27572 -136657 -376663 -496252 -321519 26404 265268 264036
41366 264036 146758 98923 154233 211137 204545 180290 187657 169492 30385 -202134 -363420
41355 -363420 -327740 -143988 40199 135726 140024 62014 -87224 -238005 -290393 -231302 -161998
41344 -161998 -174655 -250497 -316445 -355000 -402581 -465015 -498279 -477083 -430830 -392606 -357561
41333 -357561 -326699 -347616 -438657 -487180 -330713 9553 273917 250965 60912 13336 200852
41322 200852 396762 387968 240115 145974 162931 229028 315906 410199 433534 347581 275010
41311 275010 348640 492020 523111 426620 326612 228992 30496 -214617 -304464 -228782 -231066
41300 -231066 -411453 -522151 -339367 -18359 151766 172105 244426 376484 379674 232097
41290 232097 154860 273423 433796 441687 304777 144882 21966 -46278 -11717 129517
41280 129517 257976 241499 98872 -26170 -32602 63867 206402 368311 525424 610559
41270 610559 554380 379509 211613 154548 170570 139809 37930 -20459 53359 187839 239424
41259 239424 157675 -2113 -175846 -317401 -368003 -293611 -144376 -3997 108229 217096
41249 217096 295441 276349 163657 50653 9782 21512 27269 2919 -39366 -92152 -181212
41238 -181212 -349316 -580829 -741593 -669547 -371717 -60706 69501 38193 -19438 -58633
41228 -58633 -126970 -228201 -310503 -349094 -327050 -189769 46113 194596 83004 -186685
41218 -186685 -329378 -226302 -16678 150290 255987 285285 178686 -17089 -149880 -200784
41208 -200784 -324441 -543881 -617969 -379603 -22755 152979 138517 125132 133032 10567
41198 10567 -223683 -320051 -150028 94071 162786 66780 10890 102645 246345 299043 246235
41187 246235 207501 291582 456614 538053 440519 266777 198381 273735 365080 370656 332783
41176 332783 330166 339172 280039 164835 114116 203908 345725 371850 239669 97339 103535
41165 103535 220891 270163 183215 90907 112086 171213 139562 77439 169627 425555 613153
41154 613153 555317 357397 237619 235083 225568 167872 162701 253397 330021 304639 251610 264609
41142 264609 279659 189799 67747 85973 221858 246714 73171 -76485 19442 245736
41132 245736 295781 77908 -189966 -262089 -100765 155025 332304 335918 215882 120465
41122 120465 122129 143886 127062 161876 320215 476373 484388 433760 493395 581693 482501
41111 482501 253914 186420 324070 385124 258879 211985 413775 604055 503335 263745
41101 263745 188738 229742 122047 -125685 -244886 -140792 18479 113945 173662 174339 41535
41090 41535 -133437 -147294 7946 132108 141283 164165 271628 349216 309507 221524 158209
41079 158209 106200 85064 159868 272659 258653 99504 -34555 -62847 -102052 -206702 -226418
41068 -226418 -59144 149844 223851 207714 237266 293125 264509 163199 102683 115998 125889
41057 125889 59435 -92385 -274690 -373786 -312738 -190330 -196815 -329507 -358148 -176446 -3141
41046 -3141 -66434 -247556 -250399 -17583 240810 356838 320178 136313 -189078 -517592 -647556
41035 -647556 -559663 -419758 -304938 -110911 206084 472727 494905 293603 45678 -118502
41025 -118502 -170698 -128969 -51021 -20614 -39482 18191 238222 491852 557493 420087 315453
41014 315453 422126 623718 673435 507611 265027 53300 -125994 -219459 -102185 188220
41004 188220 383667 313562 160178 190423 348704 368186 224122 176215 332056 466575
40994 466575 384265 198223 90212 22256 -107291 -201157 -97977 138279 294332 314538
40984 314538 327123 399549 458570 443438 369488 235705 21140 -205244 -293884 -165532 116875
40973 116875 416546 599566 589564 432604 267411 161124 47666 -95211 -133115 19324
40963 19324 197546 183811 22086 -73140 -57136 -65455 -120784 -98788 -3868 -1023 -96936 -57331
40951 -57331 218567 468421 397461 78886 -167105 -185638 -93938 -42961 -51391 -70080 -80295
40940 -80295 -102799 -167613 -269204 -326038 -236731 -18663 171077 205834 120658 24284 -43788
40929 -43788 -94950 -99511 -14165 122286 200949 152234 8374 -123161 -128833 19238 205065
40918 205065 254050 122027 -45836 -87229 -4267 75871 72934 23631 7013 53605 117668
40907 117668 111670 -11479 -192938 -311933 -302944 -195365 -51448 65524 75416 -48718 -165342
40896 -165342 -53398 296760 592155 560649 294647 135194 249155 467688 554483 492842
40886 492842 435799 462976 492039 421384 285535 229682 345366 563204 721378 722936 603986
40875 603986 460834 347640 253199 148230 34552 -50945 -82785 -91796 -130284 -181327 -158267
40864 -158267 -35746 80970 92248 56255 98736 199264 196794 25874 -170715 -218939 -124698
40853 -124698 -52366 -133995 -333567 -482619 -454040 -313058 -243677 -293347 -297301 -150263 -20434
40842 -20434 -110293 -310180 -345979 -224123 -223300 -410186 -489272 -263205 51129 160743 109502
40831 109502 123289 230442 283761 230277 127788 -4255 -137434 -140828 44944 230564
40821 230564 201698 42330 -1677 83578 86148 -51899 -127957 3879 225676 329505 239387
40810 239387 23220 -174365 -195458 -6283 220536 287484 212333 149322 128022 59465 -42859
40799 -42859 -74328 -59265 -122272 -224743 -174881 52026 241147 256567 207568 213292 221392
40788 221392 167589 116933 131495 171040 220849 336222 467018 437977 217545 9485 -44729
40777 -44729 -51924 -122943 -161978 -72238 34130 29820 -11154 2291 -31219 -189129 -281140 -114249
40765 -114249 137822 157677 -3691 15983 324702 598126 538751 242294 2353 -34415
40755 -34415 95611 307278 507026 603203 576791 490533 395352 292253 189204 108763 33407
40744 33407 -76797 -213459 -326804 -367763 -271585 -455 297244 309336 -77256 -556906
40734 -556906 -782195 -853766 -1125056 -1568550 -1721102 -1347505 -804431 -558595 -620440 -679217
40724 -679217 -579577 -405086 -231371 -60869 52257 28822 -90088 -172931 -166372 -132541 -145515
40713 -145515 -233423 -379676 -506428 -508542 -370121 -191541 -60050 19234 33977 -53095 -170819
40702 -170819 -156263 -8103 51784 -91141 -234665 -165979 3166 52839 53053 234259 541077
40691 541077 655912 475395 245935 164901 141654 56646 -17599 -4589 888 -75007 -105390
40680 -105390 33288 224711 273822 188529 108690 52191 -59633 -185685 -193711 -95837 -55509
40669 -55509 -132004 -194029 -142530 -67303 -98831 -218149 -307398 -312891 -269231 -211925 -147885 -85280
40657 -85280 -27153 43116 113910 111998 -8733 -159246 -189033 -89867 -30177 -117956 -207411
40646 -207411 -62365 305422 593403 550408 260972 13974 -35931 20412 27253 -52936 -135413
40635 -135413 -112452 48768 252516 333369 228458 66204 14658 77538 130245 117763 95584
40624 95584 98798 111870 160446 273834 348521 236116 8928 -66529 96571 269966 269412
40613 269412 218694 262381 238521 -69455 -497364 -658861 -496761 -342824 -401673 -496067
40603 -496067 -417916 -238495 -114385 -26366 95056 162913 56394 -165202 -344542 -426990
40593 -426990 -429353 -316022 -80654 131283 164676 71025 18567 32813 -2829 -119703 -215992
40582 -215992 -233009 -213729 -175269 -80656 40085 89232 51401 7570 -20601 -87929 -159642
40571 -159642 -105393 74831 193803 144366 58772 75100 103664 -2864 -174347 -225369 -155357
40560 -155357 -129001 -190502 -220562 -189436 -227255 -373119 -456175 -344287 -152506 -64341 -69436
40549 -69436 -35811 49271 87438 69169 83273 131059 107520 3214 -40512 47006 133559
40538 133559 85447 -11218 25193 189944 290989 219534 75455 -9706 -46718 -109111 -166677
40527 -166677 -107836 82022 247022 211322 -6654 -169023 -55454 266845 478334 371207
40517 371207 115558 54238 267902 497253 520613 437314 472669 635898 729575 636346 442177
40506 442177 288682 230267 240446 252297 186978 38917 -66945 -4377 165685 248791 175658
40495 175658 88458 130818 264590 350705 312339 158673 -55742 -227897 -260372 -199621 -226137
40484 -226137 -410333 -569824 -494003 -239176 -52860 -41894 -74190 -16064 84605 105216
40474 105216 27246 -61239 -75014 11108 164114 305041 358024 331012 325979 433619 620825
40463 620825 738499 652523 384429 115912 8577 16858 -37884 -179002 -191225 63838
40453 63838 371903 402004 161330 -18510 42824 168287 177614 188693 379050 645716 753735
40442 753735 708558 709714 777279 706818 439970 223732 277017 484272 574338 481131 367203
40431 367203 361714 433589 503986 547013 559142 528806 470788 423109 376774 261510 43881
40420 43881 -186254 -267691 -114759 191205 455903 526233 407770 234361 122085 70030
40410 70030 18235 -28006 6279 126769 190122 49795 -215981 -321212 -94590 273695
40400 273695 423714 253238 20037 -12492 125262 258695 354924 469684 515409 342994
40390 342994 53316 -33237 197983 479115 524363 372184 217135 100436 -17188 -32888
40380 -32888 173890 468110 581058 487068 406390 430876 413887 278985 165612 162004 141324
40369 141324 9795 -102461 -73071 -11608 -47159 -66360 92166 314893 360739 255768
40359 255768 254489 424007 546801 475186 322333 217641 106055 -79773 -230742 -197792
40349 -197792 -3088 207083 331766 349279 280217 199847 185305 174570 4657 -310561
40339 -310561 -481973 -276238 157912 457116 460110 293560 115133 -28725 -112261 -102224
40329 -102224 -53971 -75134 -155056 -172123 -103109 -72272 -138078 -183387 -100775 48476 158518
40318 158518 233829 296530 254984 32578 -236019 -317889 -185309 -45388 -40314 -67444 36432
40307 36432 257046 451202 551887 606154 643836 630745 567510 531995 569836 612531 577491
40296 577491 511516 548242 722415 909671 985333 973707 978876 1019711 1025144 979149 965302
40285 965302 1029232 1081880 1014157 859647 754307 745561 732896 628012 500041 495706 644535
40274 644535 808656 830295 686440 491793 388854 445960 620850 798103 891647 930156
40264 930156 1003632 1106085 1100718 908487 669401 599052 699059 740843 567627 288457
40254 288457 109995 91406 157869 251344 338806 347483 247730 166948 263531 487196 614255
40243 614255 543200 411645 380014 440249 499016 512734 455413 280475 25446 -149582 -148668
40232 -148668 -78993 -80413 -102856 -4428 195095 338750 388837 475269 661962 828712 845091
40221 845091 733416 596244 492877 449911 486407 553230 541976 435110 361750 417571 510995
40210 510995 491982 368101 275842 279172 317446 335633 346215 350694 304503 195959 91710
40199 91710 74973 181444 393478 640360 815879 873018 898787 1008979 1168331 1224440
40189 1224440 1142718 1077214 1137717 1209188 1121997 915977 786100 799059 813474 693600 472820
40178 472820 270489 161761 179997 335915 551436 663904 602657 505956 551511 704822
40168 704822 756597 603713 366345 200661 122967 84637 103664 206328 308597 288588
40158 288588 158055 46905 20395 22423 6394 -1301 -165 -47754 -128293 -117507 18701
40147 18701 108253 3008 -161151 -119015 143308 357820 335691 162771 -11217 -166497
40137 -166497 -285994 -237661 22524 263663 224207 -13599 -111855 71101 325191 410093
40127 410093 328021 203614 76660 -63020 -164627 -173717 -121701 -56239 36186 139600 138420
40116 138420 -24956 -197049 -181720 -27294 26679 -105576 -239225 -204032 -94470 -128304
40106 -128304 -347807 -573526 -614592 -441077 -175992 10151 13136 -129689 -273216 -306959
40096 -306959 -251669 -191241 -151780 -105220 -59886 -63926 -113923 -134282 -75916 17463 73536 81038
40084 81038 83068 114931 182369 271747 344301 345741 264645 164068 111461 92651 47114 -20060
40072 -20060 -25510 79132 236589 350164 374133 314982 195063 55305 -45393 -77646 -63767
40061 -63767 -24315 60019 199205 348596 453467 497408 470326 349615 167908 30069
40051 30069 -13088 -36233 -92510 -83667 81272 271272 267684 85942 -43897 -25253 151
40040 151 -58902 -91325 -23362 27583 -4654 38326 257994 436242 322197 47044 -45259
40029 -45259 93826 191981 122191 68405 159190 234662 120621 -92578 -209675 -201540 -154144
40018 -154144 -72802 100570 348643 582926 730645 731351 528805 169455 -155133 -265251
40008 -265251 -156772 48900 251648 405873 486248 507506 528161 570514 590198 566646 539291
39997 539291 504585 390046 213809 151014 311629 533717 541005 272381 -55415 -184775
39987 -184775 -34659 266483 476992 428295 204461 73777 159484 274543 197450 -1300
39977 -1300 -80637 5605 72396 5150 -103820 -128869 -41443 148055 402160 584650 554849
39966 554849 374425 247967 217990 118164 -99873 -220839 -94901 85598 53064 -120667
39956 -120667 -122391 136887 396969 424211 310196 295920 429200 524686 417835 155485
39946 155485 -71585 -124091 -18917 128285 226276 268210 296916 339634 373098 334062 177287
39935 177287 -46602 -188409 -133627 48348 140860 1797 -274911 -445010 -350889 -69930
39925 -69930 151055 109272 -173458 -471418 -571858 -463459 -290575 -159639 -58040 52255
39915 52255 153470 211799 226927 204428 137178 54874 39015 136163 289157 401367 446333
39904 446333 470000 498893 496723 435935 395150 536226 924739 1371805 1544942 1309515 901013
39893 901013 664176 669386 711068 652149 593163 657177 773659 786303 672244 538493 459834
39882 459834 419994 377866 310096 208553 93579 11956 -10313 16012 82568 177471 234153
39871 234153 179299 55190 -15929 -23976 -91256 -241940 -316372 -224384 -112813 -115995 -102210
39860 -102210 99448 341971 325832 85523 -288 259015 602394 702161 576062 455606
39850 455606 434006 443197 459773 529019 629610 674028 627216 513568 336566 95059 -150242
39839 -150242 -321839 -407180 -412369 -286334 -2860 315775 480492 440668 314164 224686
39829 224686 203740 233091 269126 230080 81021 -58252 -14190 207352 410468 459354 404165
39818 404165 318107 177288 -875 -65468 58769 187773 99372 -126592 -197416 -21906
39808 -21906 174227 183657 70349 532 -11356 -57755 -152136 -227814 -261211 -276369 -262085
39797 -262085 -181472 -36021 154413 386878 602614 637025 375168 -46531 -314290 -250683
39787 -250683 12647 194246 141035 -54389 -156775 -5141 325654 584416 595274 410540
39777 410540 175524 -62829 -300065 -419473 -290938 -16018 126390 28252 -130121 -175049
39767 -175049 -163598 -200818 -214148 -86777 108069 202376 187792 180454 182394 93621 -40552
39756 -40552 -21955 190537 358540 274265 49877 -49689 36137 140389 152424 143961 196576
39745 196576 271288 322856 407252 558653 658220 578131 405085 344901 407120 378498 166163
39734 166163 -35749 -50547 -6157 -119147 -327838 -389147 -264494 -133986 -50614 116554
39724 116554 351908 422990 266373 154056 290106 498085 537086 492373 564592 665571
39714 665571 573479 371326 348763 499416 501270 248877 40260 108482 292158 354441 348996
39703 348996 432547 532438 478047 330543 306734 433804 525059 483565 412706 410483 446407
39692 446407 477171 507963 484903 300352 3914 -138259 60692 437521 653256 598806
39682 598806 476490 480991 565702 592588 566036 577652 601530 517123 325406 175287 135475
39671 135475 96594 -17479 -86105 26868 235826 344388 334646 365851 497696 597174 557704
39660 557704 448398 373731 323215 260443 251551 374536 555933 626513 535135 406094 362422
39649 362422 372977 327659 219309 171957 271473 435083 518325 518972 569096 707722 783217
39638 783217 660749 430854 301728 350054 491055 627071 683504 557857 227624 -91846
39628 -91846 -102093 198918 457813 378137 58634 -177723 -169949 -9807 161606 293356
39618 293356 376383 381585 295868 181133 152961 265043 406816 383595 164300 -23303 35472
39607 35472 236287 296070 171023 108330 240939 376718 315835 164286 151015 295008
39597 295008 454962 584628 718055 784280 671890 452583 324559 323462 284243 124285
39587 124285 -17805 2638 126399 186361 117115 -15653 -129624 -188169 -174575 -69045
39577 -69045 125178 335133 426215 324308 150890 144531 371948 598766 560751 300797
39567 300797 92771 65994 79599 -12614 -151839 -208500 -180092 -131304 -34353 178289 431208
39556 431208 526924 395774 222771 236583 413576 494478 313404 13753 -138386 -87098
39546 -87098 -11978 -44984 -116533 -128493 -129327 -204507 -298272 -287538 -179967 -99495 -96515 -102321
39534 -102321 -71268 -44071 -45138 -22179 68658 188890 264307 257983 187429 120149 144958 277998
39522 277998 401192 376815 228376 113196 95016 55891 -101478 -264410 -240266 -34307
39512 -34307 133827 117539 32924 69788 181665 119855 -188019 -450376 -351357 1622 174127
39501 174127 -36089 -342259 -366596 -114753 109390 132549 48856 -9384 -17772 31127 165470
39490 165470 320936 350043 231455 147806 255144 464028 557351 468691 330828 266620
39480 266620 243229 167548 46413 -22705 1205 43332 28042 -9613 11909 89863 157522
39469 157522 207981 280933 323633 210808 -38018 -200232 -116993 83723 151853 25943
39459 25943 -143605 -214365 -158303 3234 220392 378918 375412 246349 131330 104979 119941
39448 119941 100462 18726 -92965 -135326 -2122 261894 429225 334758 95561 -44312
39438 -44312 -28196 10217 5304 25052 82093 75979 -29691 -128993 -125728 -40206 70143 177915
39426 177915 250080 265117 279597 351442 396519 278266 56496 -32188 103038 274083 284102
39415 284102 178977 128054 178191 239874 238410 186048 149998 191674 285272 300396 162912
39404 162912 17939 81468 315814 437514 313215 159011 221049 411527 434641 201059
39394 201059 -42259 4552 368561 772190 900532 707136 437606 326867 353820 389299
39384 389299 474098 739128 1092213 1243436 1089259 840418 695415 614831 518864 473772
39374 473772 529710 575091 528739 507596 618304 732203 673833 520551 499920 652080 789681
39363 789681 769082 641449 537949 524325 574703 618087 614757 603675 626219 619190 498724
39352 498724 342449 319134 417223 449314 378403 399773 598291 780134 797723 786735 878558
39341 878558 925365 772455 593307 649226 866984 963215 875097 761671 668338 507296
39331 507296 317074 226918 184854 24488 -199734 -247994 -94644 3280 -98591 -242316
39321 -242316 -265227 -235560 -267660 -316550 -304253 -287725 -347663 -418576 -371967 -218020 -119186
39310 -119186 -207363 -428037 -568576 -456388 -143886 144121 256343 221006 95665 -120789
39300 -120789 -346463 -389407 -225168 -113075 -217898 -290252 -5620 506199 790872 663526
39290 663526 358371 122346 -14889 -64478 -2135 78888 29607 -85857 -60142 81409
39280 81409 87489 -70125 -98393 130399 326474 224187 -3415 -22673 174587 322541
39270 322541 282585 152728 55578 19293 28573 41147 -17634 -164986 -294040 -276867 -109788
39259 -109788 81086 143098 13962 -190942 -240769 -54876 136332 59426 -208805 -325839
39249 -325839 -152532 106942 263582 368868 489630 524539 404698 270584 277776 379128
39239 379128 441920 438247 392114 282946 131378 47325 69744 82323 -1521 -91792 -60558
39228 -60558 86862 256668 363989 339239 184742 55790 101619 203723 110823 -125762
39218 -125762 -151523 152279 447092 424978 213982 84297 48867 23098 103829 359361
39208 359361 558811 467331 258770 282072 524770 656198 537424 348760 233120 133831
39198 133831 11968 -51722 -24810 19466 48308 98206 152344 153862 129976 148571 187637
39187 187637 205903 278271 469033 632834 567179 333905 200217 261412 345162 316300 265473
39176 265473 330499 492555 623383 635572 549253 474172 510967 615560 634000 542620 519953
39165 519953 649391 714062 510496 242943 319724 791513 1262577 1381351 1190374 954165
39155 954165 846367 866017 905105 844334 680155 547401 523451 490992 342876 217535
39145 217535 312589 541045 629742 526126 440748 485839 542110 519922 491253 494239 442901
39134 442901 313786 213273 183177 141527 88600 157793 365234 514804 476061 380621 411934
39123 411934 552438 674903 756273 855630 961680 988748 889308 702905 528442 468076
39113 468076 539503 645132 700236 753778 866349 923267 755724 438348 254182 322267
39103 322267 462368 496434 481234 534012 608371 589904 490746 410771 389978 411537 479895
39092 479895 598669 727853 836931 943792 1043786 1066959 969175 816184 729911 789490
39082 789490 997052 1274400 1476809 1487553 1334478 1165416 1101223 1162962 1322671 1540943
39072 1540943 1752736 1887926 1908026 1781804 1476840 1049682 679272 505747 488575 521778
39062 521778 602548 745623 821614 679896 400430 234360 295603 465992 586948 590296
39052 590296 472493 308549 256975 374539 471517 347480 116840 65243 223741 360530
39042 360530 387866 464647 635006 680445 473903 223000 180670 302673 369921 309006 218568
39031 218568 167848 121344 29260 -101094 -210114 -228973 -140107 14185 206745 437326
39021 437326 611559 540770 211968 -56719 63052 495311 861118 933629 792966 600304
39011 600304 451773 412545 465627 460849 323713 242898 412450 678031 727577 565208 482824
39000 482824 604079 777493 894762 987913 1023668 927225 803453 818738 890606 823774 698983
38989 698983 746206 879510 789303 488676 318102 384249 452374 436905 518739 699930 730075
38978 730075 588328 563196 723696 781194 620051 498595 563818 621548 551845 510123 565120
38967 565120 580146 581257 773318 1070246 1112726 881531 768925 914500 1027633 993926
38957 993926 1047361 1193782 1123117 878527 917414 1284095 1446013 1212486 1062823 1261363
38947 1261363 1430157 1349352 1377095 1677411 1849137 1758495 1903473 2469439 2869584 2744255
38937 2744255 2572364 2766643 3039788 3195263 3598785 4302315 4713372 4732444 5130792 6174967
38927 6174967 7088860 7576248 8533742 10456453 12599298 14592075 17233911 20708058 23941031
38918 23941031 26915833 31367620 37727577 44094009 50218747 59386367 73911581 93104638
38910 93104638 119735483 162388834 221628155 275668883 292029703 258848958 197874713
38903 197874713 141882936 105454011 82666332 65320431 52605420 44983612 39245598
38896 39245598 32839134 27195117 23890759 21482542 18353444 15401200 13785298 12619356
38888 12619356 10805537 9021091 8176110 7685123 6773749 5937896 5748507 5601041 4895829
38879 4895829 4209565 4155878 4227365 3819297 3333013 3274681 3263642 2875030 2517733 2576187
38869 2576187 2584406 2122435 1665541 1690193 1775770 1450947 1126566 1304048 1595771 1427830
38859 1427830 1059301 1023298 1147463 997265 767381 880379 1143465 1109681 898025 918072
38849 918072 1129568 1244902 1309393 1449415 1424942 1065570 767741 911357 1151912 959599
38839 959599 522430 421226 683125 848006 773955 725159 800187 859693 912919 1062724
38829 1062724 1177444 1067642 854306 760867 723111 593691 504270 616011 753412 703183
38819 703183 616062 680099 684858 398074 100021 202374 555126 683557 539995 468787
38809 468787 556740 567906 448181 380712 380846 303742 220488 347619 624645 762632 689390
38798 689390 584494 521145 426819 341113 365553 411155 314152 132412 36241 14821 -20463
38787 -20463 7447 171257 301013 248066 193496 332168 457896 271915 -83502 -225132
38777 -225132 -87410 138494 416176 749394 876621 618771 349321 535951 962255 1031826
38767 1031826 732838 604849 777616 790772 470691 254255 409755 588406 461796 252760
38757 252760 285924 461001 512129 427713 322633 217444 184379 387125 757064 961209
38747 961209 901381 906391 1221182 1658168 1967799 2168174 2251274 1977333 1323187 785829
38737 785829 816255 1191271 1347921 1148217 912043 835702 792535 664311 508706 377122
38727 377122 241458 130294 125102 204710 267233 307955 420803 622037 805717 882939 869638
38716 869638 836138 830702 835500 769672 585862 373782 279098 308543 334766 310706 324336
38705 324336 395493 389938 224104 10450 -96103 -74866 12584 120904 192589 163331 72770
38694 72770 45578 102034 125466 69784 34210 64220 57089 -44516 -141147 -161938 -190216 -290734
38682 -290734 -373944 -348501 -254399 -139425 24633 188058 177605 -41937 -232134 -174747
38672 -174747 44480 200670 227501 191577 129203 89207 187128 420152 568329 488175 367842
38661 367842 455044 651383 650654 412681 214978 235929 346214 362426 293861 256159 289076
38650 289076 339541 339851 264323 165650 146138 234168 332292 356897 353928 380166 369321 262017
38638 262017 176880 255939 390740 328144 58963 -121121 -9880 227727 295583 142967
38628 142967 -23248 -25432 108964 231785 236127 124701 -18659 -94002 -46980 98664 257436
38617 257436 343393 329473 240747 96425 -87428 -213605 -120449 203828 491029 453580
38607 453580 173120 33329 209609 429607 369504 111073 7283 192822 439207 476026
38597 476026 283183 46591 -46192 63142 279285 422375 377021 197353 47403 52699
38587 52699 220072 448430 584184 526544 327350 141346 52223 15840 -9006 13880 93545
38576 93545 156619 176653 244884 419694 612971 719903 745427 701923 525127 235552 43759
38565 43759 107056 287282 348012 297517 314525 412808 439688 377699 375410 456683 463322 350554
38553 350554 290514 382145 489294 499275 525825 676119 797558 683035 414341 260089
38543 260089 280191 272894 134821 46386 197082 490624 671027 651790 559539 479361 330492
38532 330492 55757 -202419 -249352 -109181 -6508 -65187 -152847 -86319 107065 231798
38522 231798 179958 43159 -31603 -22082 -37531 -178187 -413523 -600737 -619226 -472515 -250041
38511 -250041 -28174 147029 227011 206456 187515 284810 449497 502521 376169 198430
38501 198430 80983 -40824 -254465 -469963 -507173 -319621 -15093 290802 523373 599550
38491 599550 469943 218501 24005 118 113261 237567 252128 129329 -22871 -55085
38481 -55085 46612 151576 195850 284971 490628 667439 631945 451231 372193 480284
38471 480284 599668 564929 454487 481675 720544 1001370 1076199 882176 621147 529312
38461 529312 591166 593350 462170 370339 437488 525359 485431 431934 546917 740270 764817
38450 764817 609793 513993 588819 677769 636330 532905 492051 512184 530697 543412 578596
38439 578596 638106 709651 768549 767305 709156 702117 817495 926904 840385 600148 458267
38428 458267 531557 650196 610163 428381 271525 248951 348996 488081 561502 515616
38418 515616 406637 330641 298787 260016 223566 247696 319524 365454 373372 384574 379252 302632
38406 302632 191326 132159 108097 35572 -58942 -64741 19815 96261 162791 306671 490700
38395 490700 559710 499514 481318 587507 688848 666030 571790 500513 467549 482775 574539
38384 574539 683058 700191 656536 682032 753138 706060 544729 478027 577782 674289 692181
38373 692181 794100 1044840 1234753 1235995 1248574 1447581 1640316 1551313 1234441 917090
38363 917090 633348 327685 157757 335958 740812 999182 926749 643076 316457 53096
38353 53096 -22350 146647 396128 503731 465732 393227 210295 -254813 -894635 -1329894
38343 -1329894 -1339472 -1059639 -732576 -483432 -376336 -451839 -620823 -693047 -588709 -407660
38333 -407660 -274038 -237221 -310664 -458436 -557206 -521550 -441329 -444358 -477643 -406436 -266694
38322 -266694 -199456 -186854 -105831 -15869 -113208 -382113 -565684 -526837 -379414 -221888 -28023
38311 -28023 126137 37243 -276532 -468877 -293449 64013 252732 178885 483 -130493
38301 -130493 -149860 -43835 106849 151684 63537 -6951 31765 71280 14597 -41380 10030
38290 10030 72029 -1954 -159729 -241587 -230736 -232864 -271977 -278253 -239058 -212274 -212984 -205100
38278 -205100 -178399 -139732 -70293 23718 74920 53445 36401 91732 160293 143366 47600
38267 47600 -33530 -20711 120237 353874 528490 477497 236889 22240 -83383 -230410
38257 -230410 -470950 -548614 -243183 241388 503813 462611 375752 404093 443526 396289 333306
38246 333306 313031 253365 78652 -156360 -360247 -499902 -560270 -534811 -492545 -529207 -612712
38235 -612712 -594888 -415478 -187432 -48458 -27282 -72503 -107690 -51496 98222 196763 102739
38224 102739 -97393 -167078 -42006 93998 96778 38871 14853 -44126 -217513 -395154 -401400
38213 -401400 -247517 -108352 -80043 -83696 -67 185428 362632 374554 160461 -128285
38203 -128285 -223826 -30267 242642 317622 163362 -25713 -104593 -103005 -96763 -94085 -82925
38192 -82925 -84317 -103611 -100162 -59256 -39487 -88311 -144071 -88901 101394 314330 430093
38181 430093 458914 511887 648210 796513 839649 741311 569024 425495 379721 424561 469448
38170 469448 423763 331863 358693 561830 748060 687829 434727 267505 308273 383559 329124
38159 329124 247275 324630 528992 655251 594666 400459 145621 -114392 -268427 -221456
38149 -221456 -59368 11390 -76060 -183628 -197709 -181645 -238376 -354796 -467399 -565899 -632547
38138 -632547 -585090 -403522 -232232 -218788 -304793 -318029 -235640 -195994 -247749 -253502 -99392
38127 -99392 131496 272222 256957 116629 -107735 -338465 -426964 -290111 -63351 15022
38117 15022 -102539 -201605 -77227 205270 392996 347210 188901 144147 295315 508463
38107 508463 587381 468781 249020 38087 -155543 -361933 -524656 -526196 -346306 -120015
38097 -120015 1477 543 -32860 -31206 -2816 12627 -16794 -106434 -229091 -304288 -277637 -222470
38085 -222470 -289648 -505205 -672639 -567768 -229293 42374 30706 -130375 -140102 56969
38075 56969 194540 63278 -189465 -271633 -152121 -58812 -98714 -105330 59954 247853 217236
38064 217236 -21604 -224418 -216115 -28257 220916 418041 439025 225528 -71282 -175238
38054 -175238 935 235721 276776 139571 30348 60472 167236 266658 337567 352891
38044 352891 264449 106621 16611 77391 193811 195194 37319 -156908 -249445 -222867 -150695
38033 -150695 -82813 -12025 52431 39038 -106576 -313917 -428823 -391505 -315242 -326232 -367735
38022 -367735 -265918 1099 214959 174982 -29977 -118436 41088 304673 484540 574909
38012 574909 666467 736746 664212 429595 176649 47584 53451 137848 267675 397162 430634
38001 430634 322621 172051 117893 158572 167244 81578 -17717 -34609 26300 107030 179265
37990 179265 228957 224789 165705 111841 104565 96863 33118 -36579 -7762 122795 238046 249541
37978 249541 191888 147363 144348 160864 163720 102902 -67000 -295042 -415323 -307123 -54424
37967 -54424 138862 188767 194010 241607 261323 155851 -913 -24734 124289 270114 254279
37956 254279 143832 112205 172472 163322 10447 -134282 -99217 52863 102697 -27965 -195799
37945 -195799 -270775 -311939 -428646 -570599 -576358 -386853 -104919 130704 230746 146646
37935 146646 -88045 -295157 -267688 -7898 248150 298441 171686 668 -181229 -407065
37925 -407065 -626729 -727599 -676509 -539496 -389663 -283446 -275898 -342386 -329176 -126421
37915 -126421 124047 145226 -135855 -505601 -738654 -800131 -736578 -549978 -291361 -134768
37905 -134768 -205819 -408772 -543380 -533730 -442570 -337028 -261971 -278552 -386401 -448135 -337318
37894 -337318 -142565 -77638 -186537 -285293 -224703 -70999 27262 26575 -29585 -107853 -172484
37883 -172484 -159063 -63268 940 -59973 -154083 -94243 138489 329001 277063 40469 -141970
37872 -141970 -133763 -23623 37824 35718 65287 162758 256533 285118 269957 237745 161228 49359
37860 49359 20362 166910 372372 392193 156161 -112235 -149908 35491 193666 142652
37850 142652 -38598 -144735 -93315 21710 89340 109881 143256 197518 226709 203179 129400
37839 129400 6359 -134282 -192811 -103396 28988 25375 -102644 -138240 12436 144053
37829 144053 54757 -118850 -92664 118162 211299 67433 -58143 86476 399611 602814
37819 602814 603315 511735 423615 370426 405124 536548 612938 467408 187800 54958 164060
37808 164060 279739 160925 -110798 -255319 -151006 78668 285942 445735 565277 586128
37798 586128 455569 230782 44183 -10855 65549 190932 232325 88014 -198938 -448553
37788 -448553 -528767 -495113 -478877 -490091 -442359 -339975 -289409 -303741 -249133 -56327 145965
37777 145965 206193 149203 89754 47171 -16028 -48058 36166 185481 254206 207170 142649
37766 142649 111576 62090 -11890 -11774 116949 283048 352528 276804 93921 -107836 -209244
37755 -209244 -150375 -33159 -28866 -152473 -243537 -206271 -134116 -134772 -171875 -177139 -195278 -290977
37743 -290977 -399769 -403297 -301814 -199150 -151218 -122354 -62913 41216 160711 214126 131882
37732 131882 -16142 -47195 100361 255840 241318 110082 30922 26456 -7484 -82405 -102949
37721 -102949 -54305 -25915 -39002 -17008 48729 70997 49924 115687 303855 437623 357489
37710 357489 161063 70606 119887 122199 -49643 -281549 -371569 -285808 -178713 -180104 -249377
37699 -249377 -277916 -266541 -310180 -425759 -503676 -456800 -318555 -150524 38407 213331
37689 213331 276699 223404 219890 375572 528456 451287 212925 108525 235221 374700
37679 374700 349114 263822 288316 391757 440904 412672 361586 297510 242856 298602 487461
37668 487461 620828 506123 238888 111264 247060 487853 634995 643994 561193 423322
37658 423322 276286 183008 160300 181946 251383 370532 438875 329458 105189 6477 140096
37647 140096 317560 317485 189210 145588 238198 317263 287208 227552 234953 288481 321837 320440
37635 320440 297004 262409 262742 349955 469491 483473 374658 319235 452807 650402 668074
37624 668074 453718 190742 63171 101371 237872 375937 397169 244380 37659 -15375
37614 -15375 117544 222865 96549 -214691 -484265 -536697 -354146 -44684 214927 273003
37604 273003 127202 -71510 -176415 -157209 -44277 127728 262126 205045 -80793 -416600
37594 -416600 -577738 -508832 -306448 -84734 51745 14766 -152729 -255237 -179958 -76001
37584 -76001 -150981 -369155 -520810 -516572 -419958 -256332 -20889 161315 143375 32364 91432
37573 91432 321467 414547 216154 -38544 -93408 -22140 -20087 -73116 -76716 -107410 -290457
37562 -290457 -497653 -465533 -188386 63325 130871 143114 258290 438895 573291 655805
37552 655805 727218 744893 637082 438508 272445 208508 203084 180697 122956 56361 -13351
37541 -13351 -103572 -183879 -161901 4989 223747 368988 444199 541500 661199 701642 633804
37530 633804 538701 448852 327565 255189 420401 805711 1092714 1061706 900094 892227 976977
37519 976977 901556 687048 590915 645708 599508 361398 156058 116409 45477 -224320 -499981
37508 -499981 -498332 -265191 -81015 -70418 -133149 -174606 -180014 -109235 67323 237283 237649
37497 237649 92321 3288 83040 227500 276438 182400 3331 -155197 -169138 9504
37487 9504 242707 299035 115962 -115652 -186918 -108528 -39161 -47150 -52096 9462 63031 -9416
37475 -9416 -198503 -355927 -368024 -296392 -295600 -405524 -496639 -445668 -294660 -178891 -154549
37464 -154549 -178298 -218196 -283449 -350010 -357510 -304547 -266722 -288964 -328368 -334420 -316093 -286861
37452 -286861 -206586 -35773 189929 382675 467682 402946 194779 -59807 -206809 -182294
37442 -182294 -93393 -95211 -221555 -389683 -518508 -564242 -491305 -315661 -149703 -89380 -70316
37431 -70316 39337 209030 264505 167708 103720 199611 322261 300068 206356 223170 309658
37420 309658 245169 -2817 -188302 -130294 49984 140504 120980 90883 40144 -127210 -385719
37409 -385719 -563074 -528816 -307470 -11596 243375 367771 343409 254316 196227 155008
37399 155008 49231 -120679 -263447 -333490 -363672 -349570 -233885 -54928 26667 -52983
37389 -52983 -126122 -6649 236669 366603 299485 186339 170359 219793 255249 308935 455093
37378 455093 655455 778333 752323 633396 525383 471062 410680 237427 -65013 -330689
37368 -330689 -336580 -69223 213399 266863 138839 60214 120271 197311 196327 185325 235862
37357 235862 261453 121171 -175282 -453166 -548823 -461235 -341232 -334013 -408987 -379757 -152613
37346 -152613 104653 163365 52633 -5898 33698 -16362 -206606 -293400 -109998 151037
37336 151037 247461 262789 390477 521909 402758 104381 -42152 30704 49119 -105573
37326 -105573 -199552 -72170 91556 109973 126504 334520 607046 664773 462118 175002
37316 175002 -67833 -226769 -244818 -119141 6846 12167 -29973 -17299 -28542 -163218 -297419
37305 -297419 -247624 -86428 -27876 -55229 56874 360683 646633 761281 766350 737967 643234
37294 643234 485199 360300 289016 168887 -28094 -176650 -186568 -114969 -31331 71433
37284 71433 176283 221616 243148 357207 528200 546838 347229 153057 162133 258433 218348
37273 218348 62870 -6219 67527 153037 184057 242302 357449 399546 257339 20116 -116211
37262 -116211 -87235 -24415 -74053 -213246 -300675 -285927 -273819 -340841 -384087 -256132 5043
37251 5043 202010 210879 75464 -108752 -278297 -380504 -402537 -421897 -496655 -516701 -325573
37240 -325573 6183 218399 213924 186123 321972 552174 687087 644643 453432 185545
37230 185545 -18258 -16704 130158 183386 59882 -28012 94493 271772 245479 30913
37220 30913 -143538 -169783 -123605 -66392 14089 101474 158948 206439 248750 186174 -49827
37209 -49827 -333330 -480298 -492258 -495674 -499018 -409064 -258855 -209175 -306153 -419248 -454125
37198 -454125 -468256 -526624 -570714 -489923 -254727 34551 187817 70492 -210710 -352089
37188 -352089 -203001 22440 38634 -111252 -163129 -61985 -15001 -125628 -251227 -275765
37178 -275765 -268044 -279900 -221997 -63997 42788 -14957 -133825 -174369 -174209 -232214 -304444
37167 -304444 -276177 -152679 -32905 44642 103925 134834 110994 58799 9866 -61781 -156514
37156 -156514 -168978 -20845 163961 159227 -78912 -344517 -429200 -342963 -246734 -246170 -319217
37145 -319217 -397889 -437293 -409268 -307790 -192117 -157234 -201894 -184117 -2175 221626 273078
37134 273078 156316 104296 234803 382208 375168 292122 271906 242811 76613 -109804 -85154
37123 -85154 122332 264768 266550 275700 302909 141930 -235901 -510480 -425093 -142131 14429
37112 14429 -10273 -39336 11196 69401 89091 96856 94619 61490 18421 -14268 -63781 -116697
37100 -116697 -75149 87588 225360 203289 94547 56249 95390 105354 51126 -45723 -227969
37089 -227969 -515401 -746031 -721212 -519743 -469647 -746911 -1145979 -1314510 -1114772 -705261
37079 -705261 -353200 -213085 -227316 -211633 -72833 71117 41070 -164729 -364286 -405816
37069 -405816 -301382 -159398 -76571 -98316 -197980 -276991 -247091 -119694 27696 145237
37059 145237 212089 190492 73104 -47158 -51136 70041 229993 370675 476203 493479
37049 493479 361668 125412 -85716 -197257 -220807 -167662 -53049 27921 -19237 -113059
37039 -113059 -61557 145934 274579 163748 -35952 -77984 39315 109355 34892 -62007
37029 -62007 -48574 47272 118181 121392 76404 -8627 -130291 -242510 -291317 -298892 -348719 -458046
37017 -458046 -517590 -420989 -233309 -146390 -240734 -369649 -342875 -167641 -20104 -13093 -102820
37006 -102820 -223234 -380313 -552408 -608972 -447500 -167880 8859 837 -55985 -18856
36996 -18856 69265 73761 -10034 -41736 61311 214682 305822 356363 462911 623443 721544
36985 721544 679604 541669 388504 251272 149131 146223 304334 595140 897629 1076324
36975 1076324 1055135 851537 570575 345649 253009 279660 370345 484350 605135 721813
36965 721813 813063 842016 781739 666462 593552 638254 782452 952298 1087151 1140727 1087512
36954 1087512 996945 1015436 1160144 1211486 975566 603324 446476 598210 790285 784455
36944 784455 646126 545457 500136 451673 424997 455431 480446 440326 378306 330138 241598
36933 241598 109616 61192 160578 287878 353007 459784 673724 802177 651913 377151
36923 377151 301010 467653 630438 625213 493757 284639 18591 -151225 -34663 283094
36913 283094 466928 341642 82806 -46232 42117 285748 552249 651728 482500 218272
36903 218272 148732 289770 373366 277163 208481 354144 590780 694142 631095 482387
36893 482387 262279 -1231 -160201 -119946 -18350 -55285 -213273 -298320 -204973 -15703
36883 -15703 121330 123305 32368 5183 167330 429621 554105 454193 296932 240865 233444
36872 233444 176733 129456 181800 251146 184476 -2190 -144748 -151495 -76690 -10624 -2552
36861 -2552 -57429 -120538 -100790 23566 163549 222116 175212 39110 -130589 -192263 -33368
36850 -33368 214701 255523 2623 -308147 -468180 -533931 -584089 -496579 -191136 123975
36840 123975 221511 202717 284043 382245 249647 -59017 -209736 -74638 126600 201830
36830 201830 206431 229412 235322 211804 241228 328508 359700 315815 327844 430417 463558 336906
36818 336906 211864 279609 489453 628443 576628 385919 193567 134212 250979 433345
36808 433345 527034 532758 578096 669368 637400 403507 139225 46985 103896 143083 97145
36797 97145 45884 82732 220783 384371 448371 356586 231869 271746 501078 738549 834694
36786 834694 801679 675578 442265 189094 131187 336664 583322 646174 580743 554506
36776 554506 558773 508074 486538 618496 768022 665029 332316 109928 200163 430396
36766 430396 547693 527630 482433 458194 457450 503791 544111 425497 121624 -135297 -116526
36755 -116526 95879 235302 216245 181925 218950 241516 202165 221997 400309 624716 699362
36744 699362 587266 405914 234644 60861 -93072 -133537 -44749 27645 -60804 -250859
36734 -250859 -337291 -223998 -28544 94922 145966 217570 308665 312136 191671 65093 64956
36723 64956 188501 339569 455278 519792 504146 389434 236609 141534 107077 33991 -137645
36712 -137645 -337076 -437887 -379393 -200142 -183 117217 119697 81261 101565 186377 258129
36701 258129 271407 237290 142028 -43074 -247067 -320683 -232366 -133492 -157343 -254394 -298094
36690 -298094 -242372 -90648 164633 454058 601356 525792 382114 359566 437636 486087
36680 486087 490351 494771 440903 295130 242627 476388 836011 949183 738124 497867 438335
36669 438335 445538 373527 280894 252300 242817 238878 335336 504574 524375 310921 109250
36658 109250 158592 356581 457410 435208 440106 534540 679204 860402 1038306 1083689 954026
36647 954026 823859 860712 983104 1017495 971527 956217 954092 876309 755903 679138 611882
36636 611882 495977 432776 562642 832060 1078066 1273456 1490960 1689983 1735804 1583172
36626 1583172 1283306 891995 526649 386713 514160 652154 561611 361455 318093 418149
36616 418149 423110 254711 43593 -130776 -263743 -257444 -31645 236614 281735 138635
36606 138635 81507 196556 305759 308477 305899 363372 410396 400512 347673 218690 6771
36595 6771 -147519 -147259 -152197 -316823 -439222 -230112 167236 341000 241445 203399 345598
36584 345598 414983 289866 189349 274127 435262 569731 679185 638144 299210 -96179
36574 -96179 -87330 305324 534831 337880 87609 129414 275974 252260 174561 241265 339426
36563 339426 305766 247621 293913 340862 321130 394515 600398 671018 476016 295901 351007
36552 351007 419219 251434 20539 7744 156153 269183 345514 405234 312282 81694
36542 81694 13157 202955 304693 108736 -63376 77764 282087 259024 228623 454564
36532 454564 653588 458593 105508 43867 178235 122428 -77667 -127855 -149115 -480612
36522 -480612 -983201 -1184164 -1002448 -745577 -514901 -191570 109700 142634 -14178 -107150
36512 -107150 -164232 -316484 -383054 -159048 124233 167262 148575 339496 518631 407812
36502 407812 314319 618418 1005523 997615 847774 1034408 1287448 1108761 862131 1247447
36492 1247447 2044318 2542435 2862929 3586606 4449095 4833967 5198164 6409087 8029680
36483 8029680 9078624 10093069 12279415 15145657 17979705 23442843 35286676 50780808
36475 50780808 59691459 54532807 39460457 25386097 18082285 14969969 12160399 9550619
36467 9550619 8265753 7488469 6068595 4663852 4238517 4168403 3486216 2610141 2368465
36458 2368465 2456420 2186566 1801214 1820411 1912868 1544708 1044742 985782 1130387 957947
36448 957947 667307 720780 901005 738127 449726 572577 993702 1163428 995114 808043
36438 808043 636804 316631 32984 94171 325786 322188 141905 152105 331342 331534 139520
36427 139520 99660 305767 476396 440762 324949 249335 192905 149155 139720 130134 147006
36416 147006 325939 622158 711342 459914 223704 334210 563640 510908 266258 219858
36406 219858 403094 517512 485525 472905 448103 221805 -95365 -152240 89956 283110
36396 283110 219105 50052 -68182 -182970 -312725 -334487 -207819 -57847 31642 88123
36386 88123 97200 12842 -73651 -7762 186196 353423 459559 558160 576909 421827 237796
36375 237796 245273 351782 273067 33207 -37752 147998 285858 195035 109001 263102 515530
36364 515530 610564 562294 531136 519097 439352 349219 373831 478222 516201 454999 384585
36353 384585 341666 275532 178454 127829 182926 309826 414582 414754 297490 138703 37024
36342 37024 666 -64569 -219363 -375733 -371593 -166013 79968 158749 46263 -88146 -133139
36331 -133139 -192462 -366791 -471506 -214564 323700 661244 502862 129510 -718 147129
36321 147129 239775 106533 -78756 -122699 -60974 -39825 -129334 -294494 -428637 -415870 -269406
36310 -269406 -168242 -235316 -348311 -322577 -199628 -157500 -200490 -169492 -30547 90983
36300 90983 164694 291010 446867 452556 280380 162319 258037 406910 368869 171704 49069
36289 49069 113601 249264 304917 269794 229524 215070 155170 -1464 -154268 -127661 99634
36278 99634 344296 451229 458452 446824 373005 199538 56446 75118 158225 126803 15780
36267 15780 -6923 50686 30492 -82839 -160840 -198187 -294524 -373834 -240405 42129 161339
36256 161339 44608 6382 248477 524528 525965 343480 278012 380124 453823 401736 310422
36245 310422 254436 231536 261219 376319 536585 670916 760887 786202 673068 416540
36235 416540 168137 71127 86563 106366 140575 237439 308984 229847 64844 2407 66596
36224 66596 82153 -40320 -152879 -82921 118524 237428 151775 -48889 -178675 -136373
36214 -136373 29380 193591 260186 209468 103575 76069 244502 548297 725341 575029
36204 575029 231625 40227 147574 358081 427013 332946 184157 21344 -147416 -233806
36194 -233806 -160652 -16833 27930 -43136 -59378 120477 428440 644708 607240 366823
36184 366823 139188 76742 98654 7051 -240566 -473233 -533471 -445833 -313390 -164658
36174 -164658 11589 166182 221893 164204 38831 -98571 -191812 -203203 -161779 -131687 -107594
36163 -107594 -21653 118341 197899 152849 65248 44432 91757 135903 129870 72793 8082
36152 8082 21829 156817 318446 370248 320724 283172 259914 146156 -38486 -136844 -121155
36141 -121155 -140587 -220033 -165202 97679 340160 371745 323663 371444 402464 240712 18231
36130 18231 -4193 126434 128625 -58581 -210102 -193485 -116978 -76487 -29498 28638 17694
36119 17694 -21977 88266 366389 550464 423705 127280 -476 162255 390275 399654
36109 399654 195044 62829 192782 392706 333447 53086 -34019 273080 635633 649827
36099 649827 404093 258204 256753 150210 -93514 -220606 -146125 -78227 -106379 -34489 239239
36088 239239 508700 602194 645298 777933 870143 762328 582802 564892 689923 762295
36078 762295 739760 745115 802913 795972 689586 615203 688512 861582 995125 1008085 930845
36067 930845 847703 804255 779765 761532 793178 876081 885944 727982 539171 550013 744146
36056 744146 875450 866747 932022 1176348 1332183 1120056 688679 426229 431876 445910 278034
36045 278034 49652 -37288 26318 106303 130651 157814 282183 507877 708261 743259 645289
36034 645289 613130 746714 873047 763166 466903 270926 323795 458731 438610 252690
36024 252690 89100 89760 217321 333100 343472 276826 248253 334906 466123 469078 267574
36013 267574 12681 -57497 94636 240124 173332 -1149 -1613 228761 425877 375809 214421
36002 214421 214575 397839 545212 524823 402848 247624 36021 -204504 -340785 -294256
35992 -294256 -132037 49032 213774 340450 415879 507055 696086 913113 982898 867057
35982 867057 696707 540651 347028 168883 202828 474236 703856 659915 462222 355575
35972 355575 353118 319247 263047 296803 378730 342707 171618 41639 76794 201053 245558
35961 245558 107032 -178316 -436558 -478536 -295489 -65288 90708 229566 382928 408162
35951 408162 201858 -94411 -291690 -410189 -522257 -495890 -187496 208706 335967 178637
35941 178637 68279 158357 216092 39931 -203566 -232724 -43007 133483 146146 60719
35931 60719 39758 175439 392911 486428 317387 -15319 -278253 -353750 -285980 -130014
35921 -130014 78196 223142 181388 23456 -37318 55226 121794 24259 -144340 -212242 -120722
35910 -120722 96042 366132 544963 481408 211062 -37709 -99206 -14808 112797 247758
35900 247758 344488 320662 202256 140223 187932 216569 146194 87697 133348 182526 134779
35889 134779 97810 210201 376173 386548 237348 133571 202095 357686 438210 350091
35879 350091 112753 -122261 -140489 109492 379841 347651 -13633 -385700 -437957 -136518
35869 -136518 269203 487897 407466 144516 -84399 -138658 -16027 196058 363428 356824
35859 356824 189453 79276 219195 490754 593484 474259 396309 516182 652646 610681
35849 610681 478243 405396 328003 165289 86132 267978 531719 546898 320240 156582
35839 156582 180796 231289 225239 287010 446540 518434 396396 219498 133388 110549 118313
35828 118313 239902 482009 650725 582683 365744 194027 124485 101475 108390 163445 243261
35817 243261 313387 373095 412098 406311 392954 436681 490616 437720 310277 286357 395480
35806 395480 428704 257140 43196 -11461 64519 167815 343269 615918 774961 623872
35796 623872 344825 300201 510106 640455 523608 375141 410625 536919 570846 528009
35786 528009 511077 493149 418487 392887 552333 797352 863259 659379 373244 204074
35776 204074 132124 22706 -141479 -240875 -210204 -153702 -218402 -384478 -453174 -274911 59825
35765 59825 319417 394552 379757 391237 406494 341760 213919 136868 176794 277293 329430
35754 329430 279922 176928 131978 214324 357415 403917 280263 89512 -14686 -104
35744 -104 67300 169931 346277 560084 701645 773361 944448 1306316 1660127 1704405 1415773
35733 1415773 1085031 939369 883692 716944 473394 365672 426839 419202 180460 -91895
35723 -91895 -53109 349998 800118 970628 837843 599321 408261 286634 225478 237775
35713 237775 304190 360191 373423 380237 414838 443751 405342 291410 162430 92126 106557
35702 106557 163426 190773 165643 142349 165759 177799 86396 -68874 -123765 -15347 95637
35691 95637 25114 -179967 -310637 -285778 -233959 -273991 -348827 -337560 -232955 -127011 -76915
35680 -76915 -56145 -8670 94198 222285 284817 205572 29061 -103418 -119841 -95102 -113117
35669 -113117 -126598 -41952 106004 172576 92074 -39105 -81708 8128 171681 322105 407335
35658 407335 438804 474279 550503 634357 660568 599146 457806 253883 42076 -56378 59113
35647 59113 328201 538586 518710 301177 76378 5244 93379 231274 330865 402757 490261
35636 490261 555767 494194 279906 44653 -37947 83418 318029 528387 600965 484029
35626 484029 242711 53544 57335 207043 314967 253586 73580 -58553 1276 264433
35616 264433 573614 699569 542189 233361 2288 -34384 82122 246350 353898 338471
35606 338471 241761 200305 273232 345824 306764 233281 252623 309370 274399 221934 340918
35595 340918 575161 632658 414676 160986 60825 -3518 -155848 -232120 -36782 294468
35585 294468 460134 402104 295906 231253 167281 138289 224570 336923 297070 144322 107320
35574 107320 241657 354962 347626 354982 444793 447379 266245 124667 262481 544630 628702
35563 628702 431000 175840 33052 -30990 -35683 109748 388113 576344 516314 342022
35553 342022 285896 369029 451265 504031 619502 758612 716106 422514 104925 9690 87221
35542 87221 118100 73976 147525 417540 681742 713161 549814 410590 398457 412853 339292
35531 339292 217599 182550 284200 414569 424670 295571 152201 99025 110290 131746
35521 131746 201141 349706 450537 338205 66830 -137526 -201345 -272281 -403962 -409069
35511 -409069 -170292 107849 157298 10516 -92872 -38266 127343 361632 588761 603636
35501 603636 298704 -69308 -133214 81037 204615 90871 -967 132087 322789 348597
35491 348597 280094 294780 355162 313345 193191 138412 172195 209266 235410 291507 336248
35480 336248 298889 232104 257026 378544 483772 498201 434247 327847 236587 246581 361588
35469 361588 441974 385293 311669 415929 667796 820379 717683 452667 209600 79286
35459 79286 51842 77240 96551 88238 95503 151901 209841 216884 210089 232820 221612 115290
35447 115290 22020 99899 290288 359807 219342 9980 -157020 -331498 -518027 -553229
35437 -553229 -338556 -42574 95283 68117 66473 216868 482851 752136 892043 787901
35427 787901 473300 184222 149555 350117 591740 759597 854454 828142 587378 191625
35417 191625 -132174 -245128 -229580 -199679 -125014 52271 255638 375452 442586 537068
35407 537068 578569 398983 33392 -244202 -243501 -71890 59585 105483 128772 88183 -118130
35396 -118130 -416490 -559725 -425173 -171256 -18175 12188 36056 83104 76387 8967 1316
35385 1316 145046 372692 527817 519903 380821 204487 63290 -28106 -84827 -97182 -28142
35374 -28142 117421 255035 300391 274172 275429 346893 412652 364884 182024 -51199 -219087
35363 -219087 -264576 -223989 -178899 -168632 -164172 -132890 -87638 -41469 37465 163098 254675
35352 254675 202620 9033 -207832 -355101 -443060 -509094 -536974 -489690 -373836 -232751
35342 -232751 -102718 2487 88077 168629 235380 237157 135409 -23611 -139697 -161930 -112505
35331 -112505 -20164 94236 164921 111608 -39576 -148085 -120096 -5240 113226 235399
35321 235399 375334 458992 408441 286605 235195 271475 257737 95735 -142474 -315623
35311 -315623 -364286 -307157 -154539 90225 361378 536634 534422 380379 179946 53618
35301 53618 82688 253005 428512 442661 273658 90511 58668 134470 143820 39875 -52953
35290 -52953 -69892 -112539 -233028 -274361 -97058 148602 196248 56723 -5205 105609 174728
35279 174728 47338 -106699 -61629 113300 174567 62359 -65586 -96608 -71700 -55996
35269 -55996 -63129 -104212 -180358 -236733 -242511 -289022 -474731 -717171 -829202 -774335 -691450
35258 -691450 -663335 -628959 -549462 -480281 -416781 -243551 61167 317033 359189 252628 172993
35247 172993 177791 223345 310774 454627 563110 517740 363774 276362 322121 377711 314008
35236 314008 154325 7925 -65816 -73877 -33236 44451 139744 233426 315788 376371 396474
35225 396474 349343 204306 -29487 -236253 -238410 7202 300729 397959 303171 240897 331081
35214 331081 443439 431280 356444 361684 435876 466735 461376 533218 676848 735286 640524
35203 640524 530178 530202 543443 390394 101525 -71546 57380 408785 738874 858728
35193 858728 728285 421428 77361 -142708 -136666 58117 287178 419369 472527 573296
35183 573296 777067 968241 997303 898120 873582 1027610 1201893 1166470 916670 671558
35173 671558 600442 671267 778813 891275 1010259 1096431 1130680 1175729 1273488 1334417 1247575
35162 1247575 1073242 990056 1036430 1045689 905660 756837 803158 994622 1062129 879321
35152 879321 636505 575020 665970 688819 574076 499254 611829 804301 866916 775756 701254
35141 701254 760129 881117 929357 860534 714313 543584 418023 442997 683991 1055402
35131 1055402 1328073 1293846 957282 570066 431805 614511 909500 1081335 1116205 1142288
35121 1142288 1174970 1100029 908689 770081 796112 882218 888240 851790 886072 965058 973987
35110 973987 917337 907606 963987 979721 898756 784685 697055 633035 610747 662769 707346
35099 707346 588425 327809 185967 344350 647631 817686 833023 902974 1101158 1241994
35089 1241994 1171914 996843 909932 929932 953785 976672 1083794 1249649 1325203 1264336 1210480
35078 1210480 1278816 1378671 1363443 1261250 1224282 1313878 1478065 1694459 1967825 2199449
35068 2199449 2246291 2150917 2143616 2350000 2652910 2919841 3192727 3529234 3822773 3959711
35058 3959711 4037235 4228653 4513050 4743890 4937078 5275444 5830810 6479012 7107885 7724088
35048 7724088 8325786 8860281 9366950 9983020 10721922 11405547 11923148 12420386 13100800
35039 13100800 13929933 14657867 15078474 15170785 15033925 14772017 14417812 13913903 13196986
35030 13196986 12325250 11466771 10738102 10121398 9554602 9006148 8434050 7792813 7138225
35021 7138225 6602097 6184236 5697281 5031712 4361571 3938614 3760364 3606255 3362780
35012 3362780 3138960 3043628 3001561 2862040 2601512 2339673 2182928 2107568 2009995 1852650
35002 1852650 1722380 1713341 1783514 1796979 1701520 1578858 1508105 1478615 1469397 1505247 1571808
34991 1571808 1573964 1460477 1312286 1228046 1194201 1146249 1084952 1046270 1023162 1002777 1015443
34980 1015443 1059008 1040351 887701 668582 512793 475129 545665 709569 897949 965701
34970 965701 843243 651634 554723 557512 558413 525121 493659 468475 460227 544127 723167 808620
34958 808620 626647 302194 142973 254494 453196 555724 566797 565836 588532 654845 755398
34947 755398 782046 629618 396770 325159 491596 700371 724082 528177 238343 22839
34937 22839 22910 252193 540546 706839 775413 870445 948336 865440 684512 620427 648678
34926 648678 495672 123576 -112698 22535 290539 384668 410951 639424 983243 1095379
34916 1095379 884920 597729 427808 355089 348191 427972 510467 461656 350575 393867 592816
34905 592816 675673 491485 234425 157403 254627 360719 402847 411612 409721 431856 555299
34894 555299 775413 930050 878644 698978 587294 611792 682746 727877 765299 800768 771413
34883 771413 638633 474421 411513 524364 763488 985310 1052059 930570 700137 465291
34873 465291 284843 185753 186163 261490 333190 349382 346598 374403 395549 341494 240724 185506
34861 185506 171745 100361 -19813 -7721 250048 603632 821117 885289 942547 1012549 970366
34850 970366 831962 812736 996684 1167016 1142170 1105214 1364983 1896048 2374209 2623889
34840 2623889 2754630 2827712 2671418 2165468 1508806 1026994 819951 746116 674576 605733
34830 605733 580881 605830 672081 768426 859127 905540 918053 947082 1007220 1030057 923188
34819 923188 702423 540910 601481 796932 837986 610808 379602 445864 702066 758613
34809 758613 488246 184486 130856 261283 355956 358837 353766 391082 485440 650598 805040
34798 805040 780929 565565 398192 474544 682023 788919 766594 730490 674449 503462
34788 503462 287117 245345 453547 735052 885857 874772 788441 694968 614243 554509 535712
34777 535712 593167 744042 926714 1013557 925752 706668 461760 271893 175217 167787 207862
34766 207862 275912 403587 562279 603004 471541 401358 638417 1013267 1109360 881541
34756 881541 735083 885248 1040670 929454 750840 802205 988521 1058912 1063839 1196870
34746 1196870 1388609 1434867 1365940 1337187 1310290 1186770 1092725 1174670 1278253 1201277 1098650
34735 1098650 1241900 1541932 1733092 1871097 2186910 2581382 2756740 2755580 2879835 3155333
34725 3155333 3367493 3540760 3862206 4207949 4298240 4269137 4526278 5080689 5616379 6165553
34715 6165553 7086817 8403379 9812029 11320327 13214308 15472858 17941250 20956244
34707 20956244 24975790 29801214 35174708 41880968 51068805 63069023 78811085 101591403
34699 101591403 133329714 167205259 187719427 182636290 154724871 119089344 89359754
34692 89359754 68948041 54609930 43657971 35541525 29584222 24656915 20537422 17595424
34684 17595424 15443433 13284046 11209331 9891159 9238048 8471779 7369992 6431693
34676 6431693 5882154 5397003 4812038 4334987 3999941 3567052 3037158 2709048 2651633 2598204
34666 2598204 2427427 2317192 2346794 2323623 2100831 1782139 1541100 1443071 1456732 1475617
34656 1475617 1373134 1173880 1058146 1067397 1003090 792232 695896 894555 1119401 1020694
34646 1020694 684861 435305 323291 207267 160211 354066 640929 693698 525793 456903
34636 456903 574162 636489 544360 509494 669737 872298 946740 916861 851908 754374 670090
34625 670090 681731 730641 655764 452151 285025 224656 185187 143353 181291 277846 293715
34614 293715 216287 201033 318994 470074 583957 689656 750747 672101 532111 565285
34604 565285 820901 1062034 1107677 1060124 1071732 1095765 1027390 918176 867947 826516 691804
34593 691804 541999 596587 942103 1410075 1758690 1918607 2016587 2162258 2272175 2187844
34583 2187844 1942685 1752443 1687572 1548377 1206454 879733 840822 996801 1037665 909070
34573 909070 827716 870055 880380 809369 810818 918185 930969 748654 548840 488882 473183
34562 473183 376205 273056 266439 278030 210618 161421 268144 456984 543856 513928 520299
34551 520299 641153 786521 836867 770431 655059 575538 565456 594368 639012 728816 854976
34540 854976 903063 806485 702309 753879 874477 861653 769357 844533 1072799 1139720 955031
34529 955031 854292 1075354 1367289 1402782 1299157 1383743 1643488 1782533 1708011 1591617
34519 1591617 1507299 1363148 1189224 1156792 1260908 1279343 1126254 983763 980294 978024 820080
34508 820080 596999 502929 552914 596447 535923 404432 272713 182096 146447 144145 120473
34497 120473 53322 8074 78035 258139 410623 397741 258120 198488 345824 545035
34487 545035 520767 250456 30269 96405 319552 404959 289540 168283 173967 212978 143479
34476 143479 -21150 -143803 -121991 28380 208060 334044 418269 529197 665176 724530
34466 724530 640310 480911 362107 319837 326763 367543 430684 485729 525524 565387 565653 465606
34454 465606 344202 393358 631963 808711 731792 535229 437263 396860 254029 81941
34444 81941 97002 271250 341978 217499 85300 68819 53554 -52047 -130634 -63721 66903
34433 66903 121535 101358 89613 113683 157802 209118 230803 196048 173095 237589 294586 182245
34421 182245 -19359 -24319 230367 443485 375329 171871 75898 42769 -101265 -286349
34411 -286349 -279364 -61016 141690 174718 91309 -10251 -76875 -39303 138444 332702 356699
34400 356699 202139 33982 -52091 -94267 -80863 92411 409915 654117 646198 453495
34390 453495 261210 140370 53368 10034 75087 221854 293415 173963 -39566 -111438
34380 -111438 58183 287084 318436 150505 38456 144433 336377 423529 436350 503457
34370 503457 565189 443084 166668 -3578 75978 255947 336624 317444 308481 331925 326189
34359 326189 258885 147004 37093 18691 156147 347538 375198 185328 -6807 -4609
34349 -4609 99479 91816 -29227 -84644 -30140 -25915 -166222 -319598 -307327 -113425 148932
34338 148932 372072 485445 449511 306153 175208 126114 100365 24692 -53912 -29164 103263
34327 103263 234725 283983 265404 213149 126419 26511 -10162 51382 117968 65292 -84551
34316 -84551 -172870 -119296 -34821 -46103 -83875 22089 257395 393478 301887 152160 169227
34305 169227 295816 277675 58460 -108388 -5434 249113 369766 280447 180401 251431
34295 251431 420193 454948 244314 -66600 -221892 -129476 35687 42148 -108097 -194597
34285 -194597 -103680 -10381 -132250 -398366 -525928 -398498 -196490 -122166 -158865 -186675
34275 -186675 -196388 -248026 -296015 -218604 -15978 160292 215750 243351 372710 558294 618981
34264 618981 486407 328947 374384 639517 901399 953446 832656 736199 749385 758236 660218
34253 660218 560179 652978 941428 1179887 1128919 798535 402939 132456 24993 20355
34243 20355 55570 90194 98858 86559 92911 142860 196176 179907 80528 -23761 -40281 49175
34231 49175 195766 353843 504571 623446 682153 701265 749525 845953 895778 789130 563749
34220 563749 401005 421202 531135 539518 402885 272694 277976 347986 318974 155023 -36248
34209 -36248 -175638 -278496 -345030 -320279 -214694 -137514 -125743 -59564 133773 304797 279448
34198 279448 155154 190141 413579 566545 476902 287175 214014 255913 268883 197119 87453
34187 87453 -24294 -103413 -75316 70234 203226 213193 176552 222653 299107 243086 55059
34176 55059 -81026 -61633 19932 57844 80028 142378 202294 189811 129828 110932 165575
34165 165575 228036 193310 13180 -229680 -357316 -268204 -66941 42264 -17679 -141671
34155 -141671 -188027 -93420 125589 367458 454544 282938 -18994 -205332 -200765 -142405 -126765
34144 -126765 -92621 -6549 33294 -5771 32819 257552 504756 545395 423907 379865 474103
34133 474103 512386 363892 160997 106072 221116 381741 498120 556468 537030 402755
34123 402755 181376 -7066 -47915 46840 140113 114336 5133 -43859 44448 206658 349024
34112 349024 449261 499749 437900 238726 31903 2229 164680 338280 369724 297696
34102 297696 253536 269847 253654 124023 -73537 -193642 -122239 108060 334993 420149
34092 420149 379975 332191 321858 262006 73812 -167472 -286365 -196374 12624 181563
34082 181563 234608 205148 152438 106994 91718 136359 241227 362288 459708 524981 532414
34071 532414 422101 196460 -12687 -66630 8079 64639 44064 26588 63216 83489 23623
34060 23623 -68224 -129947 -186766 -260574 -266983 -121325 107375 264731 301013 290194 293218
34049 293218 315084 375786 498106 616429 613363 476176 322526 244707 224894 239303 336401
34038 336401 531955 706136 714444 580896 490432 575838 774250 918899 923117 827328 690232
34027 690232 508044 278637 94237 83079 241167 391943 368719 203370 74231 79226
34017 79226 127874 84002 -35432 -73192 43825 159692 56472 -236094 -412015 -247138
34007 -247138 102330 286069 192549 33656 4306 49816 37432 -20243 -41290 -43186 -84151
33996 -84151 -119215 -63884 50209 121348 144677 202906 309872 383750 370339 293544 195422
33985 195422 117218 115986 201144 277432 252886 180298 183376 264849 310012 275898 252770 317564
33973 317564 427196 484167 441578 343116 310393 444505 666387 735906 552187 346163
33963 346163 393293 600030 610732 318405 13522 -32878 111233 244269 330490 431234
33953 431234 509079 488890 409894 355482 312124 237209 184720 218581 269910 226087 106444
33942 106444 6312 -80446 -219639 -343405 -276209 14609 336496 493403 483274 423491
33932 423491 380740 351221 336499 343086 334004 267242 183805 179540 264075 323433 282961 240711
33920 240711 330930 486955 489219 278232 59227 7079 23221 -66171 -206910 -222280 -136189
33909 -136189 -140386 -256274 -287873 -157001 -39291 -68115 -120182 -32349 145940 270397 327493
33898 327493 377760 384077 269366 84026 -34399 -40538 -13298 -39668 -146999 -308607 -446262
33887 -446262 -470157 -365969 -188280 52494 393403 770615 996800 964234 765784 550498
33877 550498 374711 253179 213523 218748 174049 82387 37709 8094 -157343 -417277 -504188
33866 -504188 -357403 -293777 -505120 -681111 -476695 -109652 -62702 -343597 -512644 -391244
33856 -391244 -262767 -326812 -413579 -374192 -351873 -468684 -567860 -485601 -327345 -269778 -293224
33845 -293224 -289799 -255160 -215815 -138898 -48756 -49729 -108930 -29452 212636 335998 154845
33834 154845 -102977 -117518 61298 140530 45099 -27351 54272 216005 349979 400614 299721
33823 299721 31942 -226882 -234116 16883 269588 319197 234998 232238 410046 643808 693116
33812 693116 436191 33709 -206384 -176921 -76309 -84535 -89024 96752 371052 443334 251214
33801 251214 39761 12923 113625 182372 145675 5642 -177127 -239577 -36687 319417
33791 319417 507830 377910 133213 44266 124461 204507 191882 115548 17832 -51507 -11704
33780 -11704 136242 236064 155618 -11834 -66013 27962 138016 195531 243165 255127 115650
33769 115650 -158429 -354157 -330396 -210057 -182363 -232202 -213927 -105606 -17809 9724 47096
33758 47096 107320 97669 -23629 -163878 -212608 -149372 -16425 112492 126675 -26338 -213104
33747 -213104 -229287 -86224 -13913 -108522 -179814 -84585 -3051 -159910 -427744 -489016 -311075
33736 -311075 -163288 -179806 -206625 -129546 -64382 -110575 -167443 -146810 -157076 -295718 -428527
33725 -428527 -377924 -209953 -122398 -119663 -13878 259408 515155 556709 413958 276876
33715 276876 257008 281034 218741 79104 24772 160033 367648 452144 404397 383503 442520
33704 442520 447382 318431 179864 171300 251766 300029 288054 245152 165507 66709 33532
33693 33532 90886 138895 119096 120288 203264 266857 236461 231592 353747 446850 304251 18947
33681 18947 -120170 -28673 108802 134389 52304 -92835 -236026 -216939 63720 415329
33671 415329 535540 425485 366386 465439 524465 432760 380758 532699 746891 804032 707283
33660 707283 579443 450495 330098 315924 426445 468427 278582 -13895 -162898 -144822
33650 -144822 -125258 -169803 -192590 -143435 -62234 14452 41380 -76600 -329625 -468516 -248609
33639 -248609 208086 519666 531144 466736 537395 630363 531634 286344 148168 240295 426614
33628 426614 506979 426467 283745 214100 283308 442342 559741 524264 340389 125290
33618 125290 6857 16286 72860 75755 10016 -49926 -36276 45592 152619 257794 337914
33607 337914 351619 277461 147600 4468 -141770 -267416 -295388 -183068 -30516 -9182
33597 -9182 -163559 -348686 -387664 -241287 -4598 209046 343559 395221 377350 295875 156785
33586 156785 1159 -87348 -46523 89524 208593 225899 161441 114243 167809 307849 422692
33575 422692 406894 279020 166365 155092 200861 217181 186894 124334 -1413 -194529 -326624
33564 -326624 -249745 -29572 77387 -58515 -259714 -260465 -15333 300084 512661 563400
33554 563400 459580 255905 72771 12175 42697 60377 55408 99954 167406 120902 -53322
33543 -53322 -150456 -8661 239819 333857 242455 189588 322767 516257 550986 366050 69338
33532 69338 -198045 -332767 -293984 -154540 -75467 -138424 -235969 -211136 -77358 -3110 -78525
33521 -78525 -192525 -177881 -12075 177276 272218 277566 280329 339978 441821 539572 605249
33510 605249 624334 576131 456724 307781 186322 114063 84386 91837 110837 87142 26518
33499 26518 51815 260014 543082 688111 657551 611859 634102 631705 582927 651326 897077
33488 897077 1080628 980885 752103 695586 785942 734061 478680 282830 299413 357102 290887
33477 290887 205714 240981 296588 201383 6834 -85463 4753 201403 423839 614370 681084
33466 681084 574602 394545 292334 290617 305071 312515 378505 517528 619485 543078 257696
33455 257696 -91844 -261240 -120533 179944 345351 277446 173056 227752 378674 445531
33445 445531 391818 295041 169648 10701 -56686 109977 415704 594422 572365 575535 781391
33434 781391 1015297 941629 498729 12900 -135195 109129 449842 558331 378017 110650
33424 110650 -50411 -104217 -160001 -260337 -350619 -380296 -363764 -346703 -352002 -356149 -309527
33413 -309527 -204909 -121664 -144544 -233574 -255361 -167011 -74973 -68350 -98497 -96033 -104744 -193089
33401 -193089 -305427 -316188 -191518 -1771 188647 353453 459947 480191 431859 354161
33391 354161 275637 237918 276396 328623 263615 82678 -17226 105042 311954 346825 145952
33380 145952 -133752 -327006 -366541 -250109 -56130 55439 6104 -75536 -25838 110165
33370 110165 155895 66820 -53631 -155015 -263348 -320227 -199790 80592 322635 354684
33360 354684 169169 -123401 -344176 -298659 35278 389314 463082 293122 170957 209201
33350 209201 229151 111021 -501 59309 236899 389090 482380 545087 561132 526319 503160
33339 503160 533471 591017 667783 790491 919824 977434 1005644 1129956 1316252 1358809 1188271
33328 1188271 996312 947593 954859 870685 730183 649297 622659 579629 531958 525412 537928
33317 537928 542271 573373 633831 643561 578307 530382 533101 475900 320358 243730 399365 657744
$$ [...]
##END NTUPLES=NMR SPECTRUM
##END=
