##TITLE=31Pdec_LR-721-0-C1
 CDCl3, 24 sc
 2.10.2020
##JCAMPDX= 6.0         $$ Bruker NMR JCAMP-DX V2.0
##DATA TYPE= NMR SPECTRUM
##DATA CLASS= NTUPLES
##ORIGIN= UXNMR, Bruker Analytische Messtechnik GmbH
##OWNER= root
$$ XWIN-NMR		Version 3.5
$$ Fri Oct  2 10:06:51 2020 Russian Standard Time (UT+4h)  she@DPX200
##.OBSERVE FREQUENCY= 81.013821
##.OBSERVE NUCLEUS= ^31P
##.ACQUISITION MODE= SIMULTANEOUS
##.ACQUISITION SCHEME= undefined
##.AVERAGES= 24
##.DIGITISER RES= 17
##SPECTROMETER/DATA SYSTEM= spect
##.PULSE SEQUENCE= zgpg30
##.SOLVENT NAME= CDCl3
##.SHIFT REFERENCE= (INTERNAL, CDCl3, 0, 182.463)
##AUDIT TRAIL= $$ (NUMBER, WHEN, WHO, WHERE, WHAT)
$$ ##TITLE= Audit trail, XWIN-NMR		Version 3.5
$$ ##JCAMPDX= 5.01
$$ ##ORIGIN= Bruker BioSpin GmbH
$$ ##OWNER= she
$$ F:/spectra/data/she/nmr/P31/1/pdata/1/auditp.txt
$$ ##AUDIT TRAIL=  $$ (NUMBER, WHEN, WHO, WHERE, WHAT)
(   1,<2020-10-02 10:06:01.17 +0400>,<she>,<DPX200>,
      <created by zg, POWCHK disabled, PULCHK disabled
       configuration hash MD5:
       00 E9 B6 7A A2 85 ED C7 34 08 36 98 17 FE 4E 26
       data hash MD5: 32K
       EE A6 25 2C 0A 63 22 00 4B D8 7B B9 F5 A0 06 53>)
(   2,<2020-10-02 10:06:03.40 +0400>,<she>,<DPX200>,
      <Start of raw data processing
       efp BC_mod = 2 LB = 1 FT_mod = 6 PKNL = 1 PHC0 = -2738.957 PHC1 = 68.00137 SI = 64K 
       data hash MD5: 64K
       F9 BD 9B C2 4E B3 01 0A 50 A8 0B 7C 9E 9D 66 80>)
(   3,<2020-10-02 10:06:21.62 +0400>,<she>,<DPX200>,
      <pk PHC0 = -1.890085 PHC1 = 0 
       data hash MD5: 64K
       B9 03 95 45 3A 43 D3 ED 1E 5F 14 68 F9 32 BD EC>)
$$ ##END=
$$ 
$$ hash MD5
$$ DF FF 98 B6 50 39 8B B4 90 E2 A4 0F 2A 5E 77 E7
##$RELAX= 
##$RELAX= 
##$RELAX= 
##$RELAX= 
##$RELAX= 
##$RELAX= 
##$RELAX= 
##$RELAX= 
$$ Bruker specific parameters
$$ --------------------------
##$DU= <F:/spectra>
##$EXPNO= 1
##$NAME= <P31>
##$PROCNO= 1
##$TYPE= <nmr>
##$USER= <she>
##$AMP= (0..31)
100 100 100 100 100 100 100 100 100 100 100 100 100 100 100 100 100 100 
100 100 100 100 100 100 100 100 100 100 100 100 100 100 
##$AQSEQ= 0
##$AQ_mod= 1
##$AUNM= <au_zg>
##$AUTOPOS= <>
##$BF1= 81.014009
##$BF2= 200.13
##$BF3= 200.13
##$BF4= 200.13
##$BF5= 200.13
##$BF6= 200.13
##$BF7= 200.13
##$BF8= 200.13
##$BYTORDA= 1
##$CFDGTYP= 0
##$CFRGTYP= 5
##$CHEMSTR= <none>
##$CNST= (0..31)
1 1 145 1 1 1 1 1 1 1 1 1 1 1 1 1 1 1 1 1 1 1 1 1 1 1 1 1 1 1 1 1 
##$CPDPRG= <waltz16>
##$CPDPRG1= <>
##$CPDPRG2= <waltz16>
##$CPDPRG3= <>
##$CPDPRG4= <mlev>
##$CPDPRG5= <mlev>
##$CPDPRG6= <mlev>
##$CPDPRG7= <mlev>
##$CPDPRG8= <mlev>
##$CPDPRGB= <>
##$CPDPRGT= <>
##$D= (0..31)
0 1 0 0 0 0 0 0 0 0 0 0.03 2e-05 3e-06 0 0 0 0 0 0 0 0 0 0 0 0 0 0 0 0 
0 0 
##$DATE= 1601618760
##$DBL= (0..7)
120 120 120 11 120 120 24 19 
##$DBP= (0..7)
150 150 150 150 150 150 150 150 
##$DBP07= 0
##$DBPNAM0= <>
##$DBPNAM1= <>
##$DBPNAM2= <>
##$DBPNAM3= <>
##$DBPNAM4= <>
##$DBPNAM5= <>
##$DBPNAM6= <>
##$DBPNAM7= <>
##$DBPOAL= (0..7)
0.5 0.5 0.5 0.5 0.5 0.5 0.5 0.5 
##$DBPOFFS= (0..7)
$$ [...]
##$SUBNAM2= <"">
##$SUBNAM3= <"">
##$SUBNAM4= <"">
##$SUBNAM5= <"">
##$SUBNAM6= <"">
##$SUBNAM7= <"">
##$SUBNAM8= <"">
##$SUBNAM9= <"">
##$SW= 369.568048894756
##$SWIBOX= (0..15)
0 1 3 0 0 0 0 0 0 0 0 0 0 0 0 0 
##$SW_h= 29940.119760479
##$TD= 32768
##$TD0= 1
##$TE= 0
##$TE2= 300
##$TE3= 300
##$TEG= 300
##$TL= (0..7)
0 120 53 12 22 120 120 120 
##$TP= (0..7)
150 150 150 150 150 150 150 150 
##$TP07= 0
##$TPNAME0= <>
##$TPNAME1= <>
##$TPNAME2= <>
##$TPNAME3= <>
##$TPNAME4= <>
##$TPNAME5= <>
##$TPNAME6= <>
##$TPNAME7= <>
##$TPOAL= (0..7)
0.5 0.5 0.5 0.5 0.5 0.5 0.5 0.5 
##$TPOFFS= (0..7)
0 0 0 0 0 0 0 0 
##$TUNHIN= 0
##$TUNHOUT= 0
##$TUNXOUT= 0
##$USERA1= <user>
##$USERA2= <user>
##$USERA3= <user>
##$USERA4= <user>
##$USERA5= <user>
##$V9= 5
##$VALIST= <valist>
##$VCLIST= <CCCCCCCCCCCCCCC>
##$VD= 0
##$VDLIST= <DDDDDDDDDDDDDDD>
##$VPLIST= <PPPPPPPPPPPPPPP>
##$VTLIST= <TTTTTTTTTTTTTTT>
##$WBST= 1024
##$WBSW= 4
##$XGAIN= (0..3)
0 0 0 0 
##$XL= 0
##$YL= 0
##$YMAX_a= 35077
##$YMIN_a= -34193
##$ZGOPTNS= <>
##$ZL1= 120
##$ZL2= 120
##$ZL3= 120
##$ZL4= 120
##$ABSF1= 0
##$ABSF2= 0
##$ABSG= 0
##$ABSL= 0
##$ALPHA= 0
##$AQORDER= 0
##$ASSFAC= 0
##$ASSFACI= 0
##$ASSFACX= 0
##$ASSWID= 0
##$AUNMP= <proc_1d>
##$AZFE= 0.1
##$AZFW= 0.5
##$BCFW= 0
##$BC_mod= 2
##$BYTORDP= 0
##$COROFFS= 0
##$CY= -3
##$DATMOD= 1
##$DC= 0
##$DFILT= <>
##$DTYPP= 0
##$F1P= 0
##$F2P= 0
##$FCOR= 1
##$FTSIZE= 65536
##$FT_mod= 6
##$GAMMA= 0
##$GB= 0
##$INTBC= 1
##$INTSCL= 5.30512e-09
##$ISEN= 30
##$LB= 1
##$LEV0= 0
##$LPBIN= 0
##$MAXI= 10000
##$MC2= 0
##$MEAN= 0
##$ME_mod= 0
##$MI= 50
##$NCOEF= 0
##$NC_proc= -3
##$NLEV= 6
##$NOISF1= 182.463
##$NOISF2= 159.3651
##$NSP= 0
##$NTH_PI= 0
##$NZP= 0
##$OFFSET= 182.463
##$PC= 4
##$PHC0= -2740.847
##$PHC1= 68.00137
##$PH_mod= 1
##$PKNL= yes
##$PPARMOD= 0
##$PSCAL= 0
##$PSIGN= 0
##$REVERSE= no
##$SF= 81.0140089999434
##$SI= 65536
##$SIGF1= 159.3651
##$SIGF2= -187.1042
##$SINO= 113.3802
##$SIOLD= 16384
##$SREGLST= <1H.CDCl3>
##$SSB= 0
##$STSI= 65536
##$STSR= 0
##$SW_p= 29940.119760479
##$SYMM= 0
##$S_DEV= 0
##$TDeff= 32768
##$TDoff= 0
##$TI= <>
##$TILT= no
##$TM1= 0
##$TM2= 0
##$TOPLEV= 0
##$USERP1= <user>
##$USERP2= <user>
##$USERP3= <user>
##$USERP4= <user>
##$USERP5= <user>
##$WDW= 1
##$XDIM= 65536
##$YMAX_p= 347607300
##$YMIN_p= -1343841
$$ End of Bruker specific parameters
$$ ---------------------------------
##NTUPLES= NMR SPECTRUM
##VAR_NAME=  FREQUENCY,     SPECTRUM/REAL,   SPECTRUM/IMAG
##SYMBOL=    X,             R,               I
##VAR_TYPE=  INDEPENDENT,   DEPENDENT,       DEPENDENT
##VAR_FORM=  AFFN,          ASDF,            ASDF
##VAR_DIM=   65536,         65536,           65536
##UNITS=     HZ,            ARBITRARY UNITS, ARBITRARY UNITS
##FACTOR=    0.456856943014862, 1,           1
##FIRST=     14782.0589164792, 0,            0
##LAST=      -15158.0608439998, 0,           0
##MIN=       -15158.0608439998, -1343841,    0
##MAX=       14782.0589164792, 347607300,    0
$$ Real data points
##PAGE= N=1
##DATA TABLE= (X++(R..R)), XYDATA
$$ [...]
46314 -204360 -237253 -384225 -418711 -259176 -100124 -131233 -269811 -292043 -149402 -14245
46304 -14245 -23402 -113948 -169684 -218927 -362874 -555251 -613395 -482855 -340846 -341113 -382718
46293 -382718 -278028 -55365 98466 151280 251864 419526 448676 235096 -5252 -13847
46283 -13847 156447 254322 197647 120845 105437 80471 2275 -63155 -90579 -159734 -285461
46272 -285461 -323038 -156729 110542 274800 282704 252260 273990 314582 333032 377672 492259
46261 492259 585916 499720 215430 -82221 -206474 -183814 -192268 -306308 -401289 -331357 -107444
46250 -107444 146263 319737 338379 166570 -95263 -207310 -43209 200685 223315 27128
46240 27128 -93480 3006 104193 -251 -173612 -142802 79507 219152 141391 3955
46230 3955 -10684 76900 150641 184505 221320 254330 220439 73407 -177574 -453139 -605907
46219 -605907 -518575 -252399 -31943 -23360 -179874 -352596 -477033 -566293 -584855 -459706
46209 -459706 -224531 -47702 -64019 -225411 -361078 -364453 -285139 -233490 -223078 -152417 34543
46198 34543 219438 222015 32313 -172119 -264940 -303989 -355771 -324908 -111594 149079 206814
46187 206814 44790 -84703 -8882 164196 262287 283544 290033 226477 29530 -174452 -181442
46176 -181442 4754 173955 199374 159610 141356 88465 -66528 -248722 -335876 -333147 -338123
46165 -338123 -370877 -354472 -266809 -206843 -257465 -341555 -289317 -48361 234030 379115 394598
46154 394598 454677 651111 839811 797276 488859 108653 -131567 -184696 -149930 -151243 -249325
46143 -249325 -408879 -525951 -525906 -436132 -316048 -139763 154269 489361 650511 529914
46133 529914 286127 168951 237623 334712 297160 106832 -138514 -309781 -309094 -140801 56638
46122 56638 117727 23895 -68434 1415 227890 457586 551009 498404 382825 260505 110795
46111 110795 -89730 -286668 -389716 -373727 -275905 -109306 128797 357113 439869 370500
46101 370500 313298 380113 473437 458794 382925 369575 392717 351663 312807 431308 624316
46090 624316 590048 247500 -87151 -124673 3715 -4661 -141353 -138544 56265 161494 -19250
46079 -19250 -300481 -369713 -185546 17888 31167 -150737 -389517 -527847 -479679 -295418
46069 -295418 -136736 -121666 -200847 -236403 -177458 -89608 -29658 19951 78144 111016 96220
46058 96220 81018 113713 151684 111009 7452 -21277 129409 392902 594364 633346 552472
46047 552472 429681 275623 80998 -94248 -167056 -157030 -176531 -268915 -337951 -292874 -193604
46036 -193604 -166051 -214723 -221497 -120229 33670 181765 334529 470000 470742 270500 2057
46025 2057 -125661 -82972 -36510 -101806 -197445 -196533 -121065 -92416 -143022 -179302 -124003 -13260
46013 -13260 61877 49992 -39641 -150179 -180219 -28515 304104 670575 879756 846369 625888
46002 625888 334076 81398 -39639 5755 135052 200867 160277 139704 265048 476158
45992 476158 602858 595002 556633 543188 457718 212831 -106970 -331389 -383129 -295710 -133330
45981 -133330 5688 -19905 -256287 -530990 -604850 -455072 -287275 -253933 -289912 -267467
45971 -267467 -189449 -148074 -171683 -191765 -122535 66313 306692 440557 348467 108534 -50928
45960 -50928 -5113 136733 202463 168940 130453 140195 182071 242559 304269 297652 160750 -50447
45948 -50447 -181036 -118396 110375 358769 458635 351110 159395 78239 155761 255270 271735
45937 271735 280317 385817 525002 541900 395467 171106 -61369 -276879 -427408 -476726
45927 -476726 -476617 -494047 -503168 -471672 -491131 -648368 -803279 -703406 -342302 -6298 93997
45916 93997 58214 81191 174823 227705 214602 203764 219207 205499 95746 -144036 -480657
45905 -480657 -773208 -841339 -638707 -302641 4841 224149 335945 300115 144928 9761
45895 9761 -14211 -7682 -76721 -158544 -109163 59671 175840 138073 29216 -24050 -7217
45884 -7217 2263 -57910 -185653 -330034 -429589 -462656 -473414 -523631 -608158 -639054 -529481
45873 -529481 -290971 -40051 101417 116946 94540 112921 162289 196807 214936 237243 246524
45862 246524 211447 131432 -418 -212638 -445376 -515081 -344465 -163020 -268993 -600561
45852 -600561 -775394 -606257 -344324 -301074 -438071 -491827 -347807 -114790 67321 138137
45842 138137 114779 103608 231820 466091 606328 560107 482331 512347 534518 385096 152472
45831 152472 42452 47368 -4383 -131914 -185875 -127104 -85289 -132024 -204051 -261517 -321794
45820 -321794 -326286 -182163 34049 116246 16625 -92932 -92704 -60967 -90899 -146101 -175260
45809 -175260 -205275 -240413 -221499 -162029 -172025 -262244 -275453 -114508 91775 156417 61430
45798 61430 -73642 -149460 -131037 -33781 54687 27689 -104439 -226172 -302674 -418917 -575335
45787 -575335 -606656 -414541 -143580 6581 37997 91179 210273 301793 273719 117802
45777 117802 -92648 -219783 -160816 123 45134 -95591 -243782 -251273 -220025 -290458 -358819
45766 -358819 -220888 92224 346851 427040 401677 302073 80994 -175457 -238875 -44746
45756 -44746 176413 192690 46982 -86290 -182566 -333411 -515207 -589861 -535555 -505017 -600661
45745 -600661 -724222 -732430 -641035 -567517 -541971 -503893 -449668 -435982 -436744 -357197 -230052 -227983
45733 -227983 -396109 -540892 -511993 -425481 -429926 -419856 -237398 -30372 -79879 -313171 -345156
45722 -345156 -52250 242155 269858 177245 207300 320162 362579 366155 407607 368593 127354
45711 127354 -147316 -186171 -19505 83916 21283 -62422 -72492 -95687 -211147 -364629
45701 -364629 -463824 -469460 -401556 -357846 -458212 -655533 -718811 -558424 -413830 -496571 -609520
45690 -609520 -431735 -66519 71083 -117793 -293711 -229846 -98205 -89563 -113410 -65023
45680 -65023 -76651 -260880 -444011 -411590 -248544 -192058 -269693 -312149 -248914 -190301 -244788
45669 -244788 -390121 -500625 -437583 -189299 38582 13658 -181362 -186331 144710 494379
45659 494379 494669 198587 -75741 -202617 -283691 -346103 -311725 -230794 -256441 -365346 -360969
45648 -360969 -207706 -125118 -255708 -436851 -429687 -236384 -63170 -55271 -177195 -307601
45638 -307601 -370665 -385497 -412571 -441562 -371518 -172256 -16639 -117037 -429562 -668054
45628 -668054 -651645 -495352 -387369 -323095 -184160 22667 162136 168771 110733 56201 -7968
45617 -7968 -99958 -178014 -193980 -151721 -76526 23054 123154 155829 65400 -115291 -279103
45606 -279103 -337565 -292107 -228436 -246404 -364523 -479073 -460355 -317695 -211903 -247421 -316144
45595 -316144 -249129 -75049 23222 6731 49159 238171 393613 329897 153894 103143 178588
45584 178588 166845 -1067 -148959 -145147 -75932 -52938 -37673 30899 90595 70046 30799
45573 30799 59960 106011 50763 -112812 -283668 -382899 -388173 -296430 -148839 -40514 -14090
45562 -14090 -137 45554 19969 -184558 -464653 -576240 -417728 -132953 64893 76767
45552 76767 -55991 -196642 -188436 -522 187075 151338 -95546 -295319 -246982 -29938
45542 -29938 123864 100292 -19485 -96434 -73745 7376 79541 121140 161013 211450 221128
45531 221128 138448 20187 18655 218476 506290 648102 515783 222105 5803 -15590
45521 -15590 60028 83990 44489 17299 -6784 -102300 -217573 -171569 80950 324367 345272
45510 345272 211814 139055 153524 79999 -148807 -354512 -341068 -126425 128038 318327
45500 318327 435836 468287 375116 174302 -15180 -69459 4676 66382 -1564 -156027 -257578
45489 -257578 -247960 -187688 -121630 -15860 130849 221503 187571 99653 65795 90701 121183
45478 121183 150790 174837 125036 -14083 -87185 73802 401453 656042 721187 678386 593386
45467 593386 416734 149287 -63938 -109081 -63083 -77078 -169535 -221720 -138710 48078 215709
45456 215709 253477 154273 13771 -82335 -148772 -237718 -331341 -376172 -381478 -375163 -295312 -64348
45444 -64348 234537 407656 403570 367113 396073 397326 265531 67614 -62467 -114141 -171180
45433 -171180 -260937 -340450 -390692 -429908 -450276 -410076 -290233 -134453 -39157 -77994 -183964
45422 -183964 -152917 118712 421646 420203 76600 -281932 -377373 -275560 -165693 -48446
45412 -48446 163716 376741 386479 176663 -60966 -200538 -294610 -388795 -389101 -191569 145025
45401 145025 419843 452233 220618 -115662 -342285 -381490 -341392 -353046 -426522 -517301 -631097
45390 -631097 -752400 -759844 -569237 -309963 -190348 -211313 -192921 -84974 -48337 -172563
45380 -172563 -306733 -281615 -149220 -70073 -78132 -101622 -131384 -207909 -281640 -245215 -112609
45369 -112609 -35479 -106645 -243229 -301165 -226919 -61386 127758 266863 298485 251555 242830
45358 242830 335383 430575 387595 233354 146095 207055 278098 196911 5878 -120345 -119519
45347 -119519 -78931 -41911 63486 246053 346154 234681 33461 -15277 123095 231544
45337 231544 154299 4156 -36774 -4647 -80816 -272600 -358192 -208205 3774 46734 -29457
45326 -29457 2271 152622 171133 -44487 -229332 -106012 209589 374014 289620 171557
45316 171557 173762 199919 134844 42865 28519 57124 29300 -71455 -192247 -276280 -251268
45305 -251268 -63393 209299 392987 435006 455291 509082 461795 221864 -59591 -185176
45295 -185176 -176789 -164361 -128017 32491 251184 350617 307000 241917 177457 38391 -100247
45284 -100247 -33298 235934 419183 325668 119340 49863 101671 90324 -20935 -106103 -113631
45273 -113631 -119902 -150372 -118323 17431 162780 218418 207181 195510 151954 -11683 -263050
45262 -263050 -419745 -363604 -220106 -215207 -365213 -440425 -285272 -42275 52804 -7123 -41699
45251 -41699 17977 65949 53268 78116 178650 216486 86856 -86906 -114187 -10564 41274
45240 41274 -31420 -104305 -66044 8421 -33456 -202348 -342890 -332278 -233745 -194802 -224161
45229 -224161 -169174 52470 303350 399265 343698 250684 99764 -227303 -654908 -885892
45219 -885892 -774671 -551231 -517882 -648261 -666520 -449973 -163865 -13157 -28959 -122403
45209 -122403 -211589 -250535 -232179 -205525 -221908 -251500 -229521 -183270 -205502 -282146 -272864 -125034
45197 -125034 9822 -25592 -166227 -218979 -133024 -38313 -30079 -62254 -83938 -132810 -204658
45186 -204658 -152733 133915 500701 634034 420470 80452 -100861 -77987 -21220 -74972
45176 -74972 -225728 -359934 -367753 -214010 21190 183644 178929 47285 -128784 -330245
45166 -330245 -540561 -646906 -536063 -277406 -76665 -25484 -22614 16735 14220 -112875 -259706
45155 -259706 -250349 -108046 -60073 -239971 -490927 -538986 -317642 -48168 4549 -198435
45145 -198435 -473853 -644131 -682844 -627071 -453532 -145624 163795 261429 107088 -89152
45135 -89152 -119273 -31249 -32386 -180734 -294408 -191215 78306 301770 354471 298907 252775
45124 252775 248053 254844 272452 320970 368382 341068 210243 16225 -182381 -321547 -318249
45113 -318249 -148866 52819 96487 -29790 -147428 -158086 -177399 -305947 -426706 -387817
45103 -387817 -257810 -201002 -191188 -78177 106851 160041 30838 -93454 -76774 8549 81636
45092 81636 190640 337154 362763 174474 -57111 -96457 48444 169588 149327 62739
45082 62739 17439 15742 -10534 -95697 -187403 -193283 -103168 -35925 -87186 -165139 -112314 23106
45070 23106 23807 -151632 -269774 -167931 2613 30867 -33161 -9552 90514 99142 -19884
45059 -19884 -126690 -125459 -52963 39289 130908 163606 75456 -80175 -171478 -160688 -139472
45048 -139472 -178667 -227650 -182745 -9859 195599 256076 80173 -187483 -280372 -125667
45038 -125667 69451 111638 48722 -4848 -94223 -296449 -512208 -602825 -627111 -712266 -781802
45027 -781802 -670191 -448081 -354877 -424171 -454871 -372464 -339919 -449097 -561178 -545566 -451656
45016 -451656 -348481 -206677 -42622 23166 -33065 -61609 27289 132890 172670 226039 338100
45005 338100 373898 231440 28536 -97894 -216680 -427609 -605908 -553402 -310636 -88996
44995 -88996 42790 171158 275205 206968 -28672 -194730 -116303 94144 198221 114663
44985 114663 -39421 -109483 -26871 171163 361118 391534 194330 -135309 -396610 -454998
44975 -454998 -366583 -311055 -386923 -509244 -546132 -501030 -469334 -450767 -343437 -141548 9345
44964 9345 21442 -4399 43658 96665 23551 -141729 -243168 -231566 -202893 -216933 -214894 -139604
44952 -139604 -27096 53171 61296 -32037 -229579 -428954 -456080 -260265 -19276 45028 -64535
44941 -64535 -133534 -30818 114984 106629 -33281 -91559 38949 240248 382975 502059
44931 502059 654197 738091 628458 412441 302363 342423 391553 389255 422568 485588 397936
44920 397936 84292 -237423 -300850 -114022 101768 209860 254610 311602 372665 377536 290106
44909 290106 152936 84900 164796 298281 294609 113130 -72844 -104585 -9750 109456 213324
44898 213324 261698 172794 -17059 -88117 97438 359562 403466 193619 -42649 -140013
44888 -140013 -157865 -228051 -372307 -481119 -409157 -133503 139212 139815 -103294 -227082 -6101
44877 -6101 301709 299855 6070 -218165 -204439 -121314 -94607 -27429 112659 131380 -100099
44866 -100099 -404770 -523502 -427480 -260060 -103879 36790 122297 104439 19049 -62085
44856 -62085 -131287 -212694 -281671 -299899 -286279 -274729 -236869 -120060 55920 196149 220045
44845 220045 129095 -1958 -93014 -132694 -172244 -227235 -234556 -160537 -88350 -105080 -160720
44834 -160720 -161718 -147627 -208623 -262599 -130116 140460 250442 54959 -202320 -201958 50625
44823 50625 296637 382166 362818 311805 213875 67633 -44210 -40909 67439 213640 357720
44812 357720 504335 638996 673174 507594 186398 -72110 -90693 51146 124810 52319
44802 52319 -44248 -94269 -196145 -409472 -593634 -582553 -416781 -278193 -267056 -351442 -468347
44791 -468347 -561482 -568669 -478218 -363988 -279369 -163457 52485 287328 368665 240178 21871
44780 21871 -136913 -192114 -188436 -171790 -142985 -77320 20840 96557 106411 87755 108640 155699
44768 155699 150883 84689 36224 39395 39739 29596 109570 334330 586550 691090 592254 358078
44756 358078 91154 -94586 -97568 75002 288791 426407 484289 478075 361120 127163
44746 127163 -107229 -235394 -295752 -365089 -399440 -310991 -142913 -33349 -36206 -86505 -111280
44735 -111280 -79205 17813 135143 168012 64704 -93175 -197992 -241718 -259820 -237753 -171995
44724 -171995 -134609 -167935 -210314 -240477 -371203 -641495 -840445 -747587 -463638 -282434
44714 -282434 -300415 -385591 -471699 -598909 -667034 -457649 7843 385189 408294 184647
44704 184647 -18759 -108453 -163371 -249319 -360020 -443144 -406154 -202757 37516 106860 1291
44693 1291 -60349 26988 91301 -20524 -174331 -160509 -30097 -1335 -111157 -179896 -104075
44682 -104075 14068 60776 74414 142261 233699 228616 92423 -40263 1815 208201 357815
44671 357815 272473 57297 -23732 96937 205433 121594 -50256 -93148 5194 43722 -120697
44660 -120697 -402789 -590601 -558774 -381178 -252836 -285855 -396930 -442911 -423412 -437762
44650 -437762 -469087 -379629 -151573 41456 76804 37964 39240 56440 45383 68606 157517
44639 157517 191208 81439 -44335 -27136 65630 67844 6931 35317 121316 61836 -179751
44628 -179751 -376381 -343652 -168713 -60103 -110348 -285118 -533526 -813247 -1053557 -1154784
44618 -1154784 -1033640 -706361 -357684 -242171 -417402 -637477 -623021 -376366 -113528 26610
44608 26610 43398 -60022 -245702 -326444 -142409 146684 213145 40845 -34315 147791
44598 147791 307475 166759 -111471 -175814 13422 212710 298647 352192 393509 319624
44588 319624 137626 28116 101106 250254 315793 262771 143384 6536 -88246 -72647
44578 -72647 36322 119520 101665 48633 50274 70053 5942 -131173 -210342 -171463 -124734
44567 -124734 -188153 -289908 -248182 -43635 122628 111083 59632 176602 397298 448001
44557 448001 254512 69597 105211 230036 188997 -19240 -183298 -213438 -212511 -229966 -170957
44546 -170957 -11219 86554 -11791 -202208 -273548 -173833 -27361 65172 118661 167202 198052
44535 198052 214096 262717 339500 337197 181847 -18536 -71811 45016 143542 83442 -37883
44524 -37883 -54628 3350 -23827 -134878 -140673 22187 135440 -14414 -312246 -434582 -248128
44513 -248128 48453 174603 52911 -166017 -282881 -231004 -117449 -87054 -141482 -149432
44503 -149432 -61802 -14163 -123185 -273601 -260073 -104557 -60595 -268824 -550312 -620508
44493 -620508 -423513 -172647 -95714 -202635 -308254 -259851 -111363 -33299 -69349 -88178
44483 -88178 -18096 4221 -160872 -410075 -523619 -465687 -368784 -273595 -122642 -7470 -140332
44472 -140332 -487439 -689893 -521245 -226990 -203062 -474659 -713313 -684897 -456761 -195346
44462 -195346 17696 132799 81557 -124226 -332619 -373100 -219257 -12115 61889 -66868
44452 -66868 -279433 -381022 -309426 -187055 -141763 -156460 -154990 -143419 -157267 -135812 9577
44441 9577 215596 288378 139372 -86443 -162771 -23084 175529 218445 63802 -103366
44431 -103366 -83468 91833 209232 158338 35727 -54921 -131878 -186107 -93553 174288 413843
44420 413843 446223 371514 366369 371586 234593 41950 540 55773 -28213 -217291 -205406
44409 -205406 69286 272866 183559 10841 -4039 -4458 -247141 -624267 -773665 -571425
44399 -571425 -249945 -67570 -69422 -150862 -191928 -143650 -88610 -166148 -362470 -488424 -462706
44388 -462706 -460036 -630120 -836498 -875307 -798614 -771146 -734346 -516041 -210072 -121808 -317757
44377 -317757 -520724 -511007 -370618 -247037 -120101 70215 256222 337598 311260 212954
44367 212954 58241 -85061 -105632 -4724 94632 154621 268087 415083 378712 63215
44357 63215 -271051 -297206 -46270 162811 157773 67023 46227 56891 -11952 -144028 -225623
44346 -225623 -215696 -193696 -236304 -303062 -287813 -179835 -114164 -202473 -349121 -335309 -96064
44335 -96064 191743 337587 345111 315719 245366 49327 -245270 -463498 -469263 -312237 -155663
44324 -155663 -103652 -128232 -136891 -78117 19100 89571 96171 47901 -24395 -92570 -144868 -188739
44312 -188739 -221685 -196075 -61083 140411 284357 318361 323555 359728 348144 217728 67674
44301 67674 25423 24295 -74339 -191728 -117424 114303 219067 111969 75302 313405 590537
44290 590537 549430 218073 -59904 -97112 -10973 49867 85931 141608 206638 253341 245410
44279 245410 116497 -135594 -361097 -406865 -328518 -301214 -341194 -297853 -134929 -27791
44269 -27791 -116667 -321980 -488372 -579621 -634117 -636138 -547644 -406673 -291642 -218176 -152827
44258 -152827 -114192 -184931 -397482 -637034 -699376 -485350 -141787 53751 -2070 -109269
44248 -109269 -25586 196974 274775 92003 -121071 -89504 143895 286478 176638 -43235
44238 -43235 -156429 -152109 -179842 -284235 -329917 -233288 -142643 -260205 -541310 -723172 -655619
44227 -655619 -455509 -297532 -202469 -106413 397 109386 251137 401214 432952 289586
44217 289586 109057 45819 60660 31177 -22264 8397 109566 170029 162519 131584 59053
44206 59053 -75399 -161149 -90768 27892 25366 -13249 136426 418861 511332 311473 95018
44195 95018 74848 113073 43619 -13385 93631 213160 107767 -139097 -229917 -94410 48420
44184 48420 47003 -14089 -31373 -55597 -165794 -307524 -349268 -243259 -75974 26421 29296
44173 29296 16698 62083 108322 70531 32589 173888 463261 622193 502868 317854 325955
44162 325955 445837 401302 153425 -50545 -29525 145884 329072 464867 530083 455712
44152 455712 195455 -180645 -495273 -564529 -351996 -67006 -13952 -257112 -531868 -586726
44142 -586726 -486498 -434153 -436163 -363088 -239216 -208445 -253990 -220924 -119979 -139123 -303542
44131 -303542 -378403 -202150 94420 291899 311188 162315 -117693 -367592 -361838 -116450
44121 -116450 58060 -30232 -180064 -127101 39725 48406 -103949 -168333 -62030 29876 -2980
44110 -2980 -25614 78945 201175 197372 126827 142019 249093 329902 334415 301296 225097 63333
44098 63333 -112209 -124468 78926 314213 369133 241015 68484 -95611 -293520 -478918
44088 -478918 -508488 -358802 -186440 -93326 8572 181206 270835 125427 -105275 -117747
44078 -117747 129004 360675 355601 164177 -59274 -235597 -319212 -279038 -203825 -248088 -388855
44067 -388855 -418464 -272527 -160582 -236434 -347141 -295699 -160754 -117216 -98737 69804
44057 69804 299797 318758 106544 -55402 -13432 66988 29631 -23658 33391 90376 -24759
44046 -24759 -251041 -374170 -317763 -182366 -57711 32135 33274 -111646 -330098 -461337
44036 -461337 -465755 -465898 -530378 -540352 -362828 -69951 133991 166896 124854 82245 -22622
44025 -22622 -230254 -412019 -424834 -352190 -407967 -596134 -673018 -531089 -409907 -543536
44015 -543536 -761888 -708619 -384080 -169283 -277670 -473303 -450665 -239643 -50310 75180
44005 75180 211397 287712 159742 -92533 -196905 -58455 106753 74718 -111476 -251826
43995 -251826 -250316 -174932 -134652 -166834 -202921 -127618 63129 174335 2375 -367351 -597430
43984 -597430 -498021 -253509 -154824 -234195 -303441 -257664 -167220 -105033 -55716 -18320 -59719
43973 -59719 -206900 -373822 -454467 -440192 -405000 -408646 -444225 -461074 -419555 -329271 -238406
43962 -238406 -192454 -218334 -326727 -474581 -540772 -437282 -260026 -204005 -279355 -268165 -73458
43951 -73458 58902 -133129 -502719 -657954 -501521 -319769 -310461 -320279 -166231 45298
43941 45298 106521 26306 -41153 -52917 -64752 -57512 29785 150689 207339 213228 244746 274549
43929 274549 216803 112843 107924 240295 391129 446921 389401 236421 30176 -117763
43919 -117763 -113523 -32830 -55940 -224301 -381243 -383013 -255269 -108784 -6832 49272 95370
43908 95370 186287 313817 348443 181521 -79761 -212373 -191850 -230634 -440801 -640498
43898 -640498 -615101 -422129 -281964 -264730 -249767 -148029 -14321 58366 46104 -15531 -77204
43887 -77204 -106229 -112026 -128986 -152999 -137833 -80886 -50366 -86157 -140657 -168999 -207457 -298735
43875 -298735 -403582 -452444 -425323 -326218 -161613 -13070 -24553 -204321 -336125 -239971
43865 -239971 -52928 -67267 -313263 -503843 -430818 -225642 -130359 -166448 -181613 -130951 -126294
43854 -126294 -207644 -235344 -96839 83790 80022 -112808 -231330 -83392 183462 275134
43844 275134 138670 -12250 -43670 -70255 -207933 -347984 -328057 -196683 -122600 -117374 -50226
43833 -50226 81871 105085 -63158 -264862 -308065 -208713 -133667 -177225 -281544 -337597 -294378
43822 -294378 -184543 -83431 -33156 237 63866 120566 81609 -48607 -140564 -97772 21031
43811 21031 97469 109456 110316 100639 35468 -44051 -13874 137238 217123 51081 -250206 -381274
43799 -381274 -221470 4617 19104 -163426 -297328 -238302 -63682 109614 252708 338651
43789 338651 296160 138620 13718 16647 47562 -33673 -188349 -256046 -176801 -34430 87086
43778 87086 171215 210332 193053 152828 139260 141349 115732 76109 68840 73638 23738 -74179
43766 -74179 -129904 -93225 -19045 -938 -87956 -248412 -365131 -312692 -114483 31778 -19012
43755 -19012 -168771 -234041 -223351 -283036 -411610 -451864 -386137 -401263 -565529 -652347 -442127
43744 -442127 -53539 198001 184908 54459 -12951 13604 56177 33806 -77626 -220805
43734 -220805 -300666 -297012 -295705 -358214 -412624 -341813 -140089 79560 197777 162278 8098
43723 8098 -134795 -115995 77714 286952 363836 326230 260563 167643 27391 -61523 23594
43712 23594 211555 274939 109999 -151425 -334011 -388664 -330814 -159682 64063 177318
43702 177318 86180 -79153 -110714 -1863 44630 -100977 -322719 -422186 -365723 -286753 -290054
43691 -290054 -343181 -350744 -257307 -73124 121775 180193 -10931 -366937 -613389 -546844 -252917
43680 -252917 13216 120336 132136 121129 63561 -47746 -124044 -94101 -2239 85541 185363
43669 185363 311251 368715 263648 82287 27169 161365 324666 335044 188823 26451
43659 26451 -26281 56073 199006 258812 117326 -174053 -381119 -308414 -31986 170486
43649 170486 132079 -48418 -189179 -245625 -257415 -184053 29818 252913 238300 -35266
43639 -35266 -267645 -207183 17580 91544 -62918 -243945 -298670 -285966 -300774 -327516 -329832
43628 -329832 -339409 -378962 -400705 -363202 -287444 -200126 -103995 -19545 41029 137308 304558
43617 304558 397623 215780 -173289 -434384 -378030 -177660 -57793 23595 199131 386750
43607 386750 409879 308965 270627 298144 207481 -50306 -298359 -402758 -426180 -452935 -443991
43596 -443991 -355764 -258731 -233346 -244105 -209732 -134549 -93152 -119911 -165769 -152530 -59659
43585 -59659 28632 -9925 -185429 -358859 -413672 -400709 -420551 -430926 -311452 -85756 76646
43574 76646 81651 -9860 -133562 -306139 -529177 -741853 -899125 -974184 -882848 -578087 -244794
43563 -244794 -184975 -413173 -569532 -383198 -42715 88196 -24762 -114957 -68057 -63461
43553 -63461 -235832 -448415 -517137 -479823 -488117 -536803 -469617 -231889 24422 126498 84164
43542 84164 46650 94300 139578 48427 -181307 -406225 -501359 -492899 -490256 -512009 -450583 -237081
43530 -237081 21411 141987 81876 -27845 -69073 -62912 -70490 -68003 -8328 65783 78892
43519 78892 43104 6468 -69290 -237862 -412938 -456268 -406908 -424337 -494549 -431010 -225151
43508 -225151 -126781 -245817 -342189 -211386 -30220 -55982 -197593 -209563 -147108 -252304
43498 -252304 -478719 -529641 -357821 -234901 -275895 -276247 -126968 -29826 -136712 -291694 -321359
43487 -321359 -299785 -319813 -265169 -47312 161835 194316 190490 361330 596281 601455 344341
43476 344341 90903 39143 145374 289864 407342 450884 387773 241619 49566 -170483
43466 -170483 -337417 -316214 -125238 14995 -10069 -25730 109148 192139 -16517 -325640
43456 -325640 -314705 47354 349914 328694 160894 97097 121898 119087 107786 143528 178037
43445 178037 169811 180830 240666 258444 177041 73693 11036 -63137 -166483 -185242 -46939
43434 -46939 140186 235491 234554 186898 76281 -96623 -230607 -251352 -226918 -243306 -259396
43423 -259396 -192216 -53664 91657 200980 204663 25668 -244579 -353378 -218164 -84986
43413 -84986 -166773 -289604 -155783 164411 314887 182878 26791 48022 140594 154825
43403 154825 125423 90650 -61217 -351705 -509607 -274471 185570 420558 263447 22101
43393 22101 40190 249210 297822 38021 -281892 -332580 -95309 154293 209563 152543 167043
43382 167043 248207 228886 52985 -132087 -185101 -140100 -100338 -74956 -15626 65774 122527
43371 122527 162520 210063 220488 138224 8793 -76490 -126053 -223964 -373678 -488289 -531634
43360 -531634 -534168 -467432 -271549 -44832 -14954 -226743 -437907 -455289 -395402 -432813 -470928
43349 -470928 -327510 -119804 -130145 -321653 -347065 -101563 90240 -4834 -151121 -41380
43339 -41380 190108 183889 -66886 -211253 -77126 111537 106601 -36959 -113972 -74363 -57200
43328 -57200 -199057 -467083 -648573 -538701 -203886 28118 -38551 -197572 -152191 23302
43318 23302 22215 -159751 -199527 -3424 104456 -79928 -272318 -142605 152571 212850
43308 212850 -13309 -226030 -257629 -212924 -162461 -30043 171347 270314 184339 27072
43298 27072 -90123 -170527 -204428 -143862 -71429 -173511 -439181 -593096 -469329 -264280
43288 -264280 -238194 -323694 -260902 -31410 99541 -13882 -170782 -91362 217864 477207
43278 477207 463781 242351 60821 61331 137308 93698 -87929 -215777 -128907 108381 300651
43267 300651 341090 267503 155268 52265 4822 55070 189120 337876 439714 468612
43257 468612 416149 302678 203624 204653 314633 458080 550939 545693 424039 218368 42997
43246 42997 24534 171253 366805 508201 580972 582910 477065 285201 138442 135757 205366
43235 205366 206094 127061 82040 133555 235177 330442 384865 329292 123850 -97268 -110432
43224 -110432 102328 302737 330974 315449 404656 469944 310055 32867 -58994 65808
43214 65808 117581 -48223 -204645 -116831 119140 274070 312705 316526 255014 83569 -45819
43203 -45819 61691 331706 510322 535537 562759 624493 557525 344884 244916 412792 613711
43192 613711 528668 204712 -22637 21216 191061 285696 274472 237781 241572 323260 482925
43181 482925 627490 614901 424596 225446 201810 335832 423630 312952 83567 -34487
43171 -34487 94721 388247 666801 841152 924592 919240 806504 652570 603473 729586
43161 729586 964886 1234180 1539734 1904283 2388643 3207256 4559630 6136408 7027403
43152 7027403 6510425 4912832 3353808 2575031 2323842 1967549 1356665 836871 664029
43143 664029 737419 823536 776779 563297 271898 91708 117311 196601 113670 -120116 -306727
43132 -306727 -336474 -250585 -85722 137601 302683 299038 235425 315525 484665 464877 203087
43121 203087 -350 62885 213311 225089 205621 361866 577389 548789 256552 -14487
43111 -14487 -102677 -123300 -171860 -161783 -50010 23655 -30339 -60719 114393 421291 613919
43100 613919 581075 438018 346202 355256 415414 455968 434129 354753 258351 181464 142676
43089 142676 165236 264385 388291 421856 300264 99741 -28850 -19726 40055 17733 -93447
43078 -93447 -137251 29586 330994 515260 442214 251683 175883 253672 332988 303140 193207
43067 193207 62749 -58332 -107383 -12707 170255 271728 224540 164094 236640 398386
43057 398386 492131 456725 373735 347521 406867 492129 492689 341830 118204 -1335 59021
43046 59021 174708 173470 33534 -130206 -226082 -259211 -277454 -311731 -355714 -358038 -253743
43035 -253743 -43501 177949 304109 306677 226417 115412 18294 -28381 -17138 29086 93266
43024 93266 175099 256628 290382 233717 83186 -98315 -170010 -12032 282377 408025 191327
43013 191327 -135714 -199766 20016 210129 234786 319139 611485 865542 778755 433176
43003 433176 159480 114200 218434 379014 525988 531558 336227 90583 -40420 -131628
42993 -131628 -334481 -558120 -585397 -447334 -388069 -468921 -500002 -394229 -306292 -346243 -398292
42982 -398292 -313353 -88336 200849 456746 535107 389321 251426 400476 737556 937508
42972 937508 1087671 1724205 2977576 4083167 4161311 3261410 2219109 1625248 1377568
42963 1377568 1191056 1046341 981589 838198 500420 180023 180252 449955 604653 402344
42953 402344 23202 -192050 -159786 -84587 -116236 -141547 -1852 204116 213183 -24125 -246002
42942 -246002 -221365 -26949 126296 203512 317788 472232 523359 410639 267883 246210
42932 246210 321445 346654 243020 65016 -111537 -285499 -461745 -541664 -407824 -145328
42922 -145328 -31184 -185417 -356807 -241975 67317 201052 51925 -85619 20118 217199
42912 217199 254327 141062 34905 -33386 -111693 -162924 -164363 -235632 -447634 -620641 -539953
42901 -539953 -275505 -64058 23330 52478 -23924 -280289 -537027 -500372 -203768 1108
42891 1108 -52854 -157720 -125487 -58300 -72536 -46134 129683 267933 125025 -207296 -409399
42880 -409399 -371135 -286787 -326821 -428114 -451795 -379095 -268645 -133527 35197 173524
42870 173524 179287 61299 -16975 94871 346490 537998 557413 477077 390666 273980 86181
42859 86181 -105069 -221211 -301496 -392616 -401814 -242464 -57013 -76407 -282958 -436751 -432393
42848 -432393 -386756 -350633 -209983 34172 150155 -9284 -284198 -450313 -490590 -467172
42838 -467172 -326118 -41117 205734 216759 51915 -87243 -146769 -200497 -245418 -229676
42828 -229676 -200952 -212563 -161403 49406 256850 209666 -39736 -189855 -138920 -90741 -159081
42817 -159081 -161836 51686 306632 323838 87548 -177250 -301390 -310650 -332958 -459838 -643696
42806 -643696 -692774 -470096 -131147 -11114 -204048 -426223 -412133 -264038 -232095 -313674
42796 -313674 -323695 -266826 -340828 -558887 -651783 -454262 -173671 -114813 -275552 -390757
42786 -390757 -309397 -154830 -108293 -175480 -228407 -195763 -126858 -84571 -49871 32245 151421
42775 151421 236035 255776 255077 259104 216163 94710 -19892 -17295 80706 161625 209980 325156
42763 325156 523802 661467 630715 521137 467203 427166 259742 -30370 -285555 -420619
42753 -420619 -486838 -492754 -351987 -97109 31625 -125268 -378698 -400672 -155929 64274
42743 64274 40494 -130603 -243340 -259267 -260993 -255136 -175132 -30585 83760 121289 117711
42732 117711 90490 11038 -95508 -121664 -12740 128845 144762 1149 -189917 -316890
42722 -316890 -378759 -437754 -508635 -531212 -445888 -276264 -127919 -96695 -166532 -206063 -95041
42711 -95041 137590 332108 372993 306959 244690 188805 52319 -152666 -263285 -171380 7894
42700 7894 77101 12283 -44972 -26434 -21979 -98556 -179194 -184776 -183696 -282876 -437305 -496563
42688 -496563 -416615 -304300 -243776 -188105 -62416 105713 211842 186367 47370 -114210
42678 -114210 -171471 -36030 246378 496687 552669 420246 245221 144051 103809 53403
42668 53403 -14107 -28371 64189 229927 378417 438056 388345 242902 36646 -168397 -296657
42657 -296657 -306028 -228679 -164659 -222288 -426832 -660565 -728792 -549932 -276648 -156950 -255877
42646 -255877 -389273 -372143 -246131 -175039 -181715 -122413 79359 303308 389587 336735 274443
42635 274443 296171 388474 491953 564235 592056 587945 567849 504471 333656 52571 -219767
42624 -219767 -345500 -320096 -259440 -246530 -269320 -312640 -408260 -541715 -596684 -484995 -293805
42613 -293805 -213111 -322195 -517715 -651126 -667424 -600134 -503480 -424948 -394271 -399549 -401075
42602 -401075 -387652 -382403 -374583 -296972 -113665 104462 239097 241069 152737 38429 -62374
42591 -62374 -126383 -140641 -115776 -81833 -66179 -81114 -116762 -135794 -103207 -41414 -23787 -83664
42579 -83664 -158688 -158485 -60878 87253 223905 285353 213828 19528 -190886 -312015 -347208
42568 -347208 -364546 -383137 -379625 -371452 -390392 -389108 -292935 -156006 -139967 -290099 -445317
42557 -445317 -444190 -327522 -241597 -207421 -103957 131093 384508 485058 390302 223217
42547 223217 135475 157571 199588 190416 164414 172837 167461 67995 -71814 -84817 85837 282665
42535 282665 316369 180802 21661 -46516 -16951 68872 166946 218776 158001 -41957 -327822
42524 -327822 -569679 -628370 -473970 -240462 -107991 -124614 -198320 -251041 -288044 -309903 -270643
42513 -270643 -165704 -66675 -30695 -67582 -208664 -464234 -676155 -602087 -250300 52369
42503 52369 75108 -10922 61005 204979 114865 -243342 -569981 -654378 -585162 -510264 -453440
42492 -453440 -439697 -549429 -729566 -765946 -581340 -376619 -331860 -343140 -226636 -26568
42482 -26568 86833 111841 180768 291454 300590 181120 81824 93635 129757 100144 58581
42471 58581 87333 142739 118695 4317 -113323 -173490 -189663 -182515 -139668 -68868 -44002
42460 -44002 -145456 -353545 -542154 -604408 -557781 -486589 -406965 -259822 -41415 144102
42450 144102 208043 188021 174385 177626 146988 92575 102569 229937 417693 545904 521969
42439 521969 344822 127788 31113 103451 209388 196134 116014 168101 398493 589276
42429 589276 522044 247701 -9795 -135230 -177076 -179745 -129051 -66539 -88913 -175217 -158554
42418 -158554 37586 252984 297065 206803 157424 183037 157157 35026 -63225 -52776 -12104
42407 -12104 -27981 -30505 107101 366466 580035 608202 465131 293455 247033 357458 487518
42396 487518 466809 293092 124336 46613 -37296 -216702 -384469 -364657 -162769 39471
42386 39471 104608 42453 -71356 -155686 -123721 41166 197723 163023 -42287 -169252 -22864
42375 -22864 295479 482428 336366 -59430 -421180 -507298 -302032 13461 248988 333551
42365 333551 278174 110511 -103022 -255131 -296034 -272347 -208391 -51010 169156 243031
42355 243031 18453 -346816 -556112 -551108 -517856 -545916 -517751 -367814 -220295 -184681 -205769
42344 -205769 -210112 -224018 -240195 -139922 113972 346314 378641 261328 159224 105501 20282
42333 20282 -98074 -156582 -114467 -24076 60032 121709 151419 145255 114670 54773 -47850
42322 -47850 -138830 -108471 59242 231161 285209 241628 166402 51035 -107943 -207533 -152982
42311 -152982 -18621 32931 -38618 -125813 -129381 -47505 61125 121498 82360 -14324 -43358
42300 -43358 55368 182843 197768 76178 -96515 -218933 -206519 -33351 180458 230820
42290 230820 77327 -73092 -29393 152096 310305 416331 517668 575787 539139 469119
42280 469119 412935 273757 16344 -134411 26639 309100 346803 136396 11719 92103
42270 92103 138424 25320 -37279 82210 158365 -15410 -258349 -286925 -146965 -70500 -76091
42259 -76091 -27011 28873 -84270 -303092 -335349 -95291 129583 55455 -235403 -428674
42249 -428674 -359756 -151065 -23845 -56708 -130327 -90483 50582 131172 82374 52703 190454
42238 190454 383133 367511 75574 -279281 -466032 -444115 -293022 -91632 71887 105399
42228 105399 16615 -81447 -134544 -210451 -322853 -322707 -102298 187620 296366 205606 128116
42217 128116 182551 254327 222167 144795 125959 135850 92818 21494 -2792 6804 -5006 -15483
42205 -15483 11275 1295 -120218 -238043 -164919 44106 105397 -107133 -383336 -475158 -395227
42194 -395227 -299251 -237476 -181284 -167158 -235388 -306028 -274645 -166475 -60173 51063 163527
42183 163527 127738 -181573 -614931 -881489 -903477 -824415 -696589 -430077 -87786 58491
42173 58491 -95956 -284534 -227628 -40175 -76746 -445346 -860932 -977929 -744964 -412278
42163 -412278 -254685 -305922 -359636 -245532 -61802 -42819 -222134 -376320 -333049 -171598
42153 -171598 -38634 71162 211679 292662 180962 -55898 -190132 -129276 -25066 -42701
42143 -42701 -136925 -138618 -1697 136210 148992 96645 129622 248644 279301 132637 -32870
42132 -32870 -31744 57721 352 -234964 -421920 -402640 -267006 -147149 -28940 126043 239629
42121 239629 232576 156406 93270 46638 38479 163134 399952 524275 390223 169763 95833
42110 95833 86400 -108793 -455551 -636835 -526463 -366947 -381884 -467854 -420964 -265015 -164961
42099 -164961 -149009 -112415 -23969 51946 108910 212793 357048 436915 396174 295941 205442
42088 205442 118990 28099 -10981 42155 119229 117615 43573 -2932 19298 44707 22692 -6537
42076 -6537 -7511 -34559 -136511 -234122 -194133 -4111 212541 338160 337091 222753 56867
42065 56867 -34064 32761 158319 152173 -12780 -152368 -110574 70965 259705 378117 388693
42054 388693 273042 115024 85496 240738 425480 458708 321651 98017 -136314 -273059
42044 -273059 -182489 91992 295603 287279 260973 437065 672097 651162 387701 214866
42034 214866 278061 352101 237749 46866 -45787 -84182 -178509 -265497 -234593 -161561 -197674
42023 -197674 -301697 -290466 -128120 20180 26498 -66588 -168083 -244867 -264287 -167871 18689
42012 18689 148062 117777 16763 18425 161706 320689 374019 323145 244719 209887 267227
42001 267227 414595 536387 449381 101272 -314833 -535552 -505868 -402720 -386942 -424267
41991 -424267 -379241 -212930 -40493 -19362 -190654 -410061 -467582 -328627 -206175 -299405
41981 -299405 -511771 -571436 -403540 -197836 -93390 -12768 116197 196426 158757 125807
41971 125807 194789 225609 70705 -117042 -73894 148870 234284 74523 -79272 -11258
41961 -11258 150140 139614 -92808 -365317 -496089 -446187 -301015 -189207 -175178 -192142
41951 -192142 -129416 6817 96111 73288 1878 -38509 -40935 -25092 -2490 -13380 -91121
41940 -91121 -154444 -52555 219456 454691 466511 309292 185422 192711 248123 223987 81427
41929 81427 -118671 -280422 -346036 -330201 -285686 -248460 -243836 -317065 -484260 -653619 -680484
41918 -680484 -532977 -339560 -239477 -240535 -253738 -210016 -100887 50143 204576 311774
41908 311774 327963 242226 96550 -15472 -15432 56899 63511 -41754 -109471 3111 177240
41897 177240 151728 -93837 -265284 -143506 125410 270383 284670 365760 525881 509079
41887 509079 163696 -292750 -519124 -451983 -311294 -270195 -295261 -310135 -325488 -332186 -232753
41876 -232753 -10942 158217 132166 38083 92091 249239 269278 115254 21287 104900 169925
41865 169925 23681 -223722 -338741 -277849 -159669 -59113 16117 57242 92419 173148
41855 173148 219516 50476 -298479 -492166 -321729 -19932 80071 19229 72083 283608
41845 283608 453648 481980 424297 280687 31502 -176226 -181588 -97935 -143420 -241308 -130077
41834 -130077 160252 312732 219465 100773 77038 -2595 -201219 -318629 -222806 -57989
41824 -57989 20595 49980 76071 42602 -11625 77021 290098 359645 157226 -102350 -191957
41813 -191957 -159367 -138021 -111920 -18638 126615 318331 548151 648929 446604 127067
41803 127067 84901 309747 352986 66840 -109080 128699 424944 356615 115055 120767
41793 120767 304867 304553 121914 42281 62318 -64015 -300839 -358576 -212059 -132566 -215339
41782 -215339 -297182 -331478 -426061 -505891 -361317 -68414 47259 -73380 -137987 -13936
41772 -13936 69672 -41252 -151295 -48685 188522 386567 511788 555617 434174 172766
41762 172766 -22612 -39702 -18611 -93476 -166982 -104849 13621 21655 -77740 -152592 -160335
41751 -160335 -168791 -197391 -169059 -30410 152639 245079 178393 27681 -68941 -65537 -25929
41740 -25929 14117 89980 175783 156223 19953 -69001 -13028 60624 26033 -31110 -19397
41729 -19397 -79578 -360542 -690582 -758428 -547303 -322097 -245009 -262977 -319066 -406458 -448507
41718 -448507 -379874 -311087 -372433 -458230 -388299 -244044 -238508 -318753 -244805 -36389 30658
41707 30658 -99971 -158001 10318 223092 282377 217156 112451 -29093 -161446 -183403
41697 -183403 -131657 -150191 -219094 -160936 52048 259681 394808 511018 529183 301443
41687 301443 -38670 -159180 -28649 41463 -71191 -132823 -32313 6869 -126584 -195619
41677 -195619 -59244 40205 -93981 -255481 -203519 -66652 -68710 -143783 -144133 -165865 -332836
41666 -332836 -482835 -403154 -193275 -83959 -66416 6619 116087 153410 139355 100472 -91174
41655 -91174 -468595 -739571 -623850 -284688 -117393 -219899 -360670 -362817 -235513 -24840
41645 -24840 183684 200063 -63130 -392348 -520607 -478333 -464267 -495534 -462089 -415502 -494532
41634 -494532 -627217 -602642 -408497 -237020 -185959 -192231 -218740 -266130 -238909 -40112 224609
41623 224609 351311 311005 219416 93326 -143099 -449354 -669607 -709061 -554190 -214611
41613 -214611 177446 349434 205453 32263 127762 352445 350903 104941 -82694 -89036
41603 -89036 -83261 -145528 -140441 -25364 42452 -6529 -35954 46202 168441 291338 468711
41592 468711 638373 605085 336643 53764 -84668 -180758 -361338 -527279 -490307 -247099
41582 -247099 9975 99796 4934 -136762 -169749 -83893 -7257 3934 64337 249818 420183
41571 420183 418111 331845 356614 484947 552744 511967 423675 260495 -16267 -241467 -202076
41560 -202076 12419 107544 25880 -14247 62086 63243 -92253 -194562 -80052 109783 163751
41549 163751 87522 7995 -33510 -54157 -34263 39332 142379 277718 440145 503450 334681
41538 334681 60461 -4710 213417 405580 293731 7685 -110230 51595 284004 342362
41528 342362 201428 50111 87326 303711 478939 448603 314876 283665 365277 403655
41518 403655 347976 287581 239346 128746 -4194 -11433 108742 186173 163413 180792 295257
41507 295257 333726 147513 -162743 -392170 -449185 -328088 -27782 367380 645970 647694
41497 647694 428266 173731 14946 -31988 -31066 -83783 -245639 -445463 -546887 -500291 -375309
41486 -375309 -261583 -207172 -218358 -245332 -224192 -200158 -299427 -485631 -511726 -280290 -71036
41475 -71036 -167663 -414785 -442353 -212643 -15591 594 -49390 -82872 -108212 -17555 305042
41464 305042 661688 701773 436982 228725 232853 254222 205973 272301 485715 569096 389463
41453 389463 196810 212119 317487 346165 344133 348406 244353 55780 43472 285154 476630
41442 476630 384955 182033 90416 37191 -62656 -23191 269453 525488 435322 154798 48578
41431 48578 148202 217603 185174 159337 147390 85952 45888 122668 231829 261382 284977
41420 284977 378721 404793 253594 114016 190814 328714 258324 57757 -3254 47220 -45947
41409 -45947 -272066 -342766 -179901 -41804 -103642 -228779 -239637 -155698 -77112 -35218 -20134
41398 -20134 6077 138891 408172 633452 583905 284383 -8838 -134010 -155355 -169215
41388 -169215 -153701 -50156 128662 307981 404636 382129 294164 222111 146767 -9920 -192012
41377 -192012 -230884 -119110 -51005 -89122 -36831 195906 359114 229633 -16067 -77039
41367 -77039 7362 -25404 -212404 -347194 -332643 -263575 -199054 -101555 21187 111227 157963
41356 157963 151633 34195 -156578 -236914 -139794 -53823 -105150 -110748 98046 318962 264473
41345 264473 33653 -48779 59593 123972 58211 -16 11983 26512 51123 142207 217504
41334 217504 157772 28585 -44719 -105113 -197116 -140002 182984 463062 312499 -121356
41324 -121356 -326637 -160541 41058 78947 135723 326449 451332 352498 163692 57076
41314 57076 38828 106774 314738 567596 631380 461455 278061 240515 295401 394017 567386
41303 567386 710958 600429 244957 -37664 -22728 169045 312494 338437 263869 102226
41293 102226 -44674 -18057 163521 283931 228369 122689 101820 121938 84729 -8261 -95991
41282 -95991 -127251 -57837 103608 246906 268491 191899 81193 -61184 -184224 -145841 29834
41271 29834 53513 -217066 -482970 -439572 -273361 -317493 -431999 -241523 155616 299423
41261 299423 141735 106464 338702 495657 407477 362159 529114 632759 459875 228510
41251 228510 177077 194283 129096 97561 212345 337471 354461 357907 377446 245243 -40813
41240 -40813 -173615 -1800 197251 162210 34912 32894 58561 -58497 -207868 -199269 -88053
41229 -88053 -17249 52691 195191 307712 301690 300136 405266 472541 363020 232940 321410
41218 321410 599779 847617 935813 854146 617491 325295 168525 217098 326050 352912
41208 352912 310164 237606 133267 75139 168090 304072 248822 33799 -50973 64423 113564
41197 113564 -22689 -92458 89730 334064 403651 327942 201359 -736 -211750 -211882 20630
41186 20630 210822 212120 189717 225034 141090 -80273 -139072 74534 236361 128371 -2480
41175 -2480 73304 160224 56163 -44748 51290 137507 6356 -127187 -17535 158913 166378
41164 166378 158791 314675 388072 128977 -172972 -103881 183820 236284 27250 -113378
41154 -113378 -106946 -128066 -151112 -13509 177968 182279 64227 55044 90689 -60381 -314544
41143 -314544 -370856 -217463 -117590 -151824 -163203 -92114 -5163 129093 354959 523257 491055
41132 491055 393431 403772 406934 253997 130031 272995 522140 560311 420687 330675 247345
41121 247345 8501 -230073 -198944 -21309 -26654 -168071 -114970 150228 309528 245642
41111 245642 159170 171289 202472 217366 244410 218318 120475 151454 435883 721579 722985
41100 722985 571614 553229 615304 536403 352517 197628 -13550 -293851 -289840 188038
41090 188038 656867 593938 287457 375276 792761 947150 764004 733251 967241 1033239
41080 1033239 780187 574844 602721 623552 546022 594087 766200 747414 502362 372031
41070 372031 447464 418708 183750 49084 172314 328323 374271 452862 606933 666824
41060 666824 626672 675933 784748 713468 475664 330851 309326 222717 123408 241229 495230
41049 495230 593002 553748 586408 568923 280558 16249 234316 688073 714904 339539
41039 339539 213081 443999 443996 59740 -127011 122186 278512 42271 -142636 16361
41029 16361 103204 -191348 -469211 -347507 -94251 -47533 -33658 158625 318755 281164
41019 281164 283124 442798 454716 199349 60610 240712 375513 240646 193274 450549
41009 450549 576962 222373 -216500 -223283 72877 282100 395395 521965 478037 172121
40999 172121 -40933 104752 311951 238298 55357 44760 82489 -17405 -75694 87475
40989 87475 272973 296731 335010 495715 519301 303040 221870 497584 746663 605453
40979 605453 319943 259364 321106 275282 230326 303605 291555 99611 24776 196875 253485
40968 253485 -2185 -167892 73275 394416 445090 469522 767025 1071586 1048386 937457
40958 937457 1136890 1556964 1882616 2055656 2058867 1701174 1060686 644090 675536 746070
40948 746070 563055 445194 642524 813485 664216 469230 475323 454579 324960 478979
40938 478979 974550 1180776 806806 478926 676996 945755 846893 802513 1201464 1553474
40928 1553474 1417757 1319903 1797237 2380436 2570125 2992378 4357425 5922476 6277177
40919 6277177 5246457 3877182 2904994 2295460 1957091 1875586 1782207 1526186 1454533 1725736
40909 1725736 1782770 1265516 793121 979705 1371719 1314634 1152629 1504947 2032245 2055465
40899 2055465 1794955 1871929 2164654 2264729 2452681 3083875 3627593 3472766 3056438 3033826
40889 3033826 3028510 2446963 1811719 1939832 2460918 2514395 2261019 2318790 2390064 1915094
40879 1915094 1419547 1694536 2279887 2291838 2076641 2435736 2908488 2555103 1812502 1781501
40869 1781501 2238526 2163853 1699325 1739727 2101053 1960634 1610687 1904108 2495260 2528860
40859 2528860 2463750 3204705 4068366 3763882 2784744 2577922 2934235 2574057 1757615 1792856
40849 1792856 2407973 2206716 1373839 1317126 1949285 1967983 1505687 1797057 2555597 2464407
40839 2464407 1908777 2338014 3315037 3220360 2455162 2774458 3920566 4276368 4284337 5527040
40829 5527040 6978499 6244030 4131345 3666973 4850972 4967351 3886537 4103866 5546641
40820 5546641 5630347 4642186 5501523 7887750 8542123 7778062 9252775 12764984 14363099
40811 14363099 14353809 17389641 23542403 27917778 30438296 36167673 44251209 48260077
40803 48260077 50241446 60521805 79547824 97956674 122961245 181170870 273867628
40796 273867628 347607300 340914743 256603715 159959197 104092994 84050286 69521339
40789 69521339 52265932 42840406 41783814 38486057 30613147 25473757 25077181 24094289
40781 24094289 20829149 18611141 17491366 14274588 9850683 8147194 8722949 7763848
40773 7763848 5336107 4756185 5834498 5353403 3409836 3048458 4243660 4107154 2567124
40764 2567124 2305021 3422602 3394504 2059179 1749890 2666125 2722113 1792622 1754924 2561447
40754 2561447 2429610 1606740 1916955 2978608 2830577 1832927 2023051 3157086 3322422
40745 3322422 2850317 3635502 5254341 5799162 5779172 7040461 8798012 9200893 9674733
40736 9674733 12761133 17067634 20399233 26610662 41293637 59695875 67441885 57131008
40728 57131008 37737521 23182929 17173942 14317116 11131708 9100294 9054641 9010761
40720 9010761 7844968 6828531 6877170 7185163 7155260 7688252 10017010 14148292 18309836
40711 18309836 19637827 16528857 10882144 6612631 5308708 5011576 3873903 2732658
40703 2732658 2814008 3225079 2646232 1716853 1716363 2266853 2259821 1881507 1896444 1948534 1312199
40692 1312199 460539 292143 570593 545535 338871 406480 440384 61610 -219555 73463
40682 73463 360917 58829 -256477 97326 613852 546988 242922 324794 447987 89895
40672 89895 -285245 -71882 298610 212065 58025 375025 679625 383686 27480 319108
40662 319108 761417 548620 54747 84858 370878 187113 -199932 -88326 244863 71395
40652 71395 -366531 -325696 13361 -63962 -402505 -289189 171803 270338 -10422 -102048
40642 -102048 26131 -8529 -54854 289966 770305 913813 1000591 1490044 1908137 1505527
40632 1505527 646293 290973 417538 244760 -229149 -248891 263842 591682 506218 466555
40622 466555 545983 327917 -104823 -202170 -11209 -123922 -515551 -519805 -56323 179694
40612 179694 -90840 -343696 -235827 -51275 23159 203473 502452 603972 486638 441975
40602 441975 410448 56765 -467392 -635453 -454190 -441853 -654885 -586807 -135150 176945
40592 176945 101020 -9686 54506 42590 -143770 -227614 -132167 -126619 -248742 -214545 -22515
40581 -22515 -16339 -235709 -322594 -167297 -44285 -43787 21332 110198 -6050 -172329 20864
40570 20864 496061 738809 625144 527203 562478 443476 140745 -7743 61065 57706 -27992
40559 -27992 98999 376676 404640 187912 140499 285932 215350 -73071 -93679 231334
40549 231334 401703 242755 174046 356072 373977 47753 -216951 -194202 -212105 -443981
40539 -443981 -549584 -358857 -209673 -263979 -189871 121538 237466 -25866 -202399 -217
40529 -217 169192 -32406 -241409 -89976 91852 -118712 -466075 -484476 -294915 -303266 -454469
40518 -454469 -397873 -143610 -11221 -103211 -262652 -376866 -375761 -147278 228388 400931
40508 400931 198264 -102376 -207658 -210348 -294795 -370927 -297817 -164222 -65794 87101 282849
40497 282849 280125 41000 -78807 118260 300016 128485 -194223 -273482 -105996 49202
40487 49202 101058 76715 -85836 -346121 -416003 -145972 174529 210540 36096 -91868
40477 -91868 -144887 -197350 -154240 60112 262440 266755 170581 118965 28500 -178350 -326962
40466 -326962 -276170 -195389 -255273 -299226 -140985 59884 55380 -81732 -134160 -109694 -107470
40455 -107470 -30255 220661 447631 404361 193458 90075 107024 57631 -63212 -76922
40445 -76922 66762 236677 328283 331528 266341 198296 210682 253631 183421 40198 53648
40434 53648 260023 392300 300234 177174 189590 208091 131895 145023 366870 553609 460124
40423 460124 232976 133070 118923 22196 -97264 -95848 -43005 -74120 -138764 -161764 -236812
40412 -236812 -395275 -427480 -222909 -42022 -144436 -386227 -493315 -483866 -494402 -447619
40402 -447619 -257473 -126384 -254849 -464150 -485652 -416545 -490836 -595119 -443571 -87773
40392 -87773 171985 271524 373065 466033 381835 159155 33009 83615 188968 267322 300198
40381 300198 212764 -221 -147107 -97824 -17917 -80602 -145694 -36319 83682 -18889
40371 -18889 -193682 -133633 104828 223600 180023 132492 24903 -305549 -691686 -784538
40361 -784538 -604053 -491162 -532788 -490104 -304954 -212989 -288845 -310382 -176970 -79920 -146023
40350 -146023 -254001 -309699 -384295 -476920 -442245 -262239 -115700 -76956 -3451 176496 304701
40339 304701 232455 24902 -159994 -232109 -159929 32942 220133 266807 194906 136364 142871
40328 142871 159894 134259 28939 -172894 -348414 -264408 99232 413182 394051 176507
40318 176507 66311 102979 134509 146409 205232 224440 104485 -28165 -27514 -13272 -123345
40307 -123345 -169724 69586 386374 409087 202381 136390 257071 279606 154926 127858
40297 127858 220757 164712 -86772 -245186 -186392 -131992 -221247 -302323 -268839 -234366 -255119
40286 -255119 -220291 -118522 -87027 -117862 -45279 111161 135525 12151 -20950 106923 172558
40275 172558 36050 -187001 -393251 -590688 -682499 -522760 -252417 -202582 -391812 -503424
40265 -503424 -428269 -409138 -550271 -626974 -528402 -457297 -508588 -459336 -181967 112689 248303
40254 248303 335690 454982 449839 252236 66086 15727 -50400 -203327 -235229 -39026 161697
40243 161697 193735 200008 285206 254855 -8360 -240223 -178715 31383 116571 95285 131859
40232 131859 218534 283615 378962 492608 420098 97117 -181583 -155936 22874 89826 89500
40221 89500 182086 256320 104950 -164099 -245393 -79660 116588 197282 205514 200574 187587
40210 187587 187983 225314 282621 356067 453141 491358 360749 128035 -30966 -131774 -337252
40199 -337252 -572661 -540231 -219562 39321 78785 164455 431992 555529 295958 -33786
40189 -33786 -53135 86991 27838 -167661 -177081 7866 130738 138366 173014 219866 157194
40178 157194 55125 67373 136287 141608 204220 481489 787944 797127 529522 284869 176465
40167 176465 78602 -46276 -110263 -120998 -129978 -50947 168628 318699 194308 -43169 -117617
40156 -117617 -95456 -197529 -310669 -159831 123694 117480 -211986 -437569 -332875 -135230
40146 -135230 -52601 31161 193718 233202 21875 -218225 -230825 -81321 7986 -14942 -61338
40135 -61338 -113699 -230219 -406598 -547608 -553503 -413528 -247933 -214815 -317499 -391330 -353394
40124 -353394 -315530 -333031 -247003 22849 238524 167435 -39656 -104061 -75856 -172959 -317630
40113 -317630 -258518 -64456 -42772 -188161 -169091 97944 301361 251923 139552 146789 175124
40102 175124 108157 28387 23083 48579 100207 244165 391198 333897 106564 3839 132378
40091 132378 254142 199319 116795 159622 229345 214284 197884 237965 206056 49363 -39317
40080 -39317 69178 189406 104604 -101899 -224467 -258112 -306769 -330009 -238118 -134692 -215864
40069 -215864 -466012 -645907 -574216 -295719 5323 167750 166542 130227 204612 371178
40059 371178 468920 401907 224526 22978 -155186 -248520 -214170 -139507 -174569 -327907 -463991
40048 -463991 -498007 -442027 -295072 -87913 1238 -172699 -438502 -486695 -336839 -306987
40038 -306987 -476696 -550852 -381800 -249577 -399225 -619442 -565756 -267765 -23914 39522
40028 39522 26013 3083 -60402 -147266 -185232 -159783 -105703 -37125 27268 52463 63991 120440
40016 120440 163756 64501 -124815 -173941 -29756 67592 -33895 -145626 -73346 19217 -142069
40005 -142069 -474104 -612436 -410311 -115437 -35766 -204539 -407852 -435473 -277443 -113321
39995 -113321 -101147 -192558 -222558 -139243 -12790 133325 294688 318479 41028 -369048
39985 -369048 -507107 -272156 -15394 -20076 -144188 -160661 -131490 -183097 -188687 8251 255198
39974 255198 291868 148009 57595 101582 196110 305593 403471 346305 59360 -261139 -395902
39963 -395902 -440610 -620052 -874431 -939128 -767153 -561446 -419000 -242997 -12259 135020
39953 135020 116759 -12569 -201275 -415528 -535506 -458364 -297089 -262636 -354798 -378703
39943 -378703 -257080 -111512 -36469 -3735 5929 -20701 -20905 76336 177897 121813 -61911
39932 -61911 -188226 -199747 -195633 -195406 -120486 -18463 -42053 -158734 -138661 91047 318141
39921 318141 362615 296933 245029 183360 78294 24193 81330 128726 40224 -112126 -180594
39910 -180594 -164512 -160316 -170597 -118437 -10342 53762 24644 -46481 -100798 -127205 -114518
39899 -114518 -25682 135212 264017 226574 18651 -176841 -159856 52434 234908 225165
39889 225165 99045 25657 46721 89772 112718 116376 74647 -23429 -104390 -99896 -65835 -99555
39877 -99555 -186567 -250970 -299768 -368038 -373437 -211198 21422 96169 -19596 -98429 12355
39866 12355 161526 117026 -101839 -257901 -214042 -91429 -95492 -265280 -451794 -523804 -517712
39855 -517712 -528706 -518838 -370494 -133870 -47469 -221731 -451690 -485520 -364722 -325651 -439270
39844 -439270 -541040 -498589 -373994 -299822 -326262 -415447 -487689 -461813 -331753 -199509 -159506
39833 -159506 -170462 -115246 39406 212522 306034 278079 170157 104220 173533 299510 316799
39822 316799 241212 270011 428418 450143 186883 -95045 -86895 88650 99537 -39667 -11800
39811 -11800 253086 457565 406287 250426 173382 138551 80103 85195 222624 377631 411743
39800 411743 357434 331638 351516 329118 192044 -26627 -176713 -110022 113231 230182
39790 230182 114125 -20025 60394 226312 216682 125292 275661 636122 776391 490057
39780 490057 78390 -125385 -163787 -208353 -234928 -183650 -176523 -312415 -441769 -394418 -276076
39769 -276076 -302067 -457320 -543666 -480073 -359653 -263085 -174315 -49319 131469 332359
39759 332359 432216 316666 44062 -195635 -314614 -368316 -350158 -168655 107616 236117
39749 236117 155442 109121 251699 371190 220469 -78425 -214719 -130511 -31352 -50325
39739 -50325 -132255 -194517 -207934 -160072 -91031 -107415 -228106 -298730 -197144 -33704 -3492
39728 -3492 -127142 -277150 -364965 -357380 -209827 53471 274033 322836 251280 154407 2141
39717 2141 -237314 -430026 -427361 -296266 -210258 -190408 -145502 -93315 -128770 -211421 -188772
39706 -188772 -25934 151122 229057 185577 33718 -162354 -255749 -160257 -2058 15819
39696 15819 -125968 -271189 -311164 -249656 -90315 161352 387390 417673 239237 33403
39686 33403 -22390 85400 237554 300552 229083 104253 39285 28885 -16879 -68025 31447
39675 31447 280727 418028 249012 -80580 -308600 -389350 -404130 -314009 -73673 133264
39665 133264 83297 -119435 -165350 -6101 103194 41067 -11780 82199 185199 130341 -14920
39654 -14920 -76021 -7247 122849 254923 334961 288082 103435 -111413 -226846 -202149 -84921
39643 -84921 36545 76014 16768 -64668 -104772 -147437 -247419 -335580 -306654 -201724 -160636
39632 -160636 -215587 -278165 -312498 -355830 -361173 -197159 133722 407432 390161 83712 -265878
39621 -265878 -368040 -127525 252270 449686 367217 210765 158092 100002 -129979 -414998
39611 -414998 -485337 -311750 -115849 -22511 46282 136723 176840 156842 163894 189047 111440
39600 111440 -72932 -205201 -197903 -129163 -64762 17730 87875 55256 -39006 -28140 116564
39589 116564 224613 192611 110197 53874 -30932 -157597 -222132 -200639 -219473 -323549 -377520
39578 -377520 -305802 -218585 -177960 -66069 159616 307720 246950 155413 246104 408724 374766
39567 374766 119150 -153225 -335227 -477352 -563712 -481833 -241657 -25519 36430 6050
39557 6050 5985 44515 13559 -181081 -488937 -699824 -621518 -314712 -66063 -57323 -152214 -107324
39545 -107324 94910 254911 244136 145556 110345 180475 273471 285168 196729 98827 88717
39534 88717 139971 131769 19214 -105043 -146835 -122814 -97982 -93978 -102309 -112984 -98711 -50252
39522 -50252 -39724 -142680 -287022 -316070 -227484 -190385 -275178 -337534 -248770 -73836 71704
39511 71704 170267 201513 77759 -174980 -339832 -281676 -153161 -158454 -254183 -275805 -227777
39500 -227777 -227734 -261353 -221115 -124149 -73491 -48592 56016 214659 291259 250138 156676 2899
39488 2899 -253959 -490977 -488759 -243767 -13894 12002 -72080 -70383 60887 212370 268370
39477 268370 199048 84631 67950 201459 348004 333777 179745 53845 12992 -44729
39467 -44729 -163130 -248873 -267043 -339520 -540827 -730793 -722748 -537381 -366952 -333725 -390486
39456 -390486 -434506 -420179 -354761 -262851 -184076 -154256 -145761 -52882 199715 513180 641990
39445 641990 442511 74565 -135590 -43527 190721 340091 349277 283572 169845 -447
39435 -447 -194164 -373669 -547477 -687086 -673670 -452343 -174692 -46859 -74602 -95473 -32651
39424 -32651 31347 28148 4045 17117 45998 40437 -10428 -80564 -124941 -101561 -25264 28925
39412 28925 27627 31865 84469 119767 77019 23137 43762 87023 55276 -12242 -3911 68286
39400 68286 99366 72950 41427 -29403 -198561 -360769 -336212 -148844 5798 78557 200345
39389 200345 356210 316530 26654 -198299 -77341 226512 330628 138970 -111177 -229645
39379 -229645 -254219 -257222 -197690 -39889 131700 212078 209290 197149 181149 92169 -88934
39368 -88934 -267410 -336942 -317598 -333066 -446038 -579069 -624509 -563057 -428656 -242608 -68493
39357 -68493 -50054 -260252 -549080 -674539 -571995 -375701 -201048 -54418 45485 25084
39347 25084 -117962 -273434 -349707 -349887 -307946 -263531 -295679 -439276 -569033 -531513 -393834
39336 -393834 -358432 -410041 -303563 4277 179042 -52612 -499177 -760385 -732172 -625333
39326 -625333 -597988 -620050 -648744 -702909 -759438 -753533 -687134 -601802 -471270 -261894 -61687
39315 -61687 5744 -34988 -65509 -68341 -93546 -77958 82471 286769 296908 98927 -37333
39304 -37333 52841 203937 216320 173557 274761 492346 607260 515231 315817 137177
39294 137177 32401 21462 83330 117174 47647 -42785 -21875 68242 54015 -95095 -211001
39283 -211001 -192283 -149051 -193913 -251358 -208835 -128887 -148738 -254949 -327666 -353045 -411863
39272 -411863 -480265 -434296 -281986 -213858 -344830 -537108 -570191 -396801 -152214 15644
39262 15644 51449 -13428 -104910 -176191 -257407 -384044 -479263 -412150 -201426 -42272 -66990
39251 -66990 -180203 -200848 -76031 108586 232288 194873 -8908 -195119 -110847 241136
39241 241136 530090 480292 204032 12458 22979 123643 208522 249102 218655 141688 141851
39230 141851 255067 298028 138111 -27265 59788 268707 243910 -23925 -172519 -49338
39220 -49338 75562 -6175 -124174 -91649 -48364 -183356 -381190 -426311 -354198 -315027 -256842
39209 -256842 -45704 214422 284453 155032 34124 123 -68900 -214582 -299155 -244039
39199 -244039 -163564 -179087 -249285 -262392 -183717 -43948 129301 301567 408161 392963 256489
39188 256489 63920 -76894 -80409 26613 112298 89068 22258 35753 148860 270108 319114
39177 319114 290093 221409 160003 133303 114148 45398 -70519 -157990 -173685 -156178 -136691
39166 -136691 -93992 -51901 -108477 -271757 -366655 -236950 18144 138076 4503 -255095
39156 -255095 -443470 -471492 -369191 -212408 -62712 55675 128308 118645 20151 -76546 -73668
39145 -73668 -25611 -68607 -171770 -147914 15018 54572 -179252 -438682 -402723 -140496 3231
39134 3231 -107022 -288026 -363577 -336256 -239142 -71548 74776 45684 -153821 -342240 -407216
39123 -407216 -392382 -310091 -84604 236137 423371 358781 216746 201158 240409 135538
39113 135538 -76994 -137070 54620 263156 229480 29483 -26277 178956 400798 364299
39103 364299 135111 5461 63051 80649 -115415 -367249 -416191 -269647 -154552 -183071
39093 -183071 -255881 -272297 -252257 -227365 -168635 -80186 -49676 -133002 -252144 -265671 -118163
39082 -118163 102665 248636 257011 214453 241850 327761 360002 324290 333503 402875 354609
39071 354609 75366 -255010 -358456 -213124 -55159 -62023 -170314 -197372 -49884 175311
39061 175311 260615 103968 -101721 -69238 172950 292411 161733 70625 238356 412581
39051 412581 263416 -67618 -195823 -93762 -40486 -86225 -26079 131320 136013 -27980
39041 -27980 -85571 31328 60272 -97844 -184486 -52894 63717 -38951 -220120 -311883
39031 -311883 -407438 -573634 -599285 -333965 -13226 64028 -36150 -74606 -55793 -138711 -291985
39020 -291985 -350191 -304381 -263664 -230085 -161720 -147970 -267220 -375823 -301225 -155123 -186050
39009 -186050 -383647 -491265 -377156 -156146 30190 132659 117517 -13068 -122919 -46865
38999 -46865 199354 447457 581310 588795 481028 309096 190851 172003 137507 1678
38989 1678 -121690 -99564 -4367 26833 20692 40006 -22549 -252234 -439828 -318723 -1211
38978 -1211 147155 31445 -103323 -114248 -122297 -188617 -171619 -12304 129989 148581 145779
38967 145779 210014 281196 345658 506020 715274 697789 332661 -89812 -212737 -62899
38957 -62899 54934 -5924 -128166 -196030 -241721 -304676 -308775 -160657 87590 240673 151330
38946 151330 -99265 -270972 -247062 -157443 -139496 -104769 74174 244531 114664 -287193
38936 -287193 -578745 -520919 -289509 -141742 -72234 30295 121294 129210 172348 383871 622436
38925 622436 618218 364191 120466 35508 -400 -79651 -80955 124724 417189 534654 390736
38914 390736 161999 66450 152646 327433 498781 619161 643424 553759 432965 410844
38904 410844 495095 539703 432182 227084 39176 -85287 -107612 54250 363737 566927
38894 566927 455932 166386 10143 65037 154655 189472 248917 313213 221441 -9997 -111328
38883 -111328 51127 255553 267749 177874 183585 230983 128264 -105193 -260290 -249612 -174859
38872 -174859 -116145 -55350 165 -2720 -45698 -43117 25199 100004 156754 219757 263733 210565
38860 210565 39374 -176578 -345412 -417001 -397317 -357911 -382862 -445310 -405228 -206722 8179
38849 8179 88696 88000 141595 206253 109857 -151250 -354537 -337909 -195574 -116508 -139250 -156735
38837 -156735 -101710 -34616 -41744 -89223 -20843 261847 632624 835639 777255 629838 581890
38826 581890 589214 486232 256412 35538 -111832 -246757 -378249 -395655 -240531 -26605
38816 -26605 92371 100276 89889 104295 85133 -19768 -145270 -141173 73614 407439 678312
38805 678312 790640 785372 730511 645402 545996 471106 427859 393408 390022 449058 483875 356716
38793 356716 122019 14237 104301 184675 133576 142986 361146 561364 495085 370446 567340
38782 567340 1006650 1272857 1307816 1457163 1808312 2106555 2510740 3721723 5839576
38773 5839576 7614876 7570053 5696835 3421047 1964177 1357079 1074513 908176 870136
38764 870136 770595 414948 1645 -105489 82712 201616 54044 -179058 -255065 -146713
38754 -146713 39426 208301 265129 129680 -137785 -337084 -339879 -215903 -85236 51619
38744 51619 236981 390300 359235 134730 -92477 -133093 -7624 83757 -13567 -232429
38734 -232429 -344690 -214697 20924 82390 -127785 -401813 -484923 -383183 -311515 -381894
38724 -381894 -483165 -476747 -367147 -225889 -80002 32547 11236 -174144 -373194 -416586
38714 -416586 -343631 -325902 -393165 -402016 -289023 -177758 -166698 -169036 -74843 52654 83899
38703 83899 39006 36254 68843 6847 -166483 -282820 -215513 -51458 51428 79438 120753
38692 120753 168961 110396 -82373 -262604 -274567 -139232 -8758 25294 4290 -6729 -18476
38681 -18476 -67526 -118016 -81983 58535 196718 194411 17435 -230211 -390794 -367896 -186500
38670 -186500 38247 203247 300502 384143 455846 432803 266109 45353 -83547 -87647 -61992
38659 -61992 -81455 -122673 -147060 -162900 -157456 -63654 122402 265575 237219 88494 -25972
38648 -25972 -53277 -50685 -30152 44990 111073 37540 -136532 -182385 -7407 160816 78547
38637 78547 -143799 -180325 43671 230509 95359 -280359 -559140 -525349 -277502 -73251
38627 -73251 -36561 -47840 58209 229212 239061 12176 -246634 -336764 -322028 -348766 -344005
38616 -344005 -132703 213679 415269 380008 311820 371717 464678 448318 338147 194830
38606 194830 1266 -220462 -340582 -302785 -223815 -196914 -164931 -113507 -186592 -423017 -566547
38595 -566547 -379637 -8959 213203 217799 175612 117909 -92640 -419061 -602938 -540603
38585 -540603 -440561 -491522 -592049 -545773 -354566 -173391 -90101 -72060 -47425 48901 229889
38574 229889 390412 376704 184584 -5512 -53117 -16796 -19794 -64438 -78422 -63613 -86990
38563 -86990 -159425 -206719 -150018 14523 179568 168216 -102614 -477817 -683290 -625629 -463556
38552 -463556 -344933 -229309 -66696 13679 -127108 -379903 -502332 -451511 -402754 -435777
38542 -435777 -408548 -210674 33479 135748 101410 76898 106138 86942 -37488 -178888
38532 -178888 -239810 -249210 -288861 -348631 -346758 -268342 -187098 -141470 -83834 6511 44201 -55495
38520 -55495 -243920 -389966 -428455 -384474 -287195 -151422 -23994 52602 119372 239752 353941
38509 353941 316199 117761 -47586 -19299 121613 176297 91448 -12935 -44256 -47830 -105537
38498 -105537 -215476 -307075 -318703 -230685 -71205 70508 76888 -86092 -285196 -308284 -84941
38487 -84941 204129 298186 143574 -51500 -77279 32865 88174 16853 -58222 -23784 60952
38476 60952 69757 1801 -25166 44891 122474 105147 41056 85977 283087 450351 361162
38465 361162 25168 -293713 -364453 -217781 -45535 42866 76809 99686 106564 97139 89781
38454 89781 71266 15821 -29114 43836 264189 510141 614261 525853 349822 228229 187942
38443 187942 128270 -7331 -92996 31142 274391 331868 85936 -204057 -259400 -163369
38433 -163369 -170617 -271248 -232706 -17116 161651 219465 325573 554585 708647 636670
38423 636670 475959 390662 295666 67981 -150661 -130565 74874 196506 135381 42032
38413 42032 31043 46732 33929 35515 63878 45837 -32468 -66520 -568 64264 26595 -38287
38401 -38287 26829 226755 381093 335033 128236 -74901 -168538 -169640 -131613 -70191 5550
38390 5550 51015 23822 -68677 -196505 -340489 -457660 -472948 -375127 -265552 -223430 -177191
38379 -177191 -22389 178767 257423 181949 96061 105079 161544 180389 135783 28077 -108318
38368 -108318 -150776 2203 238707 315090 178584 44225 84050 201036 201065 48968 -143529
38357 -143529 -272222 -299771 -252501 -208024 -200025 -139716 40305 201536 157814 -7297 -38977
38346 -38977 69858 71656 -70300 -74018 161886 321086 163202 -77332 -77099 73200 80237
38335 80237 -59439 -117546 -20670 134302 308063 474776 502498 362817 296037 471274
38325 471274 659456 567326 310399 188931 176293 52346 -103942 -30563 192596 225233
38315 225233 53190 11268 192747 310913 226194 155974 237081 299243 222699 138049 112443
38304 112443 -3521 -247532 -399537 -340195 -249587 -276623 -299728 -192280 -59460 -32549
38294 -32549 -55860 -32545 19730 75804 175928 317478 454701 611897 789560 828993 658138
38283 658138 564169 842513 1292678 1528402 1654236 2044184 2572138 2811964 2947794 3584983
38273 3584983 4643073 5588513 6974041 10215792 14950802 18019919 16633565 11830366
38265 11830366 7268156 5020016 4141837 3167988 2143264 1679033 1558619 1264049 960022
38256 960022 1041267 1285919 1217926 891387 679510 619841 517904 413910 449824 506761
38246 506761 404533 247265 197083 136326 -76651 -245194 -109143 208401 385658 358685
38236 358685 264556 124755 -62036 -99520 145430 404914 326234 20707 -96533 59040
38226 59040 173376 80830 -26638 4310 43083 -55081 -211690 -283428 -250359 -147603 16873
38215 16873 201588 340699 457233 611339 712180 569037 186415 -168356 -272975 -182921
38205 -182921 -85251 -57671 -59330 -48539 -15071 38551 88661 114679 147134 217614 262578 181332
38193 181332 -3623 -164437 -260862 -375925 -523971 -580507 -479198 -329540 -231920 -115558
38183 -115558 95204 273533 242638 74000 18699 133568 185158 3838 -245813 -292309
38173 -292309 -140201 -44036 -132384 -244885 -201328 -83932 -115876 -318167 -445559 -305681
38163 -305681 -26369 98155 -24543 -201184 -249930 -238652 -326754 -477999 -509340 -401335
38153 -401335 -353320 -463874 -552189 -443591 -276013 -309095 -516448 -612574 -470402 -267386
38143 -267386 -173437 -128967 -33657 49092 22977 -52256 -50263 42576 150578 216367 199175
38132 199175 84561 -23215 30873 197753 222229 25917 -121632 -6890 167953 94256
38122 94256 -151536 -241515 -99972 61470 133548 183679 178342 -3157 -260509 -331775 -210450
38111 -210450 -159925 -247850 -232520 -28216 88850 -74573 -310531 -360623 -294004 -291031 -311839
38100 -311839 -251211 -201067 -271150 -324918 -179257 73239 213855 247884 339305 501561 617351
38089 617351 675378 722455 660012 369868 -938 -158724 -61728 46848 7184 -90889 -124962
38078 -124962 -98187 -44002 32563 85456 72800 83498 236484 446423 492744 350948 246461
38067 246461 320740 441341 424509 267446 65684 -133583 -280481 -268172 -69529 159145
38057 159145 230161 124952 -38204 -168113 -244503 -256922 -201154 -122066 -89629 -129431 -209043
38046 -209043 -282126 -321702 -320852 -280838 -206217 -122314 -88917 -146386 -228241 -195984 -15991 162791
38034 162791 185198 86695 19579 33855 52868 43757 80871 227486 470510 798184 1224860
38023 1224860 1672010 1911586 1739625 1218803 686862 460288 514543 519510 255690 -74543
38013 -74543 -95931 208109 431081 278369 -62336 -241853 -232583 -248732 -327585 -293559 -108795
38002 -108795 20972 -59208 -258592 -395709 -392604 -282980 -168860 -183605 -358395 -525384
37992 -525384 -495506 -311653 -162963 -87666 23784 147070 107626 -104225 -253391 -192167
37982 -192167 -54778 -14057 -51955 -96958 -189771 -354166 -465949 -416701 -283155 -188355 -115652
37971 -115652 -4100 92552 101648 86474 143283 220304 194781 71280 -40974 -97319 -124555
37960 -124555 -102869 11383 155840 186901 58112 -109317 -158097 -57781 66056 55968
37950 55968 -98330 -219935 -153271 9181 33092 -122364 -244664 -195864 -110063 -146320 -222812
37939 -222812 -178879 -75270 -112767 -296280 -383025 -192795 161570 391837 318683 35947
37929 35947 -173887 -119606 86200 167578 45664 -82359 -72038 -45338 -142959 -252369 -199387
37918 -199387 -77601 -122873 -314995 -371366 -155313 139362 267834 211235 104623 41562
37908 41562 29871 31382 -15975 -130355 -212731 -137891 65390 237843 310552 368686 455666
37897 455666 462638 302109 71265 -74529 -129922 -196751 -281402 -271848 -125223 38057 82250
37886 82250 25919 -6828 37361 103883 164910 281772 474503 620576 589524 425876 278311
37875 278311 182555 57584 -98795 -186324 -199180 -256529 -365656 -346442 -113203 141032
37865 141032 202878 140247 158896 262691 265974 99133 -88896 -134252 -28580 111226 148991
37854 148991 37652 -99465 -64390 155924 330416 289808 157860 129964 166391 107924
37844 107924 -26966 -97678 -99593 -112689 -67734 154831 430060 486038 304583 148743 162417
37833 162417 207200 138439 -15304 -199603 -407012 -543761 -473487 -258564 -115578 -81351
37823 -81351 9671 168978 193864 56591 11939 161450 244012 68401 -154703 -158329 -17234
37812 -17234 67835 123624 241690 293684 143186 -39248 -12440 127098 108459 -64760 -172809
37801 -172809 -188942 -272234 -411130 -433604 -351005 -341265 -386820 -282193 -38108 76522 -22687
37790 -22687 -91016 23692 133527 55267 -78289 -66380 18748 -26085 -196167 -302232 -249422
37779 -249422 -112044 17790 108569 147259 133575 102650 80352 34687 -79877 -248338 -388142
37768 -388142 -400770 -250625 -32137 87881 58989 10531 41324 56465 -37167 -98962 45450
37757 45450 262146 267001 92903 57150 232991 329448 206620 118094 232991 291178 45294
37746 45294 -259945 -229389 76682 276216 254223 196947 121447 -172479 -643339 -920506
37736 -920506 -810191 -558529 -453838 -448998 -359862 -198017 -91118 -41086 31696 118726 174933
37725 174933 242614 360104 432624 359484 224327 193858 271472 315113 276231 251184 280301
37714 280301 253927 74199 -208771 -484293 -701353 -825110 -767721 -484333 -105214 146809
37704 146809 188170 136806 120965 124914 88160 63351 147079 286395 299724 120599 -101484
37693 -101484 -196917 -160439 -70498 53806 199930 269875 197626 96666 122119 220919 204558
37682 204558 66747 21591 170830 327164 271801 30018 -229364 -431604 -593882 -698087
37672 -698087 -720141 -709496 -698484 -607037 -383408 -159739 -90908 -101961 -4360 168627 184387
37661 184387 -5371 -154372 -92083 21206 -37865 -215134 -294819 -223268 -111479 -6675
37651 -6675 115732 177528 51263 -191015 -295245 -156823 43037 114870 109250 171015 287138
37640 287138 339029 323226 354191 472342 587694 615047 550680 406969 184085 -54047
37630 -54047 -162035 -35035 274707 582512 695901 536468 194929 -132059 -305003 -343392
37620 -343392 -340340 -320312 -251354 -157982 -114012 -128721 -146100 -159801 -212410 -267648 -219197 -67974
37608 -67974 47543 58427 58055 106886 106376 -5125 -89429 -19070 84450 41620 -62132 -4956
37596 -4956 183771 263254 202587 231229 393749 396376 78846 -258860 -264835 -48844 17183
37585 17183 -136228 -242273 -160266 -37799 2100 30881 101263 129459 95663 131800 278304
37574 278304 352890 216203 4186 -70601 -14138 28054 32015 80635 157712 158277 84316 51668
37562 51668 96039 127864 96496 54820 33699 -8630 -69172 -66913 3311 -1318 -191567 -461046
37550 -461046 -573585 -411888 -87555 171213 211690 77234 -30263 57262 296895 483773
37540 483773 477272 319029 131310 -2007 -27606 83971 260498 336486 231501 52881
37530 52881 -56702 -89561 -96850 -44795 105026 244465 227365 101279 49521 105918 119824
37519 119824 29742 -39533 -29089 -86867 -322173 -593229 -709115 -705105 -724245 -735752 -600510
37508 -600510 -360632 -218751 -218942 -176423 13868 194449 163665 -78893 -401565 -711297
37498 -711297 -938594 -979026 -803015 -557609 -422623 -400925 -361499 -254419 -169770 -199589
37488 -199589 -340747 -524525 -653227 -621022 -397682 -101795 87742 102903 8840 -126098
37478 -126098 -288838 -446380 -518263 -472267 -379269 -322891 -295055 -216358 -33486 217629 418747
37467 418747 450067 317964 195489 261596 485770 644020 570946 324090 72860 -88665
37457 -88665 -164462 -173917 -134311 -86173 -55434 -6018 106260 243030 304884 245959 125994
37446 125994 44732 49925 105980 135008 97735 39796 31677 61657 44668 -38983 -84912 -3139
37434 -3139 144286 225968 221023 218410 250987 236288 106268 -88901 -245259 -310663 -291517
37423 -291517 -214802 -128494 -89455 -97905 -79908 12077 110236 101144 -33348 -206681 -350640
37412 -350640 -474007 -581019 -609367 -510173 -344950 -227568 -182516 -135912 -55058 -13736 -70202
37401 -70202 -142627 -85060 126369 343619 385584 193291 -134019 -409357 -483554 -366037
37391 -366037 -223060 -203077 -268893 -262072 -121314 49420 140047 165870 200032 255711 292416
37380 292416 284775 237883 176775 144761 156788 145577 41264 -80167 -50415 141641 291808
37369 291808 253856 125279 41674 -56785 -267870 -464879 -438288 -242556 -143719 -220261 -268217
37358 -268217 -149599 7353 43888 -16361 -109662 -280381 -527593 -677517 -600324 -432202
37348 -432202 -392703 -475423 -508847 -445226 -380354 -328482 -197017 2019 111766 52957 -66139
37337 -66139 -114403 -80071 -275 116757 229433 240829 124273 -17533 -91885 -125933 -161556
37326 -161556 -139560 -638 169736 226370 158724 77164 25316 -59365 -185115 -242936 -163868
37315 -163868 -34395 22084 -1421 -41642 -84195 -122924 -62571 175671 449158 470253 172108
37304 172108 -138849 -132396 123177 246229 26391 -336195 -508409 -398772 -177779 -34518
37294 -34518 -25980 -110951 -215015 -265724 -246703 -220191 -233128 -216234 -65725 170540 299180
37283 299180 224342 83504 49790 84125 26136 -110860 -127192 37550 161826 63164 -90956
37272 -90956 -7647 270919 387191 169212 -137053 -236059 -164681 -145091 -230029 -303337 -325465
37261 -325465 -359501 -405678 -411116 -412516 -474590 -510322 -373720 -134156 -33464 -127410 -195586
37250 -195586 -95250 10142 -82635 -288873 -345328 -149975 154872 377089 435156 371253
37240 371253 295045 278926 263757 134247 -85384 -222480 -190551 -100523 -62539 -17712 122515
37229 122515 294591 369363 320918 190607 -13575 -253426 -398014 -369901 -276256 -261283
37219 -261283 -305444 -299512 -232550 -168278 -115236 -56857 -27095 -23157 55643 234823 344872
37208 344872 244944 49370 -60023 -119562 -247327 -340201 -198575 105363 281738 234599
37198 234599 145340 146206 182346 209255 254681 262556 146671 18915 76253 239957 231146 49397
37186 49397 10825 211801 343596 210920 51800 102116 199818 123843 7968 61829 148777
37175 148777 43241 -99826 24115 296040 295229 -31851 -267671 -150435 90096 150154
37165 150154 68051 43117 99584 138418 150623 182763 194450 115141 -12770 -71971 -24947
37154 -24947 50018 60062 -13330 -113477 -176557 -208745 -274542 -377889 -402672 -246879 10442
37143 10442 161539 87502 -137691 -346194 -418969 -349726 -230262 -163822 -158274 -136896 -72498
37132 -72498 -31170 -42746 -36173 19262 20610 -114033 -296955 -390135 -372919 -278171 -92405
37121 -92405 128843 190174 13281 -148300 -714 353067 526445 362703 74142 -114515
37111 -114515 -184376 -166382 -52344 68415 35797 -132224 -236560 -202727 -151333 -109988 51382
37100 51382 287492 296782 -30439 -360809 -356898 -126045 45031 179737 479811 842514
37090 842514 913270 621496 314172 276607 399167 426443 299340 109484 -95142 -285369
37080 -285369 -354032 -222659 3415 129429 107221 65901 110450 201007 266079 337710 489287
37069 489287 681811 769506 669929 453734 239108 69534 -60508 -137369 -163621 -200034
37059 -200034 -277473 -314155 -225467 -73971 12768 39227 109787 217894 244030 186572 206459
37048 206459 366665 494497 416243 202985 62385 74648 142424 135598 2200 -202580
37038 -202580 -339935 -314996 -217991 -229775 -349008 -363443 -163790 84747 198160 228765
37028 228765 308780 399972 401349 378487 447750 509912 354280 13431 -225018 -196343 -46609
37017 -46609 18190 668 38471 174623 296161 264006 64877 -155976 -235592 -180787 -138409
37006 -138409 -145749 -55230 184495 342687 210216 -35400 -38957 215245 389874 303652 146109
36995 146109 105281 79615 -75364 -251779 -255005 -113720 -18925 -43723 -100273 -117868 -113820
36984 -113820 -121450 -161759 -251621 -350884 -351856 -209365 -28185 63759 72537 85355 125198 153324
36972 153324 159377 149055 89695 -34413 -155698 -204595 -209555 -223395 -213044 -141522 -99587
36961 -99587 -199462 -361985 -382574 -231013 -118057 -196530 -338448 -311823 -79318 190259
36951 190259 340128 341282 234314 82878 -11062 41850 205321 321525 274222 108726
36941 108726 -37851 -78263 -16167 91057 146716 46099 -206205 -425097 -399834 -141899
36931 -141899 117367 205022 171437 124849 40756 -131927 -277381 -216885 13375 171646
36921 171646 129874 21414 7745 51715 30978 -44130 -70778 -46761 -75698 -191498 -301918
36910 -301918 -323069 -269445 -181793 -59339 76619 120489 -22128 -280449 -437173 -344372
36900 -344372 -90306 93120 78016 -51211 -136186 -125738 -84026 -77196 -120099 -205495 -309905
36889 -309905 -374783 -349881 -263741 -195820 -173595 -154682 -120538 -127146 -233262 -410920 -544797
36878 -544797 -512101 -293629 -42218 11114 -198889 -457662 -504281 -354343 -258558 -340161
36868 -340161 -436207 -359255 -165957 -51182 -75350 -128074 -119119 -93884 -160169 -359270 -603821
36857 -603821 -723058 -607574 -327905 -63093 88474 154033 160704 101273 46676 122142 289633
36846 289633 316983 87214 -203863 -303242 -221927 -135298 -93148 -41584 -37593 -191999 -429653
36835 -429653 -541247 -475381 -364954 -262374 -82154 161314 298708 261124 173715 114152
36825 114152 948 -172053 -224516 -72365 86765 64296 -24927 17253 113591 40905 -176534
36814 -176534 -286561 -196717 -83119 -99067 -209903 -349514 -510890 -617923 -525286 -245565
36804 -245565 5505 91779 112308 168349 164670 3886 -184207 -213791 -135554 -141758 -246395
36793 -246395 -288457 -234438 -243236 -387267 -520757 -521015 -489737 -577436 -715692 -675541 -364865
36782 -364865 37998 257171 183450 -28836 -119753 -5073 117298 10178 -273467 -426558
36772 -426558 -277560 -540 143504 141231 171600 307977 434586 434202 328410 226099 216909
36761 216909 304589 380348 300899 65589 -141588 -174108 -111198 -105228 -124961 -24231 181246
36750 181246 307162 274099 196332 167031 136099 51322 -49445 -147445 -282126 -417370 -432465
36739 -432465 -319658 -226585 -224627 -211550 -134522 -110053 -190919 -214985 -64288 102394 83475
36728 83475 -49031 -95437 -67559 -132732 -303121 -433576 -479699 -515364 -525468 -422621 -258329
36717 -258329 -183899 -200017 -169654 -77983 -41914 -55651 11752 129994 92821 -135194 -324398
36706 -324398 -337687 -319985 -391099 -406770 -220821 27153 109813 42394 -1242 16450 -10526
36695 -10526 -134865 -327530 -553186 -713193 -632540 -297837 562 -11238 -205542 -224560
36685 -224560 12289 227605 212520 78994 22503 50011 54338 8170 -32599 -32682 -1758 31253
36673 31253 29136 -16073 -49311 -23039 9231 -39354 -136192 -151924 -42180 101302 190734
36662 190734 217884 173207 22189 -184935 -297334 -236483 -105032 -50594 -81748 -87463 2090
36651 2090 134142 196578 132265 -1893 -94562 -115790 -154954 -274152 -378796 -328448 -136569
36640 -136569 60658 211342 376517 543205 571997 394407 132459 -55180 -143654 -192207
36630 -192207 -228741 -261249 -310853 -352164 -303758 -158304 -42942 -63355 -152835 -160476 -41904
36619 -41904 99477 112620 -90975 -440573 -684970 -591997 -238514 29041 12330 -108233
36609 -108233 -82728 36911 34438 -92146 -146156 -70781 -8733 -17901 21603 160314 264035
36598 264035 236712 166328 138855 78144 -93448 -274721 -321511 -267537 -254656 -301046 -286626
36587 -286626 -147902 38605 169579 212221 177147 77216 -55909 -162293 -192747 -148258
36577 -148258 -76511 -31034 -25031 -29708 -28909 -44272 -67985 -19930 139807 287854 252953 59002
36565 59002 -86414 -80881 -54847 -140631 -267448 -305280 -284633 -322250 -417351 -477093 -479978 -459962
36553 -459962 -383918 -214662 -63281 -96164 -284043 -413175 -375316 -288779 -282106 -303390 -223046
36542 -223046 -21773 196628 307104 235506 5484 -253561 -416876 -491644 -548797 -549826
36532 -549826 -390454 -127581 23224 -15399 -71255 -16345 9718 -162187 -414066 -475907
36522 -475907 -299494 -82181 51953 178631 353404 458066 358453 104132 -112995 -145299
36512 -145299 2050 194425 277022 209370 97129 47990 28120 -56517 -170997 -175624 -52005
36501 -52005 37003 -19698 -105126 -36304 166708 292084 201581 -12349 -151789 -124774 3629
36490 3629 121613 171868 149506 60964 -73578 -203217 -280572 -307824 -308605 -268374 -160349
36479 -160349 -18375 95529 193158 325732 434166 370841 133719 -56987 -19169 167830
36469 167830 310695 350770 324935 205419 -24473 -221633 -230189 -132090 -135888 -250520 -299593
36458 -299593 -237321 -190480 -177911 -73460 99821 139606 32613 49030 305593 524224
36448 524224 446611 226925 141434 139599 17794 -130356 -25518 295169 458579 268410
36438 268410 -68600 -280715 -319916 -245444 -87136 59017 20735 -226160 -482386 -580460
36428 -580460 -560812 -499741 -345313 -74268 138108 98369 -125329 -275129 -233453 -142999
36418 -142999 -187365 -355734 -469967 -409044 -269921 -273035 -483966 -680399 -586203 -214560
36408 -214560 145363 290632 303613 336070 356824 246473 39220 -91298 -59052 49760
36398 49760 117252 115298 73609 15600 -34364 -32577 45921 157633 207946 139510 4803 -77250
36386 -77250 -60998 -43225 -152261 -388598 -619504 -706923 -594658 -317748 -7268 158138
36376 158138 115263 4728 -16739 -8494 -126599 -300654 -264292 29525 257916 138593
36366 138593 -189730 -376767 -313747 -173822 -87051 3614 169625 358380 464683 438923
36356 438923 311249 173381 112453 108283 58545 -35841 -26823 130014 221372 60083 -189488
36345 -189488 -217295 -41509 10680 -184166 -348824 -232222 21393 104501 -39311 -227974
36335 -227974 -334190 -356443 -272081 -31434 299965 552249 635381 612668 577038 537788 441806
36324 441806 244385 -38847 -301417 -403773 -338789 -297359 -452296 -692197 -715802 -429578
36314 -429578 -108517 -65397 -267085 -412145 -327848 -133459 -15528 -7022 -54624 -167608
36304 -167608 -372942 -589242 -677313 -607039 -478536 -385608 -347502 -363597 -429202 -491060 -494198
36293 -494198 -482412 -530642 -562733 -397083 -37203 251639 270753 140460 74613 49115 -93749
36282 -93749 -310012 -379004 -245945 -99217 -74031 -94899 -71204 -45713 -56741 -29870 80209
36271 80209 184943 209873 212880 237132 178652 -49859 -320615 -416558 -303998 -144767 -76185
36260 -76185 -99489 -151715 -170951 -112119 -312 53151 -20686 -134610 -154201 -85268 -47006
36249 -47006 -88257 -148852 -191001 -245209 -312125 -329285 -264576 -155177 -31561 110976 240274
36238 240274 277232 205109 120308 119527 178838 191145 96345 -65572 -219917 -343246 -466314
36227 -466314 -588916 -622704 -478890 -219546 -38779 -41525 -115257 -98097 -5071 19848 -72187
36216 -72187 -189097 -260594 -311723 -354194 -326637 -192487 -10975 132105 195943 165792 48741
36205 48741 -77740 -102544 -23281 15430 -113169 -357191 -533245 -499812 -265048 21764
36195 21764 160441 48149 -214291 -407486 -419552 -343532 -323226 -363207 -344302 -189694 36459
36184 36459 184387 149881 -32829 -218659 -286799 -239147 -149700 -67566 -25392 -75112 -202934
36173 -202934 -256982 -108814 130508 222363 128570 32645 11403 -66965 -222917 -217989 67473
36162 67473 336094 238842 -103475 -258429 -92341 104927 106929 29247 32302 49489 -14810
36151 -14810 -48653 83500 261270 235080 -29394 -315325 -433769 -386096 -264285 -139591
36141 -139591 -74470 -122283 -255174 -356592 -332980 -201653 -48966 59926 104766 80078
36131 80078 -10417 -128446 -211420 -238268 -263302 -339781 -420899 -405493 -294304 -210607 -216960
36120 -216960 -210991 -93557 57826 120250 147383 274505 447297 470621 334727 243316 252186
36109 252186 150964 -147538 -362508 -233139 49969 110171 -41210 -48614 195102 365223
36099 365223 203560 -121107 -322223 -408759 -561587 -771642 -852462 -726425 -477182 -172905
36089 -172905 147123 343183 272940 52621 -5944 185757 328555 132050 -269929 -477280
36079 -477280 -311586 35551 295591 366047 252058 -26762 -372625 -597169 -602284 -497459
36069 -497459 -436820 -415531 -338419 -216614 -150542 -153552 -146714 -126667 -182528 -313189 -375018
36058 -375018 -277137 -108995 -3527 13940 -35625 -172550 -367758 -464961 -339214 -81708
36048 -81708 99226 113324 2318 -210748 -503054 -704610 -588513 -184471 163917 169150
36038 169150 -79738 -269381 -237978 -75521 78230 176073 205940 137989 -4956 -108672
36028 -108672 -81635 20665 51178 -52156 -200100 -276426 -275620 -272747 -293338 -287921 -237931 -206491
36016 -206491 -241751 -291220 -274370 -199866 -139958 -109984 -46656 93652 273606 414863 451423
36005 451423 350360 140410 -71418 -165262 -110283 24730 153659 227156 223600 148025 41555
35994 41555 -57623 -154552 -246268 -256749 -113358 111892 239481 193996 93111 83767 171686
35983 171686 270076 338829 387735 386759 275113 68735 -112733 -164032 -112885 -85910 -152145
35972 -152145 -227948 -171634 35206 255840 365366 383378 396403 423759 440571 464628 504188
35961 504188 468136 274954 40270 -3765 186921 382667 358869 149220 -40857 -76148
35951 -76148 15224 108381 87852 -44712 -146670 -103524 -15805 -73593 -231352 -209072 96022
35940 96022 404396 418967 225628 124007 181362 200262 81292 -34424 -21600 36002 -631
35929 -631 -114373 -178597 -144193 -86216 -77665 -79193 12568 211310 378245 362273 181817 -2685
35917 -2685 -83020 -79114 -34309 38932 96656 86294 61533 132151 275892 368885 424547 587713
35905 587713 852874 1051093 1180427 1428879 1782881 2058908 2527795 3910828 6206678
35896 6206678 7986731 7676169 5433753 3024663 1811708 1590759 1505257 1271192 1070951
35887 1070951 896022 617041 366593 327268 353054 223603 71743 153934 377381 463779
35877 463779 434092 507794 619125 473086 74133 -199243 -105409 194801 443158 571242
35867 571242 609943 559546 444402 323291 194058 34006 -70179 -9586 140647 194465
35857 194465 127975 82509 107829 123666 136353 242890 379363 324475 46759 -187291 -182403
35846 -182403 -89763 -151796 -328558 -368016 -171277 81348 162311 50642 -67390 -19854
35836 -19854 141571 190397 20401 -178362 -146247 92585 253797 164805 -40560 -125715
35826 -125715 -7039 238748 491116 639753 616832 447018 225109 31298 -85429 -76167
35816 -76167 58835 213101 270332 236060 174488 69676 -110213 -264529 -256514 -135215 -75302
35805 -75302 -104738 -83957 46188 199210 329750 465241 532877 393781 95597 -144778
35795 -144778 -260013 -381195 -512848 -457854 -181316 51964 67944 24237 66585 38991
35785 38991 -203411 -457228 -465792 -347068 -380327 -512139 -443853 -143275 86460 54094 -104234
35774 -104234 -192360 -187276 -156118 -135628 -132457 -102631 48476 302904 437681 281164 -13677
35763 -13677 -164658 -149897 -157739 -226788 -233501 -198263 -272254 -404049 -357722 -129897 -18064
35752 -18064 -160265 -316903 -259162 -87948 9177 51550 108862 87108 -92987 -285892 -316621
35741 -316621 -233811 -160363 -53171 154553 312831 218132 -69697 -311033 -411961 -436926
35731 -436926 -375586 -161897 102582 202810 103671 -30080 -116406 -230136 -364424 -359846
35721 -359846 -164578 29751 27237 -139135 -308703 -396846 -402310 -331668 -226959 -183958 -245611
35710 -245611 -337949 -380296 -390309 -415302 -430595 -376468 -242193 -63075 107236 188405 123284
35699 123284 -16714 -69992 10969 88735 40807 -76726 -151797 -186675 -225516 -220467 -128598
35688 -128598 -62419 -159368 -340989 -391445 -266382 -130374 -69798 24162 218630 382563
35678 382563 386264 298695 241503 172536 -16317 -268216 -406919 -380793 -302560 -256251 -216059
35667 -216059 -169763 -173951 -234996 -255302 -172458 -69321 -67386 -160701 -228848 -194715 -110697 -81118
35655 -81118 -129903 -169898 -114460 436 58127 33475 40228 150095 254223 219373 120769
35644 120769 160101 352909 460528 291375 -53264 -308489 -333419 -206943 -112207 -181604
35634 -181604 -386718 -533549 -435799 -134599 123468 153316 -9214 -225028 -395967 -452747
35624 -452747 -360619 -224640 -234046 -387811 -433311 -224277 23723 35439 -109443 -119069 47795
35613 47795 157615 115369 91563 183540 243580 168707 111900 227077 387233 352476 101605
35602 101605 -180876 -360877 -429468 -390341 -253983 -128479 -156036 -330586 -488368 -509836
35592 -509836 -448959 -435846 -521111 -653080 -760748 -813200 -808784 -742028 -607584 -440190 -319547
35581 -319547 -296118 -319377 -282456 -144502 23516 116473 89668 -17021 -120142 -172145 -220888
35570 -220888 -345242 -499418 -509228 -312468 -112922 -148442 -367017 -515220 -514430 -523904 -607536
35559 -607536 -587759 -341347 -34553 87578 -3746 -175878 -340439 -451267 -430872 -279862
35549 -279862 -165738 -228926 -375451 -425225 -386457 -401580 -483656 -502582 -404132 -260153 -118480
35538 -118480 22706 107986 76862 22453 108834 306490 393828 267034 76634 -5019 5699
35527 5699 -4024 -84644 -232178 -418810 -538080 -459602 -237494 -130257 -282131 -490772 -447912
35516 -447912 -151440 83820 21032 -232872 -395359 -339908 -185813 -104925 -130932 -186913
35506 -186913 -231730 -286060 -322066 -246904 -54864 109969 139191 112084 135666 132119 -26873
35495 -26873 -239703 -269605 -120818 -61764 -203572 -311034 -175778 42822 50262 -165877
35485 -165877 -371045 -437859 -443550 -455994 -427554 -314203 -150775 6947 103557 60728 -142651
35474 -142651 -366326 -405483 -217830 26800 131356 41185 -150229 -282815 -233643 -21507
35464 -21507 200135 309250 331174 332269 292189 197390 164002 289602 441097 398010 188266
35453 188266 54879 68295 21923 -200854 -403185 -380650 -250243 -258132 -390074 -409346 -223148
35442 -223148 15017 163947 248993 313232 289628 116832 -121584 -266037 -240261 -88435
35432 -88435 99010 243971 295070 234657 82548 -105374 -240853 -245503 -138986 -59298 -125025
35421 -125025 -283180 -367846 -313393 -224556 -213435 -261998 -301236 -339608 -419497 -494793 -457361
35410 -457361 -282729 -68729 79039 133180 108606 15985 -116333 -231524 -295802 -320987
35400 -320987 -307406 -220780 -79036 -9988 -132474 -384519 -551012 -490726 -286550 -146095
35390 -146095 -192979 -375302 -534445 -532296 -350053 -107711 27438 -17318 -171199 -308680
35380 -308680 -350121 -275443 -114435 34475 54054 -44184 -86282 44960 208729 167825 -64709
35369 -64709 -216850 -139991 -17848 -77661 -247500 -279536 -117797 69076 187661 320397
35359 320397 482223 498381 260296 -43755 -119428 82408 344698 463386 407607 235740
35349 235740 16120 -143485 -131656 28709 165524 142646 -5167 -162737 -273037 -321493
35339 -321493 -273845 -140290 -47923 -117699 -274457 -307905 -160265 -38320 -154921 -435104
35329 -435104 -597526 -514084 -366758 -390760 -547503 -565758 -299702 69393 248046 160563
35319 160563 -38995 -226555 -415663 -583932 -580044 -344144 -101379 -133450 -380191 -470991
35309 -470991 -208146 153626 222781 -56255 -388206 -515039 -461142 -397815 -408828 -449716
35299 -449716 -456510 -419904 -367714 -310971 -217250 -50492 152516 280203 261829 158493 86592
35288 86592 75028 65677 36558 32988 67152 84269 68991 95502 200032 269202 152260 -130693
35276 -130693 -372476 -386193 -185741 49624 157180 122230 44633 -2810 -52682 -159288
$$ [...]
##END NTUPLES=NMR SPECTRUM
##END=
