##TITLE=31Pdec_LR-718-RM1
 Ac2O+CHCl3, 124 sc
 6.7.2020
##JCAMPDX= 6.0         $$ Bruker NMR JCAMP-DX V2.0
##DATA TYPE= NMR SPECTRUM
##DATA CLASS= NTUPLES
##ORIGIN= UXNMR, Bruker Analytische Messtechnik GmbH
##OWNER= root
$$ XWIN-NMR		Version 3.5
$$ Mon Jul  6 12:29:31 2020 Russian Standard Time (UT+4h)  she@DPX200
##.OBSERVE FREQUENCY= 81.013821
##.OBSERVE NUCLEUS= ^31P
##.ACQUISITION MODE= SIMULTANEOUS
##.ACQUISITION SCHEME= undefined
##.AVERAGES= 124
##.DIGITISER RES= 17
##SPECTROMETER/DATA SYSTEM= spect
##.PULSE SEQUENCE= zgpg30
##.SOLVENT NAME= CDCl3
##.SHIFT REFERENCE= (INTERNAL, CDCl3, 0, 182.463)
##AUDIT TRAIL= $$ (NUMBER, WHEN, WHO, WHERE, WHAT)
$$ ##TITLE= Audit trail, XWIN-NMR		Version 3.5
$$ ##JCAMPDX= 5.01
$$ ##ORIGIN= Bruker BioSpin GmbH
$$ ##OWNER= she
$$ F:/spectra/data/she/nmr/P31/1/pdata/1/auditp.txt
$$ ##AUDIT TRAIL=  $$ (NUMBER, WHEN, WHO, WHERE, WHAT)
(   1,<2020-07-06 12:27:15.70 +0400>,<she>,<DPX200>,
      <continue with go, POWCHK disabled, PULCHK disabled
       configuration hash MD5:
       00 E9 B6 7A A2 85 ED C7 34 08 36 98 17 FE 4E 26
       data hash MD5: 32K
       BD 72 8B FD 4F F4 C6 39 C4 4A 7A D6 59 95 21 16>)
(   2,<2020-07-06 12:27:19.51 +0400>,<she>,<DPX200>,
      <Start of raw data processing
       efp BC_mod = 2 LB = 1 FT_mod = 6 PKNL = 1 PHC0 = -1672.33 PHC1 = 52.00197 SI = 64K 
       data hash MD5: 64K
       10 6F 50 BB 75 5A BC 78 B4 5D 15 FC 0A BD 9D 35>)
(   3,<2020-07-06 12:27:59.85 +0400>,<she>,<DPX200>,
      <pk PHC0 = 44.35009 PHC1 = -68.4 
       data hash MD5: 64K
       E9 EF 73 C7 F4 D7 BC C5 BB 26 D1 4A 06 F3 CC 81>)
(   4,<2020-07-06 12:28:03.70 +0400>,<she>,<DPX200>,
      <abs ABSG = 5 
       data hash MD5: 64K
       45 EB D5 2F 86 F5 77 F2 AF C7 56 08 BF FA C8 53>)
$$ ##END=
$$ 
$$ hash MD5
$$ E2 35 B6 74 AF 5A F8 1F EE A3 51 61 C3 3C 53 22
##$RELAX= 
##$RELAX= 
##$RELAX= 
##$RELAX= 
##$RELAX= 
##$RELAX= 
##$RELAX= 
##$RELAX= 
$$ Bruker specific parameters
$$ --------------------------
##$DU= <F:/spectra>
##$EXPNO= 1
##$NAME= <P31>
##$PROCNO= 1
##$TYPE= <nmr>
##$USER= <she>
##$AMP= (0..31)
100 100 100 100 100 100 100 100 100 100 100 100 100 100 100 100 100 100 
100 100 100 100 100 100 100 100 100 100 100 100 100 100 
##$AQSEQ= 0
##$AQ_mod= 1
##$AUNM= <au_zg>
##$AUTOPOS= <>
##$BF1= 81.014009
##$BF2= 200.13
##$BF3= 200.13
##$BF4= 200.13
##$BF5= 200.13
##$BF6= 200.13
##$BF7= 200.13
##$BF8= 200.13
##$BYTORDA= 1
##$CFDGTYP= 0
##$CFRGTYP= 5
##$CHEMSTR= <none>
##$CNST= (0..31)
1 1 145 1 1 1 1 1 1 1 1 1 1 1 1 1 1 1 1 1 1 1 1 1 1 1 1 1 1 1 1 1 
##$CPDPRG= <waltz16>
##$CPDPRG1= <>
##$CPDPRG2= <waltz16>
##$CPDPRG3= <>
##$CPDPRG4= <mlev>
##$CPDPRG5= <mlev>
##$CPDPRG6= <mlev>
##$CPDPRG7= <mlev>
##$CPDPRG8= <mlev>
##$CPDPRGB= <>
##$CPDPRGT= <>
##$D= (0..31)
0 1 0 0 0 0 0 0 0 0 0 0.03 2e-05 3e-06 0 0 0 0 0 0 0 0 0 0 0 0 0 0 0 0 
0 0 
##$DATE= 1594023852
##$DBL= (0..7)
120 120 120 11 120 120 24 19 
##$DBP= (0..7)
150 150 150 150 150 150 150 150 
##$DBP07= 0
##$DBPNAM0= <>
##$DBPNAM1= <>
$$ [...]
##$SUBNAM3= <"">
##$SUBNAM4= <"">
##$SUBNAM5= <"">
##$SUBNAM6= <"">
##$SUBNAM7= <"">
##$SUBNAM8= <"">
##$SUBNAM9= <"">
##$SW= 369.568048894756
##$SWIBOX= (0..15)
0 1 3 0 0 0 0 0 0 0 0 0 0 0 0 0 
##$SW_h= 29940.119760479
##$TD= 32768
##$TD0= 1
##$TE= 0
##$TE2= 300
##$TE3= 300
##$TEG= 300
##$TL= (0..7)
0 120 53 12 22 120 120 120 
##$TP= (0..7)
150 150 150 150 150 150 150 150 
##$TP07= 0
##$TPNAME0= <>
##$TPNAME1= <>
##$TPNAME2= <>
##$TPNAME3= <>
##$TPNAME4= <>
##$TPNAME5= <>
##$TPNAME6= <>
##$TPNAME7= <>
##$TPOAL= (0..7)
0.5 0.5 0.5 0.5 0.5 0.5 0.5 0.5 
##$TPOFFS= (0..7)
0 0 0 0 0 0 0 0 
##$TUNHIN= 0
##$TUNHOUT= 0
##$TUNXOUT= 0
##$USERA1= <user>
##$USERA2= <user>
##$USERA3= <user>
##$USERA4= <user>
##$USERA5= <user>
##$V9= 5
##$VALIST= <valist>
##$VCLIST= <CCCCCCCCCCCCCCC>
##$VD= 0
##$VDLIST= <DDDDDDDDDDDDDDD>
##$VPLIST= <PPPPPPPPPPPPPPP>
##$VTLIST= <TTTTTTTTTTTTTTT>
##$WBST= 1024
##$WBSW= 4
##$XGAIN= (0..3)
0 0 0 0 
##$XL= 0
##$YL= 0
##$YMAX_a= 44480
##$YMIN_a= -53784
##$ZGOPTNS= <>
##$ZL1= 120
##$ZL2= 120
##$ZL3= 120
##$ZL4= 120
##$ABSF1= 182.463
##$ABSF2= -187.1042
##$ABSG= 5
##$ABSL= 3
##$ALPHA= 0
##$AQORDER= 0
##$ASSFAC= 0
##$ASSFACI= 0
##$ASSFACX= 0
##$ASSWID= 0
##$AUNMP= <proc_1d>
##$AZFE= 0.1
##$AZFW= 0.5
##$BCFW= 0
##$BC_mod= 2
##$BYTORDP= 0
##$COROFFS= 0
##$CY= -3
##$DATMOD= 1
##$DC= 0
##$DFILT= <>
##$DTYPP= 0
##$F1P= 0
##$F2P= 0
##$FCOR= 1
##$FTSIZE= 65536
##$FT_mod= 6
##$GAMMA= 0
##$GB= 0
##$INTBC= 1
##$INTSCL= 5.30512e-09
##$ISEN= 30
##$LB= 1
##$LEV0= 0
##$LPBIN= 0
##$MAXI= 10000
##$MC2= 0
##$MEAN= 0
##$ME_mod= 0
##$MI= 50
##$NCOEF= 0
##$NC_proc= -7
##$NLEV= 6
##$NOISF1= 182.463
##$NOISF2= 159.3651
##$NSP= 0
##$NTH_PI= 0
##$NZP= 0
##$OFFSET= 182.463
##$PC= 4
##$PHC0= -1627.98
##$PHC1= -16.39803
##$PH_mod= 1
##$PKNL= yes
##$PPARMOD= 0
##$PSCAL= 0
##$PSIGN= 0
##$REVERSE= no
##$SF= 81.0140089999434
##$SI= 65536
##$SIGF1= 159.3651
##$SIGF2= -187.1042
##$SINO= 113.3802
##$SIOLD= 16384
##$SREGLST= <1H.CDCl3>
##$SSB= 0
##$STSI= 65536
##$STSR= 0
##$SW_p= 29940.119760479
##$SYMM= 0
##$S_DEV= 0
##$TDeff= 32768
##$TDoff= 0
##$TI= <>
##$TILT= no
##$TM1= 0
##$TM2= 0
##$TOPLEV= 0
##$USERP1= <user>
##$USERP2= <user>
##$USERP3= <user>
##$USERP4= <user>
##$USERP5= <user>
##$WDW= 1
##$XDIM= 65536
##$YMAX_p= 372658261
##$YMIN_p= -45326883
$$ End of Bruker specific parameters
$$ ---------------------------------
##NTUPLES= NMR SPECTRUM
##VAR_NAME=  FREQUENCY,     SPECTRUM/REAL,   SPECTRUM/IMAG
##SYMBOL=    X,             R,               I
##VAR_TYPE=  INDEPENDENT,   DEPENDENT,       DEPENDENT
##VAR_FORM=  AFFN,          ASDF,            ASDF
##VAR_DIM=   65536,         65536,           65536
##UNITS=     HZ,            ARBITRARY UNITS, ARBITRARY UNITS
##FACTOR=    0.456856943014862, 1,           1
##FIRST=     14782.0589164792, 0,            0
##LAST=      -15158.0608439998, 0,           0
##MIN=       -15158.0608439998, -45326883,   0
##MAX=       14782.0589164792, 372658261,    0
$$ Real data points
##PAGE= N=1
##DATA TABLE= (X++(R..R)), XYDATA
$$ [...]
6243 12961657 11274548 9014168 6852145 6634685 7457013 6976591 5042569 3044736 1482908
6234 1482908 929280 3270884 8830956 14082391 15548391 14410271 13715670 12479657 7018385
6225 7018385 -2077699 -8943694 -9712366 -6945190 -4676985 -2329108 3058912 10366351
6217 10366351 14296855 12282499 8443423 8824505 14042062 18426491 16117313 6744655
6209 6744655 -4756029 -12533598 -13569097 -8532107 -744325 5497698 7081153 4147335
6201 4147335 185943 -967060 1037650 2707958 959191 -2706799 -3551596 678622
6193 678622 6755190 9569264 7719486 4299831 2809722 3805011 5468807 5948607 4697526
6184 4697526 2739486 2287318 5040093 9762246 12150301 8586402 417259 -6612057
6176 -6612057 -8218980 -6261621 -5956320 -8387835 -8245717 -881689 10319732 17004637
6168 17004637 15859375 11802581 10355479 10710000 8663412 3147645 -3524505 -9661594
6160 -9661594 -14635779 -16587764 -13671602 -7670828 -3316009 -3465225 -6803842 -10082969
6152 -10082969 -10967197 -9524491 -8696820 -11899608 -18145474 -21790544 -19971310 -17327564
6144 -17327564 -18889884 -21271762 -17484490 -8835680 -4032112 -6053334 -8318240 -6217226
6136 -6217226 -4080027 -6301732 -9161513 -7714277 -4733265 -5430366 -7663854 -5320359
6128 -5320359 1182967 5601476 5842498 5832386 7621599 8721834 8108664 8190423 9066417
6119 9066417 7028563 1475706 -2197626 -231839 3477691 3194639 -303058 -1883803
6111 -1883803 -178339 1719372 2727619 5279693 9120823 8826776 1297100 -7403473
6103 -7403473 -7850713 516344 8035458 7353150 2706276 2908647 8492350 11531481 7265283
6094 7265283 -180445 -4830428 -6129291 -6428558 -5561511 -1770629 4296699 9583332 11196535
6085 11196535 7641535 160600 -5943605 -5382331 -540117 -419232 -8546852 -17011785
6077 -17011785 -17517435 -13276217 -12768877 -15599501 -13662454 -4995021 3039361 5347023
6069 5347023 4956901 4723563 1641238 -6012015 -12877291 -13717034 -11279731 -10868734 -11050686
6060 -11050686 -6572197 1714857 6860985 5650926 2379088 1579188 2104251 914303
6052 914303 -1120346 -777113 2033928 3915854 2967170 1220462 1193992 2292783 2469178
6043 2469178 1856492 1962431 1731675 -2111331 -9490918 -14635380 -11778650 -1728332 9293505
6034 9293505 16035237 17511621 15447037 11950656 8120492 3343169 -2941372 -7805848
6026 -7805848 -6027728 2711690 10741040 10442739 3339207 -3018574 -5243339 -6043422 -7135151
6017 -7135151 -6193412 -1676065 4079683 7914611 8762094 7330384 6009321 8177635 13750392
6008 13750392 17060963 14202747 10326699 12577646 17382105 14251274 3021592 -3321085
6000 -3321085 2980037 13054983 14745830 9130859 5716633 7279346 8495432 6320608
5992 6320608 3501465 3086027 5625917 10506873 15126493 14895727 8862841 2696246 1255344
5983 1255344 1679318 -438798 -2115175 1993385 8503345 8396745 616907 -6211256 -6444947
5974 -6444947 -3401255 -723632 3853890 11860709 17851470 15720362 7807640 2466489
5966 2466489 3756733 7267271 6152670 -848873 -8128084 -9622891 -5790543 -2443259
5958 -2443259 -2367516 -1474119 4359897 12179334 15871752 14466432 11411650 7616369 1281468
5949 1281468 -6032001 -9367579 -7094788 -2529065 1787676 6465315 11148746 12902833
5941 12902833 10100705 4297552 -2047810 -6074682 -3862113 5337737 14787215 16410819
5933 16410819 11424376 8454399 10969614 14169172 15263763 17745280 21983900 20405748
5925 20405748 8136995 -7877994 -16726083 -16048775 -11428571 -7571915 -5577782 -5515783
5917 -5515783 -6386867 -5709295 -2862913 -344595 715549 2281342 4217965 2755625 -2423139
5908 -2423139 -5489311 -3258769 -547179 -1595179 -2763551 -220654 1935615 -500108
5900 -500108 -2234574 3095349 9747696 6934279 -3303184 -7363510 574332 11447038
5892 11447038 15107648 11496908 5870976 1740434 1204311 4494496 6772984 2631363
5884 2631363 -4593728 -5892032 -421123 2952664 519032 -152236 6209052 12876219
5876 12876219 12154503 7622259 6844252 8682542 7308328 3791074 3535345 5113903 2028174
5867 2028174 -4835804 -6146699 2500368 13834975 18824546 17685757 16965191 19167294
5859 19167294 19832644 14499287 5393470 -753266 -1154087 -673759 -4694779 -10127718 -8461963
5850 -8461963 1689781 10724820 9635176 692031 -7448934 -11124229 -12931870 -14638885
5842 -14638885 -14870535 -12932407 -9840549 -5751905 -550379 3293693 2563519 -1752188
5834 -1752188 -4899360 -4306081 -2236010 -1939606 -3522694 -4561255 -3683068 -2810693 -5094871
5825 -5094871 -9472934 -8986672 1393950 15900276 23054347 20733001 18575599 22218635
5817 22218635 24201938 17363613 8608081 8771973 14849676 14797429 6770139 368195 -307999
5808 -307999 -1091017 -3773809 -1610819 6776988 11710506 7278563 913514 465286 1537397
5799 1537397 -3114229 -9620820 -8709087 53271 9126331 13800943 13606734 7466090 -3316106
5790 -3316106 -10967957 -9744512 -5551460 -7389203 -12134765 -9231660 795134 5439683
5782 5439683 -166396 -5208846 -126079 8628570 8324126 -2401226 -13380466 -16414598
5774 -16414598 -12285856 -6629148 -4335420 -7059885 -12355489 -15593947 -14500997 -10513619
5766 -10513619 -5224391 1188576 6967525 8733811 6810117 6115317 8700234 10083280
5758 10083280 7046447 4107131 6272176 9363123 5343821 -4450433 -9791592 -6062925
5750 -6062925 -483364 -931414 -5224640 -6296961 -3158190 -579917 -350042 605978 3238672
5741 3238672 3507592 -770007 -4327384 -143561 10561092 18381753 16754145 9571439
5733 9571439 5398383 6378086 6798741 2602626 -1991934 -176156 7517769 13031953 10612628
5724 10612628 3129935 -3143721 -6795744 -10466974 -13315142 -9874260 1453732 13311136
5716 13311136 17464344 15797544 17673405 26395492 34214528 33113865 25409593 19414636
5708 19414636 18119490 17349755 13391299 7164451 998619 -4105271 -7237648 -7462729
5700 -7462729 -6235980 -7007910 -11019990 -15452267 -16546371 -13025731 -6461615 -98554
5692 -98554 3063934 3043334 2939076 4101738 3125055 -2853393 -9958764 -11808573 -8604780
5683 -8604780 -5958295 -5456886 -3837696 -1885052 -5110041 -12646412 -14743509 -7046446
5675 -7046446 702639 -2161465 -11866306 -16875328 -14915383 -13132287 -13979173 -11970146
5667 -11970146 -5085039 338995 -911159 -5593314 -7344917 -4348496 671037 4125367
5659 4125367 3961584 1962161 3483656 10544561 16371518 13089187 4037433 381490
5651 381490 4831272 8079712 4297178 260947 3164490 8115554 6205399 -1352557
5643 -1352557 -6700083 -8814247 -13257205 -19882823 -20881763 -12761716 -2312002 2457914
5635 2457914 1739500 1382396 5189281 12329186 19018744 20502397 14292228 3731667
5627 3731667 -3770568 -3846012 1089409 6014308 8833197 10337075 10905640 9518887 5448849
5618 5448849 -202084 -4476532 -4467987 -607113 2386590 -13494 -6598274 -11564666 -11412216
5609 -11412216 -8204658 -5516102 -4201044 -3690035 -4705118 -8183905 -12925790 -16302118
5601 -16302118 -16403596 -12445790 -4871035 3356511 7604759 6222902 3065772 2976374 5955903
5592 5955903 8484610 9318231 10176443 10965020 8874195 3856552 927479 3643763 7873837
5583 7873837 6391930 -918756 -5709405 -1304714 8943934 15722674 14193078 7641219
5575 7641219 1843707 -647476 -40564 3146333 7201471 8103266 3410521 -2958652 -4102107
5566 -4102107 429795 2995180 -1154069 -5444617 -530766 10710308 14572101 4575743
5558 4575743 -9201844 -13352237 -7751582 -2307679 -1246645 457338 5501208 8277522
5550 8277522 4050177 -2323685 -2062199 6366938 16161225 20625906 19297174 16446688
5542 16446688 15840886 16836430 15297604 9525885 4135181 4321498 6959587 3527545 -6672953
5533 -6672953 -13445215 -9779129 -1763511 1905208 3506960 10064924 18259913 17352571
5525 17352571 6477865 -2394341 -1093161 4948079 7226134 5841122 5600176 7657659
5517 7657659 10925267 16216583 22808819 24992816 18209175 6267773 -2425025 -4050648
5509 -4050648 -1357252 860364 -1274827 -9295199 -19823426 -25664893 -23017317 -15470765
5501 -15470765 -8191699 -1620887 5512480 10838944 11030830 7219840 3099350 -22216
5493 -22216 -2045458 -1012493 3620576 7215794 5028339 -825801 -4732184 -5866051 -7488211
5484 -7488211 -9898884 -10425468 -9393503 -9838202 -11611904 -11533330 -9166505 -7081883 -5837227
5475 -5837227 -3942725 -1914767 -915647 1202157 6435415 11170966 11306247 10462281 14128634
5466 14128634 17786739 12599075 2797680 3375483 16767614 26125509 19331449 6584690
5458 6584690 3234087 6324917 2597596 -7503633 -10354097 -1905687 5488958 1767959
5450 1767959 -7502219 -11332282 -7740940 -2257790 1623124 4510059 7054946 8600209
5442 8600209 8534057 6500734 2506726 -2042449 -5090114 -6241031 -6324998 -4685110 190201
5433 190201 6888891 11164736 11077804 9338859 9007246 9207962 7078243 2419449 -1622704
5424 -1622704 -2051672 1067299 5039891 7124904 6551777 4308944 1588239 -824831 -1969619
5415 -1969619 -952347 1855808 5029134 7731632 9936583 11200559 11006635 9999149
5407 9999149 8569622 4955917 -1734327 -7275232 -6241603 -637638 1481109 -2352025
5399 -2352025 -5682229 -4429440 -3507290 -6667114 -7816166 -984239 7561168 7784570 2166159
5390 2166159 1768589 8177774 11970256 9643212 9305001 15999103 22668210 21205273 13367930
5381 13367930 5027551 -2132724 -6965917 -4760596 5528361 15765828 17891033 14192245
5373 14192245 11586007 10357571 6221127 -233519 -4423677 -5812456 -7249605 -7883359
5365 -7883359 -4609147 -17532 -1035395 -8597768 -15318377 -15194421 -10351952 -6587124
5357 -6587124 -6751479 -9855327 -12673016 -11346351 -5260740 327413 -294553 -5305967 -7783606
5348 -7783606 -6122803 -5576202 -7960983 -7219140 579555 9086524 9784097 4378859 2315272
5339 2315272 7510010 13988050 15113825 11735044 9082461 9160815 9082340 5775507 254427
5330 254427 -3393340 -3147772 -2391123 -6290883 -14377632 -19440859 -16232914 -9129190 -7193588
5321 -7193588 -12222256 -16286977 -12614387 -4766515 -1525535 -5021633 -8476094 -5825096
5313 -5825096 521798 3622104 977476 -3681493 -6541739 -7791867 -8590118 -7584472
5305 -7584472 -3690898 -414210 -3033761 -11219451 -18551841 -20974822 -21732643 -24858524
5297 -24858524 -27624272 -24935838 -19184609 -18498609 -24136125 -26802190 -19403308 -7486657
5289 -7486657 -1063107 -638327 662137 3543207 1087317 -7682134 -12585404 -6242336
5281 -6242336 3886407 5185522 -2330136 -6256452 1089512 13317176 18955897 13873672
5273 13873672 2655629 -7508359 -11403227 -7853055 -663112 4010342 3338250 -166455
5265 -166455 -2995687 -4749081 -6599505 -8081470 -7681046 -5406720 -2944159 -1890468 -2820842
5256 -2820842 -5156277 -7108487 -6778728 -4103092 -896437 1300422 2317880 2369411 1611401
5247 1611401 846365 995669 1763459 2388820 3205112 4296547 3572015 -524910 -5112743
5238 -5112743 -6022425 -4719856 -6659708 -11658810 -12224530 -4791787 3010852 1366195 -9208328
5229 -9208328 -19265304 -21442691 -15395520 -4614776 6090237 11354403 8685355 1078232
5221 1078232 -6727823 -12927217 -16760876 -15561618 -8835779 -2415529 -2183920 -5286561
5213 -5286561 -4123814 1917644 5762086 3720096 193432 115319 3118696 6847673 10053541
5204 10053541 10644327 6625017 965299 -455653 2151129 1980264 -3357106 -7596430
5196 -7596430 -6469095 -4854030 -7222748 -8059151 -415816 10632635 12815517 3442572
5188 3442572 -7350379 -10324084 -6526123 -1876979 654515 1055753 37563 -193693
5180 -193693 3034705 8431180 10703350 7333882 2301337 576591 1808220 2396306 1387755
5171 1387755 732575 1136586 1555394 2513096 5892979 10244014 10009239 2392588 -7307312
5162 -7307312 -11046738 -7728418 -3163051 -343715 4463523 13309492 20211965 19098929
5154 19098929 14098413 14220782 19532913 21220089 15826909 10287088 9798910 9464700 3470975
5145 3470975 -4730039 -8555337 -9230331 -12735337 -19206237 -23046098 -21822125 -18468711
5137 -18468711 -16062656 -16078964 -19622409 -24332098 -22877675 -11945413 -323334 610517
5129 610517 -6975982 -10342814 -5003152 190140 -1272436 -3819838 -532569 5813670
5121 5813670 8732325 7656218 5229590 1276451 -4193593 -7495022 -6920641 -6651746 -9136524
5112 -9136524 -9429013 -4004668 792539 -2321815 -9146825 -10070746 -4771264 -460383 1830614
5103 1830614 7472078 15216504 16275949 8991229 3275845 5704427 9634807 6380892
5095 6380892 -1242449 -3618571 2316062 10861246 15688577 15250155 12381111 11833226 15466816
5086 15466816 17879452 11360259 -2386913 -11706741 -10534564 -7776614 -14187527 -25416886
5078 -25416886 -27476091 -16608448 -4198172 -1587426 -7985152 -14849730 -15481425 -8364199
5070 -8364199 2969130 10760143 8387445 -2597487 -14029423 -20368465 -22159203 -20368388
5062 -20368388 -13952624 -5330910 -1548189 -5433788 -10519454 -9500461 -3521637 1953300
5054 1953300 6264561 11990537 17097359 16254182 9616402 3452171 1103161 -566558
5046 -566558 -4148468 -7249413 -8034057 -9548125 -13788081 -15767533 -9776619 399056
5038 399056 4290547 -1514435 -8363952 -6890732 1331496 7524211 7740972 5716102 4947722
5029 4947722 4173014 2280331 2194890 5955953 9542119 7524071 1174542 -2979140 -2257190
5020 -2257190 -694380 -2170006 -5121305 -5700148 -2550554 3209162 9190598 11067008
5012 11067008 4727499 -7762167 -17596962 -18317106 -13109513 -9564875 -9597509 -8877044 -4637708
5003 -4637708 732816 3689771 3286879 962535 -372334 2186193 7440875 8534584
4995 8534584 191536 -12516045 -17830122 -11303889 -1737460 -649557 -9052740 -17454326
4987 -17454326 -16976633 -7971375 1576468 4600134 1762554 -543465 985594 2369751
4979 2369751 -686927 -4773750 -2770597 5623969 13224714 14984460 12256483 7176489
4971 7176489 -288745 -8013566 -11380193 -9995603 -8229997 -6519231 -93277 9654290
4963 9654290 12013043 2701610 -5778181 -190632 13106160 16485379 6651133 -1746568
4955 -1746568 1328893 8462167 8776419 3460580 355787 1148922 1939711 1768107 3229303
4946 3229303 6873205 10530396 12855445 13630921 12113892 8355032 4541857 2286704
4938 2286704 470733 -1796053 -2711858 -1450153 -1633770 -6781017 -13684177 -15139137 -9718655
4929 -9718655 -4747675 -7511592 -15876253 -20436921 -15743639 -6805365 -2542756 -4225454
4921 -4225454 -4236467 2752274 11899744 15181518 12641664 10944153 12588056 13254821 9785051
4912 9785051 4109595 -1642895 -7142423 -9429013 -4105834 5861411 10246665 5426501
4904 5426501 1001753 6152562 15881349 18937820 14082888 8638716 4329243 -3893384
4896 -3893384 -14885508 -18668181 -10768321 -506240 890118 -5225046 -8441589 -3942395
4888 -3942395 2683110 4745604 3205553 3744215 7754862 10131967 6906482 1655813
4880 1655813 533381 2847675 2499093 -1212178 -1992550 1361714 -11006 -11331243
4872 -11331243 -23229639 -24067853 -17283286 -14720921 -16792846 -13636504 -5311528 -4786349
4864 -4786349 -16494027 -26624061 -22756548 -11074119 -4284515 -2703131 823801 4908523
4856 4908523 2148863 -5949110 -9303337 -3907216 4207210 9474870 11803085 11054713
4848 11054713 6171188 1101935 2516054 9268181 12417591 8513269 4753272 7190221
4840 7190221 11629172 11469160 7884993 5838944 5065673 2006894 -2531820 -4555863 -4197434
4831 -4197434 -5724328 -10474601 -14768604 -15233831 -12347920 -8354792 -4882683 -2820579
4823 -2820579 -1722364 567874 4844252 7458113 3853497 -4467294 -10237251 -8978602
4815 -8978602 -3889919 -269213 1576880 4395124 7131988 4907507 -3298071 -10631572
4807 -10631572 -8818958 2468596 14797436 19356050 14793691 6911112 2207979 2427014
4799 2427014 4565883 5367657 5480833 8407711 14605326 18085916 11778185 -3444135
4791 -3444135 -18164080 -24333245 -23045583 -20449394 -19125536 -17203765 -13644404 -9476825
4783 -9476825 -4703354 901158 3931023 -101542 -9027920 -14344738 -11793922 -6494151
4775 -6494151 -4279769 -3430198 -161234 2657350 -107728 -5349802 -4347461 3654269
4767 3654269 8653551 3492664 -6564321 -12173175 -12408861 -13282169 -17230510 -20415516
4759 -20415516 -19485139 -15440116 -10280562 -4504922 454928 1026039 -4540940 -12682678
4751 -12682678 -17294581 -15700981 -10908163 -8258082 -10136563 -13368504 -11974872 -3730334
4743 -3730334 6172416 10078299 7100438 4800299 9659882 18269254 21705874 17678493
4735 17678493 13359241 14702046 17933938 15962018 9841232 7241120 9799222 9386408
4727 9386408 403141 -10177022 -11229370 -2682066 4882317 5030213 2466307 3744206
4719 3744206 8066238 11001998 11427975 9689782 3777147 -6200117 -13257280 -10847423
4711 -10847423 -3208339 -477270 -4011076 -5481251 -1907811 -1425885 -9027878 -15870605
4703 -15870605 -11544298 -722492 3051982 -2689518 -6769584 -2118541 4614218 4745298
4695 4745298 -189166 -3682596 -5007648 -7584070 -10817918 -11047054 -8851006 -8546131 -10379725
4686 -10379725 -9153872 -2093234 6326213 9486868 5824730 -665651 -5119158 -5819786
4678 -5819786 -5070832 -6836086 -12373731 -18136921 -19385487 -15696232 -11351610 -10668741 -14573055
4669 -14573055 -20799986 -25035370 -22904958 -14317253 -5531853 -3147345 -5935907 -6768185
4661 -6768185 -2867010 1238170 2494807 4692865 10887174 15910864 12789077 3502936
4653 3502936 -3366333 -4411088 -4279897 -6735019 -9105347 -7495455 -2798047 964960
4645 964960 1520818 148264 639286 6324039 15463857 20805167 17886167 12395585 13269413
4636 13269413 19240378 20351672 13966936 9443444 12355339 13964875 4819827 -8829666
4628 -8829666 -13074272 -6296895 387429 569464 -1284987 -1305401 -2200416 -4993777 -5108889
4619 -5108889 -937303 2522708 2930146 4728212 9031543 8811400 1278885 -4051767 556549
4610 556549 6363346 -454197 -17212224 -27319843 -22809858 -11765456 -2986726 3858611
4602 3858611 9447197 8218058 -2555555 -15340991 -20890514 -18467014 -12214111 -3660903
4594 -3660903 5706221 10071317 5539842 -2283470 -4312766 -14403 2748850 -1325707
4586 -1325707 -9828195 -17488557 -20868566 -18857271 -13435774 -9531584 -9785102 -10446022 -6917305
4577 -6917305 -1575411 -199671 -2014378 -670813 4677504 7449415 5120604 4690593
4569 4690593 11967590 21736698 24761723 20435850 16134553 16346338 18387306 18000693 14196815
4560 14196815 8610134 3810155 1980720 2263766 539290 -4775969 -8403948 -4333858
4552 -4333858 4763189 9858588 7567515 3902587 4440354 6810792 6428705 4342708 4180997
4543 4180997 4991624 3194565 -228089 -677485 2291158 4046926 2554975 1378704 3111843
4534 3111843 5061068 4538539 3796274 5590099 7808532 7647695 7863213 12199563 16175701
4525 16175701 10394877 -5433272 -18982813 -19732131 -11641145 -6739722 -10101132 -16737006
4517 -16737006 -20740495 -20977356 -18024344 -11725903 -3882277 993554 521936 -2324051
4509 -2324051 -3223938 -2145048 -2752804 -6829625 -11056945 -9922677 -1881101 7377758 9023820
4500 9023820 70281 -12387831 -18086541 -14617808 -9187650 -9246719 -14336259 -18427828
4492 -18427828 -17496686 -12423591 -6205162 -1034599 2349576 4487984 6422038 7981005
4484 7981005 7385558 3881857 192651 504137 5738213 12310584 16340463 17952652 19962905
4475 19962905 22646771 22050614 15178042 5409994 -456932 -761414 -672750 -3443444 -4363204
4466 -4363204 1920296 11227762 13858449 8190916 2824548 3314746 4129929 -1776621 -11474914
4457 -11474914 -16520248 -15098646 -12768475 -12823897 -12690369 -9995354 -6456610 -4668801 -5470404
4448 -5470404 -9211599 -15175085 -18820821 -14473317 -3020910 6921958 8259863 3127236
4440 3127236 -843088 645461 5784688 10343639 11252925 7755012 1401827 -5283812
4432 -5283812 -10813157 -14375713 -13823328 -7206241 2541812 8136323 5920034 410388
4424 410388 -2412102 -3581090 -8267518 -16065773 -20018886 -16281911 -9624412 -6490840
4416 -6490840 -6176697 -2827372 5344284 12842498 13405955 7024944 -810600 -5108830 -4986292
4407 -4986292 -2431160 166977 952545 -861271 -4076874 -6319535 -6980433 -8103671 -10873852
4398 -10873852 -12959585 -12050006 -10573510 -12701573 -16763881 -15754110 -7360240 1286695
4390 1286695 2535094 -1940038 -4974623 -4683307 -5244093 -7940236 -8180159 -3024145 3897705
4381 3897705 7845300 9071027 10186425 11057656 10429069 10017481 12079327 13932022 10125279
4372 10125279 1113868 -4755316 -973202 7906575 10697870 3296265 -5383763 -3478019
4364 -3478019 9220575 19952037 17253154 3842989 -7415196 -8772054 -4597452 -2683372
4356 -2683372 -3392947 -1239244 5302379 10731434 9951492 4944406 1770422 2878985 4939675
4347 4939675 3866525 -221807 -3850325 -4634535 -3307346 -1490110 700755 3560156
4339 3560156 5571893 4676664 1989928 1997162 7650546 16409574 22303689 21203492 13553236
4330 13553236 3304377 -4826509 -8269114 -7899490 -5690647 -1273893 6581634 14698594
4322 14698594 16179640 9438831 2606687 3978280 10711568 12935489 7517916 807724
4314 807724 -2176933 -3349430 -4180495 -748379 8701622 17272758 16996669 9257148 1590092
4305 1590092 -2942265 -6658125 -9639073 -8733107 -4546259 -2839250 -6848636 -12699488
4297 -12699488 -14292729 -9389057 51688 9889283 15176055 13207376 6426019 -758201
4289 -758201 -8032926 -17599185 -26411830 -26669477 -17072883 -7524451 -7503225 -14057442 -16975653
4280 -16975653 -12579700 -6008595 -1891635 63351 295578 -2676633 -7550902 -9339700
4272 -9339700 -6276122 -2976569 -3229552 -3929351 -864670 2990554 1381499 -4435692 -6089560
4263 -6089560 -679833 3924075 350016 -7303862 -9745517 -5853778 -2150146 -698806
4255 -698806 3369734 10844530 14110377 8463953 107301 -3487239 -4481312 -7786385 -9146486
4246 -9146486 -1178204 11561824 16078487 10240764 6393005 12199792 19388122 17683189
4238 17683189 9833244 4499076 2356746 -1031578 -4510484 -3894990 -1365484 -1976553
4230 -1976553 -3198289 1553907 9818912 11253084 3166866 -5079627 -6117718 -3909608
4222 -3909608 -4553412 -5636333 -1161706 7895338 14288762 13352143 6707333 -755041 -3952504
4213 -3952504 97704 9059182 15470286 13642813 6262487 1868679 5745462 14612499
4205 14612499 20158305 17056635 7677744 -924272 -4609314 -5537819 -7284870 -9034061
4197 -9034061 -7425656 -2438811 2297904 4314181 3888255 1638011 -1601897 -3222854
4189 -3222854 -1477250 818647 -226428 -2960359 -2299757 1951965 5099129 6148255
4181 6148255 9319361 15341034 18544272 15782159 11641086 10923813 11955868 11548015 10876716
4172 10876716 11777798 12461120 11618020 11540193 12330400 8866818 -514571 -8197907 -7606775
4163 -7606775 -4293790 -8007702 -17361766 -21952889 -17810921 -10958101 -5864834 -242509
4155 -242509 6669539 9519187 4766319 -2948232 -6642636 -5079068 -1613277 1498846
4147 1498846 4078016 5516271 4629861 1566326 -2058082 -5262089 -9258202 -15790725
4139 -15790725 -22972009 -24589938 -17248951 -7271436 -4420792 -7808636 -5976375 5247515
4131 5247515 13918321 8568111 -4161664 -9130934 -4528953 -1520008 -4664641 -6391194
4123 -6391194 -2068096 2270789 1234382 -1465253 -931102 973457 584677 -1674098 -4753217
4114 -4753217 -9909304 -16257766 -19474939 -18262917 -15898209 -12730169 -4634863 7744521
4106 7744521 16405109 17041729 14600819 13005294 8373527 -956844 -6813071 -2624457
4098 -2624457 5010719 6301293 3725982 6368267 13099095 13597930 5026852 -3365592
4090 -3365592 -3414527 2798930 8225892 8267641 2187232 -6505196 -10684237 -6568030 88034
4081 88034 726353 -3809956 -4833780 414866 4203166 -686500 -11806504 -21266972 -24102164
4072 -24102164 -20507210 -13956076 -8576467 -5351582 -1362135 3874266 4236220 -4386512
4064 -4386512 -13923376 -11924884 580228 9225604 6328434 146843 -313051 870285
4056 870285 -4281890 -13020458 -16413686 -13443944 -10401343 -8767940 -3689400 5468077
4048 5468077 11914177 10888642 5608634 1275605 -1322571 -3375579 -4041787 -2622491
4040 -2622491 -1383391 -2296231 -3168472 -913358 2757691 3277807 773500 1069879 7306126
4031 7306126 14459688 15793059 12176869 10163776 11605868 10873487 4092759 -3957677
4023 -3957677 -5943062 -1671613 2557878 2369526 -1122702 -5159562 -8740759 -12105848
4015 -12105848 -15567567 -18741997 -19337976 -14533735 -5913610 -235860 -1471850 -4896993
4007 -4896993 -4167533 -1573638 -4404802 -12590228 -18100506 -17157061 -14685505 -14441010 -13067983
3998 -13067983 -8163343 -4700990 -7370261 -12058745 -11446273 -5220222 1319125 5593055
3990 5593055 8510469 9315069 6048801 264281 -4101407 -6190320 -8215649 -10697947
3982 -10697947 -11874950 -11168286 -9315244 -5906468 -634138 4263690 7111323 10915777
3974 10915777 19093068 27888157 29260337 22057723 14247224 11994430 12089056 8454088
3966 8454088 1504194 -3402264 -3997729 -3113609 -3745728 -5690981 -7073127 -6922029 -6047170
3957 -6047170 -6450866 -9452489 -13699524 -16065481 -15256212 -13051764 -10991036 -7843029 -2412167
3948 -2412167 2687590 2913865 -2715965 -10240445 -15014861 -15463454 -12398274 -6925057 -508889
3939 -508889 4128243 4101440 -1166031 -8914576 -14620678 -15053834 -10899324 -6865381 -8227601
3930 -8227601 -16023118 -25460011 -29412638 -23683352 -9691140 6320272 16483264 16214342
3922 16214342 8126796 -112065 -3704659 -4970208 -7367458 -8052851 -1858578 8143718
3914 8143718 11378467 3717957 -5800438 -6975954 -1792024 608602 -1824264 -2921318
3906 -2921318 295593 3678635 4317925 5170212 8800260 12744425 14180952 13995473 13170240
3897 13170240 10259232 6142482 6424484 14121374 23220090 24630609 16950238 7242378
3889 7242378 2216632 1986708 1865162 -2133159 -8999560 -12754309 -8330283 1901536
3881 1901536 10248101 13010507 13550144 14647593 13425797 7610652 1676934 1316392 5325166
3872 5325166 8264480 7929620 4788342 -2222829 -12238405 -17588325 -10930586 3084410
3864 3084410 11241197 7802491 -27593 -3911538 -4003421 -3895172 -3273348 -835722 425111
3855 425111 -3290428 -10169169 -14574885 -14129142 -11475549 -9747632 -9286953 -8868323 -8204880
3846 -8204880 -8763320 -12415222 -18799640 -24249691 -24836033 -20672945 -15677604 -12960613 -12158097
3837 -12158097 -11272656 -9007242 -5060408 -367308 2509299 1439250 -2223044 -4592020
3829 -4592020 -3603225 -423166 3412478 7425522 10167575 8855585 2803056 -4656517
3821 -4656517 -9096594 -8544411 -3581335 3941992 11015703 14203351 12406142 8637115
3813 8637115 7762994 11829308 17362879 17706592 9375176 -3609214 -13416042 -16788309
3805 -16788309 -17040663 -17002463 -14587065 -8631229 -4541642 -8211398 -16708034 -21216506 -18189306
3796 -18189306 -11741337 -5875862 -901903 2234673 870145 -4271867 -8220509 -7774423
3788 -7774423 -4146079 747442 5495325 6726643 1976487 -4139729 -3774451 2445827
3780 2445827 5238649 850376 -2969018 191759 4704980 2048380 -5405290 -7779067
3772 -7779067 -1577071 6874602 10230090 7092590 1525689 -764890 2275394 5316784
3764 5316784 1009423 -8678082 -12394403 -4649942 5579139 7525958 3458569 2884233
3756 2884233 7366411 10731967 10918870 11289334 11476964 7014666 -1307337 -6641145 -6254162
3747 -6254162 -4808944 -5567903 -5455187 -1659857 2745833 3107225 -755985 -5081263 -6027843
3738 -6027843 -2265900 3604316 6505021 4468179 1309810 687893 602758 -1473237 -1883081
3729 -1883081 3667849 10796453 11125516 4468042 -2675816 -9233297 -19349275 -29890837
3721 -29890837 -30248127 -17861021 -3066267 5804505 11547808 17016559 16166636 4770953
3713 4770953 -8819396 -13802773 -11959522 -12867135 -18249168 -20474382 -14463905 -3211582
3705 -3211582 7120947 11430533 7267610 -1729406 -6470649 -2502522 3181143 1440942
3697 1440942 -6057241 -10107222 -7260522 -2081733 1778148 4570770 5793775 4834273
3689 4834273 5477960 11093874 15615328 9144616 -5937518 -14582967 -8554153 2917352
3681 2917352 7240795 4814726 4020315 6620149 7288201 4182742 893972 -1379660 -5583120
3672 -5583120 -11671366 -14555257 -11829823 -8264044 -8735347 -10196747 -5431722 6306183
3664 6306183 16989687 19258167 14712307 10294845 8770331 6708940 1385086 -4913231
3656 -4913231 -9112298 -11823306 -14378089 -14585866 -9909818 -3097045 238196 -874741
3648 -874741 -2314991 -1855613 -1603016 -2717887 -3045573 -2109015 -3467526 -8791751 -13698968
3639 -13698968 -13467923 -9728341 -7319433 -7253056 -7478778 -8370649 -11704169 -14899311 -12406488
3630 -12406488 -4195622 2289827 1371498 -3339656 -3853711 2029528 8566816 9032643 2482803
3621 2482803 -5754335 -8548403 -2754639 7505789 13769338 11259608 3976678 395166
3613 395166 4247981 11061111 13917213 11140649 7507549 8466729 13778823 17270168 13658508
3604 13658508 5567423 1785486 7143770 16086569 18981979 13454138 5849516 2113666
3596 2113666 1977279 3246375 6721961 13399856 20272817 23031953 20964095 15738471
3588 15738471 7588322 -3147228 -12515307 -15935096 -14104115 -11442224 -9242536 -5294488
3580 -5294488 74142 3580483 5430767 9652076 15568108 15591879 6175451 -4405528
3572 -4405528 -5418519 2396740 8630825 7245229 2300161 -535913 -2078899 -6517714
3564 -6517714 -13758743 -18332190 -15644559 -7726238 -1681409 -1814811 -4413181 -2785577
3556 -2785577 3123977 6470448 3776454 -91807 -499976 -945791 -6551135 -13995289 -15534248
3547 -15534248 -10827504 -6785645 -6388451 -5863607 -3537532 -2871724 -4262321 -2118555 5627941
3538 5627941 12373478 12668865 10928426 13712018 18469976 18019763 13136439 11895786 16905797
3529 16905797 21407127 19901554 15799307 15042802 17142717 16920519 12288552 6015592
3521 6015592 905419 -2988661 -6016094 -6751955 -3911785 706652 3135925 1523939
3513 1523939 -1749197 -3304288 -3140015 -3830096 -5613769 -5063078 -4362 6411466 8800477
3504 8800477 5680896 661585 -1568781 1462825 9671195 20478308 28801848 29344838
3496 29344838 20646198 6801044 -5114305 -9597680 -5968963 1701896 8264863 11767961
3488 11767961 13494068 13745456 10047912 1500289 -7200670 -9593270 -5052844 463288
3480 463288 1747538 -93128 -269502 3456720 8274692 9028015 3023339 -6992315 -14909283
3471 -14909283 -17262498 -16127556 -14668450 -12220667 -7393550 -3842875 -6678830 -12918449
3463 -12918449 -12792354 -3652742 4156253 702563 -9730723 -15321423 -13170927 -10347774
3455 -10347774 -10298176 -8239326 -1667325 3971115 4421766 3696637 6124281 7478590 1239357
3446 1239357 -10365365 -19088936 -21996783 -22617546 -22193237 -17866374 -10234143 -5044053
3438 -5044053 -4803733 -4906363 -1347400 2916067 3111713 12005 -1933147 -974280 917594
3429 917594 1135745 -2064833 -8377575 -13255756 -10517002 -627052 7160997 5397509 -1751713
3420 -1751713 -4154685 1406865 9516989 15128671 17715578 17251689 13110432 8003528
3412 8003528 6727511 9008271 8992253 3996644 -1510287 -3307304 -3494653 -5371274 -6852630
3403 -6852630 -3993236 1819029 5159422 3609440 -582625 -4783291 -8050757 -9390773
3395 -9390773 -7474281 -2744506 2052535 3689032 343000 -6807647 -12975822 -13288159
3387 -13288159 -8782339 -6099854 -8660589 -11469238 -8763280 -3740841 -4608556 -12064313
3379 -12064313 -17457995 -14668019 -7869423 -4643839 -5991914 -6956806 -4156171 1105490
3371 1105490 5567019 6804503 4603728 2111274 4148507 11541216 18392373 18223739
3363 18223739 12043362 6792814 6145781 7106354 6579319 6553084 9718822 13630160 13776263
3354 13776263 10595590 8506015 8443898 6565155 1409320 -2766427 -2581793 -1332844 -4360177
3345 -4360177 -11393664 -17390606 -18850909 -15516742 -8172957 506746 4883271 1895843
3337 1895843 -3173073 -2497655 3141966 5970454 4453722 6411639 15630888 23570290
3329 23570290 20392706 8134394 -3790230 -11238285 -16099279 -18279631 -15308820 -8440360
3321 -8440360 -1884091 3169390 7575477 9282246 6690123 5000918 10133339 16973820
3313 16973820 14204803 2328334 -4495778 998092 7942692 4285447 -4606104 -4990960
3305 -4990960 3938241 10139637 7765942 4002901 5639488 9398688 9662080 7635625
3297 7635625 7151964 6771940 2260478 -5747050 -11959039 -13349006 -11548907 -8558981 -4157591
3288 -4157591 1231346 4430237 3090742 88445 1219519 7864073 14291422 13906093
3280 13906093 6603560 -2100965 -7904663 -10905227 -12822619 -14541607 -16541651 -18338863
3272 -18338863 -17239843 -11622049 -5886506 -6828304 -13225647 -15052992 -6748872 4709503
3264 4709503 10268249 11242673 13491349 14295892 6046402 -8550288 -16710660 -13001236
3256 -13001236 -5929119 -3327876 -1389555 5399027 12363392 11699012 5566521 2589422
3248 2589422 4558724 5788678 4109004 3502778 5481130 5950622 2576092 -1234767 -2017806
3239 -2017806 -674139 898188 2797646 4484664 3455373 -948201 -5737362 -8019476
3231 -8019476 -7238953 -2854147 5512560 13988989 16078655 11688487 9486840 15819815
3223 15819815 25498330 28726783 23710528 16618321 11654866 7674386 3543633 480496
3215 480496 -1174388 -2090237 -665339 4787488 10066471 7716107 -2173533 -9886660 -8456458
3206 -8456458 -2820796 -1644180 -4278725 -2606190 5814624 13594127 13965686 9855959
3198 9855959 9026344 13244086 16509504 13620101 6852468 2391272 2230108 2728865 1202242
3189 1202242 393998 3902646 9543658 11370520 7864306 3785652 2914874 3294786 2099994
3180 2099994 1221521 3874718 8134283 8642350 3934819 -2301598 -7029906 -10357307 -11729135
3171 -11729135 -8835067 -2862022 -409947 -5914787 -14780670 -18663078 -16066401 -12535517
3163 -12535517 -10737405 -6756674 1287353 6908671 3140485 -6473757 -11380334 -7800301
3155 -7800301 -2528506 -1993917 -4162823 -4466307 -3638517 -4100768 -2903991 4508902 15044759
3146 15044759 19487208 13989181 4543951 -1137261 -1331612 1462774 5142134 8394648
3138 8394648 10033724 10255791 10252045 9890103 8821125 9509170 14050013 17646715 12200123
3129 12200123 -963105 -8970537 -2689244 11700668 21559655 22457643 17892836 10376173
3121 10376173 1339880 -4263485 -2987228 -467154 -4453549 -11414377 -10291356 -23486
3113 -23486 7429372 4225385 -3397886 -6690213 -6365325 -6796817 -6688469 -3553720 -935128
3104 -935128 -2136739 -1653684 7001493 17603329 16507938 2554127 -8574051 -4044388
3096 -4044388 9765011 16440664 10011883 -426467 -4310337 -1131818 2397907 1567771
3088 1567771 -2644602 -6206266 -5319537 1441012 11092805 16655798 12834017 2198958
3080 2198958 -6934486 -9896938 -9890313 -11023239 -11152913 -6280565 390678 282089 -8864161
3071 -8864161 -18601814 -19777445 -13281122 -7836818 -9417241 -15804022 -20548677 -19888484
3063 -19888484 -15654456 -12317362 -11499518 -10270311 -5794307 -31063 2789892 2185776
3055 2185776 1237534 782245 -1805920 -7152962 -11538030 -12051453 -10657103 -10757122 -12365101
3046 -12365101 -12931697 -10907378 -6654269 -1528976 2706462 5196264 7189772 9948085
3038 9948085 11742786 9914791 5542560 2183631 142062 -3325071 -7848498 -9424860
3030 -9424860 -7058548 -4309835 -2823168 -241080 3824760 6409423 7924492 12701152
3022 12701152 19517399 19719752 9637269 -3007128 -10678666 -15727064 -21625813 -23409557
3014 -23409557 -16420662 -7062792 -3799478 -3663943 284637 3755070 -2274117 -13299330
3006 -13299330 -15265139 -6543841 -337517 -2851275 -4456457 2170761 9293179 7513920
2998 7513920 454158 -3142211 -2985780 -3471206 -3445196 464699 5206665 5432699 3368121
2989 3368121 6021989 13799847 19179973 16848543 9711544 4172266 2985891 3307160
2981 3307160 112485 -7906653 -15370855 -15369258 -8169738 -1469429 -947630 -4445741 -6886639
2972 -6886639 -6513424 -4119704 -406123 3330118 5491984 6928680 9441464 10695411
2964 10695411 6226137 -1990565 -5730676 -2075887 2197500 1483171 -735359 126658
2956 126658 1044500 -2706162 -8857893 -12434324 -13761183 -15221370 -14733871 -9964663 -5085606
2947 -5085606 -5727207 -10275378 -13053893 -12769392 -11046451 -6814667 -106157 2619503 -3931501
2938 -3931501 -14105690 -18654754 -19150328 -24407962 -34000204 -37054230 -28682622 -17000924
2930 -17000924 -11163954 -11455516 -13944557 -16463728 -16766047 -12424399 -6031144 -4010645
2922 -4010645 -7589885 -11214491 -11778895 -12379749 -14873771 -16278892 -15127873 -13744290 -11564270
2913 -11564270 -4647335 4686645 6960688 -368529 -6590554 -2343675 6920981 9621543
2905 9621543 3838979 -3458988 -7503568 -7820770 -3859136 3005215 6722930 4109818
2897 4109818 1849952 7407976 15996624 16385193 8103976 2261265 4510751 7614952
2889 7614952 4248336 -1770723 -2496022 2014538 4523859 484596 -7388351 -12683411
2881 -12683411 -10572274 -1273506 9300176 13511743 8391938 -2315603 -12404048 -17961451
2873 -17961451 -18430614 -15776906 -13165673 -12170358 -10863651 -6678151 -818181 2956129
2865 2956129 3656506 3751274 4410706 3983029 2029909 808309 1121700 474973 -2643529
2856 -2643529 -6247063 -8776181 -11580122 -14531764 -13422879 -6420750 63805 -2142449
2848 -2142449 -11860961 -19532979 -19042348 -13076262 -6314028 440389 6731208 8631834
2840 8631834 3259843 -5740554 -11652692 -12236566 -10468271 -9233219 -8765086 -8217758 -6252450
2831 -6252450 -930269 7411452 14002019 14331852 10486794 8476626 9599902 9617061 6817519
2822 6817519 4793997 5428818 5472951 3279453 2627394 5214743 5435775 -928780 -7885821
2813 -7885821 -7014974 -638886 1522489 -2846144 -6258019 -3945734 -114033 -36389 -3441517
2804 -3441517 -7781657 -11136610 -9959438 -1301796 10023737 13821897 7470610 -424942
2796 -424942 -2690189 -2145924 -3210248 -3705736 -1938632 -3899654 -14035714 -24513937
2788 -24513937 -23798405 -12463826 -908753 5797112 10552277 13455660 9783508 147732
2780 147732 -7255027 -7708094 -5526742 -5517554 -5885974 -3105412 2029123 6518441 8381859
2771 8381859 5410427 -3811883 -14917998 -19193440 -13111761 -1751439 9269144 18892269
2763 18892269 24788263 20602917 5707361 -8437197 -10120088 -2323523 2201529 -1356092
2755 -1356092 -5757791 -5190035 -3838711 -7735568 -14878084 -18657806 -17287130 -14515509
2747 -14515509 -12588232 -9608083 -4622940 -1296064 -3648285 -9663139 -12206330 -6786565
2739 -6786565 3692100 12673897 16220293 14229220 8285430 1515538 -1375918 1747124
2731 1747124 6812375 8187849 6569072 7338471 10944831 11128976 4819211 -2399230 -4545539
2722 -4545539 -3568678 -4442496 -6610571 -6521909 -5287196 -6723056 -9417254 -7816593 -1115702
2713 -1115702 5272778 7678223 7773564 7414875 5875509 3916742 4775937 8348940 9504354
2704 9504354 5442097 68471 -2706192 -5491432 -12178215 -19545450 -20153541 -12431558
2696 -12431558 -2552809 3563625 5480813 5342696 4526708 4558425 7319696 12101081 15273514
2687 15273514 15093327 14607286 17519867 22815402 25658538 22518385 13773442 2825485
2679 2825485 -5300239 -6311263 -943092 3841995 1631065 -5152547 -7369902 -691597
2671 -691597 8707233 12223075 9133889 5264258 3993928 3497531 2118676 1327953 2244486
2662 2244486 3379279 3605260 3910929 4213004 1782435 -4437608 -10728958 -12927067 -11664392
2653 -11664392 -10152414 -8951761 -6882815 -5449324 -7421337 -11032766 -10207676 -1973261
2645 -1973261 9406775 16724119 15897579 7897605 -1938973 -6311414 -1935507 5543038
2637 5543038 6575597 -739089 -8221639 -8467086 -3019239 3279553 9946623 16856502
2629 16856502 17681820 6439212 -10668002 -19006727 -12920423 -2198227 1286733 -3386476
2621 -3386476 -9986760 -15200604 -19061803 -20089097 -16978936 -13043290 -12790498 -15049444
2613 -15049444 -14973518 -12235422 -11486347 -14238359 -15852889 -12252650 -5029319 2050943 7404532
2604 7404532 10195608 8674551 3384718 -826856 380883 5548025 9568391 9560507 6271669
2595 6271669 1593295 -2431227 -3589358 -1442829 1580160 3237260 4180709 5413665
2587 5413665 5364424 2872659 865163 2526510 5321043 4154337 -179811 -1813040 399288
2578 399288 665202 -3673561 -6473339 -1891948 6014208 8850714 5732671 3082510 4286249
2569 4286249 6174520 5736288 3951646 1442627 -3930090 -12034366 -17359043 -14976816
2561 -14976816 -7240525 -852271 1393147 2549749 5865809 10628782 14305259 16138011
2553 16138011 16968020 16795667 14300014 8868476 2258568 -2239673 -2536285 4561 1158102
2544 1158102 -2338331 -8864700 -12737026 -10429951 -5422430 -4448023 -8729137 -12469348
2536 -12469348 -11961832 -11840813 -17254219 -23101067 -19198760 -6140642 3331279 2246469
2528 2246469 -539073 5034619 14046727 15591365 11952264 15125331 26219698 33416174
2520 33416174 32507998 33692139 41015238 40118048 19105404 -9097884 -20806397 -12316805
2512 -12316805 -984285 1775568 1950088 5765690 7436521 1137182 -7118317 -8785491
2504 -8785491 -5815998 -5664109 -9213699 -11785225 -11621158 -9845844 -5774584 538211 4519509
2495 4519509 3210410 2161749 8301882 18085028 21220518 15379010 8547943 6201896
2487 6201896 4898082 1217493 -899346 3464902 11848601 17355903 16692186 11402993
2479 11402993 3941402 -3446517 -7459677 -5191254 2580665 10849606 13518031 7877760
2471 7877760 -2460469 -9563545 -8283779 -1474571 3452236 2405924 -2762922 -7797939
2463 -7797939 -9356599 -6786770 -4197862 -8287040 -19264096 -26800096 -21885467 -10512655
2455 -10512655 -6710997 -12711657 -16601804 -11346439 -4705093 -5625156 -11668523 -16876886
2447 -16876886 -22096120 -28324239 -28372319 -16525920 -923847 5241729 1542895 -1437594
2439 -1437594 838279 2625750 -170205 -4574007 -7911313 -11155477 -13226947 -10055153
2431 -10055153 -1362177 7935177 13939106 15836299 13050609 7358119 5861816 12950065
2423 12950065 20791075 18177645 7974746 3674689 8090456 9565379 2855687 -1134920
2415 -1134920 6058126 15453602 14560317 5865040 -11717 -1472948 -4248036 -8432231
2407 -8432231 -9291868 -7481692 -7408832 -7634443 -3105929 4253241 6561110 1451072 -5208794
2398 -5208794 -7833858 -5795912 -645138 4785326 5680320 23730 -7104060 -9682800
2390 -9682800 -8974031 -9687747 -11431488 -11518904 -12774172 -19091927 -25294051 -21625914 -8107595
2381 -8107595 5012875 11066800 11881474 9288228 2627609 -3923486 -2723706 5349731
2373 5349731 10339803 8240400 6562572 10530552 14138069 11300181 6442921 6059616
2365 6059616 7453475 4467019 -1524024 -4652650 -3681929 -199527 7472544 19675660
2357 19675660 28198824 23297207 7202220 -7332023 -12144036 -10746904 -10070323 -11445790
2349 -11445790 -11539624 -8080838 -2909461 -887338 -5065136 -11574692 -12267821 -5272664 855334
2340 855334 -1884962 -9399831 -11312740 -6051954 -2535579 -6640172 -13263539 -14420719
2332 -14420719 -9918123 -6298025 -7879042 -11957881 -12270099 -5869169 3457203 8924624
2324 8924624 8024430 4521142 2668046 2304579 1619567 1603371 4268267 8428441 10627868
2315 10627868 8939940 3577794 -3781582 -8815150 -6548565 1408083 5574203 151352
2307 151352 -7419126 -5179062 7291297 18881494 21818739 18741112 14929397 11579957
2299 11579957 8659617 7412010 7206113 5245496 1470777 -1229114 -2839677 -6412863
2291 -6412863 -11126210 -11713411 -6833088 -1166289 3241390 9983414 18924510 22196511
2283 22196511 15667439 7205456 6074160 10046592 11250492 9591089 10637152 13505953
2275 13505953 11461631 3900367 -2027567 -2563341 -1290122 -506815 2594795 8261685
2267 8261685 10704831 6423772 -598930 -6149003 -11722743 -18253682 -20350109 -13823859
2259 -13823859 -4423492 -1214291 -3835264 -4286819 -370325 928674 -5144699 -13499483
2251 -13499483 -16169987 -11771855 -4727821 822476 2980492 1474946 -1263040 -1151403
2243 -1151403 1996691 2850671 -1529163 -5287016 -1176124 7335288 8804053 -203715
2235 -203715 -9198298 -7795114 238556 3125773 -2276112 -7515434 -5933116 -1685956
2227 -1685956 -2382629 -7866572 -11204888 -8600658 -3299455 597180 3917478 9611337
2219 9611337 16543285 19590149 16082191 9406587 4745890 3047774 1338028 -2042078
2211 -2042078 -5230546 -6004769 -4772406 -3706663 -4711609 -8623508 -14221940 -17477866
2203 -17477866 -14490865 -6389550 1302527 5405627 7917042 10397368 9985114 4906406
2195 4906406 -48596 494944 3199660 -587795 -12243592 -22925755 -24482692 -18025291
2187 -18025291 -10014719 -4724826 -2719564 -2460857 -1043968 3024969 6029205 2109345
2179 2109345 -8063528 -16357707 -17290400 -14039775 -11383969 -8371232 -2691226 2965769
2171 2965769 5038187 5422493 7083961 7066290 1614708 -4459216 -2561875 6183970 11313304
2162 11313304 7944262 2491970 943839 176508 -4226794 -8823910 -7499507 -1018678
2154 -1018678 4970283 8256938 10464316 11458021 9252219 4564037 559657 -1502327
2146 -1502327 -2429673 -1793772 1292001 4506129 3651310 -1905256 -8313541 -11851641 -11655768
2137 -11655768 -8542102 -4717613 -4203735 -9217856 -15705472 -16922217 -12693124 -10568103
2129 -10568103 -15301542 -21225025 -18992790 -7634300 4192331 8317209 4996320 371606
2121 371606 -1149564 -170954 1001586 2645947 6948907 13472263 17855807 16811309 12621569
2112 12621569 9988082 9596874 8189517 4474258 1003563 -195836 118014 1340439
2104 1340439 4062847 6912714 6814237 4220773 3286157 4520795 3063946 -1912051 -2595825
2095 -2595825 5997433 15167982 11948045 -3218296 -17118734 -20923015 -17553990 -12085620
2087 -12085620 -5185964 1133521 1144404 -5663099 -10782176 -8048243 -2938935 -4208589
2079 -4208589 -11193659 -16301994 -16432658 -14778561 -13472789 -11285585 -7939378 -5142109
2071 -5142109 -3530777 -2756896 -3698620 -6770755 -9620298 -10500270 -11827889 -15800061 -18855755
2062 -18855755 -16174541 -9922129 -6752421 -8000909 -8662684 -5791245 -1681002 1272189
2054 1272189 2620110 808129 -5053518 -9887189 -6692796 2427576 6884388 1979435
2046 1979435 -4638340 -4402525 1478030 7236626 11442696 14689151 14258601 8224414 1125755
2037 1125755 -1017749 1233270 3134452 3448069 4377335 6538212 9363175 13799145 19087935
2028 19087935 19751720 12046858 1048340 -5244488 -6751108 -9245606 -13442377 -14471576
2020 -14471576 -11708443 -10291402 -11671044 -11177510 -7386866 -5540108 -7706361 -7306673
2012 -7306673 905853 11618427 16269675 14961808 13953132 14322962 11004651 2788030
2004 2788030 -3752178 -2462176 4733053 10821701 11628852 8570006 5197028 3305685
1996 3305685 2434308 1843275 1869025 2881548 3586629 1916051 -1711434 -3074350 2446335
1987 2446335 14448843 25545381 26073261 13182512 -4044961 -11356205 -3604830 9966507
1979 9966507 17488219 18253448 19579656 22821160 21244645 12777003 5649564 6605444 10790188
1970 10790188 9882625 4658853 1679407 1307284 -2194353 -10058160 -17004831 -20078831
1962 -20078831 -21556820 -21685094 -16424439 -5724963 2675097 2326719 -3854348 -8835409
1954 -8835409 -10364860 -9937616 -6932751 219525 9022900 14474534 14742571 11247225 5011678
1945 5011678 -2133849 -4758497 928829 9077339 8543851 -2797081 -14393779 -16517046
1937 -16517046 -11279939 -6111249 -2538683 1733270 4082610 -663817 -9979220 -14428712
1929 -14428712 -10693836 -6691982 -10304404 -18857511 -24273248 -23965414 -21138681 -17559993
1921 -17559993 -12343891 -6570567 -2899434 -361026 4745820 11437670 12999597 6230047
1913 6230047 -2701119 -5691252 -3172841 -2818158 -9211241 -18866982 -25094268 -24266115 -17275942
1904 -17275942 -8149450 -1778894 -167120 -286576 1844330 5057649 4626076 279327
1896 279327 -2369801 -588951 556871 -3671807 -9263938 -9347882 -5231484 -3786701 -5243123
1887 -5243123 -2731810 4647656 7791527 1230977 -7286499 -7748283 -2299887 -437445
1879 -437445 -3830432 -5164560 -588037 5729685 9940421 13132469 15742993 14803991 9831496
1870 9831496 5330064 4087665 3294411 644103 -947418 1314785 4737668 5536779 4515704
1861 4515704 3617400 526459 -7579600 -17141506 -20928102 -17277840 -12176609 -11810164 -16020946
1852 -16020946 -19249318 -16119598 -6737287 2398686 4395062 -253692 -4657960 -5093912
1844 -5093912 -4909557 -6754742 -7023309 -2968927 184787 -3489501 -9822098 -9174178 -391037
1835 -391037 7713828 8621896 4445297 -611534 -5695265 -9966105 -10125198 -4780935 2556326
1826 2556326 7226063 7222156 2392726 -6275956 -15280879 -20122450 -19685749 -16502580 -12573152
1817 -12573152 -8370907 -5788899 -7521171 -12524226 -15874898 -14113487 -7886665 229002
1809 229002 6954722 8670432 5461557 3594053 7966805 13050462 8736383 -4555110
1801 -4555110 -14805615 -14246157 -8130527 -4587527 -3721239 -1682841 987082 844422 -2902764
1792 -2902764 -8593069 -13933275 -14743036 -7069291 6087399 15504122 16633175 14218501
1784 14218501 12991500 11025279 7113541 7000451 14904841 24631351 26909428 21390950
1776 21390950 14371643 8818148 3925901 694270 252107 -354474 -3482495 -5087840
1768 -5087840 -943231 4567952 4073537 -906535 -2473348 744332 2251300 -782968
1760 -782968 -3269881 -886361 4138242 7662601 8249170 5880355 1415069 -1456153 1511949
1751 1511949 9566852 17160106 19963922 17764185 12531943 7179167 4686321 4770405 3465463
1742 3465463 -376809 -1533702 3878092 10885854 11849618 6906016 1935966 -624355
1734 -624355 -2290032 -3284751 -3825041 -6789881 -11403576 -8858381 6144985 23388937
1726 23388937 27568309 18158472 8015708 4705930 5034076 6055742 8319624 8510326
1718 8510326 2024758 -6271511 -6111956 2783860 11322368 16173759 20544165 20972961 10052734
1709 10052734 -6588615 -13656595 -9356860 -7340604 -12204538 -12733675 -4781821 311512
1701 311512 -1928038 -57439 9648653 12560386 1544615 -8457197 -6298103 -2499733
1693 -2499733 -5117241 -2793275 9202385 16877470 29523196 97658429 239121767 369862042
1685 369862042 372658261 238481853 83769947 13236396 16595195 23234121 7053029
1678 7053029 -6177400 -2040030 3710316 828471 -1488354 1620236 1552871 -5178238
1670 -5178238 -10378682 -9676792 -8024755 -7317301 -2869825 5388719 10419353 9061766 5660746
1661 5660746 3615736 2274709 2666116 7543091 14815120 18514164 17117015 14652914
1653 14652914 13573528 12332533 9656336 6061248 1999035 -1213244 -723628 3392653
1645 3392653 6194237 4754391 2560047 2023739 -1504772 -11112449 -19544151 -18171579
1637 -18171579 -10283100 -5535943 -5198108 -3344251 25392 -1031742 -6228380 -8698975
1629 -8698975 -7622599 -9988377 -17724078 -23516990 -22485490 -18510767 -15414637 -10682776
1621 -10682776 -2200755 6499366 12022945 15366828 16700286 12876585 4297415 -2418390
1613 -2418390 -3273209 -2483167 -4723523 -7563368 -6604023 -3002438 -636348 27633 498112
1604 498112 586291 419301 2066791 5024755 4505883 -1227754 -6415686 -5840129 -2748615
1595 -2748615 -2752781 -4254902 -2437168 512891 -1971417 -8956601 -11714515 -6766961 -1266351
1586 -1266351 -2044132 -5918933 -5954230 -2749118 -3038648 -8493568 -12221514 -8204429 249253
1577 249253 5204810 4919539 4920814 8069182 9368954 4413406 -1617711 -13077 8148128
1568 8148128 12176507 6278144 -2986678 -6534988 -4211722 -2591239 -5924223 -13182185
1560 -13182185 -20321276 -22132854 -16032522 -7429088 -6355312 -14532298 -21444126 -18909237
1552 -18909237 -13320512 -15194188 -21977672 -22253695 -14302310 -8125225 -8583634 -8957895 -4775167
1543 -4775167 -2516291 -8146693 -16129659 -17629379 -12871411 -7472455 -2131758 5294113
1535 5294113 11491540 11053228 6674521 6904803 13071453 16501836 11144206 2329912 -752998
1526 -752998 3368997 8713285 11009433 12211723 15989924 21686171 24324021 20192235
1518 20192235 11213037 2806599 -1916539 -3938889 -4554410 -2936491 1252744 5870602
1510 5870602 8986694 10887882 11501750 9456523 6505609 8382718 16512541 23078934
1502 23078934 20815974 14292713 13287806 16947679 14366618 1613749 -11792700 -16601432
1494 -16601432 -15057739 -13696261 -12936932 -10166437 -6846946 -5578937 -4643756 -1936253
1486 -1936253 -387498 -3241673 -7640632 -9159774 -9065561 -10533880 -11482274 -8639446 -5294478
1477 -5294478 -6554068 -9593725 -7882364 -3244587 -3514714 -8711418 -10419764 -6079602
1469 -6079602 -2820503 -4240460 -4356762 608340 4803455 3413684 1369637 3773730
1461 3773730 5926575 1901804 -3652348 -2321011 4052240 6250972 1946628 -2415138
1453 -2415138 -2726385 -1589268 -1869825 -3389196 -6068912 -9862368 -11873321 -9644322 -6355905
1444 -6355905 -6215364 -5975010 1073193 12775783 18196598 11774963 204525 -7123558
1436 -7123558 -8354750 -7592716 -8610925 -12285567 -15750717 -13296997 -3155909 6766256
1428 6766256 6533027 -2171742 -7642643 -4301081 1349313 2824234 2141474 2466295 1903043
1419 1903043 121963 2181662 9070970 12875904 9023336 5223607 9279081 15677057
1411 15677057 15032997 10299644 10916578 15091468 11652690 -1593177 -14228156 -18598243
1403 -18598243 -17191359 -13538827 -7541349 -2425978 -4795163 -13281058 -17237502 -11798493
1395 -11798493 -5111383 -5301991 -9275710 -10770407 -10847127 -12529724 -12448952 -6857200 -467207
1386 -467207 -146496 -3804895 -4476970 -2365414 -3615236 -8773388 -11555849 -9054684 -5038191
1377 -5038191 -2334852 556777 3653980 3139345 -2364530 -8227338 -9259793 -5167790
1369 -5167790 1122778 7142839 11395279 13207299 13265579 12096233 8309127 1279524 -5593298
1360 -5593298 -8691273 -10290917 -15235963 -21651486 -21779633 -13729891 -5622592 -4754821 -8560901
1351 -8560901 -10392808 -8900172 -6709210 -4332528 -1150444 710869 -932593 -4082906
1343 -4082906 -5997367 -8235338 -12748857 -15595794 -11498109 -3396990 76186 -2943214
1335 -2943214 -4977858 -761547 5773752 9164725 10403746 12462407 13201982 8918080
1327 8918080 1772419 -2476709 -2634000 -2458103 -3791887 -4826206 -5297244 -7857214 -12650956
1318 -12650956 -15113877 -11656299 -4327603 2209714 5155663 3039608 -5058021 -15626304
1310 -15626304 -19374338 -9949371 6311951 15015938 9636527 -1662141 -7149148 -4943974
1302 -4943974 -1632417 -1191285 -1101624 1253440 4017326 4610962 4274056 5998522 9779663
1293 9779663 12571774 12516896 11379899 12386879 16222247 19604173 18597855 13867357 11137841
1284 11137841 14298354 19103044 17246407 7109743 -3268458 -5604951 -542144 4749032
1276 4749032 5094001 686496 -5252114 -8763468 -7345874 -3395808 -3229283 -8796437 -13117378
1267 -13117378 -9391247 -2274493 -2588010 -11170162 -16620674 -11562135 -2919150 -1079711
1259 -1079711 -5641044 -8614440 -6932694 -4206253 -2866991 -2176203 -2935210 -7034161 -12169795
1250 -12169795 -13380722 -10557360 -8581668 -9140996 -8497119 -5015865 -2696959 -4381516
1242 -4381516 -7051070 -7347390 -6562932 -6165626 -3682701 1586478 3497031 -3266798 -13355554
1233 -13355554 -16180226 -10066278 -3667854 -3352370 -6645316 -9264159 -10708280 -9799830
1225 -9799830 -2413551 10704916 19679954 16058652 4205997 -4571181 -6813872 -8623868
1217 -8623868 -13980077 -19613034 -22673379 -25508790 -29118542 -28367378 -19273005 -7021947
1209 -7021947 -946965 -3566905 -9535649 -13819731 -15710295 -15505879 -12903889 -9739998
1201 -9739998 -9506315 -12027487 -12266793 -6822492 1283356 6782808 8552448 8827816 8057598
1192 8057598 4462855 -1578065 -6335970 -7120914 -5472326 -4395819 -4211923 -3468369 -3134168
1183 -3134168 -6564435 -13831555 -18905158 -16172818 -8880744 -6294720 -11118584 -14876210
1175 -14876210 -9694775 -96558 3585233 909540 1577334 9134963 13790188 6499408
1167 6499408 -6888696 -12763278 -6834500 3261571 9934882 12482690 12410125 9370570
1159 9370570 3730630 -1986775 -6186967 -9018247 -9406058 -5685090 -105503 2248542
1151 2248542 847770 1133675 5907028 9962431 7087667 -1152340 -7695436 -8447366 -4711544
1142 -4711544 321464 3214189 321384 -8779162 -18062329 -19584127 -12225275 -3101278
1134 -3101278 415757 -2271161 -6329347 -7226492 -3719467 3111479 11531556 19246961
1126 19246961 22833517 19232648 9586726 398487 -2171867 814756 3106628 2233898
1118 2233898 1871375 4084640 5148854 2598976 487121 1886016 1497178 -6282747 -15822241
1109 -15822241 -16786720 -10747082 -10121014 -19107144 -27069195 -25438990 -20494538 -21607795
1101 -21607795 -25460237 -22208184 -12052920 -4730116 -4563514 -6124779 -4728457 -2102020
1093 -2102020 -163007 2713280 6552213 7707515 5147380 3258317 5153335 7913032
1085 7913032 7444585 3620077 -2155749 -9688715 -17064103 -19858600 -17300279 -14707066
1077 -14707066 -15423361 -15129613 -9823279 -4854583 -8204547 -17116447 -19739368 -10188750
1069 -10188750 5032191 16240628 19643437 16376026 9558845 4700964 6662995 12786510
1061 12786510 14223129 7434985 -632948 -2425310 459842 2080378 1737834 2444218
1053 2444218 3324553 897595 -3286967 -3294900 2245949 7598900 7928663 5306890 4495898
1044 4495898 5945419 5552241 166674 -8152056 -13454670 -12038684 -7396208 -6740450 -11390543
1035 -11390543 -14200426 -9742534 -3227304 -3704413 -10776412 -15002192 -11167325 -4132640
1027 -4132640 -166055 915837 2059499 2837871 884798 -3782192 -8762328 -11320075
1019 -11320075 -9388123 -3884948 -528089 -4403396 -11433331 -11201106 -1048997 8744702
1011 8744702 8185602 425500 -4243306 -2923716 -2055145 -7077400 -16060458 -22808523 -22272091
1002 -22272091 -14311464 -5269842 -3156566 -7874318 -9991980 -3549887 4617439 4633474
994 4633474 -1754486 -4636716 -1324070 1269951 -871715 -3490642 -2721237 -742543 -188418
985 -188418 -73176 56607 -1423692 -2959011 171943 7219708 9954638 3658545 -5481579
976 -5481579 -8553018 -4683120 765426 4114880 4672968 2025751 -3110789 -8152665 -12241328
967 -12241328 -16952242 -20336799 -15661293 -1302343 12829481 15195987 5826041 -6103745
959 -6103745 -14179904 -17443584 -14642198 -4684855 7615161 14134185 12844504 8779177
951 8779177 5668047 3059519 1789966 4644790 9686741 10150387 4190538 -1511172 -1556688
942 -1556688 684525 75078 -1254296 1769634 7420324 9043036 5517179 2812336 4057418
933 4057418 4319756 -1434404 -9677423 -12556131 -8875642 -5413040 -6621927 -8331997 -5117104
924 -5117104 261192 910366 -2381595 -1298775 6201721 10364417 3555599 -6723864
916 -6723864 -7307132 1569046 6524385 199630 -9660155 -13126656 -11376773 -11575067 -14727988
907 -14727988 -15423359 -10589529 -2725255 4133862 7356100 5931927 1491954 -1819291
899 -1819291 -1300241 1630474 4560727 7236409 9057550 7084568 865057 -3915614 -2215327
890 -2215327 2134838 1524232 -3165923 -3029365 4896731 11730051 8588747 -1693873 -9842372
881 -9842372 -12596022 -13490584 -13671479 -9388635 232952 8885906 10074993 5372897 2106430
872 2106430 4110615 8193268 9807874 8839792 7877516 7151506 4643208 738143 -1207076
863 -1207076 -540260 -1992906 -9121014 -17156203 -17109454 -6992074 5402809 11847470 11470006
854 11470006 7440512 931768 -7220298 -12497266 -10653169 -4820512 -2634146 -5568387
846 -5568387 -7031256 -3214250 258941 -2711163 -7798695 -5495510 4250304 10332131
838 10332131 5257121 -4764937 -8566403 -4386692 -84906 -1239095 -5055455 -6555864
830 -6555864 -5542908 -4788507 -4661483 -3027859 830433 5234290 8812800 11618321 12963490
821 12963490 10355008 2362515 -8166084 -15480968 -15991221 -11139407 -4899034 489471
813 489471 5131278 8679746 9335427 6637999 3460854 3242179 5910902 8413850 8853603
804 8853603 7929815 6302183 3326844 -314804 -1290486 2437600 7560957 8305642 3495740
795 3495740 -1765118 -2210558 2041178 7298165 11211945 13149135 11258683 3574030 -6972459
786 -6972459 -12781359 -10087121 -4671227 -4935704 -10676930 -13831150 -10391086 -5531283 -4570106
777 -4570106 -4927702 -2090002 1176241 -1238804 -7833520 -10285641 -5420037 913605 3592305
768 3592305 4832074 7856493 10397068 9386022 7251148 8051034 10781563 11757373 10710402
759 10710402 9282869 6353796 863896 -3014550 -294025 6414408 9717988 8102276
751 8102276 6548962 6416625 2997180 -4720476 -10074052 -8761181 -5900319 -7658299 -11561543
742 -11561543 -11511016 -8167440 -7352594 -10507215 -13352986 -13072361 -11140309 -9387429 -8169587
733 -8169587 -8318911 -10511273 -12656379 -11795694 -8604811 -6646467 -7528132 -9896545 -12105814
724 -12105814 -12406855 -8335783 -573248 4339915 1004254 -6124202 -7693919 -2980736
716 -2980736 -889242 -6158277 -12657276 -13734904 -11605648 -11365416 -12237505 -11180522 -10088666
707 -10088666 -12145149 -14394482 -11329520 -4038513 1200346 2585003 4249038 7775251
699 7775251 8771958 3971982 -3073322 -6089589 -3149871 2117490 4596864 2124747 -2819008
690 -2819008 -5959847 -6697106 -8866643 -13946870 -16388913 -10219896 1204462 7381775
682 7381775 2926183 -6748621 -12699191 -11544986 -6477994 -2682384 -2922837 -5449018 -6086721
673 -6086721 -3928290 -2944852 -5139240 -5578368 345448 7887348 8858076 4620621 3786229
664 3786229 7220702 6449810 -495666 -3534908 3032974 9259322 3860807 -8320547
656 -8320547 -13799506 -9902769 -5668416 -6430907 -8414676 -7759952 -5078325 -824525 4882998
647 4882998 7143652 -72154 -13217246 -20401459 -16344130 -8864980 -6997671 -9408475
639 -9408475 -9204260 -4629138 554176 3739977 5296724 5661443 4874504 4079257 4460729
630 4460729 5323295 5189326 3916446 2199538 15305 -2963049 -6024629 -7568066 -6680343
621 -6680343 -4730085 -5077003 -9191432 -12469402 -7652838 4728756 13471975 9588336
613 9588336 -1063901 -5007083 926735 7292208 7417142 5448477 6430162 7669309 5310275
604 5310275 2098001 2055373 2832386 15285 -4790713 -6317999 -3138854 2371106 8315572
595 8315572 12325560 10055289 996360 -7099239 -6494124 -264911 2021365 -2102534 -6314852
586 -6314852 -6955690 -7752487 -11124622 -12511163 -7813668 -1115758 484910 -2844279 -3590685
577 -3590685 3086499 12765261 16585789 11346403 2975204 -826251 140243 -459772 -5478298
568 -5478298 -9937162 -9227077 -7020764 -9798919 -16310737 -18943980 -15005970 -10304012 -10243398
559 -10243398 -12682053 -11968590 -6240720 1582167 7169508 7289976 1610827 -6060519 -10137623
550 -10137623 -8165520 -2173977 4512496 9203862 9086970 2890419 -5283746 -7708639
542 -7708639 -1280308 8289843 12554216 8694733 598890 -5701726 -5912248 250519 7839529
533 7839529 9718257 3752360 -4128904 -6426894 -2646603 829103 -1464295 -8743606
525 -8743606 -15979440 -18877942 -16556264 -11034536 -5081868 -293198 2958331 4160030
517 4160030 2515091 -1356507 -4907039 -6034139 -5206083 -4147338 -3153908 -1165645 1663553
508 1663553 2994400 761035 -3877118 -7007682 -5948635 -2435429 -889804 -3245608
500 -3245608 -6577693 -6735267 -3346562 286630 1880146 2993888 6548261 12458689 16710676
491 16710676 15151612 8159856 752221 -2797656 -3365807 -3912926 -3121073 3473133 14746622
482 14746622 21361007 15908176 2455983 -8762909 -13820776 -16636213 -19387046 -18383512
474 -18383512 -11210642 -2247577 2394318 1902870 -574730 -3719016 -8732189 -15056882
466 -15056882 -18705409 -16104211 -8586025 -1741586 412627 -44714 1960322 6929366
458 6929366 9414966 5699158 -576938 -3406024 -1925303 907026 4093853 7880839
450 7880839 9517186 5894842 -478832 -4168757 -5025103 -7508966 -11927928 -13176434 -9182106
441 -9182106 -3979162 -880940 950713 1583336 -1032583 -5252741 -5822121 -2756185 -2786887
432 -2786887 -8255130 -12233247 -9566735 -5103619 -4731567 -5563662 -2849254 -383819 -4783514
423 -4783514 -13538710 -18049218 -16085327 -12664241 -10331520 -6999919 -2669984 -453820
415 -453820 -839418 -1476335 -2218066 -4158518 -4857517 -1595554 1572108 -2088726 -10749578
406 -10749578 -14815604 -9970911 -1800450 4055577 8444079 12731948 13894676 9837175
398 9837175 3847117 -432938 -3700111 -6874518 -6965208 -1604298 5543936 8210887 4570039
389 4570039 -1933291 -6913270 -8131966 -6342972 -4838351 -6326419 -9404234 -10445772
381 -10445772 -9107248 -8460040 -9365828 -9248194 -7599138 -7695982 -10511151 -11615669 -7429633
372 -7429633 -831286 2820620 2237999 -228681 -2662780 -4159069 -3849565 -2234852 -1363834
363 -1363834 -1475552 6442 4079185 7877946 9273504 10404262 13442831 15942631 14243675
354 14243675 9257218 5108541 3730408 4189945 5679333 7589878 7828300 4589528 -610016
345 -610016 -4258012 -4713516 -2961996 -740178 250511 -1124597 -3559453 -3516823 576433
336 576433 5803055 8162619 6702466 2852297 -1580741 -3860081 -1339063 3871481 4707925
327 4707925 -2355297 -11555577 -14967455 -12513075 -9745680 -8461007 -6258805 -4102381
319 -4102381 -6508009 -12947882 -16026349 -11317289 -3881283 -1513734 -5327571 -10402147
311 -10402147 -12634342 -11350389 -7380516 -2352196 912101 292376 -3250832 -6734954
303 -6734954 -8140427 -7215877 -4403432 -708963 1946884 2011755 -5493 -2199162 -3474125
294 -3474125 -4094455 -4271056 -3490709 -1526750 949575 3290316 5430009 6669200 4962588
285 4962588 -645306 -6988754 -8685597 -4419117 728309 1408886 -1114591 -1194238 3039681
276 3039681 7445898 8019473 5482854 2449534 -578340 -4231635 -7808587 -10011755 -10450670
267 -10450670 -8970427 -5523241 -1942130 -1218721 -3409228 -5052270 -4353712 -3510086 -3562923
258 -3562923 -1153331 5544680 11281130 9576835 2091840 -3387755 -3378214 -1728658 -2341173
249 -2341173 -4100669 -4149505 -2131783 136644 354453 -3308695 -10033352 -15160502 -14365304
240 -14365304 -8982160 -4090073 -1902747 -764355 140014 -74623 -283048 1833819 4571278
231 4571278 3378551 -1382996 -3781607 -1800582 -1362666 -6880468 -13179704 -12316449 -4826427
222 -4826427 1508208 2009220 -922692 -2854923 -1668229 2423916 7107292 8617289 5547973
213 5547973 1335912 -164971 -241249 -2672540 -6987624 -9303517 -9322045 -10722697 -13575160
204 -13575160 -12236563 -3783713 6179495 10248354 8514450 6731686 7467549 8121735 7000360
195 7000360 6095375 6596878 5990671 2189619 -2402724 -4027451 -2996591 -2749887 -4248331
186 -4248331 -4624460 -1869413 1941000 3393513 1808204 -787326 -2263674 -1537197 1601626
177 1601626 5941545 8629611 7230561 2347213 -2564839 -4146251 -1758103 2352265
169 2352265 5213998 5917341 6165048 7373775 8097249 6356315 3840112 4289074 7196079
160 7196079 7410429 2977797 -1231356 -1284278 -994780 -5361267 -10773701 -9320581 -1501092
151 -1501092 3658399 2106601 177168 3454422 7818529 6841222 2193742 60331 1013833
142 1013833 572183 -2016244 -2636856 -124830 1055994 -2196972 -6700446 -7680430 -5099980
133 -5099980 -2376555 -823100 1423063 5186177 7532725 4652680 -3170852 -10835038
125 -10835038 -13347854 -10805396 -7421033 -6227827 -6584030 -6848449 -6995821 -7458451 -7520345
116 -7520345 -6543167 -5226102 -4098230 -2343659 225949 1774570 1082110 -79548 276186
107 276186 602642 -2135754 -7416186 -11255697 -11272853 -8895638 -6436750 -4676444 -3703944
98 -3703944 -3484643 -2831830 -193867 3613193 5611852 4610007 2955773 3271311 5277663
89 5277663 6899279 6548664 3150526 -3762258 -12026877 -16962210 -15993238 -11694716 -7767557
80 -7767557 -3797119 2343239 8139693 7729689 653055 -5604615 -4803781 18441 1562840
71 1562840 -1503064 -4133232 -3209999 -954930 -94216 -822071 -3538421 -9361784 -15753612
62 -15753612 -16656119 -10468334 -3753569 -2956896 -6024700 -6821630 -4475507 -2635109 -2001557
53 -2001557 -299801 1484330 -69943 -3545552 -3294936 1240456 3660977 664709 -2514244
44 -2514244 -609764 3380190 3354643 -744129 -4323983 -5718386 -7044790 -9135801 -10230923
35 -10230923 -8992971 -5572022 -751658 3440163 4234299 1953827 898336 3317846 5393463
26 5393463 3087268 -999197 -1559057 1019415 1882950 -114698 -1548518 -1368855 -2685163
17 -2685163 -6811674 -10769735 -11915621 -10510372 -6743409 24812 7611144 11242254 9521307
8 9521307 6322685 4914452 4009939 1561967 -1448983 -3384770 -4507162 -4681611
0 -4681611
$$ Imaginary data points
##PAGE= N=2
##DATA TABLE= (X++(I..I)), XYDATA
65535 -8490274 -7135109 -2842436 170236 687480 2380715 7249914 11539411 11245408
65527 11245408 8038316 5962911 5037398 2461861 -1344688 -2438754 790996 5043346
65519 5043346 6406771 4849323 3289835 3874779 6366116 9113772 10322105 8739284
65511 8739284 4265453 -1682917 -6749944 -8970611 -7751025 -3849753 1168429 5439798
65503 5439798 7532670 7434773 6517291 5799650 4642485 2105406 -1005374 -3067168 -4248899
65494 -4248899 -5958553 -7560497 -6423687 -2246063 1558536 2663178 3336131 6509258
65486 6509258 10578036 11483601 8685486 5674855 5142927 6728408 9200058 11828204
65478 11828204 13567424 13607420 12833026 12307736 10582676 5378154 -2066998 -7379505 -8231761
65469 -8231761 -6350527 -3920227 -953490 2869838 6456606 8559803 8757054 6711149
65461 6711149 2828869 -165784 542067 3349857 3268424 -1447430 -7098737 -10236177 -11598495
65452 -11598495 -12306385 -10478185 -5228162 -407905 223376 -1038705 192443 2214431
65444 2214431 -1017801 -9840236 -16338044 -13892368 -4998519 2951302 6205058 5853499
65436 5853499 3179525 -1941017 -8199179 -11662741 -8872801 -443328 8685421 12557859
65428 12557859 8998111 2228323 -451528 3658494 9153201 8828182 2705271 -2444175
65420 -2444175 -2791733 -2557339 -7126373 -14617542 -18399413 -16052014 -11139347 -6796794
65412 -6796794 -2752853 588222 575474 -2625607 -4078774 -947584 2324066 122127
65404 122127 -5850614 -9248650 -8456614 -7845729 -10316318 -14034988 -16900231 -18858932 -18543765
65395 -18543765 -12945032 -3049193 4520328 4781460 300902 -2984119 -2937178 -1205321
65387 -1205321 1142216 4092373 6450506 6853415 6330330 6941603 8596607 9858311 10871002
65378 10871002 12364709 12460738 8105644 57201 -6716948 -8527064 -6404619 -3404950
65370 -3404950 -1084967 328051 948515 2087037 5729842 11017043 13372722 10123839
65362 10123839 5573809 6689567 13733004 19049346 16607686 9385060 4691869 4758409
65354 4758409 5542659 3472732 -768095 -5166074 -9021168 -11429925 -10530241 -6215856
65346 -6215856 -1123474 2762232 5962349 8357470 7482813 2778451 -1483236 -1342539
65338 -1342539 960947 346618 -3689894 -7663416 -10668614 -14666154 -18258384 -16371622
65330 -16371622 -8229163 -572401 287818 -3825377 -6271211 -3899813 1068097 5447332
65322 5447332 7974393 8337637 6000161 839861 -5617576 -10214122 -10696822 -9130467
65314 -9130467 -10731539 -16727950 -20456639 -14946892 -3240723 4513781 4521150 3393528
65306 3393528 6601048 9530581 4825672 -6138073 -14874244 -16260151 -12193414 -6445557
65298 -6445557 -881139 3538213 6028951 6812416 6469574 4793826 1903790 -659650
65290 -659650 -1671482 -1637615 -969827 1181283 4534113 6736047 7150734 8826779 13708501
65281 13708501 18375682 17946155 12332068 5580616 958330 -489701 1080182 3659900
65273 3659900 4330210 4004897 7893028 17234908 24368500 21605156 12079451 5475629
65265 5475629 5126613 6202223 5368687 4706869 5631379 5771433 3431910 -86690 -3466794
65256 -3466794 -5869152 -4680588 1444057 7469507 6731729 1479925 1385956 9882488 19399874
65247 19399874 22721290 21479987 19697926 16474224 10470670 5255016 3958442 3664925
65239 3664925 1276689 327248 5164186 12168902 14270763 11807056 11260115 14142105
65231 14142105 14596487 8845701 738212 -3934157 -3901422 -1312337 2009881 4996963
65223 4996963 6434012 5538231 2607601 -1144930 -3601224 -2630763 1366015 5054159
65215 5054159 6318673 7210568 10031408 12160032 8643943 -499350 -9225145 -12034717
65207 -12034717 -8784682 -2899955 2296689 5114908 5937936 6660013 7913987 7311582
65199 7311582 2713178 -3470142 -6189516 -3718278 1142660 5390913 8088476 8622886
65191 8622886 6605612 3981374 3488800 4281598 2824787 -1181040 -4283209 -5975143
65183 -5975143 -10416228 -18251746 -22073120 -15579461 -3724597 2917798 2369665 2723497
65175 2723497 8807739 14565218 12386093 4785908 1142950 4932551 9842033 9118575
65167 9118575 4341173 2474158 6513437 11954848 12383173 6712445 192763 -1122174
65159 -1122174 3570401 9188778 10114828 6095796 2326300 3425832 8262541 11848904
65151 11848904 11603085 9585603 8289023 7054365 4806057 4059314 8139633 14562862
65143 14562862 15728934 8475413 -571294 -2894148 859763 2376045 -2451635 -8400074
65135 -8400074 -8936810 -4409372 653711 4173798 6267019 5729899 2268336 326025
65127 326025 4428054 11013962 11560314 5198590 1346509 6200689 12868849 11020230
65119 11020230 2336881 -1084727 7072638 19327265 23883542 17351192 5999271 -2170675
65111 -2170675 -3963444 -1298994 2611682 6867395 12594323 19354236 23716100 22833993
65103 22833993 17810062 11588309 5191256 -1556308 -7300065 -10246580 -10794547 -10136156
65095 -10136156 -7631134 -2781340 1921794 4102928 5730720 9418613 12109687 8675773
65087 8675773 1329881 -1762975 1421401 3377381 -1061864 -6133132 -3421540 6082473
65079 6082473 13801257 14547457 10563744 6326877 3973507 3450401 3726323 3476375 2145680
65070 2145680 158627 -2122074 -4104169 -3840950 -91363 4349707 5132958 2737024
65062 2737024 1869105 3406956 2454323 -3013617 -7131034 -3820620 4933124 12681736
65054 12681736 16507133 17371072 16402531 15196305 16152659 18244072 16336434 9128949
65046 9128949 3231456 4012702 7159453 5935091 2312738 2724736 6084996 5425604 191391
65037 191391 -2461343 688109 4259416 3000815 -1676688 -5763656 -7445885 -6378121
65029 -6378121 -3500059 -2542691 -6363568 -11115174 -9773778 -2261855 3902881 4042388
65021 4042388 1130220 -1236657 -3964006 -7824209 -9604648 -6447414 98338 6798396
65013 6798396 11629886 12586426 8396925 2163301 -601351 580459 494521 -3343814 -6959399
65004 -6959399 -6728028 -4616646 -4124604 -5789809 -8805484 -12205348 -12862930 -7915805 -680184
64995 -680184 2251770 1318421 3688416 10483051 13559573 9180526 5033438 7189840
64987 7189840 9615805 5294354 -799358 -459659 2994132 910686 -4609102 -4112817
64979 -4112817 1965589 3151434 -3158614 -6409995 869961 12040874 16466092 12485102
64971 12485102 5266761 -1510452 -6402954 -7638478 -5157825 -2388006 -2308612 -3930438
64963 -3930438 -4675324 -3351779 716490 7767464 14818827 16638549 12104965 6452229
64955 6452229 4707148 5784317 5553297 3051059 896304 1375140 4270114 7133152
64947 7133152 6589635 1514680 -4134025 -4532691 516878 4460886 2372386 -2819588
64939 -2819588 -5332487 -4681505 -4758591 -6635918 -7038713 -4056851 -234405 1558770 2476417
64930 2476417 5637313 11010781 14592599 12866205 6887812 1484211 939499 5583583
64922 5583583 11725721 14397488 11220410 4849896 896807 1929566 4427829 3954915
64914 3954915 2286857 5254522 12939040 17091199 11483964 965747 -4199052 -607893
64906 -607893 6170888 9962327 9350168 5439252 -93531 -3564870 -800593 7251092
64898 7251092 13544137 12446541 6587160 3647699 6760959 10203189 5835559 -6485832
64890 -6485832 -16734741 -14968941 -2934658 7994349 10754346 9686666 11489129 14677392
64882 14677392 13464330 8189926 4720602 4914440 4761882 2193710 198472 893329
64874 893329 2238581 2422807 2428638 2418865 584844 -2222335 -1762563 2627567 4838962
64865 4838962 -282152 -9174423 -13511909 -10005405 -2935935 1787242 2183597 283816
64857 283816 -1313374 -2542417 -5402390 -9885756 -11984228 -8399059 -2106676 524041
64849 524041 -2161611 -5860082 -6942512 -5592191 -2022420 4792808 12760301 16217781
64841 16217781 12656870 6016776 1240336 -330971 1418079 6818315 12543621 11960428
64833 11960428 3914503 -3273079 -1603646 6186394 10932244 8989278 4755389 2891162
64825 2891162 2840085 1129707 -3594720 -7969540 -6240846 2687484 11246452 11009439 4548040
64816 4548040 2655189 8261039 11841440 6953957 796537 1845509 5576047 2595087
64808 2595087 -5710230 -11318078 -14309980 -20080876 -24407857 -16186247 3345979 17807510
64800 17807510 16673095 7951421 4512918 7579849 10393613 10190100 8942822 7588524
64792 7588524 6131583 5654471 5391338 2020421 -3948517 -6239553 -2128555 1741862
64784 1741862 -1038064 -6123001 -4825251 2505373 7622072 7167530 6089171 7959204
64776 7959204 9538529 7608169 5533844 8983392 17698742 24795260 23751983 14675337
64768 14675337 3803574 -2609533 -3545985 -2056996 -65127 3074708 6925540 8771984
64760 8771984 7867911 7308041 8971149 9994103 7817272 5506984 7288859 11067982
64752 11067982 10975298 6472709 3264923 4794687 8194049 10076065 11322949 13377219
64744 13377219 13662903 8526027 -848108 -8426494 -8990474 -2597536 5804047 10371857
64736 10371857 9125758 5683322 5362271 9002361 11860535 9266959 2077042 -4300505
64728 -4300505 -5175968 -258427 6497915 9667578 6213196 -1875655 -8996539 -10706210
64720 -10706210 -6952298 -823540 4458376 6817812 5528876 2014282 -384491 573227
64712 573227 3176659 3449127 -58158 -4610838 -7032243 -7524414 -8140116 -8393346 -5157054
64703 -5157054 1963524 7410521 4754859 -5083148 -13318169 -12179247 -2655050 7679752
64695 7679752 12610491 11212190 5826485 -442952 -4419995 -4392391 -2168683 -1472746 -3331309
64686 -3331309 -5128038 -5113955 -5090428 -6634592 -7316449 -3985461 1650537 4428000 2318572
64677 2318572 -1869486 -5342527 -7925224 -8959874 -5994806 792417 6296243 6129281
64669 6129281 2251547 -632769 -2242449 -5854367 -11395896 -14427593 -12405477 -7426587
64661 -7426587 -1813491 4434744 10061904 11189734 6814468 2027614 1926060 5046499
64653 5046499 6863215 7402148 10300556 15106289 15812821 8582352 -2442124 -9079560
64645 -9079560 -7465988 -1284888 2899125 3097531 3934404 9746325 16688471 16077284 6634481
64636 6634481 -2377071 -3940841 -3109081 -7325326 -12240378 -7478462 5327902 11981926
64628 11981926 5391129 -4773856 -6702829 -1586393 2064786 1423288 -889153 -3868636
64620 -3868636 -6700548 -5008832 2770083 8859113 5242657 -3091857 -4015184 3366709
64612 3366709 6886549 -312398 -9914788 -11461152 -6522804 -3425385 -4362352 -5403745
64604 -5403745 -5379456 -6841857 -9407374 -8941709 -3922984 2486486 7559991 11743590 14921363
64595 14921363 14074950 7311851 -2400989 -10270108 -14663725 -16279690 -13976411 -5781265
64587 -5781265 5508073 12469246 11898266 9996086 13829790 19613976 16210290 1148751
64579 1148751 -13900907 -17473953 -12196066 -8502340 -9154660 -8066990 -2517159 2547458
64571 2547458 3597055 3717726 5421538 5330766 1160496 -1529430 3581483 12478676 13840889
64562 13840889 3288275 -10901615 -17784433 -15360313 -9970066 -7067975 -6020605 -3552160
64554 -3552160 795202 4526036 6310807 7615753 9621558 10968412 10348741 9127984
64546 9127984 8503413 5850661 -1938633 -11924850 -16378465 -11497087 -1369742 7394262
64538 7394262 11331635 10087431 5565270 2593503 5453155 11374099 12298112 5896181
64530 5896181 -287493 714678 5986562 8541248 7274464 5230298 2647911 -1068810
64522 -1068810 -2108597 2991890 9752202 11033136 8062986 7600941 9654003 8083382
64514 8083382 3478793 4406318 13409774 22256665 24831020 24431689 23472313 17092289 4653982
64505 4653982 -2866501 2442197 11443343 10585405 2373684 -56180 5157349 6890105
64497 6890105 747696 -4116994 -757530 5953254 10090805 13335285 16823196 15253976
64489 15253976 7133872 1610032 5645504 11879803 9668182 2157986 520478 5019744
64481 5019744 4960008 -2995153 -9423809 -7857441 -4441437 -6678626 -11918935 -13817802
64473 -13817802 -12915606 -13018219 -12364507 -6932334 292302 1631894 -4300002 -10851124
64465 -10851124 -12779661 -11357739 -9443615 -7432122 -5613736 -5102695 -4355711 63770
64457 63770 6690175 8420619 2307892 -4819167 -5471389 -2026388 -1992680 -5984170 -7921865
64448 -7921865 -5739467 -3582443 -2800237 641475 6937392 8794914 2042144 -6875681
64440 -6875681 -10211606 -9926562 -11963924 -14534238 -11541026 -4796244 -2131126 -3533061
64432 -3533061 -112309 10655909 19071583 17391421 10642209 6707369 3758250 -3710757
64424 -3710757 -12161145 -12253220 -2093126 11382736 22217139 28352242 26991529 17093179
64416 17093179 6460805 6021106 14757217 19719176 14278961 6913348 6795609 10006049
64408 10006049 8008182 2478113 1671561 6231059 9006168 7641377 7531766 11283003
64400 11283003 13836721 10795572 4720691 -202283 -4029825 -7749527 -9046350 -6189446
64392 -6189446 -2710461 -2989281 -5052447 -2964837 4033099 9762794 9641953 6704765
64384 6704765 6309399 7711680 5150922 -2895197 -9576785 -7083226 3863970 14781137
64376 14781137 18972035 17329707 14398320 12050679 9105361 4946882 789727 -1812177
64368 -1812177 -1751640 1366070 5739402 7247746 3403042 -3025320 -6760213 -6005414 -3137788
64359 -3137788 42489 4122070 8414543 9261730 4397676 -3298820 -8850099 -10373483
64351 -10373483 -8967691 -5159414 1052131 6888139 7440559 1741427 -4074267 -2803666
64343 -2803666 4850884 10277312 7237582 -185538 -2588826 3057183 10336079 12193545
64335 12193545 8703074 4168744 614429 -1875643 -1307184 4161646 11139550 13653661
64327 13653661 11579360 10919999 13812922 14032813 6554505 -3135329 -5412754 160995
64319 160995 4694006 3134932 727049 3632328 9014290 9939387 6954508 7831491 15393043
64310 15393043 22030008 19767992 11153393 4775685 2585906 -1325360 -8912149 -12607418
64302 -12607418 -5812461 6245873 12156938 8243174 928705 -3357683 -4251623 -3368293
64294 -3368293 -769697 2398916 3219964 1872673 2752461 7769980 12822881 14358187
64286 14358187 15110643 18786227 22786981 21858892 16532481 11967081 9773015 7174045
64278 7174045 4019742 4215636 8793423 13110275 13266636 10894185 9251084 8687856 8599514
64269 8599514 9849870 11924753 11262776 6470340 2306736 3798568 8396177 9251985
64261 9251985 5539768 3940632 8939753 16600518 20134384 17740416 12321808 6855507
64253 6855507 3431690 4237330 9238295 13965314 13617767 9306068 6795944 8883603
64245 8883603 12415616 13367800 11254213 7414107 2828872 -274301 1511434 7804809
64237 7804809 12598639 11293676 7169076 6587029 9964026 12733302 13689994 15880414
64229 15880414 19176587 19023037 14552810 11316575 12548732 13855201 11266512 8901056
64221 8901056 12140671 17424180 16733623 10275725 6473052 9045570 11837363 8771798
64213 8771798 2399077 -1204559 -1179752 -1108077 -2565952 -3780525 -3272800 -1387110 1141798
64204 1141798 3499343 3989501 1015956 -4934253 -11226908 -14801899 -13752482 -8380954
64196 -8380954 -1357508 4368439 8560766 13445732 19912812 25490404 26990327 23734187
64188 23734187 17266614 9493898 2397192 -1790144 -1719874 2200453 8457532 14754681
64180 14754681 17680511 14677126 7755246 2952197 3991787 8059827 9705019 7124983
64172 7124983 2405342 -2487720 -6744237 -8784961 -6697807 -767165 6684456 13709045
64164 13709045 18914857 20181519 16294302 9762423 5050272 3744624 4045405 4759862
64156 4759862 6370049 8016337 7613088 6152585 7589000 12224681 14343389 9701439
64148 9701439 1889620 -2609209 -2616218 -1052455 1504225 6083631 9736393 7657128 1445331
64139 1445331 -1381785 1939951 5507923 4571177 2949194 5462318 8188498 3666102
64131 3666102 -6595404 -12561384 -8914553 -1194445 3033324 3389135 3972289 5944068
64123 5944068 7176621 7114474 7798641 10133224 11843208 10001191 4793555 480586 2279342
64114 2279342 11251458 22141784 27437346 23906149 14516808 4802412 -857624 -450333
64106 -450333 4568809 8686975 6176135 -2564228 -10433675 -10677434 -2845337 8546964
64098 8546964 18242282 22022177 17930244 8571364 134752 -3190542 -2269327 600831
64090 600831 5197878 10924729 14120240 11693390 5951304 2579290 4493880 9474658
64082 9474658 12442971 9073813 199523 -5918638 -354395 14308166 23833702 19588536
64074 19588536 10898922 12668942 24369909 30999023 24105553 11676867 4842864 3965026
64066 3965026 2844566 -271311 -2480839 -3220310 -5095939 -8505822 -9877574 -6195784
64058 -6195784 490790 4088929 619707 -6462660 -9160338 -4766321 77123 -1613804
64050 -1613804 -7433417 -10101501 -8762364 -8465949 -9734313 -7161663 663518 7860493
64042 7860493 10002947 9125596 8068176 7049242 7769577 12747717 17830901 14335470
64034 14335470 2816458 -4498388 -718811 5270405 2590002 -5881630 -10290640 -8939534
64026 -8939534 -6641047 -3928363 1264350 5494637 4499566 3129159 9425319 20032793
64018 20032793 22287056 11299933 -4217302 -13761061 -14343436 -7754558 2825312 11968493
64010 11968493 15021812 13660969 13149943 14515769 15110343 15001619 15645085 14410879 8862028
64001 8862028 4302372 7195762 12646122 9652756 -1567459 -9575468 -9740244 -9360252
63993 -9360252 -12573839 -13876031 -11159959 -11688086 -18373419 -22446060 -17684764 -10687768
63985 -10687768 -8499385 -7080676 -1921594 502180 -6167217 -14186139 -11714514 -644903
63977 -644903 7870746 10544608 12308151 13793589 11136457 5806940 2846852 1098166
63969 1098166 -3689184 -7889497 -3744532 6972690 14609740 16515578 18538355 21510037
63961 21510037 18884866 10133704 4370217 6440840 9865922 8366515 5009003 4617393
63953 4617393 5434751 4066705 1823011 744345 -706916 -3088348 -2565985 3382054
63945 3382054 11595938 18082988 22199711 23172643 18618689 10137609 4181706 3322545
63937 3322545 2716412 -753997 -2655511 592862 4309161 2939442 -971773 -1986331
63929 -1986331 -676221 -107132 1729438 7905094 14726862 16291359 14202492 14458606
63921 14458606 16704234 15341757 10498952 8862082 12555850 15339100 12293487 6669332
63913 6669332 4192788 5834901 9059659 11869297 12775681 10174950 4440327 -1498712
63905 -1498712 -5172828 -6360407 -5641380 -3774472 -2575750 -3281449 -3710489 -270766 6696513
63896 6696513 12631289 14195194 11960615 7650012 2440010 -1417396 -1236713 2391015
63888 2391015 5605637 6130432 5313739 4769350 4385690 4540487 6699256 10481259 13337616
63879 13337616 14221520 14255915 13017195 8349085 1258447 -3485753 -3721804 -2503830 -2038117
63870 -2038117 131677 5507379 9903698 8868914 4240421 803023 -287827 -265035
63862 -265035 1377580 4405888 4824006 765712 -1805626 2930138 9359140 6622238
63854 6622238 -4231185 -9834344 -3773170 4128908 3146537 -3066530 -4621628 -1643057
63846 -1643057 -2085321 -7065971 -9210728 -5435719 -1756856 -3170356 -6555668 -7088417
63838 -7088417 -5558327 -5243398 -6224563 -7061029 -8471675 -11012236 -11897174 -8613839 -3752188
63829 -3752188 -1725911 -1911239 243382 5558092 9472022 9218984 8225750 10649749 14605306
63820 14605306 14410371 8330174 755587 -3297033 -3019858 -431710 3196349 7526939
63812 7526939 11256694 12616405 11744689 10570372 10004040 9021008 6845169 3794814 -802802
63803 -802802 -8592600 -18016424 -23035677 -19575781 -11488818 -6227812 -5881383 -6725153 -6205916
63794 -6205916 -4538438 116782 10410927 21633906 22639033 9903689 -5525506 -11092017
63786 -11092017 -7423690 -3163259 -306329 5879670 14927949 19680824 17490370 13848452
63778 13848452 12707205 11144072 6570760 2093670 1160937 2986453 6444356 12165340
63770 12165340 17344528 15462543 6014639 -1995142 -1922992 1342942 512208 -2088371
63762 -2088371 85933 5588142 8071181 8230102 11805920 16934338 14928919 5111444
63754 5111444 -1975521 135107 4841783 3987723 14737 -408423 1425174 -1120677
63746 -1120677 -8310888 -12851238 -10044358 -3309548 883516 -569707 -6305511 -12241916
63738 -12241916 -13989735 -10416856 -5373566 -3742807 -5604560 -6307930 -2363521 4831162
63730 4831162 11431333 15233152 16403818 15628461 13006031 8614886 3291822 -1643486
63722 -1643486 -5438448 -8347121 -10750485 -12111988 -11243769 -7587874 -2280482 1647754
63714 1647754 843561 -4519545 -8330998 -3368382 9325717 19067400 17193274 7740467
63706 7740467 1996286 4195868 8222772 7878566 4095256 856903 -198912 848903
63698 848903 3023318 2668830 -3786444 -13042242 -16666538 -12403508 -7366546 -6231042
63690 -6231042 -3567911 6007169 16952674 20486800 18030806 17312197 18409340 14475802
63682 14475802 5542589 667195 4280286 9623808 9159477 4120183 274101 503885
63674 503885 4718033 11204999 15187130 12051649 4965872 3006177 8656254 14286215
63666 14286215 14955435 16339137 23370046 28968704 23664985 11094284 3179241 2631610
63658 2631610 1161610 -5413683 -11072052 -10483982 -6424769 -2817524 1343415 6543935
63650 6543935 8412291 4669092 1022772 3801909 10337753 12775341 8874257 2931685
63642 2931685 -2354345 -8313948 -14325523 -15525201 -9020166 1273820 8494299 9465674
63634 9465674 5984746 1610301 -1062337 -1426582 -912888 -1327637 -2347576 -1929238 -100347
63625 -100347 -399003 -5248696 -10900857 -9969330 271884 14143545 23184608 24052885
63617 24052885 19788466 15016715 12128254 11367954 11890869 11972785 9950625 5791583 568005
63608 568005 -5629600 -13010170 -18725250 -17391613 -7521538 4771621 11737390 12251678
63600 12251678 10603135 8414557 3072701 -5111740 -10089859 -8107721 -4378380 -6481422
63592 -6481422 -13069037 -14892874 -7385481 3043925 7493407 5304558 2744120 3340897
63584 3340897 4046991 1178589 -3644504 -5655120 -3222543 442717 1605858 143637
63576 143637 -1136873 68236 3823313 8830238 13654581 17013757 17928622 16252583
63568 16252583 12839182 8988865 5872552 4339964 4708072 6376668 7705103 6511146
63560 6511146 1445747 -5952207 -10643636 -7703023 1801885 10185208 11027030 6767601
63552 6767601 5161423 8475014 10658856 6844345 1139673 1121540 7438083 13672430
63544 13672430 15510961 15344711 17296868 21670161 25747919 27158895 24828989 18852323
63536 18852323 11211665 5251760 2916426 3008095 2666043 40351 -4188133 -7121599
63528 -7121599 -6492341 -4395165 -5957107 -11586820 -13481086 -5176359 7282846 11135332
63520 11135332 4146411 -2358493 -177609 5179844 5824365 4294962 6447677 9000482
63512 9000482 5395792 -823918 -1229607 1437409 -3512186 -15081950 -19126034 -10405907
63504 -10405907 -1391480 -1731245 -2918349 5316731 15055122 11592794 -2421770 -10245208
63496 -10245208 -5324581 3038213 7691060 11847044 16712613 15641725 6866736 72892
63488 72892 2265477 6329254 2300390 -7035437 -10772606 -5342567 2979965 7883541
63480 7883541 8057706 4804282 1101207 1204449 5605339 8308838 4059548 -4329245
63472 -4329245 -10838595 -14844127 -18544353 -19426437 -13599132 -4785146 -1024959 -2337489
63464 -2337489 -348116 8180537 15586007 14332067 7355144 3580267 7600563 16663923
63456 16663923 24069166 23652910 14853878 4615468 66118 -1024703 -6833288 -18129993
63448 -18129993 -25912159 -24539946 -18962044 -14760277 -9478766 -434048 6322954 3838279
63440 3838279 -3611159 -5509478 34932 4878654 3394972 -1171934 -3125862 -889050
63432 -889050 3321930 5723089 3416723 -1268835 -1045025 6688789 13621086 10849461
63424 10849461 2326906 -1045898 1205616 -1062969 -10507218 -15993698 -9036995 3674635
63416 3674635 10765153 11025811 10392738 10636420 9270038 6439675 4251654 2067136 -1089797
63407 -1089797 -2291490 845497 4263523 2587552 -2164847 -3721393 -1520009 -515545
63399 -515545 -2337994 -4049017 -5193915 -8139965 -10482215 -5267586 8010817 19265812
63391 19265812 19122172 10031178 2096514 1103086 4525057 7197416 7279531 7011246 9208663
63382 9208663 12673748 11589183 1913060 -11821370 -19667344 -17039736 -8834716 -1875503
63374 -1875503 2524573 6476665 10289331 12731052 13576637 12612048 8538569 2068383
63366 2068383 -2205140 -626142 4535263 8445106 10544592 14021825 19185712 21725365
63358 21725365 18448823 11501762 5465881 2486365 1705615 1849941 2408823 2473914 84355
63349 84355 -5711287 -11858202 -12131559 -3307574 9797157 18123761 17840522 13517175 11121352
63340 11121352 11149958 10665513 8815335 6836702 4640232 1291644 -1841228 -1846365 1741791
63331 1741791 6121974 8360616 7562748 4515958 1072691 -707812 -416166 574869 1942195
63322 1942195 5240755 9998318 11791040 7541482 613806 -2916190 -1148227 3803655
63314 3803655 9841698 14142934 11875357 2419522 -5582992 -3540690 3958590 4537021
63306 4537021 -3509542 -8869431 -5459676 -1082554 -2365035 -2856873 4413409 12076910
63298 12076910 8471202 -3219495 -8748614 -3123667 4954427 8025354 7342990 4563610
63290 4563610 -2331303 -11413904 -14945175 -9671161 -1421118 4204887 8286555 12218011
63282 12218011 12964600 9545102 6913675 7887513 7904338 3533952 -572317 121285 1509327
63273 1509327 -1471185 -4479188 -613371 6537395 7067448 18425 -5592672 -4613382
63265 -4613382 -1178001 348730 842139 1075534 -869025 -4275328 -5035736 -2858606 -2632392
63256 -2632392 -6051435 -8495529 -7054556 -4859951 -3979515 -987139 5641054 10070793
63248 10070793 6961386 -136059 -4299853 -5283361 -7935314 -13442482 -18116738 -19289060
63240 -19289060 -17462696 -13830401 -9521907 -5781323 -1915319 4235972 10796041 11081374
63232 11081374 3060408 -4646286 -2597515 6677357 12594786 10927899 6784217 4534272
63224 4534272 3131698 2112252 4149961 8879710 10545384 5404845 -2856447 -8105150
63216 -8105150 -8785829 -7550887 -6714303 -6352226 -5263057 -2576939 786943 2970830 4622011
63207 4622011 8792604 14625516 15007449 5805052 -5979348 -10389219 -8330366 -8699638
63199 -8699638 -13204062 -14165601 -8109120 -1010793 2547634 5179862 7907547 6053012
63191 6053012 -505792 -2924559 3531812 10767355 10130452 5189098 3492314 3647955
63183 3647955 1076771 -474822 4593318 10990891 9389430 2628364 1425231 5692027
63175 5692027 4757309 -3026060 -5905833 2007781 10950625 11817371 10465069 16609612
63167 16609612 27268198 31561566 26706443 19493386 14543305 9785516 3174356 -3029557
63159 -3029557 -5846491 -5138135 -2629059 -123324 775244 -928856 -4815171 -9004482
63151 -9004482 -10873449 -8677628 -3928176 -1178691 -3202311 -7424259 -9722701 -9877574
63143 -9877574 -9392482 -6315623 1681266 10271288 11814783 6187883 1050977 216263
63135 216263 -596625 -4518011 -8334840 -9801030 -11866793 -15087438 -13795246 -5536042
63127 -5536042 2972055 5515572 4943997 5391321 3695582 -2639757 -6000024 1704242
63119 1704242 14537385 19235363 13735700 7598985 5553869 2902990 -1958923 -2742614
63111 -2742614 3229233 8766721 7220534 1637238 -1373388 -811069 288253 567111
63103 567111 133929 -1526572 -3882513 -4598382 -2693075 537913 4633721 9893621 13758407
63094 13758407 12881010 10020690 12322061 20109679 24059632 17693095 6904713 2034973
63086 2034973 5086921 9951135 11396372 8513743 2447365 -3738195 -4974653 998123
63078 998123 9898016 15681436 17307278 17282850 16004931 12098286 6641099 2233165 -1417175
63069 -1417175 -6653873 -12861734 -16188248 -14618871 -10290139 -6246949 -3064767 902038
63061 902038 7006108 13689016 16177823 10830081 423156 -7993122 -11790633 -15137959
63053 -15137959 -20256120 -21564706 -13778113 -1927247 3473859 -363212 -6390282 -7980245
63045 -7980245 -5163696 -867325 2697695 2986919 -1552136 -7324424 -8011794 -3210190
63037 -3210190 322419 -1479772 -3747616 278101 9913992 18578371 21613323 18705697
63029 18705697 11060387 603029 -9045636 -14558313 -15690448 -13774869 -8745018 -809313
63021 -809313 6028782 6498518 1009605 -3476988 -1494617 4393152 7351112 4888684
63013 4888684 946957 -23158 1958025 4106914 4939215 4741092 3826849 2903041 4101147
63004 4101147 8478458 12538843 10677885 2348426 -5887632 -6959621 157006 11178373
62996 11178373 20455495 22773823 15755053 4186822 -1605448 3537332 12951376 16806485
62988 16806485 14569850 12842580 13388801 11739488 7613385 7449143 13493249 18421378
62980 18421378 15751640 9214744 6143841 6970662 7792463 9061870 14186143 21726106
62972 21726106 26164236 25582198 22408071 17522158 10300584 4178283 4688810 10481317
62964 10481317 13306596 9736945 6488429 10087391 16918753 18946554 15114357 10773150
62956 10773150 8264527 4861745 -270043 -3549191 -3283478 -3485624 -8042048 -14001730
62948 -14001730 -14497031 -7681143 300390 2155431 -2398110 -6904073 -6308656 -2897373
62940 -2897373 -2578560 -6476965 -9297343 -6577834 -187016 5445924 9222399 11750692
62932 11750692 10631881 3308892 -5758505 -7273371 1281624 11457589 14388743 10705591
62924 10705591 5907569 941477 -6052089 -12046389 -11746775 -7627823 -8833451 -17632078
62916 -17632078 -24406417 -20433746 -9678704 -2506204 -2417238 -5299411 -8219897 -11406884
62908 -11406884 -12974546 -9543596 -3017269 26998 -2343905 -4752198 -3725131 -3402271
62900 -3402271 -7707774 -12233276 -10231314 -3359255 715714 163438 843230 5178167
62892 5178167 6603504 -671269 -11632185 -16037741 -11468828 -4953661 -2357704 -2111325
62884 -2111325 -771625 549309 -1352447 -6320296 -11512082 -15272035 -16732473 -13520636
62876 -13520636 -4373310 6595446 12762988 12617586 10669269 10388243 10621294 9977996
62868 9977996 9673928 9637049 6842480 1339006 -539235 5879119 15629187 19713202 16610024
62859 16610024 12527729 11683677 12496735 12952686 13351975 12923092 9570576 4474123 1682428
62850 1682428 1575458 -27783 -4454365 -7397679 -6067422 -3623661 -3140044 -2380442 1258984
62841 1258984 5359524 6893253 7958833 11708139 15702242 14871869 8791407 833314
62833 833314 -7619183 -16576591 -23045619 -23379128 -19206941 -15387751 -12731856 -8547160
62825 -8547160 -3961454 -4099027 -9860641 -15494981 -16355842 -14129973 -12333500 -11201833
62817 -11201833 -9435202 -7196372 -5153977 -3709448 -4464863 -8655640 -12871097 -10975841
62809 -10975841 -2573804 4846752 5155705 1177251 60110 4567585 11952559 17967231
62801 17967231 18780216 12490693 2501619 -3707476 -2835830 318192 634288 129772 2731456
62792 2731456 6027455 5390053 3427461 6825454 14476894 17605337 13271374 9395415
62784 9395415 12714889 18922771 20053395 16213203 13626601 14377079 14743845 12639049
62776 12639049 10738217 11487127 13441825 14097377 13434613 13175283 14401808 17017361 20148166
62767 20148166 22184487 21516107 18083750 13667467 10278628 8731705 8770573 9721088 10564395
62758 10564395 9834365 6131043 -644936 -8153260 -12342972 -10881498 -6223531 -3578734
62750 -3578734 -4826436 -6285193 -4347357 -1377103 -2519461 -7217978 -8328998 -1438663
62742 -1438663 8526460 13158386 10616129 5759883 1561163 -4197715 -12239299 -16912228
62734 -16912228 -12341663 -1049701 8372961 11742442 12824269 15586680 17701568 14856632
62726 14856632 8188867 3018213 1472311 727661 -1300548 -2640842 -1080956 2096791
62718 2096791 4667038 7378880 12083765 16805604 16079472 7445205 -4107648 -9976373
62710 -9976373 -6469113 1204099 4288361 36172 -5187382 -3567043 4432852 10597231
$$ [...]
##END NTUPLES=NMR SPECTRUM
##END=
