##TITLE=31Pdec_LR-718-RK1
 CDCl3+DMSO-d6, 124 sc
 10.7.2020
##JCAMPDX= 6.0         $$ Bruker NMR JCAMP-DX V2.0
##DATA TYPE= NMR SPECTRUM
##DATA CLASS= NTUPLES
##ORIGIN= UXNMR, Bruker Analytische Messtechnik GmbH
##OWNER= root
$$ XWIN-NMR		Version 3.5
$$ Fri Jul 10 10:56:42 2020 Russian Standard Time (UT+4h)  she@DPX200
##.OBSERVE FREQUENCY= 81.013821
##.OBSERVE NUCLEUS= ^31P
##.ACQUISITION MODE= SIMULTANEOUS
##.ACQUISITION SCHEME= undefined
##.AVERAGES= 124
##.DIGITISER RES= 17
##SPECTROMETER/DATA SYSTEM= spect
##.PULSE SEQUENCE= zgpg30
##.SOLVENT NAME= CDCl3
##.SHIFT REFERENCE= (INTERNAL, CDCl3, 0, 182.463)
##AUDIT TRAIL= $$ (NUMBER, WHEN, WHO, WHERE, WHAT)
$$ ##TITLE= Audit trail, XWIN-NMR		Version 3.5
$$ ##JCAMPDX= 5.01
$$ ##ORIGIN= Bruker BioSpin GmbH
$$ ##OWNER= she
$$ F:/spectra/data/she/nmr/P31/1/pdata/1/auditp.txt
$$ ##AUDIT TRAIL=  $$ (NUMBER, WHEN, WHO, WHERE, WHAT)
(   1,<2020-07-10 10:56:11.10 +0400>,<she>,<DPX200>,
      <continue with go, POWCHK disabled, PULCHK disabled
       configuration hash MD5:
       00 E9 B6 7A A2 85 ED C7 34 08 36 98 17 FE 4E 26
       data hash MD5: 32K
       7A 70 40 0B 6E C3 2A D0 03 30 3F AD 85 75 96 71>)
(   2,<2020-07-10 10:56:14.03 +0400>,<she>,<DPX200>,
      <Start of raw data processing
       efp BC_mod = 2 LB = 1 FT_mod = 6 PKNL = 1 PHC0 = -2620.092 PHC1 = 746.8016 SI = 64K 
       data hash MD5: 64K
       75 04 A8 43 5A 1B 51 CD D5 9F FE CB 36 AF DB 81>)
(   3,<2020-07-10 10:56:17.53 +0400>,<she>,<DPX200>,
      <abs ABSG = 5 
       data hash MD5: 64K
       3A CA 0B 68 11 42 E1 A9 DA 23 38 E9 1D 68 73 1B>)
$$ ##END=
$$ 
$$ hash MD5
$$ 45 E2 18 62 2D 42 DB 6E 36 08 82 F6 01 72 C0 CC
##$RELAX= 
##$RELAX= 
##$RELAX= 
##$RELAX= 
##$RELAX= 
##$RELAX= 
##$RELAX= 
##$RELAX= 
$$ Bruker specific parameters
$$ --------------------------
##$DU= <F:/spectra>
##$EXPNO= 1
##$NAME= <P31>
##$PROCNO= 1
##$TYPE= <nmr>
##$USER= <she>
##$AMP= (0..31)
100 100 100 100 100 100 100 100 100 100 100 100 100 100 100 100 100 100 
100 100 100 100 100 100 100 100 100 100 100 100 100 100 
##$AQSEQ= 0
##$AQ_mod= 1
##$AUNM= <au_zg>
##$AUTOPOS= <>
##$BF1= 81.014009
##$BF2= 200.13
##$BF3= 200.13
##$BF4= 200.13
##$BF5= 200.13
##$BF6= 200.13
##$BF7= 200.13
##$BF8= 200.13
##$BYTORDA= 1
##$CFDGTYP= 0
##$CFRGTYP= 5
##$CHEMSTR= <none>
##$CNST= (0..31)
1 1 145 1 1 1 1 1 1 1 1 1 1 1 1 1 1 1 1 1 1 1 1 1 1 1 1 1 1 1 1 1 
##$CPDPRG= <waltz16>
##$CPDPRG1= <>
##$CPDPRG2= <waltz16>
##$CPDPRG3= <>
##$CPDPRG4= <mlev>
##$CPDPRG5= <mlev>
##$CPDPRG6= <mlev>
##$CPDPRG7= <mlev>
##$CPDPRG8= <mlev>
##$CPDPRGB= <>
##$CPDPRGT= <>
##$D= (0..31)
0 1 0 0 0 0 0 0 0 0 0 0.03 2e-05 3e-06 0 0 0 0 0 0 0 0 0 0 0 0 0 0 0 0 
0 0 
##$DATE= 1594363991
##$DBL= (0..7)
120 120 120 11 120 120 24 19 
##$DBP= (0..7)
150 150 150 150 150 150 150 150 
##$DBP07= 0
##$DBPNAM0= <>
##$DBPNAM1= <>
##$DBPNAM2= <>
##$DBPNAM3= <>
##$DBPNAM4= <>
##$DBPNAM5= <>
##$DBPNAM6= <>
##$DBPNAM7= <>
##$DBPOAL= (0..7)
0.5 0.5 0.5 0.5 0.5 0.5 0.5 0.5 
##$DBPOFFS= (0..7)
0 0 0 0 0 0 0 0 
$$ [...]
##$SUBNAM3= <"">
##$SUBNAM4= <"">
##$SUBNAM5= <"">
##$SUBNAM6= <"">
##$SUBNAM7= <"">
##$SUBNAM8= <"">
##$SUBNAM9= <"">
##$SW= 369.568048894756
##$SWIBOX= (0..15)
0 1 3 0 0 0 0 0 0 0 0 0 0 0 0 0 
##$SW_h= 29940.119760479
##$TD= 32768
##$TD0= 1
##$TE= 0
##$TE2= 300
##$TE3= 300
##$TEG= 300
##$TL= (0..7)
0 120 53 12 22 120 120 120 
##$TP= (0..7)
150 150 150 150 150 150 150 150 
##$TP07= 0
##$TPNAME0= <>
##$TPNAME1= <>
##$TPNAME2= <>
##$TPNAME3= <>
##$TPNAME4= <>
##$TPNAME5= <>
##$TPNAME6= <>
##$TPNAME7= <>
##$TPOAL= (0..7)
0.5 0.5 0.5 0.5 0.5 0.5 0.5 0.5 
##$TPOFFS= (0..7)
0 0 0 0 0 0 0 0 
##$TUNHIN= 0
##$TUNHOUT= 0
##$TUNXOUT= 0
##$USERA1= <user>
##$USERA2= <user>
##$USERA3= <user>
##$USERA4= <user>
##$USERA5= <user>
##$V9= 5
##$VALIST= <valist>
##$VCLIST= <CCCCCCCCCCCCCCC>
##$VD= 0
##$VDLIST= <DDDDDDDDDDDDDDD>
##$VPLIST= <PPPPPPPPPPPPPPP>
##$VTLIST= <TTTTTTTTTTTTTTT>
##$WBST= 1024
##$WBSW= 4
##$XGAIN= (0..3)
0 0 0 0 
##$XL= 0
##$YL= 0
##$YMAX_a= 8660
##$YMIN_a= -24662
##$ZGOPTNS= <>
##$ZL1= 120
##$ZL2= 120
##$ZL3= 120
##$ZL4= 120
##$ABSF1= 182.463
##$ABSF2= -187.1042
##$ABSG= 5
##$ABSL= 3
##$ALPHA= 0
##$AQORDER= 0
##$ASSFAC= 0
##$ASSFACI= 0
##$ASSFACX= 0
##$ASSWID= 0
##$AUNMP= <proc_1d>
##$AZFE= 0.1
##$AZFW= 0.5
##$BCFW= 0
##$BC_mod= 2
##$BYTORDP= 0
##$COROFFS= 0
##$CY= -3
##$DATMOD= 1
##$DC= 0
##$DFILT= <>
##$DTYPP= 0
##$F1P= 0
##$F2P= 0
##$FCOR= 1
##$FTSIZE= 65536
##$FT_mod= 6
##$GAMMA= 0
##$GB= 0
##$INTBC= 1
##$INTSCL= 5.30512e-09
##$ISEN= 30
##$LB= 1
##$LEV0= 0
##$LPBIN= 0
##$MAXI= 10000
##$MC2= 0
##$MEAN= 0
##$ME_mod= 0
##$MI= 50
##$NCOEF= 0
##$NC_proc= -9
##$NLEV= 6
##$NOISF1= 182.463
##$NOISF2= 159.3651
##$NSP= 0
##$NTH_PI= 0
##$NZP= 0
##$OFFSET= 182.463
##$PC= 4
##$PHC0= -2620.092
##$PHC1= 746.8016
##$PH_mod= 1
##$PKNL= yes
##$PPARMOD= 0
##$PSCAL= 0
##$PSIGN= 0
##$REVERSE= no
##$SF= 81.0140089999434
##$SI= 65536
##$SIGF1= 159.3651
##$SIGF2= -187.1042
##$SINO= 113.3802
##$SIOLD= 16384
##$SREGLST= <1H.CDCl3>
##$SSB= 0
##$STSI= 65536
##$STSR= 0
##$SW_p= 29940.119760479
##$SYMM= 0
##$S_DEV= 0
##$TDeff= 32768
##$TDoff= 0
##$TI= <>
##$TILT= no
##$TM1= 0
##$TM2= 0
##$TOPLEV= 0
##$USERP1= <user>
##$USERP2= <user>
##$USERP3= <user>
##$USERP4= <user>
##$USERP5= <user>
##$WDW= 1
##$XDIM= 65536
##$YMAX_p= 168592113
##$YMIN_p= -429818423
$$ End of Bruker specific parameters
$$ ---------------------------------
##NTUPLES= NMR SPECTRUM
##VAR_NAME=  FREQUENCY,     SPECTRUM/REAL,   SPECTRUM/IMAG
##SYMBOL=    X,             R,               I
##VAR_TYPE=  INDEPENDENT,   DEPENDENT,       DEPENDENT
##VAR_FORM=  AFFN,          ASDF,            ASDF
##VAR_DIM=   65536,         65536,           65536
##UNITS=     HZ,            ARBITRARY UNITS, ARBITRARY UNITS
##FACTOR=    0.456856943014862, 1,           1
##FIRST=     14782.0589164792, 0,            0
##LAST=      -15158.0608439998, 0,           0
##MIN=       -15158.0608439998, -429818423,  0
##MAX=       14782.0589164792, 168592113,    0
$$ Real data points
##PAGE= N=1
##DATA TABLE= (X++(R..R)), XYDATA
$$ [...]
$$ plain form
3999 -60840015 -65376852 -54930643 -31308564 4073365 36359620 47818510 39423462
3992 39423462 24705377 8072238 -13082922 -31539982 -35398777 -26601902 -17121800 -10265774
3984 -10265774 -1622425 5899380 4388261 -4770924 -12986310 -16920279 -17028371 -11129020
3976 -11129020 -2183368 -2168083 -13051607 -16457255 -1192439 13043074 4459892 -11168905
3968 -11168905 -1901884 26200614 33322768 6423052 -21715005 -24392357 -17003212 -23106371
3960 -23106371 -35250864 -35214547 -30301651 -39020578 -53697887 -48968035 -24721767 -11487026
3952 -11487026 -26280444 -46057314 -38755658 -6190983 20817316 23627717 14199547 10979709
3944 10979709 13725082 11995809 4835989 -3999730 -20810920 -50600187 -75676373 -72156577
$$ packed form
3999f0840015m536837J0446209K3622079L5381929L2286255J1458890q395048
3992C9423462j4718085j6633139k1155160j8457060l858795Q796875R480102O856026
3984a0265774Q643349P521805j511119r159185q215386l933969j08092N899351
3976a1129020Q945652J5285j0883524l405648J5264816J4235513q583182j5628797
3968a1168905R267021K8102498P122154k6899716k8138057k677352P389145o103159
3960b3106371j2144493L6317M912896q718927j4677309M729852K4246268J3234741
3952a1487026j4793418j9776870P301656L2564675K7008299K810401r428170l219838
3944A0979709K745373j729273p159820q835719j6811190k9789267k5076186L519796
$$ plain form
3936 -72156577 -50088614 -47020854 -71497716 -85610312 -63392886 -33146961 -30330942
3929 -30330942 -38697334 -22246852 6113296 2318982 -30861998 -43162988 -20679268
3922 -20679268 -10118846 -37330249 -58717190 -32605737 7352795 1460689 -43557543
3915 -43557543 -67776833 -49760277 -28390638 -31280117 -34047769 -9169017 24989139
3908 24989139 31939027 9825360 -11728798 -15963245 -15263375 -24632742 -37764796 -36075441
3900 -36075441 -13498785 14465730 26864074 20237971 11684754 17118625 32125661 41594538
3892 41594538 43631748 50477230 63640284 63466355 35534515 -1216052 -9863457 19618312
3884 19618312 55975134 65213619 51531688 45592307 58642021 68011076 51796064 19614369
$$ packed form
3936g2156577K2067963L067760k4476862j4112596K2217426L0245925K816019
3929c0330942q366392J6450482K8360148l794314l3180980j2300990K2483720
3922b0679268J0560422k7211403k1386941K6111453L9958532n892106m5018232
3915d3557543k4219290J8016556K1369639k889479k767652K4878752L4158156
3908B4989139O949888k2113667k1554158m234447O99870r369367j3132054J689355
3900c6075441K2576656K7964515J2398344o626103q553217N433871J5007036R468877
3892D1594538K037210O845482J3163054j73929k7931840l6750567q647405K9481769
3884A9618312L6356822R238485j3681931n939381J3049714R369055j6215012l2181695
$$ plain form
3876 19614369 -3133231 -9563167 -14779257 -30439091 -49651351 -56969214 -45200958 -23237144
3868 -23237144 -10650580 -18224483 -31051293 -23936887 358980 7750008 -18494445 -48518049
3860 -48518049 -49460408 -35830159 -40484504 -52944466 -35202192 5932214 17886320 -14853562
3852 -14853562 -41566973 -25046232 -1696997 -23159419 -75715176 -103933144 -89637641
3845 -89637641 -60477871 -35254826 -7170690 23905357 43793023 48962182 45490629
3838 45490629 25273129 -22107871 -74339307 -90153371 -64444340 -36970723 -37853140
3831 -37853140 -54765352 -63777917 -62128936 -55758676 -41374970 -19532248 -5182819 -7509691
3823 -7509691 -15384021 -17921207 -23169922 -39537585 -53060393 -43774081 -18044487 -5820558
$$ packed form
3876A9614369k2747600o429936n216090j5659834j9212260p317863J1768256K1963814
3868b3237144J2586564p573903j2826810P114406K4295867P391028k6244453l0023604
3860d8518049r42359J3630249m654345j2459962J7742274M1134406J1954106l2739882
3852a4853562k6713411J6520741K3349235k1462422n2555757k8217968J4295503
3845h9637641K9159770K5223045K8084136L1076047J9887666N169159l471553
3838D5490629k0217500m7381000n2231436j5814064K5709031K7473617q82417
3831c7853140j6912212r012565J648981O370260J4383706K1842722J4349429k326872
3823g509691p874330k537186n248715j6367663j3522808R286312K5729594J2223929
$$ plain form
3815 -5820558 -24875897 -59567462 -78588962 -68854647 -47876397 -40451886 -45612536 -37950657
3807 -37950657 -7527477 17172363 3686685 -38209907 -68729090 -70957432 -63787623
3800 -63787623 -61554358 -51488406 -22111068 11224500 24720496 13336886 -11637482
3793 -11637482 -36312467 -46614593 -34860334 -14349778 -10663384 -28877825 -46754088
3786 -46754088 -48610541 -44326291 -43210840 -33271381 -5265672 22263789 23107084 -4750219
3778 -4750219 -43010718 -73193939 -78937482 -49529604 -1034305 26554018 16171277
3771 16171277 -1961434 2807575 13599182 -1669725 -30176810 -29354488 7013932 41751429
3763 41751429 52462293 54262000 59505745 57247951 45895770 47351822 68234247 79208305
$$ packed form
3815e820558j9055339l4691565j9021500R734315K0978250P424511n160650P661879
3807c7950657L0423180K4699840j3485678m1896592l0519183k228342P169809
3800f3787623K233265J0065952K9377338L3335568J3495996j1383610k4974368
3793a1637482k4674985j0302126J1754259K0510556L686394j8214441j7876263
3786d6754088j856453M284250J115451R939459K8005709K7529461Q43295k7857303
3778d750219l8260499l0183221n743543K9407878M8495299K7588323j0382741
3771A6171277j8132711M769009J0791607j5268907k8507085Q22322L6368420L4737497
3763D1751429J0710864J799707N243745k257794j1352181J456052K0882425J0974058
$$ plain form
3755 79208305 56988570 21724740 8142265 19946271 37102179 50204335 60649915
3748 60649915 60144752 39714582 14004473 9023132 23857337 27613725 1135443 -35517729
3740 -35517729 -46663802 -21787073 15395351 32480332 16371808 -20104364 -51662077
3733 -51662077 -58991840 -39457648 -7251929 14932918 11641153 -10200913 -25513320
3726 -25513320 -19223999 -7435172 -19322342 -58928686 -98748619 -114087490 -109293564
3719 -109293564 -102624038 -97950440 -83110988 -49460687 -3145849 39275297 60673752
3712 60673752 54923686 34946591 23046973 26941664 31600577 20710457 -1446450 -16932285
3704 -16932285 -15555112 -1015023 17393303 30018004 29757108 19064532 9200466 5117714
$$ packed form
3755G9208305k2219735l5263830j3582475J1804006J7155908J3102156J0445580
3748F0649915n05163k0430170k5710109m981341J4834205L756388k6478282l6653172
3740c5517729j1146073K4876729L7182424J7084981j6108524l6476172l1557713
3733e1662077p329763J9534192L2205719K2184847l291765k1842066j5312407
3726b5513320O289321J1788827j1887170l9606344l9819933j5338871M793926
3719a09293564O669526M673598J4839452L3650301M6314838M2421146K1398455
3712F0673752n750066j9977095j1899618L894691M658913j0890120k2156907j5485835
3704a6932285J377173J4540089J8408326J2624701k60896j0692576r864066m082752
$$ plain form
3696 5117714 -1374107 -14972210 -24488869 -21071857 -18207687 -33160055 -54262495 -51078677
3688 -51078677 -18241538 15844105 31200931 41881845 63937883 79815054 59749232
3681 59749232 8172615 -36491757 -46490816 -28385101 -2569239 18705197 28471352
3674 28471352 22754735 12672890 20057732 45273431 55445096 26007031 -17119013
3667 -17119013 -23376266 16791168 59365645 64925725 42611162 22986266 11891335
3660 11891335 -5417679 -29765399 -45009864 -44526610 -37120483 -27621314 -13340513 -524804
3652 -524804 -1156949 -7698835 6226272 47891800 86359946 86787754 51822960 14544593
3644 14544593 44212 8275366 26345409 41128409 43432994 34719935 29112014 37382956
$$ packed form
3696E117714o491821j3598103r516659L417012K864170j4952368k1102440L183818
3688e1078677L2837139L4085643J5356826J0680914K2056038J5877171k0065822
3681E9749232n1576617m4664372r999059J8105715K5815862K1274436R766155
3674B8471352n716617j0081845P384842K5215699J0171665k9438065m3126044
3667a7119013o257253M0167434M2574477N560080k2314563j9624896j1094931
3660A1891335j7309014k4347720j5244465M83254P406127R499169J4280801J2815709
3652e24804o32145o541886J3925107M1665528L8468146M27808l4964794l7278367
3644A4544593j4500381Q231154J8070043J4783000K304585q713059n607921Q270942
$$ plain form
3636 37382956 50903075 52989163 43503990 37646364 39572208 32836731 3499774 -39073717
3628 -39073717 -72891863 -86430181 -82617696 -67322650 -45447703 -24959641 -11654537
3621 -11654537 1553238 27079082 58360494 66850446 38158327 2159219 3735337
3614 3735337 41578837 62166390 29209676 -23582973 -34354364 7099682 53224110
3607 53224110 66497286 56947623 47178118 38231106 28572783 33688450 57507089 67701226
3599 67701226 33827304 -22592283 -49929347 -32924749 -5258904 3054262 -2305738
3592 -2305738 -6414276 -11064352 -18433348 -14188458 10840752 36949794 36165065 11015048
3584 11015048 -6645806 3322449 24569331 27625240 9444182 -2582539 11627000
$$ packed form
3636C7382956J3520119K086088r485173n857626J925844o735477k9336957m2573491
3628c9073717l3818146j3538318L812485J5295046K1874947K0488062J3305104
3621a1654537J3207775K5525844L1281412Q489952k8692119l5999108J576118
3614C735337L7843500K0587553l2956714n2792649j0771391M1454046M6124428
3607E3224110J3273176r549663r769505q947012r658323N115667K3818639J0194137
3599F7701226l3873922n6419587k7337064J7004598K7665845Q313166n360000
3592b305738m108538m650076p368996M244890K5029210K6109042p84729k5150017
3584A1015048j7660854R968255K1246882L055909j8181058j2026721J4209539
$$ plain form
3577 11627000 34775732 33827922 7472882 -9617920 3151074 21804081 16296163 -1190420
3569 -1190420 3384564 28711686 37231569 11380722 -24074620 -43119533 -48858654 -50308852
3561 -50308852 -41507257 -24371921 -23997280 -53358618 -82753081 -74311969 -34602759 -3902506
3553 -3902506 -426760 -4146958 4639368 17227383 13736986 -9441412 -36780544 -48149872
3545 -48149872 -33830990 -3349739 20995483 25831794 17425244 4970488 -14380523
3538 -14380523 -39770243 -49015800 -20424190 32365673 71468456 80935987 78200091 76325275
3530 76325275 61610515 21870207 -24334877 -46357334 -38345989 -19883255 -5772170
3523 -5772170 7988833 28110208 48140425 55594735 49234406 41870860 44577009 52712933
$$ packed form
3577A1627000K3148732r47810k6355040j7090802J2768994J8653007n507918j7486583
3569a190420M574984K5327122Q519883k5850847l5455342j9044913n739121j450198
3561e0308852Q801595J7135336L74641k9361338k9394463Q441112L9709210L0700253
3553c902506L475746l720198Q786326J2588015l490397k3178398k7339132j1369328
3545d8149872J4318882L0481251K4345222M836311q406550j2454756j9351011
3538a4380523k5389720r245557K8591610N2789863L9102783R467531k735896j874816
3530G6325275j4714760l9740308m6205084k2022457Q011345J8462734J4111085
3523e772170J3761003K0121375K0030217P454310o360329p363546K706149Q135924
$$ plain form
3515 52712933 53540199 46448594 45756642 58812210 71594619 66192290 44958693 24565861
3507 24565861 11493802 -1640131 -17973379 -30757410 -36586391 -39059334 -36752842 -22373513
3499 -22373513 1431758 18537446 17155166 602170 -22698076 -47359501 -65777342
3492 -65777342 -69384087 -61452966 -55155277 -52536443 -40311487 -14631772 6899022 11005266
3484 11005266 10871325 24173598 40052359 30182755 -9803500 -49746657 -59197082 -38384762
3476 -38384762 -11066035 2495781 158375 -6808740 -6700148 2515252 13219575 17180951
3468 17180951 12203683 -298848 -18539913 -37371084 -47125348 -41269647 -23396909 -3497902
3460 -3497902 10741130 18826163 28789694 52886246 92553229 126186982 124254035 82697821
$$ packed form
3515E2712933Q27266p091605o91952J3055568J2782409n402329k1233597k0392832
3507B4565861j3072059j3133933j6333248j2784031n828981k472943K306492J4379329
3499b2373513K3805271J7105688j382280j6552996k3300246k4661425j8417841
3492f5777342l606745P931121O297689K618834J2224956K5679715K1530794M106244
3484A1005266j33941J3302273J5878761r869604l9986255l9943157r450425K0812320
3476c8384762K7318727J3561816k337406o967115J08592R215400J0704323L961376
3468A7180951m977268j2502531j8241065j8831171r754264N855701J7872738J9899007
3460c497902J4239032Q085033R963531K4096552L9666983L3633753j932947m1556214
$$ plain form
3452 82697821 30604045 -2081768 -13214908 -17651675 -22336768 -25312679 -27553238 -29618612
3444 -29618612 -25117289 -13598578 -11546849 -31755970 -58061803 -61940149 -41785588 -23671266
3436 -23671266 -22389450 -25130254 -19844264 -17008884 -30110722 -50942385 -59669811 -50054674
3428 -50054674 -32114477 -16444596 -6369235 -325628 6915760 21102968 39533607
3421 39533607 50329770 47812881 43199523 51031192 68033077 74962878 60171843 34085017
3413 34085017 17086441 16855872 21980114 17933223 4867762 -5290548 -7280097 -8808225
3405 -8808225 -15302536 -18941054 -12136704 -3805821 -9031150 -26107047 -36530240 -26201079
3397 -26201079 4053879 44707436 80561824 92556341 75120813 50139773 43412227
$$ packed form
3452H2697821n2093776l2685813j1133140m436767m685093k975911k240559k065374
3444b9618612M501323J1518711K051729k0209121k6305833l878346K0154561J8114322
3436b3671266J281816k740804N285990K835380j3101838k0831663q727426R615137
3428e0054674J7940197J5669881J0075361O043607P241388J4187208J8430639
3421C9533607J0796163k516889m613358P831669J7001885O929801j4791035k6086826
3413C4085017j6998576k30569N124242m046891j3065461j0158310j989549j528128
3405h808225o494311l638518O804350Q330883n225329j7075897j0423193J0329161
3397b6201079L0254958M0653557L5854388J1994517j7435528k4981040o727546
$$ plain form
3390 43412227 47370845 31355406 -7635179 -33724555 -24264543 -4668950 -9677664 -32980161
3382 -32980161 -42373392 -28332325 -8063957 7330263 18296645 15750003 -11467180
3375 -11467180 -45876318 -50623701 -19763760 7751305 -917351 -29032988 -35329287 -6881269
3367 -6881269 31604985 51909457 48425138 34089640 23750515 21319397 16290461 -4600407
3359 -4600407 -37708220 -60290104 -54405593 -27743441 -4125875 1739582 -6162379 -15147543
3351 -15147543 -15872674 -8277035 -1733128 -5475695 -14717680 -13534612 2420807 15978790
3343 15978790 12024340 1558620 5759006 21474932 23866116 6094502 -5370235 12470344
3335 12470344 42662021 47019664 15458406 -21511507 -31837982 -19163703 -13004909
$$ packed form
3390D3412227L958618j6015439l8990585k6089376R460012J9595593n008714k3302497
3382c2980161r393231J4041067K0268368J5394220J0966382k546642k7217183
3375a1467180l4409138m747383L0859941K7515065q668656k8115637o296299K8448018
3367f881269L8486254K0304472l484319j4335498j0339125k431118n028936k0890868
3359d600407l3107813k2581884N884511K6662152K3617566N865457p901961q985164
3351a5147543p25131P595639O543907l742567r241985J183068J5955419J3557983
3343A5978790l954450j0465720M200386J5715926K391184j7771614j1464737J7840579
3335A2470344L0191677M357643l1561258l6969913j0326475J2674279O158794
$$ plain form
3328 -13004909 -29710481 -53856480 -58626143 -37008350 -7913119 5504353 -3253363
3321 -3253363 -25796793 -52956623 -78390219 -92023082 -83361216 -56496720 -32171126
3314 -32171126 -26428678 -32681716 -32520235 -18688345 1497818 19238352 28184290 20525125
3306 20525125 -3185325 -20827601 -6973821 28139860 39636232 4277918 -42119076
3299 -42119076 -47424228 -12730407 10042649 -10233896 -45311166 -53144594 -37471986
3292 -37471986 -38760742 -76077266 -120537114 -128125244 -85433269 -19949417 26552459
3285 26552459 32633186 11652676 -5186338 -1656220 9126179 5160304 -14608733 -28373850
3277 -28373850 -18643638 6021434 19992209 8423452 -17442113 -33797319 -31296601
$$ packed form
3328a3004909j6705572k4145999m769663K1617793K9095231J3417472q757716
3321c253363k2543430k7159830k5433596j3632863Q661866K6864496K4325594
3314c2171126N742448o253038J61481J3831890K0186163J7740534Q945938p659165
3306B0525125k3710450j7642276J3853780L5113681J1496372l5358314m6396994
3299d2119076n305152L4693821K2773056k0276545l5077270p833428J5672608
3292c7471986j288756l7316524m4459848p588130M2691975O5483852M6501876
3285B6552459O080727k0980510j6839014L530118J0782399l965875j9769037j3765117
3277b8373850R730212K4665072J3970775j1568757k5865565j6355206K500718
$$ plain form
3270 -31296601 -23907000 -27899960 -38044311 -34839824 -14431741 1780399 -6672098 -33658513
3262 -33658513 -55570231 -58908719 -49502964 -39766922 -37211723 -42967860 -52060608 -55623226
3254 -55623226 -50018954 -42878450 -44472354 -55876978 -71402635 -87101592 -97427693 -89321532
3246 -89321532 -55037079 -11592653 7787555 -11200565 -46469205 -63583323 -50531930
3239 -50531930 -23159782 -2835689 3472343 3734314 8397229 18623766 25320075 19810016
3231 19810016 3859480 -13965952 -29196947 -41372676 -43635233 -23629930 18438985
3224 18438985 60202984 75700229 61812637 38127863 21431022 10254289 -2161257
3217 -2161257 -10774723 -6521784 2897312 -4444674 -35672681 -68605474 -76918906 -61473446
$$ packed form
3270c1296601P389601l992960j0144351L204487K0408083J6212140q452497k6986415
3262c3658513k1911718l338488R405755R736042K555199n756137r092748l562618
3254e5623226N604272P140504j593904j1404624j5525657j5698957j0326101Q106161
3246h9321532L4284453M3444426J9380208j8988120l5268640j7114118J3051393
3239e0531930K7372148K0324093O308032K61971M662915J0226537O696309n510059
3231A9810016j5950536j7825432j5230995j2175729k262557K0005303M2068915
3224A8438985M1763999J5497245j3887592k3684774j6696841j1176733j2415546
3217b161257q613466M252939R419096p341986l1228007l2932793q313432J5445460
$$ plain form
3209 -61473446 -42852986 -28622162 -7082737 24986622 48417227 45129050 21240828
3202 21240828 -3953489 -20248336 -26809409 -22009421 -7225639 6908819 11237076 9506597
3194 9506597 9288564 9892925 9168960 10323297 9242581 -9578649 -45190538 -63655187
3186 -63655187 -36827052 11891418 32086655 13581233 -3660496 10477429 39749448
3179 39749448 54219950 48116091 30509209 5738613 -19120623 -30481053 -29873211 -37735408
3171 -37735408 -57364761 -58306106 -19935527 28110083 38631762 8597325 -20616290
3164 -20616290 -19338308 559050 11519126 3005777 -15822569 -30128304 -31625888 -25512564
3156 -25512564 -24761112 -32165242 -35274103 -26138019 -14046893 -7612058 1404631 20195890
$$ packed form
3209f1473446J8620460J4230824K1539425L2069359K3430605l288177k3888222
3202B1240828k5194317j6294847o561073M799988J4783782J4134458M328257j730479
3194I506597k18033O04361p23965J154337j080716j8821230l5611889j8464649
3186f3655187K6828135M8718470K0195237j8505422j7241729J4137925K9272019
3179C9749448J4470502o103859j7606882k4770596k4859236j1360430O07842p862197
3171c7735408j9629353r41345L8370579M8045610J0521679l0034437k9213615
3164b0616290J277982J9897358J0960076q513349j8828346j4305735j497584O113324
3156b5512564P51452p404130l108861R136084J2091126O434835R016689J8791259
$$ plain form
3148 20195890 34622779 27106585 3688533 -17991351 -35954230 -53778849 -54733244 -19886076
3140 -19886076 30183351 47330002 17374888 -20620667 -28540926 -15468690 -12759190
3133 -12759190 -24810531 -26723118 -298127 45496714 85209505 96613257 74358684
3126 74358684 33187637 -4406727 -27611999 -41564819 -52955013 -59189909 -53700240
3119 -53700240 -36010342 -15605095 -8313148 -22994257 -46934557 -55359079 -43928053
3112 -43928053 -35351753 -39067315 -27859795 15420478 48975078 16145874 -68503660
3105 -68503660 -128576799 -126354268 -100361819 -87447647 -66278727 -13535350 35752371
3098 35752371 36327846 6382805 -3047904 9997574 5010064 -24158409 -38625630 -22278439
$$ packed form
3148B0195890J4426889p516194k3418052k1679884j7962879j7824619r54395L4847168
3140a9886076N0069427J7146651k9955114l7995555p920259J3072236K709500
3133a2759190j2051341j912587K6424991M5794841L9712791J1403752k2254573
3126G4358684m1171047l7594364k3205272j3952820j1390194o234896N489669
3119e3700240J7689898K0405247P291947j4681109k3940300q424522J1431026
3112d3928053Q576300l715562J1207520M3280273L3554600l2829204q4649534
3105f8503660o0073139K222531K5992449J2914172K1168920N2743377M9287721
3098C5752371N75475k9945041r430709J3045478m987510k9168473j4467221J6347191
$$ plain form
3090 -22278439 -4945555 -6406524 -6533115 10635519 26597831 25385491 23093874 33429262
3082 33429262 36359512 12205553 -19253264 -27217530 -17187396 -15002401 -18954036 -6040171
3074 -6040171 21229412 33385715 21227968 8310662 8241008 4330032 -12096870 -14990597
3066 -14990597 18174631 63140091 75182506 48167966 17156962 6273972 4987601
3059 4987601 -208876 -1534370 9130346 20173074 20062101 18169852 24994889 28075658
3051 28075658 12807743 -5075449 2113677 28125732 36796489 14356691 -12498741
3044 -12498741 -18550044 -11399261 -8591843 -10247713 -11457210 -18488352 -32698813 -37967523
3036 -37967523 -24589441 -7818411 -2507040 967049 11942881 12212479 -14857600 -45215194
$$ packed form
3090b2278439J7332884j460969j26591J7168634J5962312j212340k291617J0335388
3082C3429262K930250k4153959l1458817p964266J0030134K184995l951635J2913865
3074f040171K7269583J2156303j2157747j2917306o9654l910976j6426902k893727
3066a4990597L3165228M4965460J2042415k7014540l1011004j0882990j286371
3059D987601n196477j325494J0664716J1042728j10973j892249O825037L080769
3051B8075658j5267915j7883192P189126K6012055Q670757k2439798k6855432
3044a2498741o051303P150783K807418j655870j209497p031142j4210461n268710
3036c7967523J3378082J6771030N311371L474089J0975832K69598k7070079l0357594
$$ plain form
3028 -45215194 -41664999 -10139264 11143340 12817312 20668876 39179857 36791535 2568322
3020 2568322 -26188245 -18389506 3713362 1886323 -20974616 -34339069 -31272732 -31159644
3012 -31159644 -40698630 -44049063 -30357740 -6624244 17056612 36058236 46085661
3005 46085661 46158726 44740727 47394015 41619092 11301844 -33972358 -59680750 -39391728
2997 -39391728 21437067 91716069 135600182 133975317 99250278 65550326 52889800
2990 52889800 46913660 25480935 -6077419 -25159159 -27199302 -24928566 -16758410 13606779
2982 13606779 60665479 89051412 75920711 40347550 15565408 9113310 6107439
2975 6107439 -3142234 -17570525 -37354209 -61608545 -76958890 -65020806 -24297998
$$ packed form
3028d5215194L550195L1525735K1282604J673972P851564J8510981k388322l4223213
3020B568322k8756567P798739K2102868j827039k2860939j3364453L066337J13088
3012c1159644r538986l350433J3691323K3733496K3680856J9001624J0027425
3005D6085661P3065j417999K653288n774923l0317248m5274202k5708392K0289022
2997c9391728O0828795P0279002M3884113j624865l4725039l3699952j2660526
2990E2889800n976140k1432725l1558354j9081740k040143K270736Q170156L0365189
2982A3606779M7058700K8385933j3130701l5573161k4782142o452098l005871
2975F107439r249673j4428291j9783684k4254336j5350345J1938084M0722808
$$ plain form
2968 -24297998 23925882 53335451 53085766 33803362 17047059 14892425 17321130 5583871
2960 5583871 -20928612 -42355285 -47700412 -52143177 -72368834 -95488643 -91361754 -54693623
2952 -54693623 -18435811 -19085286 -56597694 -94079112 -94375069 -54584814 -5373149 22195234
2944 22195234 25093528 20043323 14155953 -1155157 -26583297 -44388819 -41610248 -28705079
2936 -28705079 -21794401 -19654249 -14613750 -14289724 -31269547 -57599695 -71325634 -66636374
2928 -66636374 -58127763 -56514724 -59732906 -66856203 -78426891 -81443179 -58857271 -20931134
2920 -20931134 -3042194 -20537543 -46955797 -51226907 -36900238 -27062696 -27610129 -27444109
2912 -27444109 -24465281 -28982248 -44665825 -63294342 -76960872 -82994723 -79728173 -68474548
$$ packed form
2968b4297998M8223880K9409569k49685j9282404j6756303k154634K428705j1737259
2960E583871k6512483k1426673n345127m442765k0225657k3119809M126889L6668131
2952e4693623L6257812o49475l7512408l7481418k95957L9790255M9211665K7568383
2944B2195234K898294n050205n887370j5311110k5428140j7805522K778571J2905169
2936b8705079O910678K140152N040499L24026j6979823k6330148j3725939M689260
2928f6636374Q508611J613039l218182p123297j1570688l016288K2585908L7926137
2920b0931134J7888940j7495349k6418254m271110J4326669R837542n47433J66020
2912b7444109K978828m516967j5683577j8628517j3666530o033851L266550J1253625
$$ plain form
2904 -68474548 -56682738 -50795919 -51018536 -58613574 -76902524 -96337885 -94172962 -64279117
2896 -64279117 -33136260 -27508962 -39414648 -44547170 -41195570 -42378261 -40328532 -15050731
2888 -15050731 23052016 36732284 16366427 -3161313 5789119 25257859 24078016
2881 24078016 3104177 -14326935 -17325358 -9656339 7304489 29735620 40731764
2874 40731764 29243921 14371454 27903733 71997797 111620109 112465791 75941049
2867 75941049 35087515 22056810 37984331 51495393 32609808 -9761107 -35354711
2860 -35354711 -21940241 8658972 23468060 19368849 14515788 14543237 10874314 4427666
2852 4427666 6147718 14724744 15421578 4605013 -2081428 7803996 25352671 31889701
$$ packed form
2904f8474548J1791810N886819k22617p595038j8288950j9435361K164923K9893845
2896f4279117L1142857N627298j1905686n132522L351600j182691K049729K5277801
2888a5050731L8102747J3680268k0365857j9527740Q950432J9468740j179843
2881B4078016k0973839j7431112k998423P669019J6960828K2431131J0996144
2874D0731764j1487843j4872467J3532279M4094064L9622312Q45682l6524742
2867G5941049m0853534j3030705J5927521J3511062j8885585m2370915k5593604
2860c5354711J3414470L0599213J4809088m099211m853061K7449l668923o446648
2852D427666J720052Q577026O96834j0816565o686441R885424J7548675O537030
$$ plain form
2844 31889701 22659201 13612151 23632879 48422163 56734644 24958608 -25426825 -45015667
2836 -45015667 -17795253 17820132 22919236 7832949 5421670 18565671 26342939 25248536
2828 25248536 27008788 25465401 5352266 -19301611 -16318230 11194974 21426415 -6499235
2820 -6499235 -44428270 -58509088 -47555358 -24502707 7308657 40416007 54658160
2813 54658160 43690077 27329415 20005302 10958372 -6809419 -15319117 -2659049 9690363
2805 9690363 -1641654 -22246441 -19789104 10767694 46963359 70613634 76476187 63595871
2797 63595871 42697855 38827983 61490917 84737325 81584437 63469995 57494738 60173974
2789 60173974 48842316 28114503 24883215 39208491 40159299 16721633 -3158631 3781443
$$ packed form
2844C1889701r230500r047050J0020728K4789284Q312481l1776036n0385433j9588842
2836d5015667K7220414L5615385N099104j5086287k411279J3144001P777268j094403
2828B5248536J760252j543387k0113135k4653877K983381K7513204J0231441k7925650
2820f499235l7929035j4080818J0953730K3052651L1811364L3107350J4242153
2813E4658160j0968083j6360662p324113r046930j7767791q509698J2660068J2349412
2805I690363j1332017k0604787K457337L0556798L6195665K3650275N862553j2880316
2797F3595871k0898016l869872K2662934K3246408l152888j8114442n975257K679236
2789F0173974j1331658k0727813l231288J4325276R50808k3437666j9880264O940074
$$ plain form
2781 3781443 23783163 32414578 29205915 29773577 40248209 53124179 57420567 45927937
2773 45927937 23122578 7271797 10756003 20044792 13624169 -3548153 -8839406 -4286518
2765 -4286518 -17293079 -50984992 -69217192 -50605345 -26317684 -35320781 -65086352
2758 -65086352 -71724831 -46829282 -26827490 -34947787 -48214636 -36128240 -7844250
2751 -7844250 1578843 -17942810 -37465271 -29186862 -2438032 13593951 11857560 11439334
2743 11439334 21194991 24262188 8873109 -8762785 -11075357 -8469598 -16918214 -23847884
2735 -23847884 -9290720 11672023 8442810 -7625943 7330558 54607299 76049873
2728 76049873 34667342 -30955470 -64944747 -70071804 -83446740 -102405565 -85186909
$$ packed form
2781C781443K0001720Q631415l208663N67662J0474632J2875970M296388j1492630
2773D5927937k2805359j5850781L484206R288789o420623j7172322n291253M552888
2765d286518j3006561l3691913j8232200J8611847K4287661r003097k9765571
2758f5086352o638479K4895549K0001792q120297j3266849J2086396K8283990
2751g844250R423093j9521653j9522461Q278409K6748830J6031983j736391m18226
2743A1439334R755657L067197j5389079j7635894k312572K605759q448616o929670
2735b3847884J4557164K0962743l229213j6068753J4956501M7276741K1442574
2728G6049873m1382531o5622812l3989277n127057j3374936j8958825J7218656
$$ plain form
2721 -85186909 -19805020 51161651 81676858 69589659 46999784 44592690 69093309
2714 69093309 99378994 104032738 75140749 38838140 19250654 5512633 -24019548
2707 -24019548 -59218963 -70481360 -55465869 -40082820 -36012330 -32144221 -27973491 -36118061
2699 -36118061 -45630200 -26115972 15537868 26316690 -16885751 -61377913 -48227435
2692 -48227435 2449832 24501554 6253694 1657372 39400329 75550204 59072846
2685 59072846 4477225 -32517182 -27578326 -3937870 10755259 12651663 9824286 8763927
2677 8763927 16721245 37348166 57536112 54381005 23027326 -14514157 -35427123 -39649436
2669 -39649436 -39719958 -39141303 -32974114 -21763834 -11345035 -3066377 3674497 2980021
$$ packed form
2721h5186909O5381889P0966671L0515207j2087199k2589875k407094K4500619
2714F9093309L0285685M653744k8891989l6302609j9587486j3738021k9532181
2707b4019548l5199415j1262397J5015491J5383049M070490L868109M170730q144570
2699c6118061r512139J9514228M1653840J0778822m3202441m4492162J3150478
2692d8227435N0677267K2051722j8247860m596322L7742957L6149875j6477358
2685E9072846n4595621l6994407M938856K3640456J4693129J896404k827377j060359
2677H763927P957318K0626921K0187946l155107l1353679l7541483k0912966m222313
2669c9649436p0522N78655O167189J1210280J0418799Q278658O740874o94476
$$ plain form
2661 2980021 -10394566 -27873107 -35015749 -31745754 -29688082 -29077297 -16343494 10322164
2653 10322164 31668598 34389017 31716537 42739171 62977089 71696694 61237953 44175963
2645 44175963 36410206 45837891 71153789 97509073 100308088 71255341 36550993 29610932
2637 29610932 47147377 53939471 33384798 8788058 4188951 7118205 -9516764 -41889017
2629 -41889017 -55147883 -27947802 20011183 49650510 42777867 16667582 2420409
2622 2420409 11034480 21726722 7593754 -27597922 -48005626 -27451428 16066784
2615 16066784 38893476 20787731 -16201899 -36482468 -25701095 5429963 38253751
2608 38253751 57595685 54747876 33066607 11668705 13356625 42152451 75437447
$$ packed form
2661B980021j3374587j7478541p142642L269995K057672O10785J2733803K6665658
2653A0322164K1346434K720419k672480J1022634K0237918Q719605j0458741j7061990
2645D4175963p765757R427685K5315898K6355284K799015k9052747l4704348o940061
2637B9610932J7536445O792094k0554673k4596740m599107K929254j6634969l2372253
2629d1889017j3258866K7200081M7958985K9639327o872643k6110285j4247173
2622B420409Q614071J0692242j4132968l5191676k0407704K0554198M3518212
2615A6066784K2826692j8105745l6989630k0280569J0781373L1131058L2823788
2608C8253751J9341934k847809k1681269k1397902J687920K8795826L3284996
$$ plain form
2601 75437447 83586678 58866783 23378969 7095797 18432964 38422998 44761347
2594 44761347 37618123 35204402 44735848 49588119 33791903 9848536 5704353 26108444
2586 26108444 46659890 51805845 57303706 79302205 99537019 87095436 46374963
2579 46374963 14783717 12623417 23552186 30755367 42539867 65995567 81168548
2572 81168548 66187746 32236155 8722250 3953552 4182450 3062066 5463052 5667265
2564 5667265 -9899025 -34300919 -39892790 -15659601 15597542 28060443 23468383 18831970
2556 18831970 19049861 17530686 14613710 19363651 35661903 57126691 74064849 78387308
2548 78387308 65354762 38665747 12172043 -535497 1191605 5934935 2376418 -11698635
$$ packed form
2601G5437447Q149231k4719895l5487814j6283172J1337167J9990034O338349
2594D4761347p143224k413721R531446M852271j5796216k3943367m144183K0404091
2586B6108444K0551446N145955N497861K1998499K0234814j2441583m0720473
2579D6374963l1591246k160300J0928769P203181J1784500K3455700J5172981
2572H1168548j4980802l3951591k3513905m768698K28898j120384K400986K04213
2564E667265j5566290k4401894n591871K4233189L1257143J2462901m592060m636413
2556A8831970K17891j519175k916976M749941J6298252K1464788J6938158M322459
2548G8387308j3032546k6689015k6493704j2707540J727102M743330l558517j4075053
$$ plain form
2540 -11698635 -29385516 -39845746 -35615286 -18650975 1140474 14987283 21620659
2533 21620659 23245212 17503485 -2061786 -34769211 -64081573 -67558978 -41535705 -10979358
2525 -10979358 -4075033 -18319437 -25386919 -11159993 6854191 9201545 970833 -6991232
2517 -6991232 -23603284 -58926072 -92527458 -90747757 -52448503 -9465965 18260124
2510 18260124 38789997 56642550 58743464 45325966 44791810 75122229 110283492 108477250
2502 108477250 62247484 1521521 -42932543 -60865113 -56644699 -42792272 -37281212
2495 -37281212 -50162988 -69897047 -72653676 -47868900 -10782496 10402445 269043
2488 269043 -26863846 -38513640 -20314979 4647033 6077464 -11088614 -16556458 -2939745
$$ packed form
2540a1698635j7686881j0460230M230460J6964311J9791449J3846809O633376
2533B1620659J624553n741727j9565271l2707425k9312362l477405K6023273L0556347
2525a0979358O904325j4244404p067482J4226926J8014184K347354q230712p962065
2517f991232j6612052l5322788l3601386J779701L8299254M2982538K7726089
2510A8260124K0529873J7852553K100914j3417498n34156L0330419L5161263j806242
2502A08477250m6229766o0725963m4454064j7932570M220414J3852427N511060
2495c7281212j2881776j9734059k756629K4784776L7086404K1184941j0133402
2488B69043k7132889j1649794J8198661K4962012J430431j7166078n467844J3616713
$$ plain form
2480 -2939745 6221022 623810 775724 17952830 31110753 25440452 21352555 35774473
2472 35774473 43845420 16375223 -26636967 -41707008 -27172407 -19683931 -32065139
2465 -32065139 -38369422 -23069759 -4886780 -2458013 -9495326 -14768523 -18707063 -20240670
2457 -20240670 -12697690 -2127362 -5618536 -22222196 -28546743 -12818322 7853366 13107434
2449 13107434 3013683 -10040941 -13575096 3969703 41235796 70366126 63181918
2442 63181918 35724398 34632188 69643476 94735270 73131859 26515291 -3888864
2435 -3888864 -13138200 -19705983 -24137040 -16331231 -6362994 -12800487 -30420527 -39727484
2427 -39727484 -39458994 -41055615 -40182612 -24535124 -3963140 -1130229 -13244853 -12946249
$$ packed form
2480b939745R160767n597212J51914J7177106J3157923n670301m087897J4421918
2472C5774473Q070947k7470197m3012190j5070041J4534601P488476j2381208
2465c2065139o304283J5299663J8182979K428767p037313n273197l938540j533607
2457b0240670P542980J0570328l491174j6603660o324547J5728421K0671688N254068
2449A3107434j0093751j3054624l534155J7544799L7266093K9130330p184208
2442F3181918k7457520j092210L5011288K5091794k1603411m6616568l0404155
2435c888864r249336o567783m431057P805809R968237o437493j7620040r306957
2427c9727484K68490j596621Q73003J5647488K0571984K832911j2114624K98604
$$ plain form
2419 -12946249 10013298 34758540 41417070 33049356 19904227 4464353 -9710355
2412 -9710355 -13341325 -4786204 6091506 13408328 21584891 32643395 41396477 46997506
2404 46997506 54727636 61684189 54880217 29986292 916200 -14546865 -10446358 7007027
2396 7007027 24954928 30458628 22617378 15691351 17856072 13768200 -11773190 -38761853
2388 -38761853 -29600482 15437449 51714458 50136165 32446729 28331128 28470134 10981601
2380 10981601 -8960019 2892583 40058745 55210818 27076594 -7178792 -3037867
2373 -3037867 33580427 61350964 59658478 45049337 38288218 39121938 37762659 33764399
2365 33764399 33718152 38875969 43045477 38154642 17857408 -16786071 -48732707 -51365338
$$ packed form
2419a2946249K2959547K4745242O658530q367714j3145129j5439874j4174708
2412i710355l630970Q555121J0877710P316822Q176563J1058504Q753082N601029
2404D6997506P730130O956553o803972k4893925k9070092j5463065M100507J7453385
2396G007027J7947901N503700p841250o926027K164721m087872k5541390k6988663
2388c8761853R161371M5037931L6277009j578293j7689436m115601J39006j7488533
2380A0981601j9941620J1852602L7166162J5152073k8134224l4255386M140925
2373c037867L6618294K7770537j692486j4609141o761119Q33720j359279l998260
2365C3764399m6247N157817M169508m890835k0297234l4643479l1946636k632631
$$ plain form
2357 -51365338 -16915783 25558712 36505761 11495839 -15235500 -17000813 -5956710
2350 -5956710 -7062707 -19022098 -21720245 -11061354 -547443 9069348 34112408 74495778
2342 74495778 99429128 82009406 33820341 -10244857 -32379632 -42726886 -56322530
2335 -56322530 -74497116 -89095130 -94076677 -89972066 -81729638 -73003428 -60838230 -38760859
2327 -38760859 -7058725 24798128 48623936 64164879 71699409 66321641 47020292
2320 47020292 24797525 12309557 9022828 4834343 -5119216 -17629801 -29429176 -37615582
2312 -37615582 -34282675 -12768804 19204944 43461093 52190107 55597047 63603982 68593155
2304 68593155 55331480 24353538 -3340936 -5968909 18939987 53810505 75925461
$$ packed form
2357e1365338L4449555M2474495J0947049k5009922k6731339j765313J1044103
2350e956710j105997j1959391k698147J0658891J0513911R616791K5043060M0383370
2342G4495778K4933350j7419722m8189065m4065198k2134775j0347254j3595644
2335e6322530j8174586j4598014m981547M104611Q242428Q726210J2165198K2077371
2327c8760859L1702134L1856853K3825808J5540943P534530n377768j9301349
2320D7020292k2222767j2487968l286729m188485r953559j2510585j1799375q186406
2312c7615582L332907K1513871L1973748K4256149Q729014L406940Q006935M989173
2304F8593155j3261675l0977942k7694474k627973K4908896L4870518K2114956
$$ plain form
2297 75925461 72943399 49436050 22612094 9969493 16613377 32426659 41877372 36670240
2289 36670240 19413428 -1371869 -15833977 -15197806 1756920 21535394 23136398 242201
2281 242201 -27440403 -33209352 -12765011 12507835 20996084 11955208 779787 1543712
2273 1543712 16774680 36927053 45667052 31721045 1002177 -25923846 -31929841 -17175283
2265 -17175283 4703923 18466485 14563889 -6503248 -30910165 -38187053 -18934815
2258 -18934815 15099833 42905634 54673604 56812074 58128240 55806396 38234504 2809842
2250 2809842 -31499952 -37204935 -9574004 21499818 21438717 -9784869 -39507776 -41430621
2242 -41430621 -18639671 12333060 41608253 62436459 64564620 44997762 15932933
$$ packed form
2297G5925461k982062k3507349k6823956j2642601O643884J5813282R450713n207132
2289C6670240j7256812k0785297j4462108O36171J6954726J9778474J601004k2894197
2281B42201k7682604n768949K0444341K5272846Q488249r040876j1175421P63925
2273A543712J5230968K0152373Q739999j3946007l0718868k6926023o005995J4754558
2265a7175283K1879206J3762562l902596k1067137k4406917p276888J9252238
2258a8934815L4034648K7805801J1767970K138470J316166k321844j7571892l5424662
2250B809842l4309794n704983K7630931L1073822o1101l1223586k9722907j922845
2242d1430621K2790950L0972731K9275193K0828206K128161j9566858k9064829
$$ plain form
2235 15932933 -8755518 -25795336 -32482527 -18248912 17837490 50949357 50938551 16401568
2227 16401568 -25357943 -48204379 -43863045 -16253507 21062649 43627541 33480832
2220 33480832 3271091 -13028481 -269344 19910423 18878231 -1427677 -10141434
2213 -10141434 16820433 67891472 102918783 91521624 47018282 15428358 23759527
2206 23759527 48212496 46552614 13552500 -15505787 -14037182 5456597 15510379
2199 15510379 9412629 2801426 11299425 34518471 54891310 50503156 18984474 -12405175
2191 -12405175 -14852923 5129164 16360674 11376844 17879033 51775875 85758886 85917723
2183 85917723 60498220 45982217 54364085 60757768 43274761 13356253 -1387732
$$ packed form
2235A5932933k4688451j7039818o687191J4233615L6086402L3111867j0806l4536983
2227A6401568m1759511k2846436M341334K7609538L7316156K2564892j0146709
2220C3480832l0209741j6299572J2759137K0179767j032192k0305908q713757
2213a0141434K6961867N1071039L5027311j1397159m4503342l1589924Q331169
2206B3759527K4452969j659882l3000114k9058287J468605J9493779J0053782
2199A5510379o097750o611203Q497999K3219046K0372839m388154l1518682l1389649
2191a2405175k447748J9982087J1231510m983830O502189L3896842L3983011J58837
2183H5917723k5419503j4516003Q381868O393683j7483007k9918508j4743985
$$ plain form
2176 -1387732 6498007 13177200 -11187402 -65427502 -108951255 -100109421 -43603128 12926550
2168 12926550 31116573 13812942 -17569776 -50994027 -74623847 -66946988 -24542635
2161 -24542635 16068277 14935273 -20168553 -46410460 -43813527 -31515713 -28445201 -29066759
2153 -29066759 -23818452 -15845441 -7401431 7222434 24247962 26960413 12547845 3575137
2145 3575137 16968883 36254365 32518420 4662334 -17939596 -10796982 19505201 45078309
2137 45078309 45828090 27220163 11182136 11111264 19811128 23512352 19153882 10683550
2129 10683550 -1637411 -15603806 -20319733 -12333592 -10404474 -32398054 -62682156 -67906646
2121 -67906646 -43785762 -18721501 -9861170 -7048998 -6127829 -21474468 -49012134 -52476718
$$ packed form
2176a387732P885739O679193k4364602n4240100m3523753Q841834N6506293N6529678
2168A2926550J8190023j7303631l1382718l3424251k3629820P676859M2404353
2161b4542635M0610912j133004l5103826k6241907K596933J2297814L070512o21558
2153b9066759N248307P973011Q444010J4623865J7025528K712451j4412568q972708
2145C575137J3393746J9285482l735945k7856086k2601930P142614L0302183K5573108
2137D5078309P49781j8607927j6038027p0872Q699864L701224m358470q470332
2129A0683550j2320961j3966395m715927P986141J929118k1993580l0284102n224490
2121f7906646K4120884K5064261Q860331K812172R21169j5346639k7537666l464584
$$ plain form
2113 -52476718 -14007976 29583340 33658352 8036101 -3129420 10761563 19075592
2106 19075592 6851084 -694357 18509698 45960881 47790432 21376790 -2126927
2099 -2126927 1589356 19701395 18370850 -13658368 -48204012 -54310502 -42318017 -48308845
2091 -48308845 -75744658 -84926058 -53354747 -13283607 -3663238 -13452483 -7261874 15035493
2083 15035493 25586538 20901310 21687422 26026160 8888134 -28653258 -53378730 -51306959
2075 -51306959 -44336426 -45268360 -38175696 -19190983 -14530008 -34652341 -49348024 -37383187
2067 -37383187 -26029954 -46716533 -80442637 -85929522 -60547504 -34226522 -19356853
2060 -19356853 -7264433 -3687032 -25155033 -60367369 -72091940 -43508871 4242432
$$ packed form
2113e2476718L8468742M3591316M075012k5622251j1165521J3890983Q314029
2106A9075592j2224508p545441J9204055K7451183J829551k6413642k3503717
2099b126927L716283J8112039j330545l2029218l4545644o106490J1992485n990828
2091d8308845k7435813r181400L1571311M0071140R620369r789245O190609K2297367
2083A5035493J0551045m685228P86112M338738j7138026l7541392k4725472K071771
2075e1306959O970533r31934P092664J8984713M660975k0122333j4695683J1964837
2067c7383187J1353233k0686579l3726104n486885K5382018K6320982J4869669
2060a9356853J2092420L577401k1468001l5212336j1724571K8583069M7751303
$$ plain form
2053 4242432 42549328 57660666 43300743 727235 -48312251 -73992648 -70407778
2046 -70407778 -55320106 -38062642 -13528841 10013920 8461425 -21583694 -50720900
2039 -50720900 -55911557 -49033988 -50591008 -55955772 -48013500 -29469499 -22592998 -42457643
2031 -42457643 -82144338 -118243281 -124867575 -93835725 -48880975 -27760793 -41922426
2024 -41922426 -65071144 -66823742 -42443021 -4351889 34296086 56877088 47426165
2017 47426165 14857544 -6943174 -2123398 4056667 -13304818 -36078503 -31343893 -4411955
2009 -4411955 11628521 7989310 4182063 5996379 -599663 -13387640 -12622061 -2103100
2001 -2103100 -10461313 -39432734 -52957816 -37648953 -31606500 -61609287 -89330719 -63694295
$$ packed form
2053D242432L8306896J5111338j4359923m2573508m9039486k5680397L584870
2046g0407778J5087672J7257464K4533801K3542761j552495l0045119k9137206
2039e0720900n190657O877569j557020n364764P942272J8544001O876501j9864645
2031d2457643l9686695l6098943o624294L1031850M4954750K1120182j4161633
2024d1922426k3148718j752598K4380721L8091132L8647975K2581002r450923
2017D7426165l2568621k1800718M819776O180065j7361485k2773685M734610K6931938
2009d411955J6040476l639211l807247J814316o596042j2787977P65579J0518961
2001b103100q358213k8971421j3525082J5308863O042453l0002787k7721432K5636424
$$ plain form
1993 -63694295 -1567370 32680191 16590549 -9420288 -9495830 5013732 9790509 4512028
1985 4512028 -1854505 -11400810 -22386719 -17979761 8983703 38240791 48982024 48453266
1977 48453266 52840674 54095229 32156996 -5614442 -24048644 -4076586 31941032
1970 31941032 47332984 31779599 6270804 -5383012 -455226 6831653 6210666 2029746
1962 2029746 2959566 8477660 12382796 14365862 16668080 11855646 -9946162 -37981710
1954 -37981710 -41950533 -6796624 45509531 80307496 86848472 79935109 75352278 77309943
1946 77309943 82977924 85776114 78719541 64586649 55339530 51923394 37734445 7708103
1938 7708103 -11044196 7516784 43995770 52841312 24559585 -3169062 -2949473 5034226
$$ packed form
1993f3694295O2126925L4247561j6089642k6010837p5542J4509562M776777n278481
1985D512028o366533r546305j0985909M406958K6963464K9257088J0741233n28758
1977D8453266M387408J254555k1938233l7771438j8434202J9972058L6017618
1970C1941032J5391952j5553385k5508795j1653816M927786P286879o20987m180920
1962B029746R29820N518094L905136J983066K302218m812434k1801808k8035548
1954c7981710l968823L5153909N2306155L4797965O540976o913363m582831J957665
1946G7309943N667981K798190p056573j4132892r247119l416136j4188949l0026342
1938G708103j8752299J8560980L6478986Q845542k8281727k7728647K19589P983699
$$ plain form
1930 5034226 -11215687 -47592678 -72854945 -69354055 -44584629 -12976320 14699112
1923 14699112 29723316 29751533 23424733 20988161 23323166 26538833 31041275 39120871
1915 39120871 49858193 61681908 72382403 73731985 58418048 36527512 28741674
1908 28741674 35129416 29287431 -3453445 -40145234 -49434552 -29863311 422785 34652867
1900 34652867 72199529 96485714 90138618 66586053 55112200 55541588 39684071 1527809
1892 1527809 -26986810 -22091638 -1473321 5444104 -2385977 -6620574 -1401948 3952546
1884 3952546 2903966 -5269684 -21729813 -41823917 -50664064 -40770033 -27685756 -31392050
1876 -31392050 -45658118 -43094750 -12449057 23499302 33256866 11510597 -17025112
$$ packed form
1930E034226j6249913l6376991k5262267L500890K4769426L1608309K7675432
1923A4699112J5024204K8217o326800k436572K335005L215667M502442Q079596
1915C9120871J0737322J1823715J0700495J349582j5313937k1890536p785838
1908B8741674O387742n841985l2740876l6691789r289318J9571241L0286096L4230082
1900C4652867L7546662K4286185o347096k3552565j1473853M29388j5857517l8156262
1892A527809k8514619M895172K0618317O917425p830081m234597N218626N354494
1884C952546j048580q173650j6460129k0094104q840147R894031J3084277l706294
1876c1392050j4266068K563368L0645693L5948359R757564k1746269k8535709
$$ plain form
1869 -17025112 -24536964 -6686211 16047007 20312703 1905440 -23427894 -38303693
1862 -38303693 -39998784 -39473453 -47179722 -60598184 -66811391 -60684073 -57686805 -76964261
1854 -76964261 -109002543 -117600385 -86585637 -47049380 -35928738 -41754277 -23462783
1847 -23462783 22980100 55525964 49365127 29594519 23570129 18369143 -5443469 -28534174
1839 -28534174 -19564312 11722922 28469913 24266291 26541878 43805858 49180818 25409556
1831 25409556 -7005259 -21061546 -17610952 -14600983 -22878650 -45015788 -77682455 -101731694
1823 -101731694 -90223680 -42976596 4161205 21432307 19415251 22244985 25537935
1816 25537935 8996861 -21262732 -36578317 -30278221 -25475447 -31886935 -26560208 6103465
$$ packed form
1869a7025112p511852J7850753K2733218M265696j8407263k5333334j4875799
1862c8303693j695091N25331p706269j3418462o213207O127318K997268j9277456
1854g6964261l2038282q597842L1014748L9536257J1120642n825539J8291494
1847b3462783M6442883L2545864o160837j9770608o024390n200986k3812612k3090705
1839b8534174Q969862L1287234J6746991m203622K275587J7263980N374960k3771262
1831B5409556l2414815j4056287L450594L009969q277667k2137138l2666667k4049239
1823a01731694J1508014M7247084M7137801J7271102k017056K829734L292950
1816B5537935j6541074l0259593j5315585O300096M802774o411488N326727L2663673
$$ plain form
1808 6103465 41311954 45175011 22649194 7725388 14149253 23070317 18722801 9196696
1800 9196696 3728541 -7513485 -35062106 -65257255 -70285236 -38003103 17904573 70699501
1792 70699501 95245764 80361639 39973648 5300589 -6605696 -9748222 -22674199
1785 -22674199 -36743660 -31180933 -11013041 -2413475 -10753215 -12511330 4006496 17953327
1777 17953327 9102759 -13096434 -30162568 -41455655 -50531680 -46029702 -21280256 3501632
1769 3501632 5620724 -5980003 -7811590 -774539 -1590683 -5870574 4079196 19476002
1761 19476002 13590064 -6987090 -2401162 36262710 64353034 48249278 16544830
1754 16544830 16071840 45238304 66216218 62767022 48784043 33390196 16242834 10368174
$$ packed form
1808F103465L5208489L863057k2525817j4923806O423865Q921064m347516r526105
1800I196696n468155j1242026k7548621l0195149n027981L2282133N5907676N2794928
1792G0699501K4546263j4884125m0387991l4673059j1906285l142526j2925977
1785b2674199j4069461N562727K0167892Q599566q339740j758115J6517826J3946831
1777A7953327q850568k2199193j7066134j1293087r076025M501978K4749446K4781888
1769C501632K119092j1600727j831587P037051q16144m279891R949770J5396806
1761A9476002n885938k0577154M585928L8663872K8090324j6103756l1704448
1754A6544830m72990K9166464K0977914l449196j3982979j5393847j7147362n874660
$$ plain form
1746 10368174 30426332 58007707 56247923 25692655 10715345 38021943 79835350
1739 79835350 94713249 77764791 50468342 24442907 64977 -15545318 -15180415
1732 -15180415 -7894866 -7814446 -12612345 -9840426 2572885 17776427 33254824 46918045
1724 46918045 50517995 44362523 45976321 63041993 71826558 49505860 14096005 -2384001
1716 -2384001 -9040333 -39431676 -82494369 -83866312 -30034495 21107771 20998146 -4168951
1708 -4168951 -3769439 22274318 41220469 45578285 45408847 31136333 -3240540 -22628397
1700 -22628397 6602264 54088879 65622865 49901644 56034216 76818333 60322743
1693 60322743 20171333 31024047 81194507 37991883 -164377057 -385864887 -429818423
$$ packed form
1746A0368174K0058158K7581375j759784l0555268j4977310K7306598M1813407
1739G9835350J4877899j6948458k7296449k6025435k4377930j5610295L64903
1732a5180415P285549Q0420m797899K771919J2413311J5203542J5478397J3663221
1724D6918045L599950o155472J613798J7065672Q784565k2320698l5409855j6480006
1716b384001o656332l0391343m3062693j371943N3831817N1142266j09625k5167097
1708d168951L99512K6043757J8946151M357816j69438j4272514l4376873j9387857
1700b2628397K9230661M7486615J1533986j5721221O132572K0784117j6495590
1693F0322743m0151410J0852714N0170460m3202624k02368940k21487830m3953536
$$ plain form
1686 -429818423 -283377899 -109114473 -26753633 -10642003 422007 4403515 -16314632
1679 -16314632 -34255274 -19735585 5679905 6093220 -12676764 -22861323 -22571842 -27800084
1671 -27800084 -37059566 -36191452 -25334488 -16128432 -12179514 -10313812 -10386776 -10041677 -1714014
1662 -1714014 14710801 29801306 41368141 54336608 58078920 30266799 -23695715
1655 -23695715 -61865783 -55998316 -28867346 -20935380 -38966216 -59353750 -66020101 -62118322
1647 -62118322 -55253189 -50654624 -50956766 -49751493 -36340584 -15715187 -6359973 -8914648
1639 -8914648 -1255239 20952243 27570675 145377 -32755276 -36365968 -20429191 -14267994
1631 -14267994 -14081636 1878885 21432239 11902292 -17745555 -18873917 22449514 57685750
$$ packed form
1686d29818423J46440524J74263426Q2360840J6111630J1064010L981508k0718147
1679a6314632j7940642J4519689K5415490M13315j8769984j0184559K89481n228242
1671b7800084r259482Q68114J0856964R206056L948918J865702p2964L45099Q327663
1662a714014J6424815J5090505J1566835J2968467L742312k7812121n3962514
1655b3695715l8170068N867467K7130970P931966j8030836k0387534o666351L901779
1647f2118322O865133M598565l02142J205273J3410909K0625397R355214k554675
1639h914648P659409K2207482O618432k7425298l2900653l610692J5936777O161197
1631a4267994J86358J5960521J9553354r529947k9647847j128362M1323431L5236236
$$ plain form
1623 57685750 42953866 -272975 -16750908 13495809 62615436 96419433 104076910
1616 104076910 91767225 67390551 37179762 9248005 -6988623 -8559587 -4364236
1609 -4364236 -5121414 -7208972 850935 12716440 5693749 -20027384 -27642697 7125441
1601 7125441 53881876 66124189 45763411 31163165 32346344 24618822 5584888 6928667
1593 6928667 35641430 51510651 28240447 -3713113 -7030127 4278012 -4772226 -27213544
1585 -27213544 -26041691 3114731 24674789 18473724 5316259 9500302 25605353 35240648
1577 35240648 35190058 34283389 35802554 36362790 35221092 34442088 32334717 22921160 2349412
1568 2349412 -24983410 -46563277 -50805147 -38165897 -19531859 -1534885 19256105
$$ packed form
1623E7685750j4731884m3226841j6477933L0246717M9119627L3803997P657477
1616A04076910j2309685k4376674l0210789k7931757j6236628j570964M195351
1609d364236p57178k087558Q059907J1865505p022691k5721133p615313L4768138
1601G125441M6756435J2242313k0360778j4600246J183179p727522j9033934J343779
1593F928667K8712763J5869221k3270204l1953560l317014J1308139r050238k2441318
1585b7213544J171853K9156422K1560058o201065j3157465M184043J6105051R635295
1577C5240648n0590r06669J519165N60236j141698p79004k107371r413557k0571748
1568B349412k7332822k1579867m241870J2639250J8634038J7996974K0790990
$$ plain form
1561 19256105 42249634 52215287 34763125 -1097943 -27770158 -26959418 -4704740 20019239
1553 20019239 32260709 27415641 11906941 421710 3102353 11930302 8744769 -9269881
1545 -9269881 -22828464 -16790168 -1979382 2634045 874225 12091761 34330099 39892631
1537 39892631 18024004 -1720041 9698976 33867045 28345493 -11432936 -48006519
1530 -48006519 -60202005 -67226943 -81525059 -76228272 -28714340 31125063 52680494
1523 52680494 29908622 337592 -11447255 -13928968 -16627814 -14782396 -10134852 -14321525
1515 -14321525 -23454323 -18235173 1243805 8712580 -8187729 -27270589 -26472932 -15624405
1507 -15624405 -15489109 -24451952 -25689610 -13587326 4661512 23093464 37924336 43971602
$$ packed form
1561A9256105K2993529R965653j7452162l5861068k6672215Q10740K2254678K4723979
1553B0019239J2241470m845068j5508700j1485231K680643Q827949l185533j8014650
1545i269881j3558583O038296J4810786M613427j759820J1217536K2238338N562532
1537C9892631k1868627j9744045J1419017K4168069n521552l9778429l6573583
1530d8006519j2195486p024938j4298116N296787M7513932N9839403K1555431
1523E2680494k2771872k9571030j1784847k481713k698846J845418M647544m186673
1515a4321525r132798N219150J9478978P468775j6900309j9082860P97657J0848527
1507a5624405J35296q962843j237658J2102284J8248838J8431952J4830872O047266
$$ plain form
1499 43971602 41783334 38366676 32163010 11351027 -22201762 -43059990 -31260534 693671
1491 693671 23793981 24792857 10390931 -8367582 -21624383 -21020713 -8111108 5896579
1483 5896579 17954928 37907119 65662615 80914956 70661162 50350359 39397284
1476 39397284 31561826 11872167 -10343832 -11537224 9788036 31569584 39954497 40344079
1468 40344079 38190052 30626408 20133133 18949207 34422842 59512619 78444441 76112882
1460 76112882 49822270 21783187 28167264 78157093 132054117 140288573 100263724
1453 100263724 55271495 39804253 46564291 48969046 36449590 19817308 13773362
1446 13773362 21638720 33013896 34423825 23225940 7686987 -4998877 -9879135 4355393
$$ packed form
1499D3971602k188268l416658o203666k0811983l3552789k0858228J1799456L1954205
1491F93671K3100310R98876j4401926j8758513j3256801O03670J2909605J4007687
1483E896579J2058349J9952191K7755496J5252341j0253794k0310803j0953075
1476C9397284p835458j9689659k2215999j193392K1325260K1781548Q384913L89582
1468D0344079k154027p563644j0493275j183926J5473635K5089777J8931822k331559
1460G6112882k6290612k8039083O384077M9989829N3897024Q234456m0024849
1453A00263724m4992229j5467242O760038K404755j2519456j6632282o043946
1446A3773362P865358J1375176J409929j1197885j5538953j2685864m880258J4234528
$$ plain form
1438 4355393 43598766 83347048 83924975 45932058 21483891 46116606 86534023 87153085
1430 87153085 44369112 -2524716 -32812636 -52347762 -55797793 -31791272 -835199
1423 -835199 2012721 -15692114 -11516980 22552964 47269301 41015735 27154323 22395587
1415 22395587 9733511 -14481116 -16439988 20873901 62490758 74464076 72296407
1408 72296407 79559443 77512058 42061259 -486682 -6270106 17871871 29286372 18648390
1400 18648390 13968659 23354953 25115172 16633185 24636642 55849576 78657764 70096726
1392 70096726 48105500 39732810 44400664 46584983 42490818 35058058 19128123 -9210575
1384 -9210575 -37972414 -49696058 -42413384 -30324266 -26302286 -29651973 -29201576 -15688633
$$ packed form
1438D355393L9243373L9748282N77927l7992917k4448167K4632715M0417417O19062
1430H7153085m2783973m6893828l0287920j9535126l450031K4006521L0956073
1423h35199K847920j7704835M175134L4069944K4716337o253566j3861412m758736
1415B2395587j2662076k4214627j958872L7313889M1616857J1973318k167669
1408G2296407P263036k047385l5450799m2547941n783424K4141977J1414501j0637982
1400A8648390m679731R386294J760219q481987Q003457L1212934K2808188q561038
1392G0096726k1991226q372690M667854K184319m094165p432760j5929935k8338698
1384i210575k8761839j1723644P282674J2089118M021980l349687M50397J3512943
$$ plain form
1376 -15688633 7868121 28867112 38740962 39022550 33370902 24606934 23558117 44194896
1368 44194896 78594576 94213330 74021431 43329873 34058521 38319949 28189098
1361 28189098 9284700 14311638 43975374 57587909 34898484 7681985 7230808 14117854
1353 14117854 -7207259 -45732898 -53109076 -9383387 51577984 84761142 78931394
1346 78931394 53725730 30366752 15135842 2963047 -10834194 -22022612 -21798918
1339 -21798918 -11911817 -9037151 -25152835 -47156654 -47702797 -17855545 20783318 40550580
1331 40550580 36542256 24715843 17114689 10185496 11745 -1954284 18583735 51756668
1323 51756668 64908108 41120510 5869608 -693621 25829124 49385121 41202891
$$ packed form
1376a5688633K3556754K0998991R873850K81588n651648q763968j048817K0636779
1368D4194896L4399680J5618754k0191899l0691558r271352M261428j0130851
1361B8189098j8904398N026938K9663736J3612535k2689425k7216499m51177O887046
1353A4117854k1325113l8525639p376178M3725689O0961371L3183158n829748
1346G8931394k5205664k3358978j5230910j2172795j3797241j1188418K23694
1339b1798918R887101K874666j6115684k2003819n46143K9847252L8638863J9767262
1331D0550580m008324j1826413p601154o929193j0173751j966029K0538019L3172933
1323E1756668J3151440k3787598l5250902o563229K6522745K3555997q182230
$$ plain form
1316 41202891 13146744 -5890333 -9466385 -11826306 -16772959 -10625358 12321771 35523301
1308 35523301 39374737 23328479 262702 -22783393 -47280795 -69796412 -76778753
1301 -76778753 -56332958 -11652993 38465934 71303889 75558046 60123222 46171919
1294 46171919 45282074 47128521 35172131 11371432 -6125031 -9739845 -11528957 -19836142
1286 -19836142 -23600783 -12511528 2319902 6479415 8863360 25238738 41934731 27051925
1278 27051925 -18181582 -50418798 -40606277 -13254717 -9107119 -29350283 -42638425
1271 -42638425 -34672469 -22247494 -20613186 -22551748 -16301885 -6939201 -9647561 -28111224
1263 -28111224 -46120335 -42095218 -14451226 9548672 672873 -34214224 -54795079
$$ packed form
1316D1202891k8056147j9037077l576052k359921m946653O147601K2947129K3201530
1308C5523301L851436j6046258k3065777k3046095k4497402k2515617o982341
1301g6778753K0445795M4679965N0118927L2837955M254157j5434824j3951303
1294D6171919q89845J846447j1956390k3800699j7496463l614814j789112q307185
1286a9836142l764641J1089255J4831430M159513K383945J6375378J6695993j4882806
1278B7051925m5233507l2237216R812521K7351560M147598k0243164j3288142
1271d2638425P965956J2424975J634308j938562O249863R362684k708360j8463663
1263b8111224j8009111M025117K7643992K3999898q875799l4887097k0580855
$$ plain form
1256 -54795079 -34762803 7965906 37615793 40558361 26503157 8631222 1074713
1249 1074713 17758184 48885303 54202981 10419234 -44853057 -50976918 -2866556 43363517
1241 43363517 45747190 21618885 7336656 7057120 2195500 -11378731 -18517119 -6783183
1233 -6783183 20442370 45374632 46022306 17984037 -11359138 -7227049 31462543 74437379
1225 74437379 103412808 125411359 138188034 118229404 62335967 10271509 -1608351
1218 -1608351 12465393 14703155 -95380 -6116462 7429611 23247774 25313906 14776245
1210 14776245 -3077426 -25451954 -44375926 -50271424 -44248547 -33531786 -17805806
1203 -17805806 5894137 29693113 42300878 46214797 52370275 61929503 68280812 71177076
$$ packed form
1256e4795079K0032276M2728709K9649887K942568j4055204j7871935p556509
1249A074713J6683471L1127119N317678m3783747n5272291o123861M8110362M6230073
1241D3363517K383673k4128305j4282229k79536m861620j3574231p138388J1733936
1233f783183K7225553K4932262O47674k8038269k9343175M132089L8689592M2974836
1225G4437379K8975429K1998551J2776675j9958630n5893437n2064458j1879860
1218a608351J4073744K237762j4798535o021082J3546073J5818163K066132j0537661
1210A4776245j7853671k2374528j8923972n895498O022877J0716761J5725980
1203a7805806K3699943K3798976J2607765L913919O155478R559228O351309K896264
$$ plain form
1195 71177076 72342391 64307717 44096037 32038444 51713630 91045477 108989736
1188 108989736 87327278 53534278 41981722 50808048 51223255 28668242 1341281
1181 1341281 -5867 34243675 77925542 90946168 61212890 18830987 -634426
1174 -634426 1791907 -1375227 -20166569 -36113679 -33650148 -18868141 -3269140 8863456
1166 8863456 10668739 -7375138 -37401385 -53457088 -42889830 -22111606 -10490675
1159 -10490675 -6327328 -1605641 -2211441 -15639799 -32407111 -37809292 -31435399 -19081467
1151 -19081467 1673520 28341815 38603451 13969183 -27267786 -46164938 -31696627
1144 -31696627 -9925815 -3625066 -7512220 -9863998 -14536977 -28648417 -47081746 -63550028
$$ packed form
1195G1177076J165315q034674k0211680j2057593J9675186L9331847J7944259
1188A08989736k1662458l3793000j1552556Q826326M15207k2555013k7326961
1181A341281j347148L4249542M3681867J3020626k9733278m2381903j9465413
1174f34426K426333l167134j8791342j5947110K463531J4782007J5599001J2132596
1166H863456J805283j8043877l0026247j6055703J0567258K0778224J1620931
1159a0490675M163347M721687o05800j3428358j6767312n402181O373893J2353932
1151a9081467K0754987K6668295J0261636k4634268m1236969j8897152J4468311
1144c1696627K1770812O300749l887154k351778m672979j4111440j8433329j6468282
$$ plain form
1136 -63550028 -81215877 -96613592 -88194506 -42536590 16505516 48333442 44232758
1129 44232758 34140007 41911536 54992684 48043073 19164879 -11741356 -28979799
1122 -28979799 -30021180 -16521936 6696165 26706439 32375283 29692397 33901245 45938847
1114 45938847 50940302 42164524 30852123 26997692 25597834 20345632 16581352 19124742
1106 19124742 19438299 8423226 -7495857 -16770896 -20924301 -28235003 -36826399 -38812348
1098 -38812348 -33982621 -23848031 -940494 36102356 64582045 60027702 33702726
1091 33702726 20762834 29533194 31768810 10050314 -16210183 -26029153 -27652355 -32189645
1083 -32189645 -23986417 11098348 45773369 35791113 -21052390 -81722876 -112660851
$$ packed form
1136f3550028j7665849j5397715Q419086M5657916N9042106L1827926m100684
1129D4232758j0092751P771529J3081148o949611k8878194l0906235j7238443
1122b8979799j041381J3499244K3218101K0010274N668844k682886M208848J2037602
1114D5938847N001455q775778j1312401l854431j399858n252202l764280K543390
1106A9124742L13557j1015073j5919083r275039m153405p310702q591396j985949
1098c8812348M829727J0134590K2907537L7042850K8479689m554343k6324976
1091C3702726j2939892Q770360K235616k1718496k6260497r818970j623202m537290
1083c2189645Q203228L5084765L4675021r982256n6843503o0670486l0937975
$$ plain form
1076 -112660851 -118125831 -111743552 -91564805 -56467773 -22654757 -4994465 3671295
1069 3671295 18159782 35992836 42092597 31946181 15864062 2950235 -7003622 -15738723
1061 -15738723 -20526140 -18277609 -9456636 4549277 23889336 47132051 67375069 75087833
1053 75087833 67464993 54066635 48566833 52726126 53464639 40190747 19575907 5710268
1045 5710268 470470 -5311542 -13227516 -13185823 -346278 16190773 26780141 32562831
1037 32562831 37093658 37129886 30790997 26704359 34436485 50503105 63015051 66532480
1029 66532480 64236092 59340850 53003142 47820004 45454421 43708841 43009770 50570684
1021 50570684 68323464 81635273 72775775 43590378 12134339 -11591360 -31555419
$$ packed form
1076a12660851n464980O382279K0178747L5097032L3813016J7660292Q665760
1069C671295J4488487J7833054O099761j0146416j6082119j2913827r953857q735101
1061a5738723m787417K248531Q820973J4005913J9340059K3242715K0243018P712764
1053G5087833p622840j3398358n499802M159293P38513j3273892k0614840j3865639
1045E710268n239798n782012p915974M1693J2839545J6537051J0589368N782690
1037C2562831M530827L6228o338889m086638P732126J6066620J2511946L517429
1029F6532480k296388m895242o337708n183138k365583j745580o99071P560914
1021E0570684J7752780J3311809q859498k9185397l1456039k3725699j9964059
$$ plain form
1014 -31555419 -46647257 -43528476 -16629661 17649824 36691104 33993560 19633829
1007 19633829 7196815 6124608 17179053 28288329 24241970 7405910 -1666049 8689411
999 8689411 26699591 38803422 48998482 60969553 58455452 28609838 -6000057 -8903899
991 -8903899 19002533 39539048 32036076 18135824 21879239 33526318 30810682 13700581
983 13700581 -3551536 -19095239 -39911741 -61417503 -70923261 -65859069 -52703401 -34189618
975 -34189618 -12393632 3105736 6569675 9096281 23459183 41714043 45623636 34843578
967 34843578 25901049 25159655 21005149 2863806 -27593024 -62133179 -86620527 -80425423
959 -80425423 -36408459 19386623 50101425 51486932 50820063 61416373 65515800 49812045
$$ packed form
1014c1555419j5091838L118781K6898815L4279485J9041280k697544j4359731
1007A9633829j2437014j072207J1054445J1109276m046359j6836060r071959J0355460
999H689411J8010180J2103831J0195060J1971071k514101k9845614l4609895k903842
991h903899K7906432K0536515p502972j3900252L743415J1647079k715636j7110101
983A3700581j7252117j5543703k0816502k1505762r505758N064192J3155668J8513783
975c4189618K1795986J5499368L463939K526606J4362902J8254860L909593j0780058
967C4843578q942529p41394m154506j8141343l0456830l4540155k4487348O195104
959h0425423M4016964N5795082L0714802J385507o66869J0596310M099427j5703755
$$ plain form
951 49812045 29909391 24543956 28609094 28826192 26670665 28353659 29632287 27891487
943 27891487 32306070 44759680 49204973 39273089 35652456 51278078 60270750 34165158
935 34165158 -7594243 -22205525 -8418974 -3585060 -18257380 -21063352 2636633 24833680
927 24833680 28310819 41881056 89020418 135537329 129956149 75925420 24008069 3834898
919 3834898 4102114 12024660 28426717 40123115 20502153 -26569628 -58373735 -49595880
911 -49595880 -27563473 -26255102 -31267673 -5165665 47382312 79387651 67041574 40723257
903 40723257 39232647 59668112 70619435 58021177 37847853 30638612 40212731 56153047
895 56153047 65553430 61580646 47541266 33021542 23683308 18914346 21014860 36061295
$$ packed form
951D9812045j9902654n365435M065138K17098k155527J682994J278628j740800
943B7891487M414583J2453610M445293r931884l620633J5625622Q992672k6105592
935C4165158m1759401j4611282J3786551M833914j4672320k805972K3699985K2197047
927B4833680L477139J3570237M7139362M6516911n581180n4030729n1917351k0173171
919C834898K67216P922546J6402057J1696398j9620962m7071781l1804107Q777855
911d9595880K2032407J308371n012571K6102008N2547977L2005339j2346077k6318317
903D0723257j490610K0435465J0951323j2598258k0173324p209241R574119J5940316
895E6153047R400383l972784j4039380j4519724r338234m768962K100514J5046435
$$ plain form
887 36061295 58009977 63875937 40187982 7361634 -1184844 16843910 28871649 11956171
879 11956171 -17813735 -30033417 -18234083 368359 12168223 18143357 22639401 25617887
871 25617887 25414547 19670801 5393770 -14246876 -28145398 -32233732 -40101863 -64068541
863 -64068541 -89145385 -84742194 -45858430 -4614292 8717616 1801823 4436768 27222815
855 27222815 52351538 61528324 56652418 50398082 49323768 52256727 56104499 55436004
847 55436004 42116334 14516134 -14146847 -24424994 -9562570 18505279 42568995
840 42568995 53991264 51824498 36741363 13907768 -2795283 -736216 15872567 29464065
832 29464065 31068878 29636084 34796182 41068647 39350467 35573658 42640540 56421910
$$ packed form
887C6061295K1948682N865960k3687955l2826348q546478J8028754J2027739j6915478
879A1956171k9769906j2219682J1799334J8602442J1799864N975134M496044K978486
871B5617887k03340n743746j4277031j9640646j3898522m088334p868131k3966678
863f4068541k5076844M403191L8883764M1244138J3331908o915793K634945K2786047
855B7222815K5128723R176786m875906o254336j074314K932959L847772o68495
847E5436004j3319670k7600200k8662981j0278147J4862424K8067849K4063716
840D2568995J1422269k166766j5083135k2833595j6703051K059067J6608783J3591498
832B9464065J604813j432794N160098O272465j718180l776809P066882J3781370
$$ plain form
824 56421910 56817298 37093445 17553824 20512775 41173253 54001731 42749326 15110063
816 15110063 -8042200 -9429735 13418611 42566301 48905024 20910646 -15624821 -21385442
808 -21385442 8786334 36647926 27189982 -9260060 -34061654 -27344737 -621202 28954981
800 28954981 53275940 62370517 44511555 8624158 -12363048 3123483 37370450
793 37370450 54682408 41354466 11254458 -17453289 -33043480 -25820031 4403739
786 4403739 36914892 46507440 34139356 23858741 27330716 31148398 23746746 12771214
778 12771214 5633461 -6105776 -27712433 -44268921 -40960503 -26802860 -19035174 -15289609
770 -15289609 -2349605 15993707 22988804 16652485 10566280 8103893 -845818 -14850287
$$ packed form
824E6421910L95388j9723853j9539621K958951K0660478J2828478j1252405k7639263
816A5110063k3152263j387535K2848346K9147690O338723k7994378l6535467n760621
808b1385442L0171776K7861592r457944l6450042k4801594O716917K6723535K9576183
800B8954981K4320959R094577j7858962l5887397k0987206J5486531L4246967
793C7370450J7311958j3327942l0100008k8707747j5590191P223449L0223770
786D403739L2511153R592548j2368084j0280615L471975L817682p401652j0975532
778A2771214p137753j1739237k1606657j6556488L308418J4157643P767686L745565
770a5289609J2940004J8343312O995097o336319o086205k462387q949711j4004469
$$ plain form
762 -14850287 -16281684 -173775 12317367 1447572 -24842406 -43891482 -45148381 -32436223
754 -32436223 -11317174 11034164 21044121 9941706 -11509206 -21725630 -12915802
747 -12915802 1553832 5475882 -1738669 -7335406 -1004423 15127318 30792630 38807987
739 38807987 40035875 38386371 36301103 38262727 51948238 76732138 94651946 85380019
731 85380019 51965846 20544429 10729339 16663116 22234181 23827550 28953881 39778363
723 39778363 47618071 40727084 12872521 -29714698 -65081374 -68138113 -35552940 7643237
715 7643237 33723997 37624355 29767610 15943585 -20059 -2452572 24380102 68428060
707 68428060 93011954 75731147 31656304 -7887134 -26060280 -22855556 -2709155
$$ packed form
762a4850287j431397J6107909J2491142j0869795k6289978j9049076j256899J2712158
754c2436223K1119049K2351338J0009957j1102415k1450912j0216424Q809828
747a2915802J4469634L922050p214551n596737O330983J6131741J5665312Q015357
739C8807987J227888j649504k085268J961624J3685511K4783900J7919808r271927
731H5380019l3414173l1421417r815090N933777N571065J593369N126331J0824482
723C9778363P839708o890987k7854563m2587219l5366676l056739L2585173M3196177
715G643237K6080760L900358p856745j3824025j5963644k432513K6832674M4047958
707F8428060K4583894j7280807m4074843l9543438j8173146L204724K0146401
$$ plain form
700 -2709155 24639810 40038365 29957788 5295034 -8425887 -1382119 10809028 9565373
692 9565373 -5398339 -21697530 -31291336 -34297900 -32211584 -26078427 -19360491 -15793365
684 -15793365 -14336926 -10296190 -1383230 9104470 13096819 891496 -30611819 -68481977
676 -68481977 -88814740 -78897308 -50451288 -23768227 -4922923 10059279 15097912 -2248388
668 -2248388 -34734641 -52971052 -39694581 -12970289 -3816634 -21312779 -50506275 -73322839
660 -73322839 -77985535 -58454045 -22178169 7572216 14242974 9064753 13816396 28027851
652 28027851 33187017 26322766 25149586 36733982 45920725 44353259 47621418 67469037
644 67469037 85477971 75244215 40176687 9252935 728222 8011327 18281963 26629926
$$ packed form
700b709155K7348965J5398555j0080577k4662754j3720921P043768J2191147j243655
692I565373j4963712j6299191r593806l006564K086316O133157O717936L567126
684a5793365J456439M040736Q912960J0487700L992349j2205323l1503315l7870158
676f8481977k0332763R917432K8446020K6683061J8845304J4982202N038633j7346300
668b248388l2486253j8236411J3276471K6724292R153655j7496145k9193496k2816564
660g3322839m662696J9531490L6275876K9750385O670758n178221M751643J4211455
652B8027851N159166o864251j173180J1584396R186743j567466L268159J9847619
644F7469037J8008934j0233756l5067528l0923752q524713P283105J0270636Q347963
$$ plain form
636 26629926 29869688 22481265 5598254 -9530605 -13299632 -7623959 -807959 1999860
628 1999860 35982 -5840368 -11627122 -8311468 12245741 46870611 78740644 89321998
620 89321998 74452638 47545931 26316930 18302196 19317673 20529362 13465837 -5652731
612 -5652731 -28685691 -36278593 -15389876 23644154 54457634 58988109 40046128 14563013
604 14563013 2725382 17651342 51781347 75630556 65064607 30408009 4564504
597 4564504 2876964 11675294 16736469 20778143 25650725 19399343 -4659940 -31573643
589 -31573643 -41144477 -28727996 -426944 36054007 63817708 59193477 21050358 -16206567
581 -16206567 -19546140 2456734 15037670 3152314 -18258542 -31911174 -34073313 -26121157
$$ packed form
636B6629926L239762p388423j6883011j5128859l769027N675673O816000K807819
628A999860j963878n876350n786754L315654K0557209L4624870L1870033J0581354
620H9321998j4869360k6906707k1229001q014734J015477J211689p063525j9118568
612e652731k3032960p592902K0888717L9034030L0813480M530475j8941981k5483115
604A4563013j1837631J4925960L4130005K3849209j0565949l4656598k5843505
597D564504j687540Q798330N061175M041674M872582o251382k4059283k6913703
589c1573643r570834J2416481K8301052L6480951K7763701m624231l8143119l7256925
581a6206567l339573K2002874J2580936j1885356k1410856j3652632k162139P952156
$$ plain form
573 -26121157 -9737958 9890156 29708384 53208831 77118393 84405379 68214010
566 68214010 51173525 57607837 75884678 75991156 58632813 54711417 74449986 89482247
558 89482247 75287750 44454418 24854115 26256608 41051471 59199235 69777684
551 69777684 63596700 45957643 33666014 31490514 26710885 14287195 9529278 25236076
543 25236076 52748224 77046652 94777847 105053479 98358965 70460236 36299264
536 36299264 15785628 13429077 21183741 30877272 35168049 28918122 19291136 21005232
528 21005232 31942152 29911616 6403599 -14440196 -8706893 10910382 13672535 -4627716
520 -4627716 -18117548 -6267536 26563708 61909171 79292961 63542977 20551236
$$ packed form
573b6121157J6383199J9628114J9818228K3500447K3909562P286986j6191369
566F8214010j7040485O434312J8276841J06478j7358343l921396J9738569J5032261
558H9482247j4194497l0833332j9600303J402493J4794863J8147764J0578449
551F9777684o180984j7639057j2291629k175500m779629j2423690m757917J5706798
543B5236076K7512148K4298428J7731195J0275632o694514k7898729l4160972
536C6299264k0513636k356551P754664R693531M290777o249927r626986J714096
528B1005232J0936920k030536k3508017k0843795N733303J9617275K762153j8300251
520d627716j3489832J1850012L2831244L5345463J7383790j5749984m2991741
$$ plain form
513 20551236 -17098203 -19962749 3420494 18347131 7522684 -16152784 -36917105
506 -36917105 -52133306 -58670388 -48423231 -26677444 -13440930 -13542022 -3772389 33313161
498 33313161 76371427 86272712 54791454 14192318 -1761535 8903937 25568677
491 25568677 34061863 36970843 41101228 45235284 42017856 26992173 4014292 -15459552
483 -15459552 -18784813 -3520119 15846307 20098428 9534851 7845765 31903441 64859527
475 64859527 74508547 55285558 33599074 29957608 36737168 41113509 47638472 60821028
467 60821028 62656418 32302105 -17713748 -47864307 -36825472 -5017072 10286553
460 10286553 -7255613 -41768797 -62774663 -52900614 -24074969 -4638523 -5947313 -8680518
$$ packed form
513B0551236l7649439k864546K3383243J4926637j0824447k3675468k0764321
506c6917105j5216201o537082J0247157K1745787J3236514j01092R769633L7085550
498C3313161M3058266R901285l1481258m0599136j5953853J0665472J6664740
491B5568677Q493186K908980M130385M134056l217428j5025683k2977881j9473844
483a5459552l325261J5264694J9366426M252121j0563577j689086K4057676L2956086
475F4859527R649020j9222989k1686484l641466O779560M376341O524963J3182556
467F0821028J835390l0354313n0015853l0150559J1038835L1808400J5303625
460A0286553j7542166l4513184k1005866R874049K8825645J9436446j308790k733205
$$ plain form
452 -8680518 9392943 40914578 58105298 48609379 26009029 7176451 -3497939 -6048080
444 -6048080 1570664 15263471 22186501 13816769 -5052444 -23559103 -34059112 -33014725
436 -33014725 -21646896 -8772343 -5586995 -14413746 -27216157 -34917312 -32608293 -18377704
428 -18377704 4169324 24042351 33119691 36597744 43104809 47594764 38334138 20430775
420 20430775 15788186 35064684 63904065 82704423 86422046 78026506 57299365 28236905
412 28236905 6463525 4318311 13430402 14799080 3549847 -8097161 -11641527 -13538549
404 -13538549 -21487481 -29446318 -25347730 -10250006 -247991 -7017803 -23565389 -34235541
396 -34235541 -32809984 -22812649 -5388290 19728600 41661463 42553161 20335029 -5278213
$$ packed form
452h680518J8073461L1521635J7190720r495919k2600350j8832578j0674390k550141
444f048080P618744J3692807O923030q369732j8869213j8506659j0500009J044387
436c3014725J1367829J2874553L185348q826751j2802411p701155K309019J4230589
428a8377704K2547028J9873027R077340L478053O507065M489955r260626j7903363
420B0430775m642589J9276498K8839381J8800358L717623q395540k0727141k9062460
412B8236905k1773380k145214R112091J368678j1249233j1647008l544366j897022
404a3538549p948932p958837M098588J5097724J0002015o769812j6547586j0670152
396c4235541J425557R997335J7424359K5116890K1932863Q91698k2218132k5613242
$$ plain form
388 -5278213 -16641131 -15997763 -12220986 -4500010 8654772 17201408 11418520 -3146028
380 -3146028 -14923491 -19699389 -13641812 10045506 40433557 44059931 6154033 -39244044
372 -39244044 -50211110 -34342538 -30270919 -42683793 -38672942 -7570058 20701905 25706476
364 25706476 23340170 28964213 32483993 27255849 26882404 33340159 24719014 -1892298
356 -1892298 -11684735 14682771 43359001 37414010 14341904 13764536 32801138 37918613
348 37918613 23666369 13628432 12817465 4519295 -8568524 -3233569 21494225 39293204
340 39293204 39911318 42051936 55194791 61990858 50026717 32107033 22129215 15168456
332 15168456 3793548 -6654832 -9891541 -8146751 -2504515 9176539 20769303 22831627
$$ packed form
388e278213j1362918O43368L776777P720976J3154782Q546636n782888j4564548
380c146028j1777463m775898O057577K3687318L0388051L626374l7905898m5398077
372c9244044j0967066J5868572M071619j2412874M010851L1102884K8271963N004571
364B5706476k366306N624043L519780n228144l73445O457755q621145k6611312
356a892298r792437K6367506K8676230n944991k3072106n77368J9036602N117475
348C7918613j4252244j0037937q10967q298170j3087819N334955K4727794J7798979
340C9293204O18114K140618J3142855O796067j1964141j7919684r977818o960759
332A5168456j1374908j0448380l236709J744790N642236J1681054J1592764K062324
$$ plain form
324 22831627 20428804 24389027 25148047 3274488 -31023335 -41719148 -19997643 -212899
316 -212899 -7289122 -20843977 -14009917 1688912 -705887 -18137467 -26184719 -17720418
308 -17720418 -2871653 17952482 50186277 80351437 84799900 63410680 40485627
301 40485627 30638955 24488594 9760064 -12594010 -35789090 -53507139 -56228685 -37599638
293 -37599638 -8622232 8116058 2672500 -13745214 -24642544 -20848198 1370791 38733800
285 38733800 74418885 88272930 79623296 68007684 66343037 66469797 58267359 49229844
277 49229844 52494354 64350550 68355191 59356770 50828367 56468298 73248318 85709290
269 85709290 80948600 56711609 21202386 -9548699 -19086798 -4526401 16733959 23195898
$$ packed form
324B2831627k402823L960223P59020k1873559l4297823j0695813K1721505J9784744
316b12899p076223j3554855O834060J5698829k394799j7431580q047252Q464301
308a7720418J4848765K0824135L2233795L0165160M448463k1389220k2925053
301D0485627r846672o150361j4728530k2354074k3195080j7718049k721546J8629047
293c7599638K8977406J6738290n443558j6417714j0897330L794346K2218989L7363009
285C8733800L5685085J3854045q649634j1615612j664647J26760q202438r037515
277D9229844L264510J1856196M004641q998421q528403N639931J6780020J2460972
269H5709290m760690k4236991l5509223l0751085r538099J4560397K1260360O461939
$$ plain form
261 23195898 15018832 13941455 31302200 48017580 41043018 21408421 23196296 53362550
253 53362550 77571256 68066972 43623970 40398118 57713183 60714679 33457007 1231589
245 1231589 -7226746 3074797 8056196 670552 -5617598 -2157795 4340672 7737936
237 7737936 14460334 32439033 56191340 71810991 73795590 67935876 57073991 34530957
229 34530957 -1254753 -33503373 -41173085 -24990914 -7058556 -2594891 -4787445 -2518012
221 -2518012 1000397 -1935300 -6169568 -790498 12457126 22522148 27736278 36244961
213 36244961 47517681 47880197 29372154 3344072 -10061689 -1112546 21711731 37444713
205 37444713 27479570 -6991574 -42154103 -53613575 -40481908 -20137625 -3257059
$$ packed form
261B3195898q177066j077377J7360745J6715380o974562j9634597J787875L0166254
253E3362550K4208706r504284k4443002l225852J7315065L001496k7257672l2225418
245A231589q458335J0301543M981399p385644o288150L459803O498467L397264
237G737936O722398J7978699K3752307J5619651J984599n859714j0861885k2543034
229C4530957l5785710l2248620p669712J6182171J7932358M463665k192554K269433
221b518012L518409k935697m234268N379070J3247624J0065022N214130Q508683
213C6244961J1272720L62516j8508043k6028082j3405761Q949143K2824277J5732982
205C7444713r965143l4471144l5162529j1459472J3131667K0344283J6880566
$$ plain form
198 -3257059 12785982 27345817 30824823 21262339 12596682 18259387 36384989 56948637
190 56948637 72478914 75828921 60682849 34060083 16877221 20852593 34004317 38739719
182 38739719 32983030 21739629 1508619 -28687279 -51091551 -46131366 -20917729 162054
174 162054 9580608 18176139 25034206 15474913 -4673680 -3697144 30334744 63970780
166 63970780 60938354 30300972 5912526 -6085442 -26357185 -55760847 -65640749 -41331968
158 -41331968 -6029167 11498109 10578113 6229377 2960904 -1735947 -2966253 3233290
150 3233290 6958497 -1968173 -14425916 -13364913 671792 12733367 17501689 20817277
142 20817277 19694050 3539846 -20804123 -27710462 -7174042 17533491 20837424 9423543
$$ packed form
198c257059J6043041J4559835L479006r562484q665657N662705J8125602K0563648
190E6948637J5530277L350007j5146072k6622766j7182862L975372J3151724M735402
182C8739719n756689j1243401k0231010l0195898k2404272M960185K5213637K1079783
174A62054R418554Q595531O858067r559293k0148593R76536L4031888L3636036
166F3970780l032426l0637382k4388446j1997968k0271743k9403662r879902K4308781
158d1331968L5302801J7527276r19996m348736l268473m696851j230306O199543
150C233290L725207q926670j2457743J061003J4036705J2061575M768322L315588
142B0817277j123227j6154204k4343969o906339K0536420K4707533L303933j1413881
$$ plain form
134 9423543 8783556 24556407 36805631 31058271 17787377 17051481 35467827 62902990
126 62902990 82983877 82257472 57303284 20542785 -4861795 -3703244 16714055 34410369
118 34410369 35336902 24507819 14135348 6929110 -2496189 -12883806 -13794739 -1418704
110 -1418704 12803858 17449068 17295476 23188895 31939077 31273899 21965523 17062248 17474772
101 17474772 8171980 -14137547 -29263882 -22089950 -5324166 2446676 4743575 11630628
93 11630628 10717989 -16344751 -53677181 -60560702 -27283953 7516379 8734616 -10196427
85 -10196427 -12715390 9237055 32116853 38429661 32963590 23714949 9089849 -10100567
77 -10100567 -21913899 -16229853 1580211 17696126 26055939 30950695 35562999 34797170
$$ packed form
134I423543o39987J5772851J2249224n747360j3270894p35896J8416346K7435163
126F2902990K0080887p26405k4954188l6760499k5404580J158551K0417299J7696314
118C4410369R26533j0829083j0372471p206238r425299j0387617r10933J2376035
110a418704J4222562M645210j53592N893419Q750182o65178r308376m903275M12524
101A7474772r302792k2309527j5126335P173932J6765784P770842K296899O887053
93A1630628r12639k7062740l7332430o883521L3276749L4800332J218237j8931043
85a0196427k518963K1952445K2879798O312808n466071r248641j4625100j9190416
77a0100567j1813332N684046J7810064J6115915Q359813M894756M612304p65829
$$ plain form
69 34797170 22599845 3414531 -9383778 -8878312 -3686386 -5553945 -10852350 -4254797
61 -4254797 17670013 37375478 37652035 24205247 17718775 27482142 41969724 44039376
53 44039376 27630479 309705 -22797981 -27243856 -9687168 16617643 32299863 31112214
45 31112214 24557981 24886473 29075936 25559955 13621382 7515816 18647181 39955266
37 39955266 54408783 56484424 56952735 64352162 70086291 59372767 32692024 7199733
29 7199733 -2779687 1620791 11610767 22200223 31764366 37700778 39256508 40830455
21 40830455 46483443 53097448 53645697 46079418 35399290 27664946 24378734 22166134
13 22166134 16866199 8733270 2835280 1930772 1024021 -5819439 -14751951 -15678455 -6658213
$$ packed form
69C4797170j2197325j9185314j2798309N05466N191926j867559n298405O597553
61d254797K1924810J9705465K76557j3446788o486472R763367J4487582K069652
53D4039376j6408897k7320774k3107686m445875J7556688K6304811J5682220j187649
45C1112214o554233L28492M189463l515981j1938573o105566J1131365K1308085
37C9955266J4453517K075641M68311P399427N734129j0713524k6680743k5492291
29G199733r979420M400478R989976J0589456R564143N936412J555730J573947
21D0830455N652988O614005N48249p566279j0680128p734344l286212k212600
13B2166134n299935q132929n897990r04508r06751o843460q932512r26504R020242
$$ plain form
4 -6658213 3653287 9424129 14295325 21840916
0 21840916
$$ packed form
4f658213J0311500N770842M871196P545591
0B1840916
$$ Imaginary data points
##PAGE= N=2
##DATA TABLE= (X++(I..I)), XYDATA
$$ plain form
65535 2932970 8850222 14643168 19234736 15453443 4140245 1000453 15388711 31690235
65527 31690235 29383740 14434796 10205263 21526980 31132458 31326762 33821202 43526401
65519 43526401 48377164 44699770 47394251 60481001 61712692 36699824 7462176 1681303
65511 1681303 9446216 167588 -26334798 -37317627 -15867712 16099102 29683828
65504 29683828 21017766 4092158 -8105163 -6408352 12231289 34461705 38007047
65497 38007047 20468786 6413634 13938290 28501328 25282549 5344870 -9709082
65490 -9709082 -11990056 -15034533 -27542615 -39035774 -37808014 -28509260 -22727989 -21323471
65482 -21323471 -15513090 -742579 18213714 33454854 39237647 33008565 17461818
$$ packed form
65535B932970N917252N792946M591568l781293j1313198l139792J4388258J6301524
65527C1690235k306495j4948944m229533J1321717R605478J94304K494440R705199
65519D3526401M850763l677394K694481J3086750J231691k5012868k9237648n780873
65511A681303P764913r278628k6502386j0982829K1449915L1966814J3584726
65504B9683828q666062j6925608j2197321J696811J8639641K2230416L545342
65497C8007047j7538261j4055152P524656J4563038l218779j9937679j5053952
65490i709082k280974l044477j2508082j1493159J227760R298754N781271J404518
65482b1323471N810381J4770511J8956293J5241140N782793o229082j5546747
$$ plain form
65475 17461818 2026244 -2865271 4211146 13447995 13999857 6037421 1092617 10063043
65467 10063043 31769910 53913948 64458598 60929612 49369700 37145107 28720131
65460 28720131 26462030 31031449 38603242 40190189 28341701 5965590 -14530327 -23376328
65452 -23376328 -22367532 -18576269 -12586392 -199719 14667803 18819952 6861698 -8557221
65444 -8557221 -12315896 -7372535 -8891678 -20174134 -27240832 -19944530 -6653891 -1256917
65436 -1256917 -4286109 -5821416 -2296484 -1323485 -10323410 -26148356 -36788180 -31933872
65428 -31933872 -14150275 -204194 -5684146 -25930472 -39659549 -35946399 -28210672
65421 -28210672 -32855420 -43643389 -41571520 -24409910 -8777472 -3492602 340024 8061587
$$ packed form
65475A7461818j5435574m891515P076417R236849N51862p962436m944804Q970426
65467A0063043K1706867K2144038J0544650l528986j1559912j2224593q424976
65460B8720131k258101M569419P571793J586947j1848488k2376111k0495917q846001
65452b3376328J008796L791263N989877J2386673J4867522M152149j1958254j5418919
65444h557221l758675M943361j519143j1282456p066698P296302J3290639N396974
65436a256917l029192j535307L524932R72999q999925j5824946j0639824M854308
65428c1933872J7783597J3946081n479952k0246326j3729077L713150P735727
65421b8210672m644748j0787969K071869J7161610J5632438N284870L832626P721563
$$ plain form
65413 8061587 8746393 -5737810 -23724813 -29611630 -26317894 -27461181 -34944831 -39496079
65405 -39496079 -37711646 -32490490 -20795671 743855 19571471 17562393 1711139
65398 1711139 3174569 34948151 68488696 67980200 35045694 2341310 -8403050 -3956296
65390 -3956296 -683649 -6940873 -23749618 -45978083 -60123332 -54682711 -35651433 -19894129
65382 -19894129 -12222292 -3075482 9725780 14936963 10029470 11084461 28318543 46704357
65374 46704357 46537555 32110526 22691160 23027160 21878485 15944949 15008398 21230963
65366 21230963 21313129 6159658 -14291870 -23464623 -17132680 -4419509 3480474 1099351
65358 1099351 -9271460 -19921903 -25787922 -29976630 -36208769 -39354540 -33852298 -29269579
$$ packed form
65413H061587O84806j4484203j7987003n886817L293736j143287p483650m551248
65405c9496079J784433N221156J1694819K1539526J8827616k009078j5851254
65398A711139J463430L1773582L3540545n08496l2934506l2704384j0744360M446754
65390c956296L272647o257224j6808745k2228465j4145249N440621J9031278J5757304
65382a9894129P671837R146810J2801262N211183m907493J054991J7234082J8385814
65374D6704357j66802j4427029r419366L36000j148675n933536r36551O222565
65366B1230963Q2166j5153471k0451528r172753O331943J2713171P899983k381123
65358A099351j0370811j0650443n866019m188708o232139l145771N502242M582719
$$ plain form
65350 -29269579 -42564570 -71971861 -93609395 -90828534 -73338814 -58153287 -44733939
65343 -44733939 -22489119 5956021 24043676 21035048 2232728 -17182767 -20470353
65336 -20470353 1960600 40816387 69657196 70132233 51710494 35065697 22188776
65329 22188776 -105097 -29980556 -45523908 -35764953 -18258276 -14585346 -22137588
65322 -22137588 -23759370 -15532368 -9287594 -12194653 -19672143 -28761151 -43514615 -61426576
65314 -61426576 -66366624 -45559126 -8430724 21545020 32195349 30395797 24733621
65307 24733621 12989849 -6773775 -24130230 -28320637 -26357481 -33751528 -49029638
65300 -49029638 -54826565 -46767736 -41536768 -46794105 -42219603 -7961457 41284421 71456370
$$ packed form
65350b9269579j3294991k9407291k1637534K780861J7489720J5185527J3419348
65343d4733939K2244820K8445140J8087655l008628j8802320j9415495l287586
65336b0470353K2430953L8855787K8840809M75037j8421739j6644797j2876921
65329B2188776k2293873k9875459j5543352R758955J7506677L672930p552242
65322b2137588j621782Q227002O244774k907059p477490r089008j4753464j7911961
65314f1426576m940048K0807498L7128402K9975744J0650329j799552n662176
65307B4733621j1743772j9763624j7356455m190407J963156p394047j5278110
65300d9029638n796927Q058829N230968n257337M574502L4258146M9245878L0171949
$$ plain form
65292 71456370 71048230 56864682 42318916 23835865 1208173 -11858738 -7932968
65285 -7932968 -463804 -6601475 -25393193 -41547520 -42464937 -25577623 1637403 22696012
65277 22696012 22941344 6482320 -6271419 -4195321 1025312 -5768778 -20384087 -26102425
65269 -26102425 -16776335 -2878992 2909154 -288369 -468225 15277460 42645647 56184405
65261 56184405 35255168 -5788976 -28830337 -16836621 9895434 27530106 36419766
65254 36419766 43105902 38902060 18470237 939800 5353071 17686989 11263682 -8563626
65246 -8563626 -12082860 4881613 12278263 -7169326 -33077384 -41519338 -37567034 -37266876
65238 -37266876 -38393262 -29252211 -13070366 -4212427 -6904426 -12624309 -14298480 -11785290
$$ packed form
65292G1456370m08140j4183548j4545766j8483051k2627692j3066911L925770
65285g932968P469164o137671j8791718j6154327r17417J6887314K7215026K1058609
65277B2696012K45332j6459024j2753739K076098N220633o794090j4615309n718338
65269b6102425R326090J3897343N788146l197523j79856J5745685K7368187J3538758
65261E6184405k0929237m1044144k3041361J1993716K6732055J7634672Q889660
65254C6419766O686136m203842k0431823j7530437M413271J2333918o423307j9827308
65246h563626l519234J6964473P396650j9447589k5908058q441954L952304L00158
65238c7266876j126386R141051J6181845Q857939k691999n719883j674171K513190
$$ plain form
65230 -11785290 -6755758 -792442 4073506 8001539 13005175 18716816 25557237 41226919
65222 41226919 70686205 97926388 96345433 66470835 45196291 61501218 96483073
65215 96483073 106703527 79007533 41552480 23000280 21048572 15987308 354165
65208 354165 -13892945 -11815754 6592930 24233205 23174174 4107680 -14581407 -18947509
65200 -18947509 -12887526 -5230749 4776690 17699322 19779837 -2997490 -38629854
65193 -38629854 -55034840 -37155290 -4820586 12719290 8778964 -2854612 -12735689
65186 -12735689 -24712010 -40542705 -48062590 -33120247 693986 33435373 50877475
65179 50877475 55831529 53023302 35088337 -2361975 -39931659 -49755411 -32103105
$$ packed form
65230a1785290N029532N963316M865948L928033N003636N711641O840421J5669682
65222D1226919K9459286K7240183j580955k9874598k1274544J6304927L4981855
65215I6483073J0220454k7695994l7455053j8552200j951708n061264j5633143
65208C54165j4247110K077191J8408684J7640275j059031j9066494j8689087m366102
65200a8947509O059983P656777J0007439J2922632K080515k2777327l5632364
65193c8629854j6404986J7879550L2334704J7539876l940326j1633576r881077
65186a2735689j1976321j5830695p519885J4942343L3814233L2741387J7442102
65179E0877475M954054k808227j7934965l7450312l7569684r823752J7652306
$$ plain form
65172 -32103105 -15673718 -16557044 -19290133 -8599670 4007778 2961387 -3505494 -1576211
65164 -1576211 -45238 -12064146 -22698277 -8511457 17475571 17444827 -13073863 -35348440
65156 -35348440 -24495822 -1338806 8339200 13640379 33643596 58160767 62697680
65149 62697680 47703805 35476978 36343113 41755952 45374407 48910331 49812401 42894175
65141 42894175 33453416 31849229 35362902 30306077 11510253 -13620554 -38145139 -58496897
65133 -58496897 -67528706 -61449899 -52562531 -56740391 -66255022 -54068625 -11769125 33550955
65125 33550955 50452006 38796328 23439860 21418951 27097639 25860279 12795827
65118 12795827 -2887279 -8284255 -1169122 7295407 6983841 2234548 4066926 12993253
$$ packed form
65172c2103105J6429387q83326k733089J0690463J2607448j046391o466881J929283
65164a576211J530973j2018908j0634131J4186820K5987028l0744l0518690k2274577
65156c5348440J0852618K3157016R678006N301179K0003217K4517171M536913
65149F2697680j4993875j2226827Q66135N412839L618455L535924R02070o918226
65141D2894175r440759j604187L513673n056825j8795824k5130807k4524585k0351758
65133e8496897r031809O078807Q887368m177860r514631J2186397M2299500M5320080
65125C3550955J6901051j1655678j5356468k020909N678688j237360j3064452
65118A2795827j5683106n396976P115133Q464529l11566m749293J832378Q926327
$$ plain form
65110 12993253 20259968 23501666 27081870 27108174 13452934 -8758331 -17867821 -5667897
65102 -5667897 7711803 2186089 -13684098 -19619606 -17282086 -25390142 -46590121 -61505475
65094 -61505475 -57087627 -41867629 -28840579 -19840803 -13241319 -12556468 -18524581 -23150737
65086 -23150737 -19730221 -10462492 1822858 19120400 37401693 41455604 23698026
65079 23698026 1393646 -178138 19141949 32009885 17792997 -12325262 -31601727
65072 -31601727 -30861919 -24151952 -23007999 -18324793 2992175 29960530 32158631 -1509408
65064 -1509408 -41114496 -46802985 -16621475 12694694 12995885 -4661543 -13144194 -5817264
65056 -5817264 4412872 10976510 19174112 28441379 27288117 11083753 -6958506 -9818941
$$ packed form
65110A2993253P266715L241698L580204K6304j3655240k2211265r109490J2199924
65102e667897J3379700n525714j5870187n935508K337520q108056k1199979j4915354
65094f1505475M417848J5219998J3027050Q999776O599484O84851n968113m626156
65086b3150737L420516R267729J2285350J7297542J8281293M053911j7757578
65079B3698026k2304380j571784J9320087J2867936j4216888l0118259j9276465
65072c1601727P39808O709967J143953M683206K1316968K6968355K198101l3668039
65064a509408l9605088n688489L0181510K9316169L01191j7657428q482651P326930
65056e817264J0230136O563638Q197602R267267j153262j6204364j8042259k860435
$$ plain form
65048 -9818941 3905525 19578532 22834975 13898791 6661389 12617025 24659453 21857572
65040 21857572 -4495087 -34712167 -39559221 -13782676 17488898 25841672 6277461
65033 6277461 -22516579 -37566954 -31155569 -16090830 -10061615 -11932237 -1767191 27781404
65025 27781404 51933918 42369951 6845244 -22215985 -34349232 -47909884 -67226096
65018 -67226096 -66048191 -30919977 6351884 5966624 -26682339 -51746258 -48382177 -30918212
65010 -30918212 -17588417 -10842933 -9916103 -17867827 -29428055 -31648754 -24446241 -23407266
65002 -23407266 -33367059 -35565819 -14616216 12960519 13798974 -20605996 -60079674 -67888091
64994 -67888091 -40648026 -10447372 -7848860 -29262554 -46589774 -43701952 -29839565
$$ packed form
65048i818941J3724466J5673007L256443q936184p237402N955636J2042428k801881
65040B1857572k6352659l0217080m847054K5776545L1271574Q352774j9564211
65033F277461k8794040j5050375O411385J5064739O029215j870622J0165046K9548595
65025B7781404K4152514r563967l5524707k9061229j2133247j3560652j9316212
65018f7226096J177905L5128214L7271861l85260l2648963k5063919L364081J7463965
65010c0918212J3329795O745484R26830p951724j1560228k220699P202513J038975
65002b3407266r959793k198760K0949603K7576735Q38455l4404970l9473678p808417
64994f7888091K7240065L0200654K598512k1413694j7327220K887822J3862387
$$ plain form
64987 -29839565 -15964135 3279031 31563385 50354160 37410757 -43596 -31013725
64980 -31013725 -38605993 -33486439 -28554372 -20281987 -2586758 16577482 23237027 13714323
64972 13714323 -3900153 -18761757 -25268660 -28676135 -42048375 -68225484 -87031055
64965 -87031055 -74416641 -34952622 -158730 8045910 -3189833 -17311347 -28175939
64958 -28175939 -32064714 -19229591 10953395 38481864 42844301 29447319 23571625
64951 23571625 40370532 68811550 83310928 67448051 30180177 108157 -2305832
64944 -2305832 13750480 23870319 20228361 13637051 6709434 -11705117 -39758114 -54463966
64936 -54463966 -43495013 -25465747 -23325894 -34313572 -41815913 -40942881 -35377551 -23893111
$$ packed form
64987b9839565J3875430J9243166K8284354J8790775j2943403l7454353l0970129
64980c1013725p592268N119554M932067Q272385J7695229J9164240O659545r522704
64972A3714323j7614476j4861604o506903l407475j3372240k6177109j8805571
64965h7031055J2614414L9464019L4793892Q204640j1235743j4121514j0864592
64958b8175939l888775J2835123L0182986K7528469M362437j3396982n875694
64951B3571625J6798907K8441018J4499378j5862877l7267874l0072020k413989
64944b305832J6056312J0119839l641958o591310o927617j8414551k8052997j4705852
64936e4463966J0968953J8029266K139853j0987678p502341Q73032N565330J1484440
$$ plain form
64928 -23893111 -8543025 -3320582 -16221775 -34225268 -42829993 -47001551 -55394674 -60577678
64920 -60577678 -56791632 -59930955 -82350666 -103010145 -95186558 -72800736 -72575487 -95040212
64912 -95040212 -101828212 -74250834 -37923377 -20938191 -20489945 -22330748 -23957948 -25418183
64904 -25418183 -22445079 -20350050 -30433119 -42969266 -31081733 6471892 34794634
$$ packed form
64928b3893111J5350086N222443j2901193j8003493q604725m171558q393123n183004
64920f0577678L786046l139323k2419711k0659479P823587K2385822K25249k2464725
64912i5040212o788000K7577378L6327457J6985186M48246j840803j627200j460235
64904b5418183K973104K095029j0083069j2536147J1887533L7553625K8322742
$$ [...]
##END NTUPLES=NMR SPECTRUM
##END=
