##TITLE=31Pdec_LR-718-M1
 CDCl3, 124 sc
 10.7.2020
##JCAMPDX= 6.0         $$ Bruker NMR JCAMP-DX V2.0
##DATA TYPE= NMR SPECTRUM
##DATA CLASS= NTUPLES
##ORIGIN= UXNMR, Bruker Analytische Messtechnik GmbH
##OWNER= root
$$ XWIN-NMR		Version 3.5
$$ Fri Jul 10 10:48:24 2020 Russian Standard Time (UT+4h)  she@DPX200
##.OBSERVE FREQUENCY= 81.013821
##.OBSERVE NUCLEUS= ^31P
##.ACQUISITION MODE= SIMULTANEOUS
##.ACQUISITION SCHEME= undefined
##.AVERAGES= 124
##.DIGITISER RES= 17
##SPECTROMETER/DATA SYSTEM= spect
##.PULSE SEQUENCE= zgpg30
##.SOLVENT NAME= CDCl3
##.SHIFT REFERENCE= (INTERNAL, CDCl3, 0, 182.463)
##AUDIT TRAIL= $$ (NUMBER, WHEN, WHO, WHERE, WHAT)
$$ ##TITLE= Audit trail, XWIN-NMR		Version 3.5
$$ ##JCAMPDX= 5.01
$$ ##ORIGIN= Bruker BioSpin GmbH
$$ ##OWNER= she
$$ F:/spectra/data/she/nmr/P31/1/pdata/1/auditp.txt
$$ ##AUDIT TRAIL=  $$ (NUMBER, WHEN, WHO, WHERE, WHAT)
(   1,<2020-07-10 10:45:40.64 +0400>,<she>,<DPX200>,
      <continue with go, POWCHK disabled, PULCHK disabled
       configuration hash MD5:
       00 E9 B6 7A A2 85 ED C7 34 08 36 98 17 FE 4E 26
       data hash MD5: 32K
       AB 3D 61 F4 11 02 58 4A 0E BB 52 7B BA B5 31 EB>)
(   2,<2020-07-10 10:46:25.57 +0400>,<she>,<DPX200>,
      <Start of raw data processing
       efp BC_mod = 2 LB = 1 FT_mod = 6 PKNL = 1 PHC0 = -2379.708 PHC1 = 15.60158 SI = 64K 
       data hash MD5: 64K
       9B BD C0 F6 C7 0D 93 5A E5 F1 41 6D 69 D4 9E B3>)
(   3,<2020-07-10 10:46:41.70 +0400>,<she>,<DPX200>,
      <pk PHC0 = 16.56495 PHC1 = 0 
       data hash MD5: 64K
       37 B3 76 C9 E2 A8 1D 9C BE D7 F7 F8 58 B2 52 E9>)
(   4,<2020-07-10 10:47:03.82 +0400>,<she>,<DPX200>,
      <pk PHC0 = -123.1734 PHC1 = 340.8 
       data hash MD5: 64K
       FD E9 C5 FC BA 4B 5C B8 D6 51 FC 68 52 99 B8 85>)
(   5,<2020-07-10 10:47:54.29 +0400>,<she>,<DPX200>,
      <pk PHC0 = -133.7758 PHC1 = 390.4 
       data hash MD5: 64K
       94 ED D3 A7 E4 E0 C2 90 1A 28 51 08 B2 7A 1C 8A>)
$$ ##END=
$$ 
$$ hash MD5
$$ 63 E2 87 36 F9 B7 23 99 30 28 DD C4 9C 4E 45 B8
##$RELAX= 
##$RELAX= 
##$RELAX= 
##$RELAX= 
##$RELAX= 
##$RELAX= 
##$RELAX= 
##$RELAX= 
$$ Bruker specific parameters
$$ --------------------------
##$DU= <F:/spectra>
##$EXPNO= 1
##$NAME= <P31>
##$PROCNO= 1
##$TYPE= <nmr>
##$USER= <she>
##$AMP= (0..31)
100 100 100 100 100 100 100 100 100 100 100 100 100 100 100 100 100 100 
100 100 100 100 100 100 100 100 100 100 100 100 100 100 
##$AQSEQ= 0
##$AQ_mod= 1
##$AUNM= <au_zg>
##$AUTOPOS= <>
##$BF1= 81.014009
##$BF2= 200.13
##$BF3= 200.13
##$BF4= 200.13
##$BF5= 200.13
##$BF6= 200.13
##$BF7= 200.13
##$BF8= 200.13
##$BYTORDA= 1
##$CFDGTYP= 0
##$CFRGTYP= 5
##$CHEMSTR= <none>
##$CNST= (0..31)
1 1 145 1 1 1 1 1 1 1 1 1 1 1 1 1 1 1 1 1 1 1 1 1 1 1 1 1 1 1 1 1 
##$CPDPRG= <waltz16>
##$CPDPRG1= <>
##$CPDPRG2= <waltz16>
##$CPDPRG3= <>
##$CPDPRG4= <mlev>
##$CPDPRG5= <mlev>
##$CPDPRG6= <mlev>
##$CPDPRG7= <mlev>
##$CPDPRG8= <mlev>
##$CPDPRGB= <>
##$CPDPRGT= <>
##$D= (0..31)
$$ [...]
##$SUBNAM2= <"">
##$SUBNAM3= <"">
##$SUBNAM4= <"">
##$SUBNAM5= <"">
##$SUBNAM6= <"">
##$SUBNAM7= <"">
##$SUBNAM8= <"">
##$SUBNAM9= <"">
##$SW= 369.568048894756
##$SWIBOX= (0..15)
0 1 3 0 0 0 0 0 0 0 0 0 0 0 0 0 
##$SW_h= 29940.119760479
##$TD= 32768
##$TD0= 1
##$TE= 0
##$TE2= 300
##$TE3= 300
##$TEG= 300
##$TL= (0..7)
0 120 53 12 22 120 120 120 
##$TP= (0..7)
150 150 150 150 150 150 150 150 
##$TP07= 0
##$TPNAME0= <>
##$TPNAME1= <>
##$TPNAME2= <>
##$TPNAME3= <>
##$TPNAME4= <>
##$TPNAME5= <>
##$TPNAME6= <>
##$TPNAME7= <>
##$TPOAL= (0..7)
0.5 0.5 0.5 0.5 0.5 0.5 0.5 0.5 
##$TPOFFS= (0..7)
0 0 0 0 0 0 0 0 
##$TUNHIN= 0
##$TUNHOUT= 0
##$TUNXOUT= 0
##$USERA1= <user>
##$USERA2= <user>
##$USERA3= <user>
##$USERA4= <user>
##$USERA5= <user>
##$V9= 5
##$VALIST= <valist>
##$VCLIST= <CCCCCCCCCCCCCCC>
##$VD= 0
##$VDLIST= <DDDDDDDDDDDDDDD>
##$VPLIST= <PPPPPPPPPPPPPPP>
##$VTLIST= <TTTTTTTTTTTTTTT>
##$WBST= 1024
##$WBSW= 4
##$XGAIN= (0..3)
0 0 0 0 
##$XL= 0
##$YL= 0
##$YMAX_a= 68548
##$YMIN_a= -50161
##$ZGOPTNS= <>
##$ZL1= 120
##$ZL2= 120
##$ZL3= 120
##$ZL4= 120
##$ABSF1= 0
##$ABSF2= 0
##$ABSG= 0
##$ABSL= 0
##$ALPHA= 0
##$AQORDER= 0
##$ASSFAC= 0
##$ASSFACI= 0
##$ASSFACX= 0
##$ASSWID= 0
##$AUNMP= <proc_1d>
##$AZFE= 0.1
##$AZFW= 0.5
##$BCFW= 0
##$BC_mod= 2
##$BYTORDP= 0
##$COROFFS= 0
##$CY= -3
##$DATMOD= 1
##$DC= 0
##$DFILT= <>
##$DTYPP= 0
##$F1P= 0
##$F2P= 0
##$FCOR= 1
##$FTSIZE= 65536
##$FT_mod= 6
##$GAMMA= 0
##$GB= 0
##$INTBC= 1
##$INTSCL= 5.30512e-09
##$ISEN= 30
##$LB= 1
##$LEV0= 0
##$LPBIN= 0
##$MAXI= 10000
##$MC2= 0
##$MEAN= 0
##$ME_mod= 0
##$MI= 50
##$NCOEF= 0
##$NC_proc= -8
##$NLEV= 6
##$NOISF1= 182.463
##$NOISF2= 159.3651
##$NSP= 0
##$NTH_PI= 0
##$NZP= 0
##$OFFSET= 182.463
##$PC= 4
##$PHC0= -2620.092
##$PHC1= 746.8016
##$PH_mod= 1
##$PKNL= yes
##$PPARMOD= 0
##$PSCAL= 0
##$PSIGN= 0
##$REVERSE= no
##$SF= 81.0140089999434
##$SI= 65536
##$SIGF1= 159.3651
##$SIGF2= -187.1042
##$SINO= 113.3802
##$SIOLD= 16384
##$SREGLST= <1H.CDCl3>
##$SSB= 0
##$STSI= 65536
##$STSR= 0
##$SW_p= 29940.119760479
##$SYMM= 0
##$S_DEV= 0
##$TDeff= 32768
##$TDoff= 0
##$TI= <>
##$TILT= no
##$TM1= 0
##$TM2= 0
##$TOPLEV= 0
##$USERP1= <user>
##$USERP2= <user>
##$USERP3= <user>
##$USERP4= <user>
##$USERP5= <user>
##$WDW= 1
##$XDIM= 65536
##$YMAX_p= 468241607
##$YMIN_p= -82024315
$$ End of Bruker specific parameters
$$ ---------------------------------
##NTUPLES= NMR SPECTRUM
##VAR_NAME=  FREQUENCY,     SPECTRUM/REAL,   SPECTRUM/IMAG
##SYMBOL=    X,             R,               I
##VAR_TYPE=  INDEPENDENT,   DEPENDENT,       DEPENDENT
##VAR_FORM=  AFFN,          ASDF,            ASDF
##VAR_DIM=   65536,         65536,           65536
##UNITS=     HZ,            ARBITRARY UNITS, ARBITRARY UNITS
##FACTOR=    0.456856943014862, 1,           1
##FIRST=     14782.0589164792, 0,            0
##LAST=      -15158.0608439998, 0,           0
##MIN=       -15158.0608439998, -82024315,   0
##MAX=       14782.0589164792, 468241607,    0
$$ Real data points
##PAGE= N=1
##DATA TABLE= (X++(R..R)), XYDATA
$$ [...]
44881F01827J648140O741772j376076j3686251r714363J1920323K7495258J8102783
$$ 601827 2249967 8991739 7615663 -6070588 -15784951 -3864628 23630630 41733413
44873D1733413o857465k2866321j7713427N77993J5758071J7163219O653955m045249
$$ 41733413 34875948 12009627 -5703800 -5125807 10632264 27795483 34449438 30404189
44865C0404189o455671n479938r723817j4161354n532927J3480099K1770650R286773
$$ 30404189 23948518 18468580 8744763 -5416591 -10949518 2530581 24301231 33588004
44857C3588004o171008m499380O483496L521278j5880710k8606306j8063424M534449
$$ 33588004 27416996 22917616 29401112 32922390 17041680 -11564626 -29628050 -25093601
44849b5093601J6400258J0278127j124309k375938Q012284J6868918J1550939
$$ -25093601 -8693343 1584784 460475 -1915463 6096821 22965739 34516678
44842C4516678l928746j2227830m955950N784619N477888j461135j300400M357900
$$ 34516678 30587932 18360102 13404152 19188771 24666659 23205524 21905124 26263024
44834B6263024J902249p290600m891129J2685715K2092631P088360j3035843j0075601
$$ 26263024 28165273 20874673 15983544 28669259 50761890 57850250 44814407 34738806
44826C4738806R704394J4360686n039658k1781418j5451664j319226k944064j4675745
$$ 34738806 44443200 58803886 53764228 31982810 16531146 15211920 12267856 -2407889
44818b407889j2843736N844992K0198965J7178333P417875L574041J747906n321497
$$ -2407889 -15251625 -9406633 10792332 27970665 35388540 38962581 40710487 35388990
44810C5388990j0803607m050670R370911J2976840K475883r579064j2661315r552828
$$ 35388990 24585383 20534713 29905624 42882464 45358347 35779283 23117968 13565140
44802A3565140o072126j468076M785414O519068j32248q170449r356439p018415
$$ 13565140 7493014 6024938 10810352 17329420 17197172 9026723 -329716 -7348131
44794g348131r138753j2901501q485483K986119Q837759M662210J442387O875137
$$ -7348131 -16486884 -29388385 -37873868 -34887749 -26049990 -21387780 -19945393 -13070256
44786a3070256J2041098O669486k324088j111472P814142P901927o040884j8747700
$$ -13070256 -1029158 5640328 3316240 2204768 10018910 17920837 11879953 -6867747
44778f867747j5347643p24043Q732450N875855j786772l898958J588805Q166296
$$ -6867747 -22215390 -22939433 -14206983 -8331128 -10117900 -14016858 -12428053 -4261757
44770d261757Q236303J241280m768804j661710Q301053J3920325Q144854l990345
$$ -4261757 3974546 5215826 447022 -1214688 7086365 21006690 29151544 25161199
44762B5161199j2169014j1658370n030332L063695R063009J0619810P270557J001790
$$ 25161199 12992185 1333815 -3696517 -632822 8430187 19049997 26320554 27322344
44754B7322344m995036p666942n001388J725632O880077N155782k208039q849517
$$ 27322344 22327308 14660366 9658978 11384610 18264687 23420469 21212430 12362913
44746A2362913j0352783o332942K425920J2601379J5762504O289901p387537r574307
$$ 12362913 2010130 -4322812 -1896892 10704487 26466991 32756892 25369355 15795048
44738A5795048J877280J2029776J0297077L538122R36814r77351o604477o812644
$$ 15795048 17672328 29702104 39999181 43537303 44474117 43496766 36892289 30079645
44730C0079645O609078J9635644R953010j8050491l2323186j3664001J8320826
$$ 30079645 36688723 56324367 66277377 48226886 15903700 2239699 20560525
44723B0560525K9603282J1742265j3110546k1420822j2021768j053947n72023
$$ 20560525 50163807 61906072 48795526 27374704 15352936 14298989 13726966
44716A3726966o460932p287819j128528K968138J054486J746476J0402289J5917132
$$ 13726966 7266034 -21785 -1150313 1817825 2872311 4618787 15021076 30938208
44708C0938208O773355o971769o109209N935286N764401j1486487j9802134j213443
$$ 30938208 37711563 30739794 24630585 30565871 36330272 24843785 5041651 3828208
44700C828208K3231778K1614784l031613j8832721j1326412J100638J3543q131399
$$ 3828208 27059986 48674770 45643157 26810436 15484024 16584662 16598205 8466806
44692H466806r352337n551919n459542m928657N411474J8944565J8851170N198493
$$ 8466806 -885531 -6437450 -11896992 -16825649 -11414175 7530390 26381560 31580053
44684C1580053k662367L773400Q112201l259184j6328095j1081850M416839O467480
$$ 31580053 28917686 32691086 40803287 37544103 21216008 10134158 14550997 21018477
44676B1018477l769522j971611J4836038J8318998l623745k1212814q217724J3989382
$$ 21018477 17248955 15277344 30113382 48432380 44808635 23595821 15378097 29367479
44668B9367479R834287j2922155j7461398J098089J0780348j887011j2913043
$$ 29367479 39201766 26279611 8818213 9916302 20696650 18809639 5896596
44661E896596n442078M701576K702427K35592Q172460J3005960K463651r834593
$$ 5896596 454518 5156094 7858521 8094113 16266573 29272533 31736184 21901591
44653B1901591p825460L16072J135065R00600Q164741J1288535m58913j1293748
$$ 21901591 14076131 14392203 15527268 16427868 24592609 35881144 35422231 24128483
44645B4128483k830394J1891546Q700785o211788p662771M831198Q847554k6222
$$ 24128483 21298089 33189635 41890420 35678632 28015861 32847059 41694613 41668391
44637D1668391l212208M901140Q551358J646436k926568n90768l654657j5561136
$$ 41668391 38456183 43357323 51908681 53555117 50628549 50037781 46383124 30821988
44629C0821988k2227041j6434909p258214M75155J1505659J9843178J0659875
$$ 30821988 8594947 -7839962 -15098176 -14623021 -3117362 16725816 27385691
44622B7385691r698590j4235434L147884J5417535N768732o034361N26920J2388133
$$ 27385691 17687101 3451667 6599551 22017086 27785818 21751457 22278377 34666510
44614C4666510Q386451m433176p069261k633000o010362j3349256j0006153P09139
$$ 34666510 43052961 38619785 31550524 28917524 22907162 9557906 -448247 260892
44606B60892L677539R0409L555144J2454522J1591348M04915m302380L863308
$$ 260892 3938431 4028840 7583984 20038506 31629854 32034769 27732389 31595697
44598C1595697J1087189N548175p475463j6918151j8378090j2085691q90963P082836
$$ 31595697 42682886 48231061 40755598 23837447 5459357 -6626334 -7517297 -434461
44590d34461M775691k875984l857259M573611J3377314J4713089Q518071j841536
$$ -434461 4341230 1465246 -2392013 2181598 15558912 30272001 38790072 36948536
44582C6948536j1079141j1856725l050619M941998L024031l074026l215771o58604
$$ 36948536 25869395 14012670 10962051 15904049 18928080 15854054 12638283 11979679
44574A1979679m886596j1778425q567205L248314Q328169K028836l171743Q95028
$$ 11979679 7093083 -4685342 -13252547 -10004233 -1676064 352772 -2818971 -1923943
44566a923943O981818P718561O269860N244071m06751j1199559j6439343r003356
$$ -1923943 5057875 12776436 19046296 24290367 23883616 12684057 -3755286 -12758642
44558a2758642K954598P570424M273862m03594m164845p798986q539887k714084
$$ -12758642 -9804044 -2233620 2040242 1636648 -2528197 -10327183 -18867070 -21581154
44550b1581154P569717J5406856J5242022O908878l185294n783740J000097P072471
$$ -21581154 -14011437 1395419 16637441 23546319 20361025 14577285 15577382 22649853
44542B2649853L055398n450693o152896O73963M440168L600917O177292J0521037
$$ 22649853 25705251 20254558 14101662 14775625 19215793 22816710 28994002 39515039
44534C9515039N037174q344482j1292179J123478Q668040j879419j2731914l233413
$$ 39515039 44552213 36207731 24915552 26039030 34707070 32827651 20095737 16862324
44526A6862324J4468698J3200067n835172j5412172n512360L623537l450411j4196826
$$ 16862324 31331022 44531089 38695917 23283745 17771385 21394922 17944511 3747685
44518C747685j1177869J032370O583786K607534k467145n887090j0235675j0703079
$$ 3747685 -7430184 -6397814 185972 2793506 326361 -5560729 -15796404 -26499483
44510b6499483J527868K2000424L2009595K0365070j797485j4101137j0182511
$$ -26499483 -24971615 -2971191 29038404 49403474 47605989 33504852 23322341
44503B3322341j600572o94168o466551r265655m210293M602042J0930997J2104850
$$ 23322341 21721769 21027601 14561050 5295395 1085102 5687144 16618141 28722991
44495B8722991P909450n94590q573495q666436K46983Q389651N421399n259450
$$ 28722991 36632441 36037851 27464356 18797920 19044903 27434554 32855953 27596503
44487B7596503r443505j189795Q093724N047445o550370j0931321l161228L646312
$$ 27596503 18152998 16963203 25056927 30104372 23554002 12622681 9461453 13107765
44479A3107765k202061j3428410j3939452r32695J3213558J8627437J6646682
$$ 13107765 10905704 -2522706 -16462158 -17394853 -4181295 14446142 31092824
44472C1092824J0978373K146214o073888o511513r43978j523180j1684175j6622849
$$ 31092824 42071197 44217411 38143523 31632010 30688032 29164852 17480677 857828
44464H57828m407855J3129410J5951083N688570J816832J0021992J3901888K051770
$$ 857828 -3550027 9579383 25530466 31219036 33035868 43057860 56959748 59011518
44456E9011518j4155340j8053723r444834M60969N262982M913828m49611q318754
$$ 59011518 44856178 26802455 17357621 17818590 23081572 27995400 27545789 19227035
44448A9227035j1493102o689557n22097N19207K91939M841818R631021N581245
$$ 19227035 7733933 1044376 522279 1041486 1333425 6175243 15806264 21387509
44440B1387509m742995q136059O31563J0114745O639183p272238j4502707l928810
$$ 21387509 16644514 8508455 9140018 19254763 25893946 18621708 4119001 190191
44432A90191J4240319J8794776M163210j0551289o144848R462887J1511838n984923
$$ 190191 14430510 33225286 37388496 26837207 20692359 30155246 41667084 35682161
44424C5682161k1103394j4755347M932280J7612627J6548043Q127179k551328
$$ 35682161 14578767 -176580 4755700 22368327 38916370 47043549 44492221
44417D4492221j1551938j0815376J217227J0047003K497293j0871539q446047
$$ 44492221 32940283 22124907 23342134 33389137 35886430 25014891 16568844
44410A6568844R229484J8327302O643432r231147r304735L380769J2869722J4244894
$$ 16568844 25798328 44125630 50769062 41537915 32233180 35613949 48483671 62728565
44402F2728565J3494232J1126880J172266j4617592k3866868j7803890j393147
$$ 62728565 76222797 87349677 88521943 73904351 50037483 32233593 30840446
44395C0840446J2697849J5195184M954974j0875540j9349756j1073975P959047
$$ 30840446 43538295 58733479 63688453 52812913 33463157 22389182 30348229
44388C0348229J8611579R123066r567927j6689429q051002R34216J89202m94593
$$ 30348229 48959808 58082874 48514947 31825518 23774516 24708732 24897934 24403341
44380B4403341R648363K1023724J6403499j614625j3525214j1519827o811595
$$ 24403341 34051704 55075428 71478927 69864302 56339088 44819261 38007666
44373C8007666o694949m118419L244696L323811q815959j6840093o339673J1493107
$$ 38007666 31312717 27194298 30438994 33762805 24946846 8106753 1767080 13260187
44365A3260187J7034425J1806898J0944112J4427871Q500846p197869j6492603
$$ 13260187 30294612 42101510 53045622 67473493 75974339 68776470 52283867
44358E2283867j2701729p658886r698947j0497188j718180R584333J1641683M386836
$$ 52283867 39582138 31923252 22224305 11727117 10008937 19593270 31234953 35621789
44350C5621789k817028l514766R00002L751366j047829j0540662j2159663L22674
$$ 35621789 32804761 29289995 30189997 33941363 32893534 22352872 10193209 10515883
44342A0515883J4114089J2823478J168021j908406O199903P742712n049841j6148767
$$ 10515883 24629972 37453450 38621471 36713065 42912968 50655680 45605839 29457072
44334B9457072j1406366K44172L761610P88548J087628L695504K239267j08406
$$ 29457072 18050706 18294878 22056488 22845036 23932664 27628168 29867435 29759029
44326B9759029L539250R268619P838523K06383m921213n267703n354485o151776
$$ 29759029 33298279 42566898 50405421 50611804 45690591 40422888 35068403 28916627
44318B8916627m985401k965925l272907m869384n319741n316090l781374M074182
$$ 28916627 23931226 20965301 17692394 12823010 7503269 2187179 -1594195 2479987
44310B479987J5577042J7003170K687756j1698977r371588K577088N517729m10097
$$ 2479987 18057029 35060199 37747955 26048978 16677390 19254478 24772207 24362110
44302B4362110J106092J2713994J8340067J0072568n77390l649487m300826q025813
$$ 24362110 25468202 38182196 56522263 66594831 66017441 62367954 58067128 50041315
44294E0041315r281319m220243k89206l066914n866602k168250L000400L563157
$$ 50041315 40759996 36539753 36250547 33183633 27317031 25148781 28149181 31712338
44286C1712338K885568L971619J185994o718711p545417N834363J8647260J3212211
$$ 31712338 34597906 38569525 39755519 33036808 25491391 31325754 49973014 63185225
44278F3185225l288922r307337k091293Q83624p322094j3352586r067344n304670
$$ 63185225 59896303 50588966 48497673 49381297 42059203 28706617 19639273 14334603
44270A4334603j0222758j2494779n68005J5318419J7300038O922914M08650K148665
$$ 14334603 4111845 -8382934 -8950939 6367480 23667518 30590432 30999082 33147747
44262C3147747J284846n932303q508100p5719R145783P624168j418274p618360
$$ 33147747 34432593 28500290 19992190 19916471 29062254 36686422 35268148 27649788
44254B7649788p998465m877833K479808J3000566J6576696M749003j3620948k0169486
$$ 27649788 19651323 14773490 17253298 30253864 46830560 51579563 37958615 17789129
44246A7789129j0888015K43155L502909N511367J2704705J6330761O672571o554019
$$ 17789129 6901114 7144269 10647178 16158545 28863250 45194011 51866582 45312563
44238D5312563m648589J0940807J6729441l70976k2759990k5043400p989884N025905
$$ 45312563 40663974 51604781 68334222 67963246 45203256 20159856 12169972 17195877
44230A7195877K539394j000059Q548219J9845049J1971537j1422340k2671206
$$ 17195877 19735271 18735212 27283431 47128480 59100017 47677677 25006471
44223B5006471p869700J2580484J1428074r482402k5130190k2086203j0293041
$$ 25006471 17136771 29717255 41145329 31662927 6532737 -15553466 -25846507
44216b5846507j487647O105257J6029486K1582986J5677008L277074n671662q745489
$$ -25846507 -27334154 -21228897 -5199411 16383575 32060583 35337657 29665995 20920506
44208B0920506p933402j774293Q544104J1734637j199436j9743626k3155071p815590
$$ 20920506 12987104 11212811 19756915 31491552 30292116 10548490 -12606581 -20422171
44200b0422171P934067R428219L044189J524923M116010K318183k691640j986552
$$ -20422171 -12488104 -3059885 -15696 1509227 5625237 7943420 5251780 3265228
44192C265228M544458P002451K510666R81304P843575J1457765j327776k2381047
$$ 3265228 7809686 14812137 17322803 18304107 26147682 37605447 36277671 13896624
44184A3896624k8301983j0476628J2463287J7823642N733723n187313k902517
$$ 13896624 -14405359 -24881987 -12418700 5404942 11138665 5951352 3048835
44177C048835P257562J4087864J2556893M239224n208759p673737l1183Q468532
$$ 3048835 10306397 24394261 36951154 41190378 35981619 28307882 28276699 36745231
44169C6745231N213688o908431j0003840M100494J9685677J6477545m200196k2676031
$$ 36745231 41958919 35050488 25046648 29147142 48832819 65310364 61110168 38434137
44161C8434137k5489704j6188996m208639N907801J2862036J4886125J1432350
$$ 38434137 12944433 -3244563 -7453202 -1545401 11316635 26202760 37635110
44154C7635110M577243k924195q585238r969918o882828k890803j351488r79092
$$ 37635110 42212353 39288158 30702920 20733002 13850174 10959371 9607883 8628791
44146H628791J492603N500914O706809K257923n720120j0852146p004590M596149
$$ 8628791 10121394 15622308 22329117 24587040 18866920 8014774 1010184 5606333
44138E606333J3565495J1360982L069517j79566O59809m760091j4032436j0850921
$$ 5606333 19171828 30532810 33602327 33422761 34082570 29322479 15290043 4439122
44130D439122O184192J3814408j342665j7210160p781895J4395160J5844500n593548
$$ 4439122 10623314 24437722 23095057 5884897 -1896998 12498162 28342662 22749114
44122B2749114j7896008m355469J5308333J9959755J4180499Q903536J149271
$$ 22749114 4853106 497637 15805970 35765725 49946224 58849760 59999031
44115E9999031j1127851j5945202o843724K314993n86971n630048n13292N921271
$$ 59999031 48871180 32925978 26082254 28397247 27810276 22180228 21666936 27588207
44107B7588207N86654p903073l819360O249940M052907p487077q622371L046364
$$ 27588207 28174861 20271788 16452428 22702368 26755275 19268198 10645827 13692191
44099A3692191R260444K998044k014651J656070L209781k945467m815484L849440
$$ 13692191 22952635 25950679 23936028 25592098 28801879 25856412 21040928 24890368
44091B4890368Q112373m355171k0077449j8454354k361239Q374895O615266K386110
$$ 24890368 33002741 28647570 8570121 -9884233 -12245472 -3870577 2744689 5130799
44083E130799J538211j076687n934100l873613O970581J2960622L225231j2492925
$$ 5130799 6669010 5592323 -341777 -4215390 2755191 15715813 18941044 6448119
44075F448119j4740886P84429J8729536K3656504J5683920M629748l836033j0139162
$$ 6448119 -8292767 -7508338 11221198 34877702 50561622 55191370 51355337 41216175
44067D1216175j2864620p468276M888755J3609101R669324k121651q511926n638778
$$ 41216175 28351555 20883279 25772034 39381135 49050459 46928808 38416882 32778104
44059C2778104l949098j1360694j8852536j2313439M283501J0451151k274281
$$ 32778104 28829006 17468312 -1384224 -13697663 -9414162 1036989 -1237292
44052a237292j5775994r516100R920289J8457856R236017p87044l27189O26216
$$ -1237292 -17013286 -26529386 -16609097 1848759 11084776 10297732 9970543 10596759
44044A0596759o607796j0991004j894327Q486645M089615n277309J411568J8415051
$$ 10596759 3988963 -7002041 -8896368 -409723 3679892 -1597417 -185849 18229202
44036A8229202J8877290r74726j3584291l993927P358276Q33959j0016219m107904
$$ 18229202 37106492 36131766 22547475 18553548 25911824 26745783 16729564 12621660
44028A2621660J0161215R963102l550112r197174r86272O375843M658199J453334
$$ 12621660 22782875 32745977 29195865 19998691 19012419 25388262 30046461 31499795
44020C1499795J784257Q73957k374407k077722K252297N112120O996023J1654434
$$ 31499795 33284052 34158009 31783602 29705880 31958177 37070297 44066320 55720754
44012E5720754J2856236J973284j1755617r259831P582969J4832600J918431j3274730
$$ 55720754 68576990 70550274 58794657 49534826 57117795 71950395 73868826 60594096
44004F0594096j3595337n975537l147452j271125P690101J6230807J2192611n17763
$$ 60594096 46998759 41023222 37875770 36604645 44294746 60525553 72718164 72200401
43996G2200401q892582j1116510j4255333j7463936j3062542j721149O679178
$$ 72200401 63307819 52191309 37935976 20472040 7409498 5688349 12367527
43989A2367527O469011P25700n559073q527260n038746K682846O017968J292766
$$ 12367527 18836538 19562238 14003165 5475905 437159 3120005 9137973 10430739
43981A0430739l270307l96037L353409j355412q960394o222188O322962J4593803
$$ 10430739 7160432 6764395 10117804 8762392 -198002 -6420190 -97228 14496575
43973A4496575J2113177P187924P185536Q050493L458939n174575j2134447j4006510
$$ 14496575 26609752 33797676 40983212 49033705 52492644 47318069 35183622 21177112
43965B1177112j0106805k270447M176954M812282K145485J962546M455073N218332
$$ 21177112 11070307 8799860 12976814 17789096 19934581 21897127 26352200 31570532
43957C1570532L485626J734222j181986p154110j0172797j965931J2416232J6704650
$$ 31570532 35056158 36790380 35608394 28454284 18281487 16315556 28731788 45436438
43949D5436438N304353p868655q447086K18486N461960L568423M93338M3213Q69991
$$ 45436438 50740791 42872136 34425050 34643536 40105496 43673919 44167257 44210470 45080461
43940D5080461K267218M446705M385273j287796r644808j3818114j1897659q066376
$$ 45080461 47347679 51794384 56179657 54891861 45247053 31428939 19531280 11464904
43932A1464904n022665j110148L939593O184256L571351Q30746L794395J0301792
$$ 11464904 6442239 5332091 9271684 15455940 19027291 19858037 23652432 33954224
43924C3954224J1352517K590570q688309j1411621m637896Q01990l479569j1441721
$$ 33954224 45306741 47897311 39209002 27797381 23159485 23961475 20481906 9040185
43916I040185r789603L880132J5913239J2186861m632731j7289407j2822293L469726
$$ 9040185 -749418 3130714 19043953 31230814 26598083 9308676 -3513617 -43891
43908d3891J3988911Q061197o151061j0707338R28572J5159926J4234448j497261
$$ -43891 13945020 22006217 15855156 5147818 6076390 21236316 35470764 33973503
43900C3973503j3729255r356442L828546R270994L497225k432854q28686L430851
$$ 33973503 20244248 10887806 14716352 23987346 27484571 25051717 24223031 27653882
43892B7653882L823535K620665L713502K394857p264187j8130593j5542602J090940
$$ 27653882 31477417 34098082 37811584 40206441 32942254 14811661 -730941 359999
43884C59999J4128697J1026117J481507J900833J0761194J2205254O70788j1477693
$$ 359999 14488696 25514813 26996320 28897153 39658347 51863601 52534389 41056696
43876D1056696j1710319j357548J0427026J6714255J3961216K770223q703833
$$ 41056696 29346377 27988829 38415855 55130110 69091326 71861549 63157716
43869F3157716j0794075n293915l499166q327145r586202j955813N109885L656305
$$ 63157716 52363641 47069726 43570560 35243415 25657213 23701400 28811285 32467590
43861C2467590P53043M392659P609857J355603o430394k286767Q506604Q582884
$$ 32467590 33220633 37613292 45223149 46578752 40148358 37861591 46368195 54951079
43853E4951079k994258q997138k407361L458789q68602n276061R73861R507753
$$ 54951079 51956821 42959683 40552322 44011111 43142509 37866448 38840309 48348062
43845D8348062N977840o411477j0889614q88013J2179488J4866795O837111j984783
$$ 48348062 54325902 47914425 37024811 36136798 48316286 63183081 70020192 68035409
43837F8035409m587553m168890q240450j6708214j9761491j0607464M282303J3724984
$$ 68035409 63447856 59278966 51038516 34330302 14568811 3961347 8243650 21968634
43829B1968634J5984378J5473106J0150840m106688j8259219j6111209R20983
$$ 21968634 37953012 53426118 63576958 59470270 41211051 25099842 26020825
43822B6020825J1545549L966554q339492r812154n868633q573575j2718540m907735
$$ 26020825 37566374 41532928 33193436 23381282 17512649 8939074 -3779466 -8687201
43814h687201J1004477J6722425N783861r018889j4440828r486881O48462J0443909
$$ -8687201 2317276 19039701 24823562 15804673 1363845 -8123036 -7474574 2969335
43806B969335J3152295O147143j612279J307504J1397385J3607273L435750o909921
$$ 2969335 16121630 22268773 20656494 21963998 33361383 46968656 50404406 43494485
43798D3494485p195227j381410L079383N619127O131480K06820j0863926j5536781
$$ 43494485 36299258 34917848 37997231 43616358 49747838 49954658 39090732 23553951
43790B3553951p066681N031655Q236042M455145L777162P112796P085503K345702
$$ 23553951 16487270 21518925 29754967 34210112 37987274 45100070 52185573 54531275
43782E4531275j413416l251850p773676j3622173j2605757k841642P165155J0771633
$$ 54531275 53117859 49866009 42092333 28470160 15864403 13022761 20187916 30959549
43774C0959549J0185654P598786k84235j2325767j7309276q341101L729926L284513
$$ 30959549 41145203 48743989 48459754 36133987 18824711 10483610 14213536 17498049
43766A7498049o827559p994269P187434K3046481K1350912M384465j0024897j0575213
$$ 17498049 10670490 2676221 9863655 32910136 54261048 58645513 48620616 38045403
43758C8045403j623272O334071P409398K436094l095499k723268M578874J1492132
$$ 38045403 36422131 42756202 50165600 52601694 49506195 46782927 51361801 62853933
43750F2853933J0022657J689984m581147m368703j909390j581614j452435J635752
$$ 62853933 72876590 74566574 69985427 65616724 63707334 62125720 60673285 62309037
43742F2309037N389380M833306o16435o389946q028593n035591l15893K876406
$$ 62309037 67698417 72531723 71915288 65525342 57496749 52461158 52145265 55021671
43734E5021671L913502M627240N299412K754867m433216j0847986r655799k547881
$$ 55021671 58935173 63562413 68861825 71616692 67183476 56335490 46679691 44131810
43726D4131810J873203J64988k283174j336158l72671k765279n109319l315928
$$ 44131810 46005013 46170001 43886827 42550669 42177998 39412719 34303400 30987472
43718C0987472J25556O97983j028696k466831m559320q067714q722693l216470
$$ 30987472 31113028 31811011 30782315 28315484 23756164 15688450 6965757 3749287
43710C749287L417248L885629n64992l017368k226908k647824m230213j322016
$$ 3749287 7166535 11052164 10487172 7469804 5242896 2595072 -1635141 -2957157
43702b957157O975747J3355400J2021904N978570J838205J821480L325964L258216
$$ -2957157 4018590 17373990 29395894 35374464 37212669 39034149 42360113 45618329
43694D5618329J114132m33494J687217N902198O291675R97839l639243k450318
$$ 45618329 46732461 46298967 47986184 53888382 60180057 61177896 57538653 55088335
43686E5088335m47683m972435j2713979j4136651q397444l034393j07035M936376
$$ 55088335 54640652 49668217 36954238 22817587 14420143 11385750 11278715 16215091
43678A6215091J0106828O656941m374997r521905l226757K736759r00499m856919
$$ 16215091 26321919 32978860 28603863 19081958 15855201 18591960 17691461 12834542
43670A2834542K297752J2704660J0215590l752736j2213701p880198l28994K135178
$$ 12834542 15132294 27836954 38052544 34299808 22086107 14205909 13876915 16012093
43662A6012093K102812J854946k423550r501691r481762O17794Q820054N326548
$$ 16012093 18114905 19969851 17546301 8044610 -1437152 -819358 8000696 13327244
43654A3327244j753954O62246R215048R455127o88485p540056l131162L679419
$$ 13327244 11573290 12235536 21450584 30905711 30217226 22677170 19546008 23225427
43646B3225427K954053r92979J053964O724136O482791R19076J136310J0350734
$$ 23225427 26179480 25186501 26240465 32964601 39447392 40366468 41502778 51853512
43638E1853512J6309102Q269350o232620j0732736k705446L127393l805814j4356193
$$ 51853512 68162614 76431964 70199344 59466608 56761162 59888555 56082741 41726548
43630D1726548j2468210J490499J0288001L563030q005519q844095j316546p20416
$$ 41726548 29258338 30748837 41036838 44599868 36594349 27750254 26433708 25713292
43622B5713292r643816j2059238J437866J5844420J1536081o540866j5322449
$$ 25713292 16069476 4010238 5448104 21292524 32828605 26287739 10965290
43615A0965290o418265M720284M937152J515857N661698J2136513Q772906k279628
$$ 10965290 4547025 9267309 14204461 15720318 21382016 33518529 42291435 40011807
43607D0011807p274593j557992N002773L193357m568243r618623p027643K74753
$$ 40011807 32737214 31179222 36181995 39375352 34807109 25188486 18160843 18435596
43599A8435596L757039j883047r433607n344788R854291J7251227N529831r232920
$$ 18435596 22192635 20309588 10875981 5531193 15385484 32636711 38166542 28933622
43591B8933622n233126J1762234J7048087N203154l881517L67336L207288p015538
$$ 28933622 23700496 35462730 52510817 57713971 53832454 54199790 57407078 50391540
43583E0391540j6730229r610687N409066P897987k614715q493396k376280M520021
$$ 50391540 33661311 24050624 29459690 37357677 34742962 26249566 23873286 28393307
43575B8393307K382347l858364m399643K202847R184531R427936J913150o423524
$$ 28393307 30775654 26917290 22517647 24720494 33905025 43332961 45246111 38822587
43567C8822587o707038J418128R116666J0629212R615413R246959M909412n736306
$$ 38822587 32115549 33533677 42650343 53279555 62894968 72141927 77051339 71315033
43559G1315033j3963430j1229846k435901K324238K686251L781468M283655J737898
$$ 71315033 57351603 46121757 43685856 46010094 48696345 52477813 56761468 58499366
43551E8499366K894939J2915461J9807506Q475382j2190314j7223082k211360
$$ 58499366 61394305 74309766 94117272 102592654 90402340 73179258 70967898
43544G0967898R699810L512193o563900l271520N774668L082834r827571j7475420
$$ 70967898 80667708 84179901 77616001 74344481 80119149 83201983 73374412 55898992
43536E5898992j5499262j1426125n269136J0556471L1328781L8823670K6222743
$$ 55898992 40399730 28973605 23704469 34260940 65589721 104413391 130636134
43529A30636134R860870P560186J5884905J8730519J0696699M24362n351528r000650
$$ 130636134 140497004 148057190 163942095 182672614 193369313 193793675 188442147 179441497
43521A79441497j3057053j5065124j4681291j6387685j9646800j5385272j017740
$$ 179441497 166384444 151319320 136638029 120250344 100603544 85218272 84200532
43514H4200532Q885732O6916j7321801j8281278J915666J9028653J3129978n213464
$$ 84200532 93086264 93153180 75831379 57550101 59465767 78494420 91624398 86410934
43506H6410934j3741711r863996o676155o835867m25019J3401893K1687052J7574965
$$ 86410934 72669223 62805227 56129072 49293205 48868186 62270079 83957131 101532096
43498A01532096R603935O477149N414141J247108l492259l523562J794518R592067
$$ 101532096 111136031 117613180 123027321 124274429 120782170 117258608 119053126 128645193
43490A28645193J4853550R998901o961982k3142610k1991980n912203O005602
$$ 128645193 143498743 153497644 146535662 123393052 101401072 95488869 101494471
43483A01494471N588608L984366O733167J188404j7614485k8162167j1337203
$$ 101494471 107083079 111067445 117800612 118989016 101374531 73212364 61875161
43476F1875161J5025310J6414758q855937k7023345j7335394K576875Q286447
$$ 61875161 76900471 93315229 84459292 57435947 40100553 42677428 50963875
43469E0963875K494901J776835O484718M623165k695237j562083Q936546J1041123
$$ 50963875 53458776 55235611 61720329 66343494 63648257 62086174 71022720 82063843
43461H2063843m439059k0818593j7927465j578358N464416k246216o387353L836346
$$ 82063843 77624784 56806191 38878726 37300368 42764784 40518568 34131215 37967561
43453C7967561J2925136M095237j1478989r717674Q941944J8934391P092355j0250969
$$ 37967561 50892697 54987934 43508945 33791271 42733215 61667606 68759961 58508992
43445E8508992j4502520j0321879j1759518j7443393j5097359k249468J2120003
$$ 58508992 44006472 33684593 21925075 4481682 -10615677 -12865145 -745142
43438g45142K1242261K3129413J4559677l759282j8776613j5637094L038228J9549264
$$ -745142 20497119 43626532 58186209 54426927 35650314 20013220 23051448 42600712
43430D2600712K2879556J7408782J0056374J124549q848552j4067645j1253472
$$ 42600712 65480268 82889050 92945424 94069973 85221421 71153776 59900304
43423E9900304n526366l589118n843990q434376q451279m669554K112007P105602
$$ 59900304 54373938 50784820 44940830 36506454 28055175 23385621 25497628 32603230
43415C2603230M698686l621099q680458m090909N767195J1099006P808708O07295
$$ 32603230 37301916 33680817 25000359 20909450 26676645 37775651 45584359 46191654
43407D6191654l725446l560260k198888j866203q31525J816850K147607k447243
$$ 46191654 42466208 38905948 36707060 34840857 34009332 35826182 37973789 35526546
43399C5526546n675599K1133Q211849K889561j7032228k9889782j7441599J0739446
$$ 35526546 29850947 29872080 38083929 40973490 23941262 -5948520 -23390119 -12650673
43391a2650673L0103944L0020128J7406370j67171j8266615k6712784j5507790
$$ -12650673 17453271 47473399 64879769 64712598 46445983 19733199 4225409
43384D225409Q325793K4368387K2174460R482613l299830j3099350j7023093j0425206
$$ 4225409 12551202 36919589 59094049 68576662 65276832 52177482 35154389 24729183
43376B4729183K430062Q476746K948643m025524l266326J195982J276298l056628
$$ 24729183 27159245 35635991 38584634 34559110 31292784 32488766 33765064 30708436
43368C0708436o275534m109490N301506J8370615K2893748R702990j0502174j6269241
$$ 30708436 24432902 20323412 25624918 43995533 66889281 76592271 66090097 49820856
43360D9820856n096736K520258m599963j0691647j62725J4917884J2622197n157796
$$ 49820856 44724120 47244378 42644415 31952768 31790043 46707927 59330124 54172328
43352E4172328j6503862j0881294J292061P715594O869828K191101k913949l637687
$$ 54172328 37668466 26787172 28079233 35794827 42664655 44855756 41941807 38304120
43344C8304120K111543Q330799Q266571M972723N630729Q554283O127086j784072
$$ 38304120 40415663 48746462 57013033 61985756 67616485 76170768 82297854 80513782
43336H0513782q000468j0065286j1722384j3119261r445366J81306J0276265J5265434
$$ 80513782 72513314 62448028 50725644 37606383 28161017 28342323 38618588 53884022
43328E3884022J2392646J416244j1823229j6070425p233874M356958P889942O849492
$$ 53884022 66276668 67692912 55869683 39799258 32565384 36922342 44812284 51661776
43320E1661776R019491R367598j574409j7076786j9942652q241873K057924K058034
$$ 51661776 60681267 70048865 68474456 51397670 31455018 23213145 25271069 27329103
43312B7329103Q78612P333135J5579020J5379525N426728q376918j8280574j6335156
$$ 27329103 28207715 35540850 51119870 66499395 71926123 63549205 45268631 28933475
43304B8933475j945031J0893952O970965p696611j1478826J739412J3330432P678193
$$ 28933475 26988444 37882396 44853361 37156750 25677924 27417336 40747768 48425961
43296D8425961o874551j3200866p300534L985532J4230609J7462910R367725k937841
$$ 48425961 41551410 28350544 21050010 25035542 39266151 56729061 66096786 63158945
43288F3158945m845336M193391P574121j407476o995636J981911J1063703L923450
$$ 63158945 58313609 62507000 70081121 68673645 61678009 63659920 74723623 78647073
43280G8647073r437778j0212397l137138o166771j6770483j5652571o26272R808253
$$ 78647073 69209295 58996898 55859760 49692989 32922506 17269935 16643663 26451916
43272B6451916P601975M891345Q496003Q088395k553342j2677406j2337263o391637
$$ 26451916 34053891 38945236 47441239 55529634 52976292 40298886 27961623 21569986
43264B1569986j807032L851975J2139786J5879182J1108679M740559J859107k192512
$$ 21569986 19762954 23614929 35754715 51633897 62742576 67483135 69342242 67149730
43256F7149730q484709o937656O426427J6801415R093549r390052j8445784j1448022
$$ 67149730 58665021 51727365 58153792 74955207 84048756 74658704 56212920 44764898
43248D4764898Q0617M249253p3615p258680j0654881o219245K743537P338539
$$ 44764898 44845515 49094768 49021153 41762473 31107592 24888347 27631884 34970423
43240C4970423M488994J174716K388636L027503j199200m181235m96894K944683
$$ 34970423 39459417 40634133 43022769 46050272 44851072 40669837 40172943 43117626
43232D3117626j672055p969068n301660K898054N495662K868861L782263P274068
$$ 43117626 41445571 33476503 28174843 31072897 36568559 39437420 43219683 50493751
43224E0493751M876555j577637k332262J291319p66244o012819j612260R544977
$$ 50493751 55370306 53792669 51460407 52751726 51985482 45972663 44360403 53905380
43216E3905380Q282906q323114j7645370o609454O810836L881673m079198K992971
$$ 53905380 62188286 53865172 36219802 29610348 36421184 40302857 36223659 39216630
43208C9216630J8553125K0907402Q868714o39102l874827j1622625k1309327j5930657
$$ 39216630 57769755 78677157 87545871 86906769 83031942 71409317 50099990 34169333
43200C4169333M986064J8775103J2203011j011233m600714j620994r04888n02678
$$ 34169333 39155397 57930500 70133511 69122278 64521564 62900570 61995682 61493004
43192F1493004J961204p87359j0301621j2126086K008193J4963826O892332j2820117
$$ 61493004 63454208 62666849 52365228 40239142 42247335 57211161 64103493 51283376
43184E1283376j7782688k829294J1897940J2814518O910849K467450k613929p271958
$$ 51283376 33500688 30671394 42569334 55383852 62294701 64762151 62148222 54876264
43176E4876264j913094J3003876J8932652L120010k0236791k6386430j1294868
$$ 54876264 52963170 65967046 84899698 88019708 67782917 41396487 30101619
43169C0101619N984297R200480J934140k023290K624960P316566J531793j1603040
$$ 30101619 36085916 45286396 47220536 45197246 47822206 55138772 56670565 45067525
43161D5067525j5530232j189603J5955284J1513542j3673073k9359361j4146816
$$ 45067525 29537293 28347690 44302974 55816516 42143443 12784082 -1362734
43154a362734J5174858K6383810J4199064J193418L98735n06681j2132001k1475294
$$ -1362734 13812124 40195934 54394998 55588416 55987151 55480470 43348469 21873175
43146B1873175j2269989O153534J0276648j885740p144307P237427K3465901K0231216
$$ 21873175 9603186 15756720 26033368 24147628 17003321 24240748 47706649 67937865
43138F7937865M952426Q77028R698524R415178q971265k5081420j9930701m324785
$$ 67937865 72890291 73767319 83465843 92881021 83909756 58828336 38897635 34572850
43130C4572850L69017l998264L56068J3479552J6133207K452403r752077q033977
$$ 34572850 34941867 30943603 31299671 44779223 60912430 63364833 53612756 45578779
43122D5578779l164565o825140j0428032j829821J1390789J3572385O383884M176592
$$ 45578779 42414214 35589074 25161042 23331221 34722010 48294395 54678279 58854871
43114E8854871R321711R869706J20205j1887078j7642197j6163036q761125K308119
$$ 58854871 68176582 78046288 78166493 66279415 48637218 32474182 23713057 26021176
43106B6021176R875502P803005J200420L68716N079590N598675j440869r547163
$$ 26021176 35896678 43699683 44900103 45268819 50348409 55947084 54506215 44959052
43098D4959052j3977101j5000463j0742931q6075Q230110M643498l149455J286798
$$ 44959052 30981951 15981488 5238557 5152482 13382592 18026090 14876635 16163433
43090A6163433J4782742J5321566k699240j5816494o215028J0867612J1488065
$$ 16163433 30946175 46267741 43568501 27752007 21536979 32404591 43892656
43083D3892656j477391p665448k731786j74296n200397q312773m544400o43560
$$ 43892656 42415265 34749817 32018031 31843735 26643338 18330565 13786165 13142605
43075A3142605p72983j39273L890481O710387N736670M436592M428619K484247
$$ 13142605 12369622 12230349 16120830 22831217 28567887 33004479 37433098 39917345
43067C9917345k526914p416707j0236325j0840525o772456L021569J1529571J0240656
$$ 39917345 37390431 29973724 19737399 8896874 2124418 5145987 16675558 26916214
43059B6916214J909082k710396j45134L832546O273161R030874Q852287n01707
$$ 26916214 28825296 26114900 25969766 29802312 36075473 45106347 53958634 53456927
43051E3456927j3461399j4126928J378952J5967748J2513601n562790k1567285
$$ 53456927 39995528 25868600 27247552 43215300 55728901 50166111 28598826
43044B8598826k5048023j7192834m344663O344804R942561Q240617P358916Q325512
$$ 28598826 3550803 -13642031 -17986694 -11641890 -1699329 6541288 13900204 22225716
43036B2225716O065345m80609n360622n143824k543379J621165R258922J5085863
$$ 22225716 28291061 27810452 22449830 17306006 14762627 16383792 25642714 40728577
43028D0728577R205539n220402j1338339l266044L795887j607763q322032l064866
$$ 40728577 49934116 44713714 33375375 30109331 33905218 32297455 23975423 20910557
43020B0910557N499940K548868n029096K01078J3749593J2772603p677452k4463687
$$ 20910557 26410497 28959365 23930269 24131347 37880940 50653543 42976091 18512404
43012A8512404j7567729N861316K4346900K5185842J0254670q820354j7286310
$$ 18512404 944675 6805991 31152891 56338733 66593403 57773049 40486739
43005D0486739r726945J994400L210631k778351k047872M288523R57557j2994742
$$ 40486739 30759794 32754194 35964825 33186474 31138602 35427125 36384682 23389940
42997B3389940j8005895m138592J2036367J2208591J490398m474116l510353l000461
$$ 23389940 5384045 1245453 13281820 25490411 26980809 22506693 18996340 15995879
42989A5995879k639542L128762J1430519J2900906M201237r625469k0597635k0256294
$$ 15995879 13356337 16485099 27915618 40816524 45017761 35392292 14794657 -5461637
42981e461637n077711J4644289K1719203J4417961R269207J3799293J2849298
$$ -5461637 -10539348 4104941 25824144 40242105 49511312 63310605 76159903
42974G6159903m958097k3758034k2261608o235217K034711k384406n688895j658295
$$ 76159903 71201806 47443772 25182164 18946947 20981658 18597252 12908357 11250062
42966A1250062K688790M323361O241013M728127n172848j3848634p584256P112659
$$ 11250062 13938852 18262213 24503226 29231353 24058505 10209871 2625615 9738274
42958I738274J1356821M245312J526068M757532q20360j4508503j5494065J650030
$$ 9738274 21095095 25340407 26866475 31624007 30803647 16295144 801079 2451109
42950B451109J5037392J1033626M635631R242872J2672238K986498n781078K664916
$$ 2451109 17488501 28522127 33157758 42400630 55072868 58059366 52278288 54943204
42942E4943204J6940316J6529874M394078l572340p262483j4675878j8276927
$$ 54943204 71883520 88413394 92807472 89235132 81972649 67296771 49019844
42935D9019844p182938O386631K024819j3534640j5502917k079396M211644l375629
$$ 49019844 41836906 48223537 50248356 36713716 21210799 19131403 23343047 19967418
42927A9967418n798140N955811J5053216R539479K094676M839758P482462k375346
$$ 19967418 14169278 20125089 35178305 44717784 46812460 51652218 59134680 56759334
42919E6759334j5659525j6852603q813548m702174n087455k96842J0314470J6546270
$$ 56759334 41099809 24247206 15433658 10731484 5644029 5347187 15661657 32207927
42911C2207927J2503819K686173n623345q694761o898484l526948p28323M307150
$$ 32207927 44711746 47397919 41774574 33079813 26181329 22654381 21926058 26233208
42903B6233208J3475953J8861641J0087171q023906j7521799j0871168J50713
$$ 26233208 39709161 58570802 68657973 60634067 43112268 32241100 32391813
42896C2391813L765200K676261K831780K135530p61274R2945N954378P981026
$$ 32391813 36157013 38833274 41665054 43800584 43039310 43132255 49086633 57067659
42888E7067659L660570L845044J1454341R681051j1643818l2723901k7990599
$$ 57067659 60728229 64573273 76027614 85708665 74064847 41340946 13350347
42881A3350347l161170J4130085J3455250Q328274Q078091P006147K357141J252374
$$ 13350347 10189177 24319262 37774512 46102786 54180877 61187024 63544165 64796539
42873F4796539N401261O421377O16849o039302r697341j1381365q083445K985169
$$ 64796539 70197800 76619177 77236026 71196724 61499383 50118018 42034573 45019742
42865D5019742J1601121M150273j2871134j8297592p496692K775962M444453R005651
$$ 45019742 56620863 60771136 47900002 29602410 22105718 24881680 29326133 38331784
42857C8331784J9812644J8671560l963095k6358736k3095635l97593J5872594
$$ 38331784 58144428 76815988 72852893 46494157 23398522 23000929 38873523
42850C8873523J5868943R684702M716553m57003m306638k852124r3924l213032
$$ 38873523 54742466 64427168 69143721 68686718 64380080 61527956 61434032 58221000
42842E8221000r458602j0538190o754966m479222l902562k002398k347851p749508
$$ 58221000 48762398 38224208 31469242 26990020 23087458 21085060 18737209 10987701
42834A0987701q766309L865335J9688967J9959225O425974j109378L784976O336320
$$ 10987701 2221392 6086727 25775694 45734919 52160893 51051515 54836491 61172811
42826F1172811j843221q340726j678133J0381359J4787158J1025015N036150j450392
$$ 61172811 59329590 50988864 49310731 59692090 74479248 85504263 90540413 89090021
42818H9090021n990818l118445L341668m4014j3277311j5798860K310496J8437452
$$ 89090021 83099203 79980758 83322426 83278412 70001101 54202241 56512737 74950189
42810G4950189Q279994j4502792j6704708L121260J2955545q44427j1936561K552162
$$ 74950189 83230183 68727391 52022683 55143943 68099488 67255061 55318500 57870662
42802E7870662K3874742J9070028j0359667l1776537k5904208n438418R074043
$$ 57870662 81745404 100815432 90455765 58679228 32775020 27336602 36410645
42795C6410645J1576809N799625m129372j1268062p105563O463973J5555037J1778710
$$ 36410645 47987454 53787079 49657707 38389645 31284082 37748055 53303092 65081802
42787F5081802K975550m24414m48611l282083m519242L405546J3574339J0529274
$$ 65081802 68057352 67632938 67184327 63902244 59383002 62788548 76362887 86892161
42779H6892161n032580j2992052j383384J5384308J5345299k657134j9871814
$$ 86892161 81859581 68867529 67484145 82868453 98213752 95556618 75684804
42772G5684804k1442113r038428O820462J6534047J4554298K801237p560617n594142
$$ 75684804 54242691 45204263 52024725 68558772 83113070 85914307 78353690 72759548
42764G2759548O248910J4614848J1770911L111486k498182k160046L086400J1276429
$$ 72759548 79008458 93623306 105394217 108505703 106007521 103847475 106933875 118210304
42756A18210304J6544361J0965086m690067j7816357j7692573p909669L07375
$$ 118210304 134754665 145719751 141029684 123213327 105520754 97611085 97918460
42749I7918460K371196J584160O11573m57995j62842K366920K908328k673796
$$ 97918460 100289656 101873816 102485389 102027394 101864552 104231472 107139800 104466004
42741A04466004r369724p358187L456880J1064399O507488m876868j1120430p478341
$$ 104466004 95096280 87738093 91194973 102259372 108766860 103889992 92769562 85291221
42733H5291221J545678R970462J5067621J6157434J3262020P438752N26897n497401
$$ 85291221 86836899 96807361 111874982 128032416 141294436 148733188 149260085 143762684
42725A43762684q588774p711817m794922l552262m658763l885421K548336J1586405
$$ 143762684 135173910 127462093 122667171 119114909 114456146 110570725 113119061 124705466
42717A24705466J4960019Q041053m357328j2532139j2115746p993477o749835
$$ 124705466 139665485 147706538 143349210 130817071 118701325 110707848 103958013
42710A03958013p232098k559467Q533033J7717517J7425560J0735490O275261
$$ 103958013 96725915 94166448 102699481 120416998 137842558 148578048 154853309
42703A54853309O586097P221412N161824J664001k355076p219016j0675599r408355
$$ 154853309 161439406 168660818 173822642 175486643 173131567 165912551 155236952 145828597
42695A45828597m885084j759632k85858K961101O668180N388407p4917k168737
$$ 145828597 140943513 139183881 138898023 141859124 148527304 153915711 153840794 151672057
42687A51672057O69050Q69452l942383m354359N426326J5825672J5903062J0190044
$$ 151672057 152341107 153210559 149268176 144913817 150340143 166165815 182068877 192258921
42679A92258921Q895953Q707799q86853j5916070k0093026r880868r11678m282349
$$ 192258921 201154874 209862673 208975820 193059750 172966724 163085856 162174178 157891829
42671A57891829j0857730p383304L357285R244375Q402958J0375216J9288243
$$ 157891829 147034099 139650795 143008080 152252455 160655413 171030629 190318872
42664A90318872K5116429J5178030q395270k6379256k1554848o80989R898408
$$ 190318872 215435301 230613331 222218061 195838805 174283957 173602968 183501376
42657A83501376l396503k1797157j9026604J526397J3425448Q558732P214633
$$ 183501376 180104873 158307716 139281112 140807509 154232957 162791689 170006322
42650A70006322K0199826K6764323P566715k0879695k8486053j5374926p549083
$$ 170006322 190206148 216970471 224537186 203657491 175171438 159796512 152247429
42643A52247429j5275153k2169282j5745832m196956K407409O492946J0726237
$$ 152247429 136972276 114802994 99057162 94860206 97267615 103760561 114486798
42636A14486798R351232J226592l340379J323278N771825O17927q749011j1899866
$$ 114486798 123838030 125064622 121724243 123047521 128819346 129437273 120688262 108788396
42628A08788396p950944j741555M782849Q777417M426343n750727q071671K692425
$$ 108788396 100837452 99095897 103878746 112656163 117082506 111331779 103260108 105952533
42620A05952533J1310882L087757j2589916j5732541n736323K83263m195295p495633
$$ 105952533 117263415 120351172 107761256 92028715 86292392 86575655 82380360 74884727
42612G4884727j673730N619905O191120L537397L233739K957805j84315j683452
$$ 74884727 73210997 78830902 85022022 88559419 91793158 94750963 94566648 92883196
42604I2883196K876501Q825757Q361426J450215m891017n457033j410067J448735
$$ 92883196 95759697 104585454 112946880 114397095 109506078 104049045 102638978 104087713
42596A04087713k636029j2865793j9602263j3608335K014695J4923329J8335825
$$ 104087713 101451684 88585891 68983628 55375293 57389988 72313317 90649142
42589I0649142J5202204Q137542l579675j4328162j2427087K499245J3605220
$$ 90649142 105851346 113988888 110409213 96081051 83653964 86153209 99758429
42582I9758429Q206370m349836p975635m530153p691004j6877203j5759910J016617
$$ 99758429 107964799 103614963 95639328 91109175 83418171 66540968 50781058 51797675
42574E1797675J6457967J4187644L75587p068476k520800M974430P914895P315042
$$ 51797675 68255642 82443286 82818873 75750397 73229597 78204027 86118922 93433964
42566I3433964N077544N01355l546818k50764J0647292J8678483J5103235N225492
$$ 93433964 98511508 99012863 95466045 95215281 105862573 124541056 139644291 144869783
42558A44869783J635942P794614J5693934J8878729J9237635J9069310J5390320
$$ 144869783 146505725 154300339 169994273 188873002 208110637 227179947 242570267
42551B42570267P575691L261570Q611287J7678629K0614163J9135689K3116764
$$ 242570267 250145958 253407528 262018815 279697444 300311607 319447296 342564060
42544C42564060L2684419L5691696K5877157J2593162O911862P096452M822799
$$ 342564060 375248479 410940175 436817332 449410494 456322356 463418808 468241607
42537D68241607j495368p387425j0759500j1895732r398281l549896R5806k267519
$$ 468241607 466746239 459358814 448599314 436703582 427305301 423755405 423851211 421583692
42529D21583692n802257m461390j132354j750341l229984J972672J0867009J0888593
$$ 421583692 415781435 411320045 410187691 408437350 405207366 407180038 418047047 428935640
42521D28935640k649315j9291024k5728359j8219375k400437J1406318J2764270
$$ 428935640 426286325 406995301 381266942 363047567 360647130 372053448 384817718
42514C84817718l0035j5138420j9914493j7327572j8514526k1055624j1806415
$$ 384817718 384787683 369649263 349734770 332407198 313892672 292837048 281030633
42507B81030633O204200J0488133p225499k3491151j5568995M735588J0528451
$$ 281030633 287234833 297722966 290497467 267006316 251437321 256172909 266701360
42500B66701360J189766r18781J0402194J6652291P509473l525691m863150n584848
$$ 266701360 267891126 266972345 277374539 294026830 301536303 298010612 293147462 287562614
42492B87562614j5203173k3311949j6631342l152913n35295q576066j2210834
$$ 287562614 272359441 249047492 232416150 229263237 228727942 220151876 207941042
42485B07941042q114683r099987k0092403k6647966j4914784P725172K0667595
$$ 207941042 199826359 190726372 170633969 143986003 129071219 136796391 157463986
42478A57463986J3826833l164063j3743100j2110578p128544r069322j4837841
$$ 157463986 171290819 168126756 154383656 142273078 135144534 126075212 111237371
42471A11237371j1924197J594885R886588j09074j8203353k3060940j1080603
$$ 111237371 99313174 100908059 110794647 110685573 92482220 69421280 58340677
42464E8340677J020218K324280O28350M602343Q382875L761933m145419n729409
$$ 58340677 59360895 61685175 62313525 66915868 75298743 79060676 74915257 69185848
42456F9185848l001696l716325n400012Q2112Q781818P257537n249740j1995164
$$ 69185848 66184152 62467827 57067815 57149927 65931745 73189282 67939542 55944378
42448E5944378k341075J1623320J1500269j957491j0698072m063354Q507324J1591484
$$ 55944378 53603303 65226623 76726892 74769401 64071329 60007975 68515299 80106783
42440H0106783L595995l034950K64156N828135m44720j8639295l1095533k3044994
$$ 80106783 83702778 80667828 80931984 86760119 86315399 67676104 36580571 13535577
42432A3535577j500988J3781427J4956285J1760867J2528750J1389868K56793
$$ 13535577 12034589 25816016 40772301 52533168 65061918 76451786 76708579
42425G6708579j5587125k3021727j7608897o329386L138818P830416O406654k27163
$$ 76708579 61121454 38099727 20490830 14161444 17300262 25130678 31537332 31310169
42417C1310169m949793J95221J2118199J7594842R897556j882079n450880k036978
$$ 31310169 26360376 26555597 38673796 56268638 66166194 64284115 58833235 56796257
42409E6796257k929470j1352414j6419467p998842Q507815J7966459J3809697
$$ 56796257 53866787 42514373 26094906 18096064 26603879 44570338 58380035
42402E8380035M330395j14601N2432j912852o288694o560618j806957r55785j0176136
$$ 58380035 62710430 62595829 62648261 60735409 54446715 47886097 46079140 45123355 34947219
42393C4947219k1667395k1302706n196249J6173639K8589547K4966893Q720287
$$ 34947219 13279824 -8022882 -13219131 2954508 31544055 56510948 65231235
42386F5231235q133152j2545195k655353Q526081P610485k748881r254474p524770
$$ 65231235 57098083 44552888 41897535 50423616 58034101 55285220 46030746 38505976
42378C8505976n274072n428454J05616J3478553K0499676Q921991j1122701j8575034
$$ 38505976 33231904 27803450 27909066 41387619 61887295 70809286 59686585 41111551
42370D1111551r246176J610996L431462K569051O939089J1433228O880596m362213
$$ 41111551 31865375 33476371 36907833 39476884 46415973 57849201 64729797 60367584
42362F0367584j0935503p575759o68439R54318l369424n466889K331788J6712400
$$ 60367584 49432081 41856322 41187883 42142201 38772777 33305888 35637676 52350076
42354E2350076K4326976J6805400K128674n683869n881197r341024j7485563j7339664
$$ 52350076 76677052 93482452 95611126 89927257 84046060 74705036 57219473 39879809
42346C9879809l739905Q277953N221732l216148o92829P203774K258508j2618827
$$ 39879809 36139904 44417857 49639589 46423441 45730612 52934386 55192894 42574067
42338D2574067j3912105M151049J6483634M660354j3414222j0155025J0214505
$$ 42574067 28661962 32813011 49296645 53956999 40542777 30387752 40602257
42331D0602257J9662235Q514701m286344l331959L132237K367633j457545K783136
$$ 40602257 60264492 68779193 64492849 61160890 64293127 66660760 65203215 67986351
42323F7986351J2718597J5033363M199407j1249448j9653990j6552068n319669
$$ 67986351 80704948 95738311 99937718 88688270 69034280 52482212 47162543
42316D7162543O401311J0858946N624894l648021q231165n047319O84215J962432
$$ 47162543 53563854 64422800 70047694 66399673 58168508 53121189 53805404 55767836
42308E5767836j524890k667427M019566J3528938J4443091L379471r297165j1881069
$$ 55767836 54242946 51575519 55595085 69124023 83567114 86946585 77649420 65768351
42300F5768351m772739L788075J0125301J4731358J3658007K300181j2474470
$$ 65768351 60995612 64783687 74908988 89640346 103298353 105598534 93124064
42293I3124064j6464316p583596j03195m723558j4422659j5970914o625694O731730
$$ 93124064 76659748 69076152 68972957 64249399 49826740 33855826 27230132 33961862
42285C3961862J6658448J7312878O570317p045750q635759M075733J5208137J2341438
$$ 33961862 50620310 67933188 74503505 67457755 58821996 62897729 78105866 90447304
42277I0447304K891286j266013l020950r248786j2616745l686345P257217L180524
$$ 90447304 93338590 92072577 89051627 79802841 67186096 63499751 70756968 73937492
42269G3937492r329041p543170R485826J6860516L331364j1366980j0068179m485062
$$ 73937492 64608451 57065281 66551107 83411623 86742987 75376007 65307828 60822766
42261F0822766j0612223j8623411j0238857P671887J1929051n98686q933842l14360
$$ 60822766 50210543 31587132 21348275 29020162 40949213 40350527 31416685 31102325
42253C1102325J3090531J3828694J189835j1326456j1369375J882164J5926655
$$ 31102325 44192856 58021550 59211385 47884929 36515554 38397718 54324373
42246E4324373J4582095l263402j8112587j2697264M226550R966953L05780o793896
$$ 54324373 68906468 65643066 47530479 34833215 39059765 49026718 49332498 42538602
42238D2538602k59262R493611J0551440P265366Q133247R263170K351269r430653
$$ 42538602 42279340 51772951 62324391 69589757 77723004 86986174 89337443 79906790
42230G9906790j5398930j2126643m986527N52942J674388k335809o355574k031308
$$ 79906790 64507860 52381217 47394690 47947632 49622020 47286211 40930637 38899329
42222C8899329Q171138Q660935o456439j8364339q109991J1499693J1125866r683395
$$ 38899329 47070467 55731402 49274963 30910624 22800633 34300326 45426192 35742797
42214C5742797j8747928q4809K0214508J4023153n461423o244246J1158882J6638323
$$ 35742797 16994869 16910060 37124568 51147721 45686298 39442052 50600934 67239257
42206F7239257Q48764j0320489J278851J8101043J7132493M068746l033276n439631
$$ 67239257 68088021 57767532 59046383 77147426 94279919 98348665 95315389 89875758
42198H9875758j4424866k2981669j4541482N200550J2603077K936880l058830
$$ 89875758 75450892 52469223 37927741 43128291 55731368 58668248 55609418
42191E5609418N524586J3094347O256643l728922k000819N195854M347249j336146
$$ 55609418 61134004 74228351 80484994 76756072 74755253 79951107 84298356 82962210
42183H2962210m07943N049111M728521n09534k121277n67569j716139k496053
$$ 82962210 82554267 87603378 92331899 91822365 89701088 89133519 87417380 84921327
42175H4921327K539828O027418j908594j2842824j0342357K003412N832167L27735
$$ 84921327 87461155 93488573 91579979 78737155 68394798 70398210 76230377 76558112
42167G6558112K992502J4407207J1153145j4350198l4033766k3192766K274052
$$ 76558112 79550614 93957821 105110966 90760768 56727002 33534236 35808288
42160C5808288J0415185j099328q882984k853533M869975N959432O076359Q014770
$$ 35808288 46223473 45124145 36241161 33387628 38257603 44217035 50293394 58308164
42152E8308164N922936J4009j237965J950549j224076j1145409j1963267L472211
$$ 58308164 64231100 64245109 63007144 64957693 63733617 52588208 40624941 44097152
42144D4097152J7495920R969736j2557571k4328515j3090480P175006J5960095
$$ 44097152 61593072 71562808 59005237 34676722 21586242 28761248 44721343
42137D4721343Q531727l976902r580892n847452J854934P736268R522477P052928
$$ 44721343 53253070 49276168 39695276 33847824 35702758 43439026 52961503 60014431
42129F0014431J128841m396658l393371M915924J1690574Q276931q69252l015251
$$ 60014431 61143272 56746614 53353243 58269167 69959741 78236672 77367420 74352169
42121G4352169M151900P854573j211296j3943132j4436621j369123J1425567J3642289
$$ 74352169 78504069 86358642 85147346 71204214 56767593 55398470 66824037 80466326
42113H0466326Q432936L157913m99250l275301k725299K469100O931777M751531
$$ 80466326 88899262 92057175 91557925 88282624 85557325 88026425 94958202 99709733
42105I9709733o14281l41510N541280O436751k631755j1163459p221212M009604
$$ 99709733 99095452 98753942 104295222 110731973 108100218 96936759 89715547 93725151
42097I3725151O297023m187931j3123234r183434j98481j33847p310275o765752
$$ 93725151 100022174 95834243 82711009 73527575 73329094 73195247 65884972 59119220
42089E9119220P438308K2614962K2813834P156775j0590395j6580069q024826
$$ 59119220 66557528 89172490 111986324 119143099 108552704 91972635 83947809
42082H3947809O734094J5292720R826827o774325k1613342k1345276n006914J2510843
$$ 83947809 90681903 105974623 115801450 109027125 87413783 66068507 61061593 73572436
42074G3572436J4209073N88172r433519k265656J1313832J0784248l926728j1705741
$$ 73572436 87781509 88369681 78936162 76670506 87984338 98768586 94841858 83136117
42066H3136117j893241J0134847P975672q68721l34235N847264J462931j2071510
$$ 83136117 81242876 91377723 99353395 98484674 98150439 103997703 105460634 93389124
42058I3389124j5130553q21910J3882526J4045645O255906L431206N335521N557701
$$ 93389124 78258571 77436661 91319187 105364832 111620738 115051944 120387465 125945166
42050A25945166N620497Q973405R704034R90382j0466658j1524498j716003O167033
$$ 125945166 131565663 140539068 150243102 151233484 140766826 129242328 127526325 133693358
42042A33693358L987716l158705p057831o746515o418650q214238r324610m577625
$$ 133693358 137681074 134522369 127464538 120718023 114299373 106085135 96760525 92182900
42034I2182900P196725J8416779J8453526O633539n811343j0443720j1314088
$$ 92182900 99379625 117796404 136249930 142883469 137072126 126628406 115314318
42027A15314318j4155828j4164117m657397Q240590J2282604P602095N456369
$$ 115314318 101158490 86994373 82336976 90577566 102860170 110462265 115918634
42020A15918634R051154R244557J830081m014477l35968P002122P538614M10383
$$ 115918634 124969788 134214345 136044426 132029949 131693981 138696103 146234717 146645100
42012A46645100p572086j2039050j2673287r439871l382349K070645N048863O971677
$$ 146645100 139073014 127033964 114360677 104920806 101538457 103609102 108657965 115629642
42004A15629642P371375K889235m184020l712854Q265233J9542546J6321478M436417
$$ 115629642 123001017 125890252 121706232 117993378 126258611 145801157 162122635 166559052
41996A66559052L506914J8777469L1340720K3362353M427519J846016K6027824
$$ 166559052 170065966 188843435 220184155 243546508 247974027 249820043 275847867
41989B75847867N5047686N8154418L0028163m440829j8881418j2405825m361297
$$ 275847867 330895553 389049971 419078134 414637305 395755887 383350062 378988765
41982C78988765p746607j6254539j7124347p570919N471169J4456067J4139923
$$ 378988765 371242158 354987619 337863272 330292353 335763522 350219589 364359512
41975C64359512J784408j7380583k9156010k4131270j0344852l069582l959263
$$ 364359512 366143920 348763337 319607327 295476057 285131205 282061623 278102360
41968B78102360j808893O043516P629104k945384j2600613p708434M937630Q704174
$$ 278102360 276293467 282336983 289966087 287020703 274420090 266711656 271649286 280353460
41960B80353460J578408m663752n553051p643617j1188804o284931Q634211J9411521
$$ 280353460 281931868 277268116 271715065 264071448 252882644 246597713 255231924 274643445
41952B74643445J5278518L125137n874953j1738512j6954422j4469828J30664
$$ 274643445 289921963 293047100 287172147 275433635 258479213 244009385 244140049
41945B44140049J3284553Q872644n333063o579531P356610J2352056o354947l1471468
$$ 244140049 257424602 266297246 260964183 254384652 261741262 274093318 267738371 236266903
41937B36266903l7620450k3423269o691396J186949J626976k592583r793245j3637328
$$ 236266903 198646453 175223184 168531788 169718737 171345713 168753130 158959885 145322557
41929A45322557q241430J783598O883697O535554P197494Q132754J680405j1278859
$$ 145322557 137081127 138864725 145748422 152283976 159481470 167614224 169294629 158015770
41921A58015770j8364382j2664757l257871k927534j1509012j7030735j0385990
$$ 158015770 139651388 126986631 123728760 120801226 109292214 92261479 81875489
41914H1875489M674123J5032852J1326978j311472q401882m323201P39235k236470
$$ 81875489 86549612 101582464 112909442 111597970 103196088 98872887 99612122 97375652
41906I7375652n690990J305443J1758300J0021888q01376j842775Q900776J0386664
$$ 97375652 91684662 92990105 104748405 114770293 113968917 112126142 121026918 131413582
41898A31413582n746656j6671816k957979J7621746J4500140r881979k5054121
$$ 131413582 125666926 108995110 106037131 123658877 138159017 128277038 103222917
41891A03222917j7653674m589972n49455R31322O486780O925497m158747j3793600
$$ 103222917 85569243 80979271 80429816 81361138 87847918 94773415 90614668 76821068
41883G6821068q000699N319485Q140513j030784p890764m846878K292850Q152454
$$ 76821068 68820369 74139854 82280367 81249583 73358819 68511941 70804791 78957245
41875G8957245J3910559J8229767J4542551J847882j0283644j2308940n399877
$$ 78957245 92867804 111097571 125640122 127488004 117204360 104895420 99495543
41868I9495543J271482J65120q719643j7627172j6810663n045698O567558P079222
$$ 99495543 100767025 100932145 92212502 74585330 57774667 52728969 59296527 66375749
41860F6375749L92475p78031N061384N695208m164405j2448298q079466J259498
$$ 66375749 66768224 65990193 71051577 76746785 72582380 60134082 52054616 53314114
41852E3314114J870400l479021j296752Q020221Q985710k917705j0810025q81154
$$ 53314114 55184514 51705493 50408741 58428962 67414672 64496967 53686942 52805788
41844E2805788J5315067J5583926k547838j8855993j6284028L43535J2767306
$$ 52805788 68120855 83704781 81156943 62300950 46016922 46360457 59127763
41837E9127763R553459m337070j4606999j2565329l262750K661325L632741O909668
$$ 59127763 68681222 64344152 49737153 37171824 33909074 36570399 40203140 47112808
41829D7112808J3094773J2014435M17713p821491j056836J0133813Q300764k270793
$$ 47112808 60207581 72222016 72639729 64818238 63761402 73895215 82195979 79925186
41821G9925186k264259R591386J3147646R19569p783819J531939J3038956M290999
$$ 79925186 77660927 87252313 100399959 101319528 93535709 95067648 108106604 112397603
41813A12397603j8690170k9903934j9115866m78331J0500632J1638863P443849
$$ 112397603 93707433 63803499 44687633 44209302 54709934 66348797 73792646
41806G3792646L061498M719491J3133917J7083361O213852j1095320j6760510
$$ 73792646 76854144 81573635 94707552 111790913 118004765 106909445 90148935
41799I0148935r199438m343810q674376r298260K047433J1896584M565652j2506020
$$ 90148935 80949497 76605687 67931311 58633051 60680484 72577068 77142720 64636700
41791F4636700j7390020k614245J7044393K4499971J8098115P921291J561327
$$ 64636700 47246680 44632435 61676828 86176799 104274914 112196205 113757532
41784A13757532k142806p195178j2425600j2647830p265006k320852j267236P7478
$$ 113757532 111614726 104419548 91993948 79346118 72081112 69760260 68493024 68570502
41776F8570502M122476M451317k946387q650467k864984O027702K153939j1257677
$$ 68570502 72692978 77144295 74197908 65547441 62682457 68710159 70864098 59606421
41768E9606421j4484337j549703J1284677J1296735M382721j747971r256006j5678207
$$ 59606421 45122084 43572381 54857058 66153793 70536514 68788543 59532537 43854330
41760D3854330q353267J2863573K5819391J5376268l746120j0601228q033712
$$ 43854330 35501063 48364636 74184027 89560295 85814175 75212947 67179235
41753F7179235q945396q697816L348803J6572959J1754660n188012j0124479J213957
$$ 67179235 58233839 49536023 52884826 69457785 81212445 76024433 65899954 67113911
41745F7113911R464457N799747K206873M542775K696210n686141p390815J375353
$$ 67113911 76578368 82378115 84584988 89127763 91823973 86137832 78747017 80122370
41737H0122370O055507m8035l906705J431415K946709o022500r241231L887291
$$ 80122370 86177877 86129842 82223137 83654552 86601261 80578761 71337530 75224821
41729G5224821J4904801M355916j4476723j5571716o83997P310135K912822J674310
$$ 75224821 90129622 94485538 80008815 64437099 63753102 71063237 73976059 75650369
41721G5650369Q462905R404703j738533j2634224j3534104r812911o913017m23625
$$ 75650369 84113274 93517977 91779444 79145220 65611116 55798205 48885188 48461563
41713D8461563J0478559J4732583M869213r649236j3941024n346865P544341J6938648
$$ 48461563 58940122 73672705 78541918 68892682 54951658 49604793 57149134 74087782
41705G4087782K0167384J7217247J0599589N114075L182493J769865l670576j3219796
$$ 74087782 94255166 111472413 122072002 127186077 130368570 132138435 128467859 115248063
41697A15248063k1124606j9850598p344480Q329486J5184833J0662367M039174
$$ 115248063 94123457 74272859 66928379 75257865 90442698 101105065 105144239
41690A05144239K619254L041009J632641L423236J0701682J2267603q87446j5909204
$$ 105144239 107763493 110804502 112437143 115860379 126562061 138829664 137942218 122033014
41682A22033014j2300155O874465J7545268R599171r07246r0205L032115m531784
$$ 122033014 109732859 116607324 134152592 143751763 142844517 142754312 145786427 141254643
41674A41254643j5893624j4431758J271953J6495977J9854748J3014550L730460
$$ 141254643 125361019 110929261 112201214 128697191 148551939 161566489 165296949
41667A65296949k461069m685753n552902o304061l035209O693217J4188574O872129
$$ 165296949 162835880 158150127 152597225 146293164 143257955 149951172 164139746 171011875
41659A71011875j2234730k3557680j4809032M346436J6866738J6977211Q534889
$$ 171011875 158777145 135219465 120410433 124756869 141623607 158600818 167135707
41652A67135707l074580r630441l115763J0379806J2204874k627798j4368299
$$ 167135707 164061127 154430686 151314923 161694729 173899603 171271805 156903506
41645A56903506p447095L888023k035255j7987683j7848890K579529J9579022
$$ 156903506 149456411 153344434 151309179 133321496 115472606 118052135 137631157
41638A37631157J6761556L843059l551490k995077J300488O794696Q495709J807232
$$ 137631157 154392713 158235772 154684282 151689205 152989693 159784389 168280098 170087330
41630A70087330o067534l206571N498745K870371r900948j0250785P846268J7592019
$$ 170087330 164019796 160813225 166311970 169182341 159281393 149030608 156876876 174468895
41622A74468895q03608k5588356k3531798J147817J6476313J1882491O272868
$$ 174468895 173665287 148076931 124545133 125692950 142169263 154051754 160324622
41615A60324622Q802082M232439j4207864k5852160j2914303J0183250J6400282
$$ 160324622 169126704 173359143 159151279 133299119 120384816 130568066 146968348
41608A46968348K299482j2640007j4179730m424341R305744K0685334K2134310
$$ 146968348 149267830 136627823 122448093 118023752 127329496 148014830 170149140
41601A70149140J0920721k673131n319095J453061M518652p70082o850370j0486219
$$ 170149140 181069861 178396730 173077635 174530696 179049348 178279266 171428896 160942677
41593A60942677j7618301k7438643k7034137j0634858Q461489J5696793J4094555
$$ 160942677 143324376 115885733 88851596 78216738 86678227 102375020 116469575
41586A16469575J3488274J1416922M05824j2832090j3560406k171398O090667
$$ 116469575 129957849 141374771 141780595 128948505 115388099 113216701 119307368
41579A19307368M983158L950311Q352131J0163971M329107j511386j879712l530621
$$ 119307368 124290526 128240837 136592968 146756939 151086046 149574660 147694948 144164327
41571A44164327j0665486j3590915m427380P327344Q511088K028759j195960j256066
$$ 144164327 133498841 119907926 115480546 122807890 131318978 133347737 132151777 130895711
41563A30895711m568581p372988j590305O915496M024987r568405j7815315j2734113
$$ 130895711 126327130 118954142 117363837 124279333 128304320 118735915 100920600 88186487
41555H8186487k971782K492859M396231N004759M165453N410563J1724714J4208286
$$ 88186487 85214705 87707564 92103795 97108554 101274007 106684570 118409284 132617570
41547A32617570J448234j7925128k1263237n346066O903981J742146m979297L381056
$$ 132617570 134065804 116140676 94877439 89531373 96435354 98177500 93198203 96579259
41539I6579259J5290391J0716563n314469j1463094l290072M567154M691521L947632
$$ 96579259 111869650 122586213 117271744 105808650 102518578 107085732 111777253 115724885
41531A15724885M914693j83332j3534329k4750182k4326719j3683141M82169J2725246
$$ 115724885 120639578 120456246 106921917 82171735 57845016 44161875 44644044 57369290
41523E7369290J8756639J7290305J2645025R152905N152454j166489n397266n099392
$$ 57369290 76125929 93416234 106061259 115214164 120366618 119200129 113802863 108703471
41515A08703471p340940j6426767k1466192j1058834N998786J2076683P522652
$$ 108703471 101362531 84935764 63469572 52410738 58409524 70486207 78008859
41508G8008859O141889P956148N65172j2487573j1944720K792487P254415q381966
$$ 78008859 84150748 92106896 92672068 80184495 68239775 71032262 78286677 69904711
41500F9904711j9776096o357521J4872800J6781996M820257M859933J9723608
$$ 69904711 50128615 43771094 58643894 75425890 80246147 85106080 104829688
41493A04829688K6520226J3735877m982282j5352940j8276728j6985038p991330
$$ 104829688 131349914 145085791 140103509 124750569 106473841 89488803 81497473
41486H1497473P782598J9375074J8715804R368558j631528j1013249j5747923
$$ 81497473 89280071 108655145 127370949 136739507 135107979 124094730 108346807
41479A08346807j2672394m817069J058155M906265J1214947J5542294O553838
$$ 108346807 95674413 90857344 91915499 96821764 108036711 123579005 130132843
41472A30132843j4165914k7393666j9037267K106175J6661100J6249557N996190
$$ 130132843 115966929 88573263 69535996 71642171 88303271 104552828 110549018
41465A10549018n683828j1485970o752624M467538J0173769M859471k197032n86680
$$ 110549018 104865190 93379220 86626596 91094134 101267903 106127374 103930342 103343662
41457A03343662N477275M595627l412299p620661k778325M410419O316445L038845
$$ 103343662 108820937 113416564 110004265 102383604 99605279 104015698 110332143 113370988
41449A13370988j414271m347992l830708J126671P576674J0149288P185465K125334
$$ 113370988 111956717 107608725 103778017 104904688 112481362 122630650 129816115 131941449
41441A31941449j499206k874799j823355K071572P742766J2942780J5924110J4706309
$$ 131941449 130442243 127567444 125744089 127815661 135558427 148501207 164425317 179131626
41433A79131626P337094l505060r997291q854900p204578j0964769j2406741j766873
$$ 179131626 186468720 182963660 172966369 164111469 156906891 145942122 133535381 131768508
41425A31768508J1385356N412272k1012213m1026888l3664683j0965452K140938
$$ 131768508 143153864 148566136 127553923 86527035 52862352 41896900 44037838
41418D4037838J961173K460141P280201P342105K967825N121022J1972220O989647
$$ 44037838 45999011 48459152 55739353 63081458 66049283 71170305 83142525 90132172
41410I0132172j1746129k1904021r704955O727327M893680o677633l493510J4036286
$$ 90132172 78386043 56482022 46777067 53504394 58398074 51720441 48226931 62263217
41402F2263217K0876792O755482r933050j1955582m338506K472191R468233J6634793
$$ 62263217 83140009 89895491 79962441 68006859 63668353 66140544 75608777 92243570
41394I2243570J2435066o828468k1109531j0575920J2766861J8871169K177289
$$ 92243570 104678636 97850168 76740637 66164717 78931578 97802747 99980036
41387I9980036j1233398k248250J4967933J4634165o164188k6266004k6743353
$$ 99980036 88746638 86498388 101466321 116100486 109936298 83670294 56926941
41380E6926941q682311J1994625K0130949J2842191j33912p466124p609972o529914
$$ 56926941 48244630 60239255 80370204 93212395 93078483 85612359 78002387 71472473
41372G1472473o111971k481488L273085K460496p803174j6695710j2987188m02301
$$ 71472473 65360502 62879014 66152099 68612595 60809421 44113711 31126523 30724222
41364C0724222R003640J2323034J6007996K0255990J5578893r26821j5848752
$$ 30724222 39727862 52050896 68058892 88314882 103893775 102966954 87118202
41357H7118202j4503381j029353N895922k623062j4379440j3458617k286284K699046
$$ 87118202 72614821 71585468 77481390 74858328 60478888 47020271 44733987 47433033
41349D7433033m222867q938256J461370J7666565J9251461L110539j2121571j1827708
$$ 47433033 43210166 34271910 35733280 53399845 72651306 75761845 63640274 51812566
41341E1812566l301109j524134p089064q727951k608633K609777K61471m209183
$$ 51812566 48511457 46987323 39898259 31170308 28561675 31171452 31432923 27223740
41333B7223740j499304Q351327J5517869J2013003J073017o192442l383735L843050
$$ 27223740 25724436 34075763 49593632 61606635 62679652 56487210 53103475 56946525
41325E6946525N323256m64473n593543m710258j355413l69677q16462l22182k64696
$$ 56946525 62269781 61805308 56211765 51501507 50146094 49776417 48959955 48637773 48373077
41316D8373077j866291k732401j963951k393369k767906L842107J6167484J8701273
$$ 48373077 46506786 43774385 41810434 39417065 36649159 40491266 56658750 75360023
41308G5360023J501718k1317782k7396407j5509695l269862J099909N887715J4406946
$$ 75360023 76861741 55543959 28147552 12637857 9367995 10467904 16355619 30762565
41300C0762565J6749214Q765042Q62217n70319l459094j1535320j2747025l65692
$$ 30762565 47511779 56276821 57139038 56568719 53109625 41574305 28827280 28461588
41292B8461588R886507K183882j1790654q917902Q707827J6199423L869406r556655
$$ 28461588 38348095 40531977 28741323 19823421 28531248 44730671 48600077 39043422
41284C9043422o676400M671666O844616j741832p751087k902797P094693J1543761
$$ 39043422 32367022 37038688 43883304 42141472 34390385 31487588 38582281 50126042
41276E0126042O831170p30574k779342P72329K313005j153072k957139Q59776
$$ 50126042 56957212 56226638 53447296 54219625 56532630 55379558 52422419 53282195
41268E3282195K730561l240902p952308j355003P568609L650753o232105j160511
$$ 53282195 56012756 52771854 44819546 43464543 51033152 54683905 48451800 47291289
41260D7291289J6852787K0287843j170130k1090726j4820839M725445J0133269
$$ 47291289 64144076 84431919 83261789 62171063 47350224 52075669 62208938
41253F2208938L92977n389356k546075k637802o995956m686649L640414L571277
$$ 62208938 62601915 57212559 54666484 52028682 45032726 40346077 43986491 47557768
41245D7557768q130566j6573024j1473408K40912Q697989J1749170P865151m341004
$$ 47557768 39427202 22854178 11380770 11621682 20319671 32068841 39933992 35592988
41237C5592988j4618873p087801J4976326K7684282J8699522L635101l20372J066335
$$ 35592988 20974115 13886314 28862640 56546922 75246444 78881545 78561173 79627508
41229G9627508l941149q567987j031266Q984989J479501k0098384k9100821j2245807
$$ 79627508 75686359 67118372 66087106 75072095 76551596 56453212 27352391 15106584
41221A5106584J2656792K1386352J1686906k74592k238049K838290L782166m354987
$$ 15106584 27763376 49149728 60836634 60562042 58323993 61162283 64944449 60589462
41213F0589462j2386887o597379J0919708J9560707O834038j0674778q034671
$$ 60589462 48202575 41605196 52524904 72085611 78919649 68244871 60210200
41206F0210200J1511589K0273397O636046r720035j0094080l414619o655401j5288436
$$ 60210200 71721789 91995186 98631232 88911197 78817117 75402498 68747097 53458661
41198E3458661j2664397O98762Q151638M568187L114843J1081343J6153407N730253
$$ 53458661 40794264 41493026 49644664 54212851 57327694 68409037 84562444 90292697
41190I0292697j1787018j6839610m846501Q452208P803494l939325j2302069r554440
$$ 90292697 78505679 61666069 56819568 65271776 73075270 69135945 56833876 47279436
41182D7279436r97072M726880N123977K849810J289557L908966J2023262J8766497
$$ 47279436 46282364 51009244 56133221 58983031 60272588 64181554 76204816 94971313
41174I4971313J2192833p704747k1658460j3139857O201654R233946p889525j8302543
$$ 94971313 107164146 99459399 77800939 64661082 70862736 80096682 72207157 53904614
41166E3904614l048274K0709625K3923005M722864j3967764j7412776j1194616
$$ 53904614 50856340 71565965 95488970 100211834 86244070 68831294 57636678
41159E7636678m244844J927470O236004N709562K966325L803473N818470J516837
$$ 57636678 53391834 55319304 61555308 67264870 70231195 74034668 79853138 81369975
41151H1369975o365468o396802K214260O243455p99379q430466o404670M95000
$$ 81369975 75004507 68607705 70821965 77065420 76266041 67835575 61430905 61925905
41143F1925905K700803m20964m972670r688163j0918432k477440J0398703J0152116
$$ 61925905 64626708 64205744 59233074 49544911 38626479 36149039 46547742 56699858
41135E6699858p900618k2442688j3796752O706445J3778541N627808K085819R645819
$$ 56699858 48799240 26356552 12559800 19266245 33044786 38672594 40758413 50404232
41127E0404232J2804781K766071p684293n582090L775263Q639634O723938J202275
$$ 50404232 63209013 65975084 58290791 52708701 56483964 65123598 71847536 73049811
41119G3049811o048233r578316k126399J0443794R969918p876226k2134412j4291475
$$ 73049811 67001578 57423262 55296863 65740657 75710575 67834349 45699937 31408462
41111C1408462N193241J3767512R205074O278487Q654558N823350l702653p491880
$$ 31408462 36601703 50369215 59574289 65852776 74507334 80330684 76628031 69136151
41103F9136151r65206M545040J805784o77562M194038P668726l70103j2952534
$$ 69136151 68170945 72715985 74521769 73844207 78038245 85706971 85336868 72384334
41095G2384334j5243405o051239K474677L500244J916041K306736J398444m172968
$$ 72384334 57140929 51089690 53564367 57064611 58980652 61287388 62685832 58512864
41087E8512864j0107543r256011n92589J0124893J6765235J7437816J3721720
$$ 58512864 48405321 39149310 38556721 48681614 65446849 82884665 96606385
41080I6606385P476684n79059r001756j3634643j0436016j523654M664009K491343
$$ 96606385 104083069 103504010 94502254 80867611 70431595 68907941 73571950 76063293
41072G6063293l471560m313306Q50151L823218R3993l153624L138754J5323847
$$ 76063293 72591733 68278427 69128578 72951796 73045789 69892165 73030919 88354766
41064H8354766J9341800Q258537q656434j7325900j4338419o734220q95205J628165
$$ 88354766 107696566 115955103 107298669 89972769 75634350 68900130 68004925 69633090
41056F9633090p5679n925481r943043m768050N828045P754724m279028j6390673
$$ 69633090 69557411 63631930 53688887 48920837 54748882 62503606 58224578 41833905
41048D1833905j2865498J987028R989487M060165m778419n514869l88948L534404
$$ 41833905 28968407 30955435 40944922 45005087 40226668 34711799 34322851 37857255
41040C7857255N430735O938586N424428r24615o338426l834679M298076R356952
$$ 37857255 43287990 50226576 55651004 54726389 48387963 44553284 48851360 58208312
41032E8208312P826832L537806o65267o150489j2273462j3529748o596516L572307
$$ 58208312 66035144 69572950 68907683 62757194 50483732 36953984 30357468 33929775
41024C3929775Q531065N522350j074000o231887q826301r543290p873093l730255
$$ 33929775 42460840 47983190 46909190 40677303 31851002 22307712 14434619 10704364
41016A0704364L4125N93556K99319M356284J1805180J3692379M298334r506695
$$ 10704364 10738489 11332045 11631364 15987648 27792828 41485207 45783541 36276846
41008C6276846j5674621j1396887l760667K354841Q658717J4727652J4224932
$$ 36276846 20602225 9205338 5444671 7799512 16458229 31185881 45410813
41001D5410813N013090l959984l202300L983661O593736K614261J914813J0256034
$$ 45410813 50423903 46463919 43261619 47245280 53839016 56453277 58368090 68624124
40993F8624124J7954916J1348704p014487j8098250j0000018M439864K532201
$$ 68624124 86579040 97927744 90913257 72815007 62814989 67254853 69787054
40986F9787054j7119749l0100634j8210128M908668J1967243q18692j0547883
$$ 69787054 52667305 22566671 4356543 9265211 21232454 20413762 9865879
40979I865879j083591J6511552K2232559J2301208k344997j2424773j5362819
$$ 9865879 8782288 25293840 47526399 59827607 57482610 45057837 29695018
40972B9695018j1143229k912075K454336J846465P9949J151123J522328j453830
$$ 29695018 18551789 15639714 18094050 19940515 20020464 21171587 22693915 21240085
40964B1240085j924973M701210J1119453Q168150P22342J706019J2431429K0022780
$$ 21240085 19315112 24016322 35135775 43303925 44026267 45732286 58163715 78186495
40956G8186495J4319244j288991j5304902j7478823n512986J0038955J1793760
$$ 78186495 92505739 91216748 75911846 58433023 52920037 62958992 74752752
40949G4752752m494948k0910516j9156642n775601j376519q997702j1323734J73954
$$ 74752752 70257804 49347288 30190646 24415045 23038526 14040824 2717090 2891044
40941B891044J2193856J1200703J962364l507171k709544Q9997L156502N881661
$$ 2891044 15084900 26285603 28247967 24740796 22031252 22121249 25277751 31159412
40933C1159412N973469L844511K554484M98201o262120j2314351o376203R589091
$$ 31159412 37132881 40977392 43531876 44030077 37767957 25453606 19077403 28666494
40925B8666494J8942160J3840051N128640J779671k177891r551459p666383R128303
$$ 28666494 47608654 61448705 66577345 68357016 66179125 56627666 48961283 58089586
40917E8089586K1071351Q575954j5690437k3888802j3965778p750227j1998879
$$ 58089586 79160937 87736891 72046454 48157652 34191874 26441647 14442768
40910A4442768r858649M964721J3230059J648647j2699773p194294J1324069J6123023
$$ 14442768 4584119 9548840 22778899 24427546 11727773 4533479 15857548 31980571
40902C1980571p47055j7663586j3069613P516006K0780402J4940098J142810m118850
$$ 31980571 31233516 13569930 500317 8016323 28796725 43736823 44879633 40760783
40894D0760783M08932M302751M440695P818491J3641814P587178j5571980l5234493
$$ 40760783 41169715 45472466 49913161 57731652 71373466 78960644 63388664 28154171
40886B8154171k7128931K976068K4588934K0694143M406489m550087l619215j206017
$$ 28154171 1025240 4001308 28590242 49284385 53690874 49140787 45521572 44315555
40878D4315555o31893m56828k114604p091787j0873172p657686Q03317O373494
$$ 44315555 43683662 43226834 41112230 34020443 23147271 15489585 16292902 22666396
40870B2666396L842675l438064o921241k339191L475928n07797j2473728j5056373
$$ 22666396 26509071 23071007 16149766 13810575 17286503 16778706 4304978 -10751395
40862a0751395J559290K1105188J9962570M46233j2121374o027302K233089m160876
$$ -10751395 -9192105 11913083 31875653 32321886 20200512 14173210 16406299 12245423
40854A2245423j7649606k0035820p580061Q815434J8384434J6002356L023447
$$ 12245423 -5404183 -25440003 -33020064 -24204630 -5820196 10182160 13205607
40847A3205607q297279k219514J8373607K8774861J3727896r366475j3698637
$$ 13205607 4908328 2688814 21062421 49837282 63565178 54198703 40500066
40840D0500066K89270R699915M083650m822709o571095m914048l936581O20888
$$ 40500066 40789336 50489251 54572901 49750192 43179097 38265049 34328468 34949356
40832C4949356Q765521R291967m376569k0347134k0564206l236583J4686683J6764557
$$ 34949356 43714877 53006844 48630275 28283141 7718935 4482352 19169035 35933592
40824C5933592M260490o895058m944979M225155N783323k957616q083403O17436
$$ 35933592 40194082 33299024 28354045 32579200 38362523 35404907 27321504 27938940
40816B7938940J3785240J5249965L808729q203407j3125318j2981851r461130
$$ 27938940 41724180 56974145 60782874 52579467 39454149 26472298 17011168
40809A7011168j680860O557099R117110P615995Q351688R392914K892744q952202
$$ 17011168 15330308 21887407 31004517 38620512 46972200 56365114 59257858 50305656
40801E0305656j3609553o899060R61756K361394K397240N747086O182631j505587
$$ 50305656 36696103 29797043 30758799 33120193 35517433 41264519 47447150 45941563
40793D5941563r289487o535679L696276R133477M969349k460099n816619l589606
$$ 45941563 36652076 30116397 33812673 42946150 47915499 45455400 39638781 36049175
40785C6049175J052560K887278j781245j0273186j4742647j0846583k111623N475789
$$ 36049175 37101735 39989013 38207768 27934582 13191935 2345352 233729 5709518
40777E709518Q568966N944570k22821k235951N084080J3501304R741620l525048
$$ 5709518 14278484 20223054 20000233 17764282 22848362 36349666 46091286 42566238
40769D2566238r217631k449366J371460o636013j2517004m175465N276478j117729
$$ 42566238 33348607 30899241 32270701 25634688 13117684 8942219 14218697 13100968
40761A3100968j3489644r887567P653029J7682759J4482447J1201469J0054425
$$ 13100968 -388676 -10276243 -2623214 15059545 29541992 40743461 50797886
40754E0797886m47874j5328187j2286347Q586947J5801546m843315k1684797l573002
$$ 50797886 50350012 35021825 22735478 31322425 47123971 42280656 20595859 17022857
40746A7022857K8380174K8863657n084154l1676323k5750438p614969l658402
$$ 17022857 45403031 74266688 69182534 37506211 11755773 4140804 482402
40739D82402q922720m672570Q945717J7346936J5509575R339459P73077j1543038
$$ 482402 -8440318 -13112888 -4167171 13179765 28689340 38028799 38801876 27258838
40731B7258838k0119352j3107551P167689K2062461J7633680M92700j1760826
$$ 27258838 7139486 -5968065 1199624 23262085 40895765 41388465 29627639
40724B9627639j0815658l407426L52614j424736l654708l063555j666007k025446
$$ 29627639 18811981 15404555 15757169 14332433 10677725 7614170 5948163 3922717
40716C922717l219084l434995l388463m104601l647089L65740O604853J1679158
$$ 3922717 703633 -2731362 -6119825 -10224426 -13871515 -13505775 -6900922 4778236
40708D778236J3857510J1682146K596401j0860828j6965114o584005J1118355
$$ 4778236 18635746 30317892 32914293 22053465 5088351 -1495654 9622701
40701I622701J5451605R8959j7434034j7923506l314239J0226457J4512807J3693521
$$ 9622701 25074306 25173265 7739231 -10184275 -13498514 -3272057 11240750 24934271
40693B4934271J0636707K060110j0871500j7832603j1288084K670086J1574412
$$ 24934271 35570978 37631088 26759588 8926985 -2361099 308987 11883399
40686A1883399J1640487R562247J0304035J0113836M828583o89816J149551P044605
$$ 11883399 23523886 33086133 43390168 53504004 58332587 57642771 58792322 65836927
40678F5836927N310194n731502j2773074p757015j743443o044524r812603L742149
$$ 65836927 71147121 65415619 52642545 44885530 43142087 37097563 27284960 31027109
40670C1027109K4018619K1662143n908646k4858460j3249199O580253M202134
$$ 31027109 55045728 76707871 70799225 45940765 32691566 39271819 43473953
40663D3473953j2349257j3827184J925733J1302145O873788L973978O179348r73947
$$ 43473953 31124696 17297512 19223245 30525390 37399178 41373156 47552504 46578557
40655D6578557j5602400j3346303J0405549K3847771N261584k0520103j8299087
$$ 46578557 30976157 17629854 28035403 51883174 57144758 36624655 18325568
40648A8325568N548356J7147132P253952k675111o17728J327799n220360r463947
$$ 18325568 23873924 41021056 48275008 45599897 44982169 46309968 41089608 31625661
40640C1625661k017221Q851420J0644881K561019q226819j4604407j0418672M304527
$$ 31625661 29608440 38459860 49104741 51665760 43438941 28834534 18415862 22720389
40632B2720389J6339853J0892735o493856j3869433k949162R996011R664279K106694
$$ 22720389 39060242 49952977 43459121 29589688 26640526 36636537 46300816 48407510
40624D8407510n67507j033721p668048j4908042r523872P225715J8176738J1555739
$$ 48407510 47840003 46806282 39138234 24230192 14706320 21932035 40108773 51664512
40616E1664512o112539j9324328j9083249q848776J20752k04873n628463m697316
$$ 51664512 45551973 26227645 7144396 -1704380 -1583628 -1788501 -7416964 -12114280
40608a2114280N136808J2483726P898675k123972m670430J658008P412597P005646
$$ -12114280 -6977472 5506254 13404929 11280957 6610527 8268535 15681132 22686778
40600B2686778L274776j6433q29454L694544J2304575J4211959Q16687j7186729
$$ 22686778 25961554 25945121 25115667 28810211 41114786 55326745 56143432 38956703
40592C8956703j8515594p35859J3424092O915450q069787r742907J098968N755641
$$ 38956703 20441109 19705250 33129342 40044792 31975005 22232098 23331066 29086707
40584B9086707j002475m263172M285890J1936869O032922n551216p753388j530132
$$ 29086707 28084232 23821060 28106950 40043819 46076741 40525525 32772137 31242005
40576C1242005J234800o70640J989650R228245R608526K68932o714305l974600
$$ 31242005 32476805 31806165 33795815 43024060 52632586 52901518 46187213 42212613
40568D2212613o20056n605341j1812150q266817J244904M697395N92733k525600
$$ 42212613 41592557 35987216 24175066 15908249 17153153 21850548 22443281 19917681
40560A9917681r97362J747290M759502R336689J1305350N184695n252891j1426602
$$ 19917681 18920319 20667609 25427111 34763800 46069150 51253845 46000954 34574352
40552C4574352j2998214j5082455j5036048n701387R162841J7145350J5269155
$$ 34574352 21576138 6493683 -8542365 -14243752 -5080911 12064439 27333594
40545B7333594J1462421P883733p13288j0600870r993316p47680P45464q357797
$$ 27333594 38796015 46679748 45966460 35365590 25372274 24624594 25370058 17012261
40537A7012261r401082O243027J8736182R572062q399829j1210004J57431O244440
$$ 17012261 7611179 13854206 32590388 42162450 33762621 22552617 22710048 28954488
40529B8954488J296734m179148o172307r251986r634179R18786J4911235J4555254
$$ 28954488 30251222 26072074 19899767 10647781 1013602 1932388 16843623 31398877
40521C1398877p33841j1943569q313067P36549M419858L203214r21250q498750
$$ 31398877 30665036 18721467 10408400 11144949 15564807 18768021 17846771 9348021
40513I348021j2388863k008789J6108257K0482607N240169r567460p520740K232283
$$ 9348021 -3040842 -5049631 11058626 31541233 36781402 27213942 19693202 21925485
40505B1925485M029742p68457l437768n316090r227783o907890P130528J9824210
$$ 21925485 25955227 25186770 21749002 16432912 7205129 297239 7427767 27251977
40497B7251977J5917899J686471n547397l787374l211921l392558M788518J7470409
$$ 27251977 43169876 44856347 39308950 35521576 32309655 28917097 33705615 51176024
40489E1176024J9991961J1330795N709892P514306N364083m223722q658008l190204
$$ 51176024 71167985 82498780 88208672 95722978 101087061 96863339 88205331 85015127
40481H5015127k351915j4681450k4292650j4443108M927658J2562054Q366266
$$ 85015127 82663212 67981762 43689112 29246004 34173662 46735716 55101982
40474E5101982R047640J7000360J6908835M465309m023441J390989O496489m665450
$$ 55101982 64149622 81149982 98058817 102524126 98500685 99891674 106388163 101722713
40466A01722713k2681239k4699436p704395O813913K646291j0419630j2167112
$$ 101722713 79041474 54342038 46637643 53451556 56097847 45678217 33511105
40459C3511105M60709J0828348N667033p841958j1772607j59363J4011360J5355857
$$ 33511105 33971814 44800162 50467195 42625237 30852630 30693267 44704627 60060484
40451F0060484M120019p255445j1953397j4249952j6263641j0390066O813084
$$ 60060484 64180503 56925058 44971661 30721709 14458068 4068002 10881086
40444A0881086K1467955J6817509j413452r544730P38185R497560j045015j7480067
$$ 10881086 32349041 49166550 47753098 38208368 38946553 48444113 47399098 29919031
40436B9919031j4296411N792853J3334408l905470k0823871j0765385J5422177
$$ 29919031 15622620 21415473 34749881 30844411 10020540 -744845 14677332
40429A4677332K4546123O704832j4611719j7428797p095156r62922k869684m460081
$$ 14677332 39223455 45928287 31316568 13887771 6792615 5829693 2960009 -1500072
40421a500072k409104r24058n87164L118778R485575J0518773K426935p390806
$$ -1500072 -3909176 -4833234 -5420398 -2301620 7183955 17702728 20129663 12738857
40413A2738857q661854J18460J0740814J3280381M339224r227915j4655622n893650
$$ 12738857 4077003 4195463 14936277 28216658 32555882 23327967 8672345 2778695
40405B778695P766857J1252381K485440n668048m133279Q70917J45902l997126
$$ 2778695 10545552 21797933 24283373 18615325 14482046 15352963 15498865 11501739
40397A1501739m041411l53336K545387O537135J4317581J7942576P744535r008186
$$ 11501739 7460328 7106992 9652379 16189514 30507095 48449671 56194206 47186020
40389D7186020j4252725n299205J295013l880606r326806l131381P889983J0613593
$$ 47186020 32933295 27634090 28929103 25048497 15721691 12590310 20480293 31093886
40381C1093886N009926q29638m856479q025561o385630R15320M361901j515425
$$ 31093886 36103812 35274174 30417695 22392134 16006504 16921824 21283725 19768300
40373A9768300n209092M270728J4988719O990680j4553540k2976691q088119J0426965
$$ 19768300 14559208 18829936 33818655 40809335 26255795 3279104 -4809015 5617950
40365E617950J3145316N647513L694278Q512703Q827962r99377j4661284k1358490
$$ 5617950 18763266 24410779 28105057 36617760 45445722 44446345 29785061 8426571
40357H426571j4844192K75247J0075944O051148k353534K56487J2062009J6621877
$$ 8426571 -6417621 -6142374 3933570 9984718 7631184 7887671 19949680 36571557
40349C6571557Q959376K020528L098999K388034o537090j2897049p744814q11389
$$ 36571557 45530933 47551461 50650460 53038494 46501404 33604355 25859541 25048152
40341B5048152l346686q006665l055257M913831J918636p789416p654131L522427
$$ 25048152 21701466 13694801 10639544 15553375 17472011 9682595 2028464 5550891
40333E550891R893429M220828l203863l549234q29517K5524K203137Q074711J2304712
$$ 5550891 15444320 19665148 16461285 12912051 12082534 12108058 14311195 22385906 34690618
40324C4690618J0027420L861352j708949n932666q484771p397269l490296j089792
$$ 34690618 44718038 48579390 46870441 40937775 32453004 25055735 21565439 20475647
40316B0475647j942032l378336l425251k403982N19042O186566J0955178R881063
$$ 20475647 18533615 15155279 11730028 9326046 9845088 16031654 26986832 36867895
40308C6867895M267221m78714l541639p615084j0255941n696954M237707J0456630
$$ 36867895 41135116 40656402 37114763 29499679 19243738 13546784 17784491 28241121
40300B8241121R296471N985451M172295J644047j703187k103801j085230n422701
$$ 28241121 37537592 43523043 47695338 49339385 47636198 45532397 44447167 39024466
40292C9024466j3700852j4521760m520851L360721j393227j0256330r173928k03476
$$ 39024466 25323614 10801854 6281003 9641724 8248497 -2007833 -11181761 -11385237
40284a1385237L999832J658762K363780P696732P332546k167614q740374k308835
$$ -11385237 -7385405 -5726643 -3362863 4333869 11666415 9498801 758427 -1550408
40276a550408R618937J3051639O967176J432900O67711o87674m937480n985717
$$ -1550408 8068529 21120168 28087344 29520244 30187955 29500281 24562801 18577084
40268A8577084L8241P420325R215202O476757L707508R83908k876058m658053
$$ 18577084 18615325 26035650 35250852 41727609 45435117 46419025 43542967 38884914
40260C8884914k223467j086275o141538j0698432n355130M465567L831641q038239
$$ 38884914 36661447 35575172 29433634 18735202 13380072 17845639 21677280 13639041
40252A3639041j4483131n974459O823441J1294579R481157P153126J054989r759231
$$ 13639041 -844090 -6818549 4892 11299471 20780628 27933754 28988743 19229512
40244A9229512j2918953K61072J6323006J6209886L631140j782326M602259Q170631
$$ 19229512 6310559 6571631 22894637 39104523 42735663 40953337 45555596 53726227
40236E3726227J121763o639395n981565j424398o11566m003393q984973j2867806
$$ 53726227 54847990 48208595 42227030 40802632 40191066 36187673 27202700 14334894
40228A4334894r955013K349091J3738602J0956354j547562o102973J486881O990388
$$ 14334894 4379881 6728972 20467574 31423928 29876366 23773393 25260274 32250662
40220C2250662L038816L87532O541610J1501890N619372m150776p757551p871898
$$ 32250662 35289478 35677010 42218620 53720510 59339882 55189106 47431555 39559657
40212C9559657r946049r481523k354775L860602K333680k38382K965998L946833
$$ 39559657 29613608 20132085 17777310 21637912 23971592 23733210 26699208 30646041
40204C0646041n714491j5566422j0090476M744758Q445916k734260j0327554j461453
$$ 30646041 24931550 9365128 -725348 4019410 12465326 9731066 -596488 -2057941
$$ [...]
##END NTUPLES=NMR SPECTRUM
##END=
