##TITLE=31Pdec_LR-717-C2-B
 CDCl3, 124 sc
 30.10.2020
##JCAMPDX= 6.0         $$ Bruker NMR JCAMP-DX V2.0
##DATA TYPE= NMR SPECTRUM
##DATA CLASS= NTUPLES
##ORIGIN= UXNMR, Bruker Analytische Messtechnik GmbH
##OWNER= root
$$ XWIN-NMR		Version 3.5
$$ Fri Oct 30 13:16:01 2020 Russian Standard Time (UT+4h)  she@DPX200
##.OBSERVE FREQUENCY= 81.013821
##.OBSERVE NUCLEUS= ^31P
##.ACQUISITION MODE= SIMULTANEOUS
##.ACQUISITION SCHEME= undefined
##.AVERAGES= 124
##.DIGITISER RES= 17
##SPECTROMETER/DATA SYSTEM= spect
##.PULSE SEQUENCE= zgpg30
##.SOLVENT NAME= D2O
##.SHIFT REFERENCE= (INTERNAL, D2O, 0, 182.463)
##AUDIT TRAIL= $$ (NUMBER, WHEN, WHO, WHERE, WHAT)
$$ ##TITLE= Audit trail, XWIN-NMR		Version 3.5
$$ ##JCAMPDX= 5.01
$$ ##ORIGIN= Bruker BioSpin GmbH
$$ ##OWNER= she
$$ F:/spectra/data/she/nmr/P31/1/pdata/1/auditp.txt
$$ ##AUDIT TRAIL=  $$ (NUMBER, WHEN, WHO, WHERE, WHAT)
(   1,<2020-10-30 13:09:24.79 +0400>,<she>,<DPX200>,
      <continue with go, POWCHK disabled, PULCHK disabled
       configuration hash MD5:
       00 E9 B6 7A A2 85 ED C7 34 08 36 98 17 FE 4E 26
       data hash MD5: 32K
       4E 9B 1D 7E F1 FA 8A 57 DE 8D 79 DE B4 F1 31 EF>)
(   2,<2020-10-30 13:15:03.28 +0400>,<she>,<DPX200>,
      <Start of raw data processing
       efp BC_mod = 2 LB = 1 FT_mod = 6 PKNL = 1 PHC0 = -2412.083 PHC1 = 139.2008 SI = 64K 
       data hash MD5: 64K
       50 EB A7 19 9F F9 26 2F 48 96 C5 9A 25 8B 61 C2>)
(   3,<2020-10-30 13:15:17.65 +0400>,<she>,<DPX200>,
      <pk PHC0 = -11.77456 PHC1 = 0 
       data hash MD5: 64K
       90 2C E0 41 43 27 E1 11 37 A0 42 3A 73 AE B6 67>)
(   4,<2020-10-30 13:15:22.10 +0400>,<she>,<DPX200>,
      <abs ABSG = 5 
       data hash MD5: 64K
       78 1C 16 EC 91 A6 74 00 A3 CA FF 20 4D 4F 8F 4E>)
$$ ##END=
$$ 
$$ hash MD5
$$ 45 6C A9 AC 67 EC 26 1E 91 80 9A 6F 7D 35 5C E0
##$RELAX= 
##$RELAX= 
##$RELAX= 
##$RELAX= 
##$RELAX= 
##$RELAX= 
##$RELAX= 
##$RELAX= 
$$ Bruker specific parameters
$$ --------------------------
##$DU= <F:/spectra>
##$EXPNO= 1
##$NAME= <P31>
##$PROCNO= 1
##$TYPE= <nmr>
##$USER= <she>
##$AMP= (0..31)
100 100 100 100 100 100 100 100 100 100 100 100 100 100 100 100 100 100 
100 100 100 100 100 100 100 100 100 100 100 100 100 100 
##$AQSEQ= 0
##$AQ_mod= 1
##$AUNM= <au_zg>
##$AUTOPOS= <>
##$BF1= 81.014009
##$BF2= 200.13
##$BF3= 200.13
##$BF4= 200.13
##$BF5= 200.13
##$BF6= 200.13
##$BF7= 200.13
##$BF8= 200.13
##$BYTORDA= 1
##$CFDGTYP= 0
##$CFRGTYP= 5
##$CHEMSTR= <none>
##$CNST= (0..31)
1 1 145 1 1 1 1 1 1 1 1 1 1 1 1 1 1 1 1 1 1 1 1 1 1 1 1 1 1 1 1 1 
##$CPDPRG= <waltz16>
##$CPDPRG1= <>
##$CPDPRG2= <waltz16>
##$CPDPRG3= <>
##$CPDPRG4= <mlev>
##$CPDPRG5= <mlev>
##$CPDPRG6= <mlev>
##$CPDPRG7= <mlev>
##$CPDPRG8= <mlev>
##$CPDPRGB= <>
##$CPDPRGT= <>
##$D= (0..31)
0 1 0 0 0 0 0 0 0 0 0 0.03 2e-05 3e-06 0 0 0 0 0 0 0 0 0 0 0 0 0 0 0 0 
0 0 
##$DATE= 1604048784
##$DBL= (0..7)
120 120 120 11 120 120 24 19 
##$DBP= (0..7)
150 150 150 150 150 150 150 150 
##$DBP07= 0
##$DBPNAM0= <>
##$DBPNAM1= <>
##$DBPNAM2= <>
$$ [...]
##$SUBNAM3= <"">
##$SUBNAM4= <"">
##$SUBNAM5= <"">
##$SUBNAM6= <"">
##$SUBNAM7= <"">
##$SUBNAM8= <"">
##$SUBNAM9= <"">
##$SW= 369.568048894756
##$SWIBOX= (0..15)
0 1 3 0 0 0 0 0 0 0 0 0 0 0 0 0 
##$SW_h= 29940.119760479
##$TD= 32768
##$TD0= 1
##$TE= 0
##$TE2= 300
##$TE3= 300
##$TEG= 300
##$TL= (0..7)
0 120 53 12 22 120 120 120 
##$TP= (0..7)
150 150 150 150 150 150 150 150 
##$TP07= 0
##$TPNAME0= <>
##$TPNAME1= <>
##$TPNAME2= <>
##$TPNAME3= <>
##$TPNAME4= <>
##$TPNAME5= <>
##$TPNAME6= <>
##$TPNAME7= <>
##$TPOAL= (0..7)
0.5 0.5 0.5 0.5 0.5 0.5 0.5 0.5 
##$TPOFFS= (0..7)
0 0 0 0 0 0 0 0 
##$TUNHIN= 0
##$TUNHOUT= 0
##$TUNXOUT= 0
##$USERA1= <user>
##$USERA2= <user>
##$USERA3= <user>
##$USERA4= <user>
##$USERA5= <user>
##$V9= 5
##$VALIST= <valist>
##$VCLIST= <CCCCCCCCCCCCCCC>
##$VD= 0
##$VDLIST= <DDDDDDDDDDDDDDD>
##$VPLIST= <PPPPPPPPPPPPPPP>
##$VTLIST= <TTTTTTTTTTTTTTT>
##$WBST= 1024
##$WBSW= 4
##$XGAIN= (0..3)
0 0 0 0 
##$XL= 0
##$YL= 0
##$YMAX_a= 14092
##$YMIN_a= -12157
##$ZGOPTNS= <>
##$ZL1= 120
##$ZL2= 120
##$ZL3= 120
##$ZL4= 120
##$ABSF1= 182.463
##$ABSF2= -187.1042
##$ABSG= 5
##$ABSL= 3
##$ALPHA= 0
##$AQORDER= 0
##$ASSFAC= 0
##$ASSFACI= 0
##$ASSFACX= 0
##$ASSWID= 0
##$AUNMP= <proc_1d>
##$AZFE= 0.1
##$AZFW= 0.5
##$BCFW= 0
##$BC_mod= 2
##$BYTORDP= 0
##$COROFFS= 0
##$CY= -3
##$DATMOD= 1
##$DC= 0
##$DFILT= <>
##$DTYPP= 0
##$F1P= 0
##$F2P= 0
##$FCOR= 1
##$FTSIZE= 65536
##$FT_mod= 6
##$GAMMA= 0
##$GB= 0
##$INTBC= 1
##$INTSCL= 5.30512e-09
##$ISEN= 30
##$LB= 1
##$LEV0= 0
##$LPBIN= 0
##$MAXI= 10000
##$MC2= 0
##$MEAN= 0
##$ME_mod= 0
##$MI= 50
##$NCOEF= 0
##$NC_proc= -8
##$NLEV= 6
##$NOISF1= 182.463
##$NOISF2= 159.3651
##$NSP= 0
##$NTH_PI= 0
##$NZP= 0
##$OFFSET= 182.463
##$PC= 4
##$PHC0= -2423.858
##$PHC1= 139.2008
##$PH_mod= 1
##$PKNL= yes
##$PPARMOD= 0
##$PSCAL= 0
##$PSIGN= 0
##$REVERSE= no
##$SF= 81.014009
##$SI= 65536
##$SIGF1= 159.3651
##$SIGF2= -187.1042
##$SINO= 113.3802
##$SIOLD= 16384
##$SREGLST= <1H.CDCl3>
##$SSB= 0
##$STSI= 65536
##$STSR= 0
##$SW_p= 29940.119760479
##$SYMM= 0
##$S_DEV= 0
##$TDeff= 32768
##$TDoff= 0
##$TI= <>
##$TILT= no
##$TM1= 0
##$TM2= 0
##$TOPLEV= 0
##$USERP1= <user>
##$USERP2= <user>
##$USERP3= <user>
##$USERP4= <user>
##$USERP5= <user>
##$WDW= 1
##$XDIM= 65536
##$YMAX_p= 438794323
##$YMIN_p= -83997106
$$ End of Bruker specific parameters
$$ ---------------------------------
##NTUPLES= NMR SPECTRUM
##VAR_NAME=  FREQUENCY,     SPECTRUM/REAL,   SPECTRUM/IMAG
##SYMBOL=    X,             R,               I
##VAR_TYPE=  INDEPENDENT,   DEPENDENT,       DEPENDENT
##VAR_FORM=  AFFN,          ASDF,            ASDF
##VAR_DIM=   65536,         65536,           65536
##UNITS=     HZ,            ARBITRARY UNITS, ARBITRARY UNITS
##FACTOR=    0.456856943014862, 1,           1
##FIRST=     14782.0589164895, 0,            0
##LAST=      -15158.0608439895, 0,           0
##MIN=       -15158.0608439895, -83997106,   0
##MAX=       14782.0589164895, 438794323,    0
$$ Real data points
##PAGE= N=1
##DATA TABLE= (X++(R..R)), XYDATA
$$ [...]
42269h224586J2394231J8402518J6843238J0961311l798391k2614939k6769033
42262b805651j1159258K115977n498110k0010056j5810174N695754J9832807J5491717
42254a2146994O369784M782726M772440j596099p648136l897155L910994K424854
42246c027586q102372j3627247p240311K098313N178556N600429J0017417J4295472
42238E192671R814503j368282q588686p920425n408021n548310o058200m232042
42230b4116792M29569R321930K0614997K3666156J0595856o986871r041102K903411
42222B7387154N904086p842886j6201179k267649J6168476J2980246n956460j3693310
42214A6478478m177289L410303p16071m393144J194627P070738M772759J17852
$$ plain form
42269 -8224586 4169645 22572163 39415401 50376712 46578321 23963382 -2805651
42262 -2805651 -13964909 -11848932 -17347042 -37357098 -53167272 -47471518 -27638711 -12146994
42254 -12146994 -5777210 -994484 3777956 2181857 -5466279 -9363434 -5452440 -3027586
42246 -3027586 -11129958 -24757205 -31997516 -29899203 -24720647 -19120218 -9102801 5192671
42238 5192671 15007174 13638892 5050206 -2870219 -8278240 -13826550 -19884750 -24116792
42230 -24116792 -23687223 -14365293 6249704 29915860 40511716 33524845 24483743 27387154
42222 27387154 33291240 25448354 9247175 6979526 23148002 36128248 30171788 16478478
42214 16478478 12301189 15711492 14995421 10602277 11796904 18867642 23640401 23758253
42206B3758253j30159K02433k604926l300403J397971M277615q64044q196555
42198A4540185q414630j028901Q045029J4076736J4031405P217845o39520k187863
42190D5640286L2037k954025r252555n982773Q297673J6421872P314907o534077
42182E2983345q786824l462482l894165q025377l387971Q839701J3604594N008480
42174E2879301o566587j1355409j0190232o242430m20761K457039l840863j4082798
42166B637260j3555779J257519J5144345J4528954N394652J876029N196723N052987
42158C7532690k821919j1890969j6057782j5374710j0281956j48273J0021878
42151i021041J1068904L109131q03001P745243J7866656J3142066l363845j1358583
$$ plain form
42206 23758253 23628094 23830527 21225601 17925198 19323169 23600784 22736740 14540185
42198 14540185 6125555 5096654 13141683 27218419 41249824 48467669 47828149 45640286
42190 45640286 45672323 42718298 33465743 27482970 35780643 52202515 59517422 52983345
42182 52983345 44196521 40734039 36839874 28814497 25426526 34266227 47870821 52879301
42174 52879301 46312714 34957305 24767073 18524643 18103882 20560921 16720058 2637260
42166 2637260 -10918519 -9661000 5483345 20012299 25406951 27282980 32479703 37532690
42158 37532690 34710771 22819802 6762020 -8612690 -18894646 -19042919 -9021041
42151 -9021041 2047863 5156994 4353993 12099236 29965892 43107958 39744113 28385530
42143B8385530k379597P336470P19653j4765925j7870622l128245J4079303J9872043
42135C2248610J5821887R390166L052628k661416n425301o030668r308857j5074632
42127B2012417j5329041n760646O613845J2768596J2421610J0024607O582584
42120D9333972K136160M04609L067512L985234k545819j0888879r830574K040738
42112C7702953J3967855J5559862N906599q629155j9553477j9914039r350724
42105A5689874L622267R317337P572077O402107R630072J1201354M502324o561299
42097F1376113j0630193l111358O747868O515955l391962j0056443n553504L268884
42089D5165360P208779Q506072J2648127J3771697L056096j1658899j2339837
$$ plain form
42143 28385530 26005933 33342403 34062056 19296131 1425509 -1702736 12376567 32248610
42135 32248610 48070497 57460663 60513291 57851875 52426574 46395906 37087049 22012417
42127 22012417 6683376 922730 7536575 20305171 32726781 42751388 49333972
42120 49333972 51470132 51874741 54942253 58927487 56381668 45492789 35662215 37702953
42112 37702953 51670808 67230670 73137269 64508114 44954637 25040598 15689874
42105 15689874 19312141 28629478 36201555 42603662 52233734 63435088 67937412 61376113
42097 61376113 50745920 47634562 54382430 60898385 57506423 47449980 41896476 45165360
42089 45165360 52374139 60880211 73528338 87300035 90356131 78697232 66357395
42082F6357395J693078J0864245N137919j733643L111907J0436145N678718p823563
42074I3722201j7462925k0751291k0357016j1476885P814750K2831463J8022159
42067G2342456L72675j0500916r521917n594005o16390J0210994K0919630J8582033
42059I6194560L552656j2206662k3669310l0504361k2749890N675320L2690632
42052D8982945K7840742j023600j2659305P971873K7536421J6422576q065054
42045A07006598j2783707K229075J2345837Q251426M54052m825681r815520j2019513
42037I0842567p194641k36000K763232N725273J1364013R830988m257797j5277838
42029I3559797p555837P497839P988980l242899n129153N386021J0431451L342437
$$ plain form
42082 66357395 68050473 78914718 84052637 82318994 85430901 95867046 101545764 93722201
42074 93722201 76259276 55507985 35150969 23674084 31488834 54320297 72342456
42067 72342456 72715131 62214215 52692298 47098293 46481903 56692897 77612527 96194560
42059 96194560 99747216 87540554 63871244 33366883 10616993 16292313 48982945
42052 48982945 76823687 75800087 63140782 71112655 98649076 115071652 107006598
42045 107006598 94222891 96451966 108797803 117049229 117503281 112677600 102862080 90842567
42037 90842567 83647926 83411926 86175158 91900431 103264444 113095432 108837635 93559797
42029 93559797 86003960 93501799 101490779 98247880 93118727 98504748 108936199 112278636
42021A12278636k905974k132026m527177j3516336j5714062k986636J3675344
42014H4171769K0341046J4454262j975440k5449439m1438917l1641436k61407
42007A8200438K4531597K4975609J2395648K740908n728345j6648389j8635344
42000D1832122m452677R281618M525211p960269m889309J1491526J7298590N066790
41992G2193602q127565j1182980j1809001j3646373n762649J3747931K5295887
41985F0708852J4628677m145889r213394j805149J748293j731076k581917o42763
41977E6965634n084092j3150013j1198013J51760L921246l489394l234320J2848222
41969C7731030K2288872N232023k0343573k2711634l963428O362110j87065k118202
$$ plain form
42021 112278636 109372662 107240636 102713459 89197123 73483061 70496425 84171769
42014 84171769 104512815 118967077 116991637 91542198 50103281 18461845 18200438
42007 18200438 42732035 67707644 80103292 82844200 77115855 60467466 41832122
42000 41832122 37379445 46661063 51186274 43226005 38336696 49828222 67126812 72193602
41992 72193602 64066037 52883057 41074056 27427683 21665034 35412965 60708852
41985 60708852 75337529 71191640 61978246 60173097 61921390 60190314 57608397 56965634
41977 56965634 51881542 38731529 27533516 27685276 31606522 28117128 24882808 37731030
41969 37731030 60019902 65251925 44908352 22196718 18233290 24595400 24408335 22290133
41961B2290133R319616J3190811k094200j3944060j445253J8573355J7781194
41954F3671596O65775o427290J194390M538424k809334o562937r56235J570328
41946E4884717m373974o393886K408273R940868N496949l059241l560860J943614
41938E7286460L136359l575311j3202117j7449030r172366Q506260J7920344O092168
41930D9542767j2414508j1307586P250003J2883386n456161k0017479p868500
41923A2611922J2658778J2860757p59786j664969J0324300J0885212n948892j8640162
41915C2327160j3683847k384257L473103P777577J3301442J1157134q41306p783833
41907D3343173P9340R248402K813145j2525168j6617905o922592r18036p063177
$$ plain form
41961 22290133 31609749 44800560 42706360 28762300 27317047 45890402 63671596
41954 63671596 64337371 57910081 59104471 63642895 60833561 54270624 53314389 54884717
41946 54884717 50510743 44116857 46525130 56465998 61962947 58903706 55342846 57286460
41938 57286460 60422819 56847508 43645391 26196361 17023995 25530255 43450599 49542767
41930 49542767 37128259 25820673 33070676 45954062 40497901 20480422 12611922
41923 12611922 25270700 38131457 37371671 35706702 46031002 56916214 50967322 32327160
41915 32327160 18643313 16259056 19732159 27509736 40811178 51968312 51127006 43343173
41907 43343173 43422513 52670915 55484060 42958892 26340987 19418395 18500359 11437182
41899A1437182j0749922K493660K1667845K2076606m03396k1122266j8001791
41892G397918K42049Q327122k84459q053754k438905P236041Q022828L029509
41884B3478349K293851N629846O432580L762388m80120p780743j5348073j2371659
41876E616419K668246J1731169J272763j3298742q233079J0843000J6691481L059367
41868C0350624q018283m489036j293313q880189j1458504N385965K5797761K4563275
41860E1958300M608997q411981l246485N336237J919468r054919j2993757n515707
41852B4600153L128943J592688p907942j1404383k064330P598063J398744j5408638
41844A533298k0426710n193544J3214069J7148992R722465K732339j501500m424952
$$ plain form
41899 11437182 687260 3180920 24848765 46925371 46521975 25399709 7397918
41892 7397918 7639967 15967089 15682630 7628876 5189971 12426012 20448840 23478349
41884 23478349 25772200 31402046 37834626 41597014 41116894 33336151 17988078 5616419
41876 5616419 8284665 20015834 21288597 7989855 -243224 10599776 27291257 30350624
41868 30350624 22332341 17843305 16549992 7669803 -3788701 1597264 27395025 51958300
41860 51958300 56567297 48155316 44908831 50245068 52164536 43109617 30115860 24600153
41852 24600153 27729096 29321784 21413842 10009459 7945129 15543192 16941936 1533298
41844 1533298 -18893412 -24086956 -10872887 6276105 15998570 18730909 17229409 12804457
41836A2804457j454748P379554R148890k939012j2955138l906796J2924827J3018397
41828C4020431k002703n845452R890452K0690730O298405j8788929k6906746j4137792
41820C218396R12501N866701N362643O402356P306503L375232m828560j1581486
41812A6034286j1276754m088324J910846k205794j4095685j9738508r965010O802944
41804c6621999J4418858Q507172p35654l445348l48977K337541J674139o71163
41796a4885431j667907L18536L178997J533065o282019j2096237n378250J1232929
41788b4046317K1250618J4271257K70825l578712M061983Q504674M50403j2731546
41780H453185j8953009j5241423n857000M848405J2064374J0338780J058037m881449
$$ plain form
41836 12804457 11349709 18729263 27878153 24939141 11984003 8077207 21002034 34020431
41828 34020431 32017728 26172276 36062728 56753458 63051863 44262934 17356188 3218396
41820 3218396 4130897 9997598 15360241 21762597 29069100 32444332 27615772 16034286
41812 16034286 4757532 669208 2580054 374260 -13721425 -33459933 -43424943 -36621999
41804 -36621999 -22203141 -13695969 -14431623 -17876971 -18225948 -15888407 -14214268 -14885431
41796 -14885431 -16553338 -16234802 -13055805 -11522740 -17804759 -29900996 -35279246 -24046317
41788 -24046317 -2795699 11475558 11746383 8167671 12229654 20734328 21184731 8453185
41780 8453185 -10499824 -25741247 -31598247 -26749842 -14685468 -4346688 -3288651 -8170100
41772h170100R15975J3032853J8968946J3772085K512597p559514j1311351o852422
41764A5309069R20302K525818l815892q078565l766206J191363p73355j259631
41756B252903R231444J9349747J0576239j1176772k0668834j0455474P91850R58295
41748H59398N99181P776934J1465998M097940j226104O298952J3447866M084295
41740D7404460j2654848j5972561m092800Q364506J4098805J4964720Q972992
41733F1085274m570395j3995065q893410J231482P11274o673494n912843J989413
41725B4972236L333553k291945k856075J612391n79920q009848o091056N711364
41717A5800700J0279357J099509q131632p768609m551436l143182L302793J5452171
$$ plain form
41772 -8170100 -7254125 5778728 24747674 38519759 41032356 33472842 22161491 15309069
41764 15309069 16229371 18755189 14939297 6860732 3094526 4285889 3512534 2252903
41756 2252903 11484347 30834094 41410333 30233561 9564727 -890747 -98897 859398
41748 859398 1458579 9235513 20701511 24799451 23573347 29872299 43320165 47404460
41740 47404460 34749612 18777051 14684251 23048757 37147562 52112282 61085274
41733 61085274 56514879 42519814 33626404 34857886 35569160 28895666 22982823 24972236
41725 24972236 28305789 26013844 23157769 24770160 24190240 16180392 10089336 15800700
41717 15800700 26080057 27179566 19047934 11279325 6727889 3584707 6887500 22339671
41709B2339671K0086586R772324n987710j6463757k0442087j6623233k350661
41702i668867J2774896J2768833P60682l613278K019752j519547j6563581j7298248
41694b0339358O611249K6277685J6997718k755062m116783N520705K065402r645499
41686B0616057p702600L218752Q9533j3209916q891953J5893913L0837491J9580505
41678F0431782J532425l552545k932057r257253j6766172j4953224p132259r14102
41670F456595M819001J1345368J2163737M869762r00452K366930Q085176O346410
41662E5552527k453064j1614016j6801861j5205859n317884P350411J2988303
41655B4498557R706278M686152J705787k298404p418203r176890p490562n189434
$$ plain form
41709 22339671 42426257 52198581 46210871 29747114 9305027 -7318206 -9668867
41702 -9668867 3106029 15874862 16635544 13022266 15042018 13522471 -3041110 -20339358
41694 -20339358 -13728109 12549576 29547294 26792232 22675449 28196154 30261556 20616057
41686 20616057 12913457 16132209 16221742 3011826 -5880127 10013786 40851277 60431782
41678 60431782 61964207 58411662 55479605 46222352 29456180 14502956 7370697 6456595
41670 6456595 11275596 22620964 34784701 39654463 38754011 41120941 49206117 55552527
41662 55552527 53099463 41485447 24683586 9477727 4159843 11510254 24498557
41655 24498557 34204835 38890987 40596774 38298370 30880167 21703277 14212715 9023281
41647I023281J226189J4433831K1927802Q605977j5442940k2366116o371584P577967
41639A8614407K707777o874268m744614J194635j954256p565892m468082J367279
41631a723014N46585m73596N462149P858230k005927r094553J966380J5689590
41623A8225844P921397j1528350j2211332O249558J2918035l056312j5811079
41616B707761p059458O095524L784500m193711K33595J0669773Q795496l292637
41608A7740843o395136N569339J7535057J4849712L3828j2386399j0380053M589875
41600C1157066J6693164J0698538q507503j9396006j1747986k38813j195571p401423
41592A0061466j200121J4370618J6634134l069558k3492236j9677763M844848
$$ plain form
41647 9023281 10249470 24683301 46611103 55217080 39774140 17408024 11036440 18614407
41639 18614407 21322184 14447916 9703302 10897937 8943681 1377789 -3090293 -1723014
41631 -1723014 -1176429 -1650025 3812124 11670354 9664427 569874 2536254 18225844
41623 18225844 26147241 14618891 2407559 8657117 21575152 18518840 2707761
41616 2707761 -4351697 1743827 5528327 1334616 1568211 12237984 21033480 17740843
41608 17740843 11345707 16915046 34450103 49299815 49333643 36947244 26567191 31157066
41600 31157066 47850230 58548768 50041265 30645259 18897273 18658460 17462889 10061466
41592 10061466 8861345 23231963 39866097 36796539 13304303 -6373460 -1528612
41585a528612K2624366J5859975m266941j4348734p748177J126169J85451l709615
41577H193882J349376J0212542O503461j0646786k1073048j0517303R246211J6480061
41569I748396O982390m999334p750248l046839J655587K489999L90195o70335
41561D799811L053236R387860J0476844L392531l793097l161389N43313k205567
41553B2493542q846524p628056K797131R364335M032055m090089l129844L664556
41545A8657106L712645n961043j4913389j3286075k333295R293653J4089468R897837
41537A9156907O47394n619498l377929M100720Q200297N670975J916281J672023
41529C2367170J200306n437035j5260974j8014702r282800L461755R893928P773325
$$ plain form
41585 -1528612 21095754 36955729 32688788 18340054 10591877 11718046 11903497 8193882
41577 8193882 9543258 19755800 26259261 15612475 -5460573 -15977876 -6731665 9748396
41569 9748396 16730786 11731452 3981204 934365 2589952 5079951 5470146 4799811
41561 4799811 7853047 17240907 27717751 31110282 27317185 24155796 24699109 22493542
41553 22493542 13647018 6018962 8816093 18180428 22212483 18122394 14992550 18657106
41545 18657106 22369751 16408708 1495319 -11790756 -14124051 -4830398 9259070 19156907
41537 19156907 19804301 14184803 10806874 14907594 23107891 28778866 30695147 32367170
41529 32367170 33567476 28130441 12869467 -5145235 -14428035 -10966280 -1072352 6700973
41521F700973K435064r08359q45750J803116N274242P027328N103916m30187p374747
41512A8785596j1219983o541773O348177J6273587J0764504o108273j4743769
41505A3558066n546524O253013K454645j0042880r454256O916698J8784894J4753527
41497C7677183P464446Q865175R543048k935962j9577638k1728292q779259L472333
41489A4001034P067213P133055N643161j514453r592394n190130J1934273K2157162
41481E1638921J0993925r957537j8312478j0019320r98644k585827p824123n292373
41473G642544K789481M336808l550273q571222o29201J1324366R845387m834724
41465A8353166j2282174j118855J2299746P281916q816981j0453905O830468J8594213
$$ plain form
41521 6700973 9136037 8227678 7381928 9185044 14459286 21486614 26590530 26160343 18785596
41512 18785596 7565613 1023840 7372017 23645604 34410108 28301835 13558066
41505 13558066 8011542 14264555 16719200 6676320 -2777936 4138762 22923656 37677183
41497 37677183 45141629 54006804 63549852 60613890 41036252 19307960 10528701 14001034
41489 14001034 21068247 28201302 33844463 32330010 22737616 17547486 29481759 51638921
41481 51638921 62632846 52675309 34362831 24343511 23344867 20759040 12934917 7642544
41473 7642544 10432025 14768833 11218560 2647338 2018137 13342503 23187890 18353166
41465 18353166 6070992 4952137 17251883 24533799 15716818 5262913 12093381 30687594
41457C0687594Q086011r684918j2592248l525847l51924m871490l243098O256112
41449A0760192Q208881k994927j1036617l142320P810549K324513j4085829j7228830
41441a9384388l50909J5101531J0485393m424973q431076n7869M165637k453198
41433e349852p823657j640421R835007J4898555J0633623J2860j4101132k4521970
41425a8056987k0273019j789507J3603011J2798428M926178N158023R305360K459771
41417H131258j2172518j4489538R31235J4859669J1677732L73271k278991M244660
41409A1276778Q041166K917488p323195j5618945j5111567l123147J1813771J4758173
41401G630522K619216j0349666j1129611k877121M762921R372458J1438828P089899
$$ plain form
41457 30687594 38773605 29088687 16496439 12970592 12618668 7747178 4504080 10760192
41449 10760192 18969073 15974146 4937529 1795209 9605758 11930271 -2155558 -19384388
41441 -19384388 -19735297 -4633766 5851627 1426654 -7004422 -7062291 -2896654 -5349852
41433 -5349852 -13173509 -14813930 -4978923 9919632 20553255 20566115 6464983 -18056987
41425 -18056987 -38330006 -40119513 -26516502 -13718074 -8791896 -3633873 5671487 8131258
41417 8131258 -4041260 -18530798 -17599563 -2739894 8937838 9311109 7032118 11276778
41409 11276778 19317944 22235432 14912237 -706708 -15818275 -18941422 -7127651 7630522
41401 7630522 10249738 -99928 -11229539 -14106660 -9343739 28719 11467547 18557446
41393A8557446m200918j3031963j1190410k119786P147876J4602264J6552598
41386B6317107O254649j0223745j2889297K550597J1069435n413865k4859586
41379g194705j5388756J3846263K4814340P839616q509686n900822J168735o28497
41371A0046488j372853N292577M288104j1854106k2353116j0058668P461915M275324
41363a4274335j3071116j7694787l750919J0507424J3543468R734452K712296
41356a2293517o771087r203426M051812J9892745J5392509o860368j7993871l880003
41348a7665206J4176503J0965022p508845j5602886m366293R981527J1302518
41341A282340L476318N04884M368801K264459j2043011k2969352j0781505J7676545
$$ plain form
41393 18557446 14356528 1324565 -9865845 -11985631 -4837755 9764509 26317107
41386 26317107 32571756 22348011 9458714 12009311 23078746 17664881 -7194705
41379 -7194705 -22583461 -8737198 16077142 23916758 15407072 9506250 10674985 10046488
41371 10046488 8673635 13966212 18254316 6400210 -15952906 -26011574 -18549659 -14274335
41363 -14274335 -27345451 -45040238 -48791157 -38283733 -24740265 -15005813 -12293517
41356 -12293517 -19064604 -28268030 -24216218 -4323473 11069036 4208668 -13785203 -17665206
41348 -17665206 -3488703 7476319 -32526 -15635412 -20001705 -10020178 1282340
41341 1282340 4758658 5263542 9632343 11896802 -146209 -23115561 -33897066 -16220521
41333a6220521L2026954J7658659m493722r008384o74508J48408o481660l879373
41325I075853P709460R253858l554938j1355550l144431O371783K763648n513694
41317A1605989m921662J47155j103778n002129k302014J678740n181894j8701422
41309b3781015k0883678n362869J3762569K0305034J2820124J627786k589502
41302d101551L980684J5438024J9407037Q646444r740458k0726200j6829557l961537
41294g887114O769848R300234N495741J073115p81717j458187j433554L645739
41286A4724105J4921755K1286753R770274j3882772k7788990k1412647p319788
41279i701310P69555O171326J4163839J4386985l194451k4789174k6426307p247765
$$ plain form
41333 -16220521 15806433 33465092 28971370 19962986 19288478 19436886 12955226 9075853
41325 9075853 16785313 26039171 22484233 11128683 7984252 14356035 17119683 11605989
41317 11605989 6684327 6831482 5727704 725575 -1576439 102301 -5079593 -23781015
41309 -23781015 -44664693 -50027562 -36264993 -15959959 -3139835 -1512049 -4101551
41302 -4101551 -120867 15317157 34724194 43370638 33630180 12903980 -3925577 -7887114
41294 -7887114 -1117266 8182968 13678709 14751824 13970107 12511920 11078366 14724105
41286 14724105 29645860 50932613 60702887 46820115 19031125 -2381522 -9701310
41279 -9701310 -8931755 -2760429 11403410 25790395 22595944 -2193230 -28619537 -35867302
41271c5867302J0451483J3044356Q155176M903515J783282j252064K272728J0547525
41263A4038699J0475408j134605r008128l207165L653363k292305j0789934k716311
41255i80978J6853262K2326172M358579j6267764j7206288k290565P925337L517181
41247A8234936o724749r943080l627172M126892M435981k613769p579207k946894
41239f637062O368397R200512M741302M406018J3209879J8694833P811965j1414577
41231D6381267j7900637n914943P745859P992087L26686j553306L413528N800979
41223D6291520K201497k071952m147569o755025j0490864j1911863r932434o888092
41215c704782l598688l36966p73913o291203q764169j35130J2448724J4574179
$$ plain form
41271 -35867302 -25415819 -12371463 -4216287 687228 2470510 1218446 3491174 14038699
41263 14038699 24514107 23379502 14371374 11164209 14817572 12525267 1735333 -980978
41255 -980978 15872284 38198456 42557035 26289271 9082983 6792418 14717755 18234936
41247 18234936 11510187 1567107 -2060065 2066827 6502808 3889039 -3690168 -6637062
41239 -6637062 -268665 8931847 13673149 18079167 31289046 49983879 57795844 46381267
41231 46381267 28480630 22565687 30311546 38303633 38630319 37077013 40490541 46291520
41223 46291520 48493017 46421065 42273496 35518471 25027607 13115744 3183310 -3704782
41215 -3704782 -7303470 -7640436 -8414349 -14705552 -23469721 -23604851 -11156127 3418052
41207C418052P394860O192041J3518340J2853688l125562j7230497j3728041k314136
41199F978745M64141j939197J624948M347306o185240j8442269r240376J5704883
41191f687059K4006608N500013j0577553r93755J5236196P776498j6796993k4933721
41183g469766o221440J3510472J1319538l203482p187548K156379Q132294K244563
41175A3281010m070282J499154J2606785J3191523J069898r251612q343417m428803
41167A5554256q168901j5361417j4806978o157330J322855L052431J537841j128419
41159b4155662k677437K241074J2992974J7362250Q327641j292646K293403Q961505
41151B4053102Q64008j3716696j1241504N069112P835018n832885n750824J8041856
$$ plain form
41207 3418052 10812912 17004953 30523293 43376981 40251419 23020922 9292881 6978745
41199 6978745 7442886 5503689 7128637 11475943 5290703 -13151566 -22391942 -6687059
41191 -6687059 17319549 22819562 12242009 11248254 26484450 34260948 17463955 -7469766
41183 -7469766 -13691206 -180734 11138804 7935322 747774 2904153 11036447 13281010
41175 13281010 9210728 10709882 23316667 36508190 37578088 28326476 19983059 15554256
41167 15554256 7385355 -7976062 -22783040 -28940370 -27617515 -24565084 -23027243 -24155662
41159 -24155662 -26833099 -24592025 -11599051 5763199 14090840 12798194 15091597 24053102
41151 24053102 24917110 11200414 -41090 5028022 12863040 7030155 1279331 19321187
41143A9321187L1458498R636771j9634022j7730686O161280J4994010L092693
41136D7299731m245177J276991L761695k95419L137280J2562096Q511171j0142858
41128F1865510k0067748j1682423l002545n485564n839790M712966J0907957N53852
41120C1962215j2338566j0593806p86102J887360p23502J640910O688563N966185
41112B3703257J821158J056585P53418m021719p243753k133739L864540J49796
41104A7949543p694305n604522O162594J2644432M760366j0911802k0919252j5732245
41096a9345191L172341J9941739J6210381n296058j9239311j0046610O427099
41089h175610P642586k069957k344349Q220024J1330579J31228j1649672j2990124
$$ plain form
41143 19321187 50779685 60416456 40782434 23051748 29213028 44207038 47299731
41136 47299731 43054554 44331545 48093240 47797821 50935101 63497197 72008368 61865510
41128 61865510 41797762 30115339 27112794 21627230 15787440 20500406 31408363 31962215
41120 31962215 19623649 9029843 8243741 10131101 9407599 11048509 17737072 23703257
41112 23703257 25524415 26581000 27334418 23312699 16068946 13935207 17799747 17949543
41104 17949543 10255238 4650716 10813310 23457742 28218108 17306306 -3612946 -19345191
41096 -19345191 -16172850 3768889 19979270 14683212 -4556099 -14602709 -8175610
41089 -8175610 -533024 -2602981 -4947330 3272694 14603273 14734501 3084829 -9905295
41081i905295p907916j443048Q029191J7543155J7406915O708074l029727n149269
41073B2252080n500953q012439p006405m21731L253002n19398l445177R52498
41065A551477N384977J614627n053171n258422j022412J10630m34613L919495
41057H12588J1091547J2722422Q173932M547665L308552j715194j1123752j5238084
41049A2579676p533622M744573R659855N629115P50086l61587j258418m327267
41041A9882411m902186o2597L052003k957219j0794754n773129J0474058J7549351
41033B6467938M364919j3615395j6496637p582236l492329o131817m223895K371046
41025a8338406K345636l074357Q41920J4366646J7339468R36984j5765864j4552737
$$ plain form
41081 -9905295 -17813211 -19256259 -11227068 6316087 23723002 30431076 27401349 22252080
41073 22252080 16751127 8738688 1732283 1310552 4563554 4044156 598979 1551477
41065 1551477 6936454 8551081 3497910 -1760512 -2782924 -2672294 -3106907 812588
41057 812588 11904135 24626557 32800489 37348154 40656706 38941512 27817760 12579676
41049 12579676 5046054 9790627 19450482 25079597 25829683 25468096 24209678 19882411
41041 19882411 14980225 14917628 17969631 15012412 4217658 -1555471 8918587 26467938
41033 26467938 30832857 17217462 720825 -6861411 -10353740 -16485557 -20709452 -18338406
41025 -18338406 -15992770 -19067127 -18225207 -3858561 13480907 14417891 -1347973 -15900710
41017a5900710m316552j752533k794961N682816J8167858J8059805O350328N802
41009B3501853M002419N836884j683895j0972405j4617550j2776276m360731J1379591
41001C09890K2329860J2295821j1746361k0619778j196852K3376871K4408660
40994D9158111M211321j2757639j3713676n985369N87369K747013r15434q487157
40986A4844539j0435169p88519R062947K946332j3612658j6716905J366960J8327905
40978D995432J3128934l368421n456840Q600790J5200678K612719j0761590m306578
40970B0645124J3874947J9014816N069289q914760p671555Q02317Q13981p889147
40962C5745012j2813297q212892j020823J312682P9698Q18952M930989P808628
$$ plain form
41017 -15900710 -20217262 -21969795 -24764756 -19081940 -914082 17145723 23496051 23501853
41009 23501853 27504272 33341156 31657261 20684856 6067306 -6708970 -11069701 309890
41001 309890 22639750 34935571 23189210 2569432 1372580 24749451 49158111
40994 49158111 53369432 40611793 26898117 20912748 21500117 24247130 23331696 14844539
40986 14844539 4409370 3620851 12683798 15630130 2017472 -14699433 -13332473 4995432
40978 4995432 18124366 14755945 9299105 17899895 33100573 35713292 24951702 20645124
40970 20645124 34520071 53534887 58604176 49689416 42017861 42820178 43634159 35745012
40962 35745012 22931715 14718823 13698000 15010682 15090380 15909332 20840321 28648949
40954B8648949L581383p547268j5940344j0920061M461259J3285924N731964o158342
40946A5143464m470920Q822765J5432442Q347286P2240P7301K00111q447753j7457316
40937A7719620j3507284n09550N543087O13788k959557K764190R076832M866122
40929B3607248n833992r160989j143842O261337J218982j1288611j5048360m217889
40921a5606116Q433987R341577L006870L627178J2216209J5247519O515723l826081
40913C8956866o762442p382615j2271928j6203001j2372139n835008m215656l308829
40905b9394752M409622J3792979J4433950Q750731O670833O106651l387396j8333648
40897C048970k1436438p146720R564620J4722150J0597384M703982j040886l981040
$$ plain form
40954 28648949 32230332 24683064 8742720 -2177341 2283918 15569842 21301806 15143464
40946 15143464 10672544 19495309 34927751 43275037 43347277 43424578 43624689 35176936 17719620
40937 17719620 4212336 3702786 9245873 9859661 6900104 9664294 18741126 23607248
40929 23607248 17773256 8612267 7468425 13729762 14948744 3660133 -11388227 -15606116
40921 -15606116 -7172129 2169448 5176318 8803496 21019705 36267224 42782947 38956866
40913 38956866 32194424 24811809 12539881 -3663120 -16035259 -21870267 -26085923 -29394752
40905 -29394752 -24985130 -11192151 3241799 11992530 18663363 24770014 21382618 3048970
40897 3048970 -18387468 -25534188 -15969568 -1247418 9349966 14053948 13013062 9032022
40889I032022J148926R956169Q887393l327927r735387j199068P079565p61411
40881B1080282j4948214j5228226k358855M876295j189991r271188q648553r49490
40873b6637940P033902R527670K549463r589528j2287786J398277J5392338R589274
40865c024330r278797j5409171k391810Q026597R20566r661344m975505R468054
40857b6325740J4677455O745067j077825L92048O056685O440785n90409q122063
40849a803997o860382M470722J4957404J2999841J734395n180401l118949o63373
40841A6535260k723908l299646Q8531p13130q895341j3421757n942148M651425
40833a3720714O022695M01844k865620k812831k655431J23154O492799Q366067
$$ plain form
40889 9032022 10180948 20137117 29024510 25696583 15961196 14762128 21841693 21080282
40881 21080282 6132068 -9096158 -11455013 -6578718 -7768709 -17039897 -25688450 -26637940
40873 -26637940 -19604038 -10076368 -7526905 -17116433 -29404219 -28005942 -12613604 -3024330
40865 -3024330 -12303127 -27712298 -30104108 -22077511 -21156945 -30818289 -35793794 -26325740
40857 -26325740 -11648285 -4903218 -5981043 -5588995 467690 6908475 6318066 -1803997
40849 -1803997 -8664379 -4193657 10763747 23763588 25497983 20317582 17198633 16535260
40841 16535260 13811352 10511706 10600237 9887107 991766 -12429991 -18372139 -13720714
40833 -13720714 -7698019 -7296175 -10161795 -12974626 -15630057 -15506903 -9014104 -648037
40825f48037K074959r91924P350457J4384649N964021o815365l581030J0145807
40817B7883537J0224682o435000j7318451j1605207m485196p380889r731085j313288
40809b0160897R750277J3603894J3593064J2782699N077944p573828r205521L945508
40801B1813140J1022964j892127j6877291j2051623K915375M438043n269312m549888
40793d50719R165535J6127446Q024469j634900l224429l371876o928012p508753
40785A0198761k454347M26051k545664m779959l201316l810040q518310r917177
40777b4602001l706666N847664J5114011K2587753K1062391N070149j2823723
40770B8549578j2910882J234569N267882p014551j2248551L378957J8997653J1613488
$$ plain form
40825 -648037 1426922 434998 7785455 22170104 28134125 21318760 17737730 27883537
40817 27883537 38108219 31673219 14354768 2749561 -1735635 -9116524 -18847609 -20160897
40809 -20160897 -10410620 3193274 16786338 29569037 34646981 27073153 17867632 21813140
40801 21813140 32836104 30943977 14066686 2015063 4930438 9368481 4099169 -450719
40793 -450719 8714816 24842262 32866731 31231831 28007402 24635526 17707514 10198761
40785 10198761 7744414 8170465 5624801 844842 -2356474 -6166514 -14684824 -24602001
40777 -24602001 -28308667 -22461003 -7346992 15240761 36303152 41373301 28549578
40770 28549578 15638696 16873265 22141147 15126596 2878045 6257002 25254655 36868143
40762C6868143p978011j4757474p661275k836751j983103M917896J3248737Q275056
40754B8093218o715313j3139198q205087p850093j5672278j4472564L257383J9319406
40746a5384526J6307767K047164n495337l272416K00573J743209L347958L015503
40738B509895j681073n719914k393399O526514J3743170J5579542J2240596M048165
40730D4853496o301520j2378268j0710219m773604J382739P218543R764306K778115
40722C1833588j1486821j8991607j1645881q413K549247J38213M736746J2777146
40714I902218R511864m524376j1046510k776474L958413m072958j3775756n922656
40706a8746235J1821653J3501277n125252j7371143m171193J7044394J7698653
$$ plain form
40762 36868143 28890132 14132658 6471383 3634632 1651529 6569425 19818162 28093218
40754 28093218 21377905 8238707 33620 -7816473 -23488751 -37961315 -34703932 -15384526
40746 -15384526 923241 2970405 -2524932 -5797348 -5596775 -3853566 -505608 2509895
40738 2509895 828822 -4891092 -7284491 -757977 12985193 28564735 40805331 44853496
40730 44853496 38551976 26173708 15463489 10689885 12072624 19291167 29055473 31833588
40722 31833588 20346767 1355160 -10290721 -10299134 -7749887 -7611674 -2874928 9902218
40714 9902218 19414082 14889706 3843196 1066722 5025135 952177 -12823579 -18746235
40706 -18746235 -6924582 6576695 1451443 -15919700 -20090893 -3046499 14652154
40699A4652154l91696j0230982k131332L426891q330418k0276318r286912J6785654
40691a5782959K9032544J7490522O6017p381013r189617j3602127j6423940j0355829
40683b6146402J452672J0149027J1505535O223352j563293k934022P554330J9037261
40675B5278460J3848647n117991j3534355j062680J0916108J472732j7560335
40668A4240586k1406414j0338257l913304o527763m746615M879729J0966620J0271373
40660f574045J1312482J3264367N656311p029209o196335P847775J0144633q886340
40652A9539639k3238141j0084779J3031316J3916994o749695j9841443j0908247
40645b4334356O812574J8762696K3835804K1785951Q477121j0450666j9166280
$$ plain form
40699 14652154 14260458 4029476 1898144 5325035 -3005383 -23281701 -32568613 -15782959
40691 -15782959 13249585 30740107 30806124 23425111 14235494 633367 -15790573 -26146402
40683 -26146402 -24693730 -14544703 -3039168 3184184 1620891 -1313131 6241199 25278460
40675 25278460 39127107 34009116 20474761 19412081 30328189 31800921 14240586
40668 14240586 -7165828 -17504085 -21417389 -27945152 -32691767 -27812038 -16845418 -6574045
40660 -6574045 4738437 18002804 23659115 16629906 10433571 18281346 28425979 19539639
40652 19539639 -3698502 -13783281 -751965 13165029 6415334 -13426109 -24334356
40645 -24334356 -17521782 1240914 25076718 46862669 55339790 44889124 25722844
40638B5722844j2488092l456508l392125o865790l985360L486622P288521N616726
40630A1926838J930986l053913r363441j2006600o033316M325046R028478M677901
40622A431979k211285m684554k710478J99460K476642L233432m74636r456019
40614a2195459j6675463j2623739J300401J1356218Q794818K753517O894841J7225714
40606F830848J6406516J018103j0526349m342888Q269774Q575353j738113o299692
40598A8193552j356603J150486l068455l459135M132617O653588n089181j8154510
40590i97641j4430350K638558J3543366J0568936M309830K741676L68268o576510
40582A2166133r265008j330007O557062J688580q021290l963333J2095949J6722142
$$ plain form
40638 25722844 13234752 9778244 6386119 -479671 -4465031 -978409 6310112 11926838
40630 11926838 13857824 10803911 1440470 -10566130 -16599446 -12274400 -3245922 1431979
40622 1431979 -779306 -5463860 -8174338 -7974878 -5498236 -2264804 -2739440 -12195459
40614 -12195459 -28870922 -41494661 -40194260 -28838042 -20043224 -17289707 -10394866 6830848
40606 6830848 23237364 24255467 13729118 9386230 17656004 26231357 24493244 18193552
40598 18193552 16836949 17987435 14918980 11459845 15592462 22246050 17156869 -997641
40590 -997641 -15427991 -12789433 753933 11322869 15632699 18374375 18742643 12166133
40582 12166133 2901125 1571118 8128180 9816760 1795470 -2167863 9928086 26650228
40574B6650228M43667j4592589o157340J4164827J8124875K650393q507713k972443
40566B9803905M190154k066486j4303620j7843354j1576442j687083J0762255
40559b720671K2507936K1318338K577245j6636350j6306452m3201J1920543J0367786
40551C2985174K606181m269668r117265q903907j516907M818744K7337j0928207
40543E701482j4096677p709618k020791k48280K899808N082802j499398j0957276
40535b2847948p929188N724218J0525368J289911m089335L353026P953755j05868
40527f126061l642775J1246832K5319212J3434326j3496243k3329367j0702969
40520g297045N5286l000735n281171K459755P347764Q62824k490841R846353K2675207
$$ plain form
40574 26650228 27093895 12501306 6343966 20508793 38633668 41284061 32776348 29803905
40566 29803905 33994059 31927573 17623953 -219401 -11795843 -13482926 -2720671
40559 -2720671 19787265 41105603 43682848 27046498 10740046 10696845 22617388 32985174
40551 32985174 35591355 31321687 22204422 13300515 11783608 16602352 16629689 5701482
40543 5701482 -8395195 -16104813 -18125604 -18373884 -15474076 -10391274 -11890672 -22847948
40535 -22847948 -30777136 -25052918 -14527550 -13237639 -17326974 -13973948 -6020193 -6126061
40527 -6126061 -9768836 1477996 26797208 40231534 26735291 3405924 -7297045
40520 -7297045 -7241759 -10242494 -15523665 -13063910 -5716146 -4853322 -7344163 2502190 25177397
40511B5177397J3046934j3148602k5617681j0123467J2764381J5051345m313276
40504A2837031k1835172k0416736o387423N297498J1193847J6016999J7061704
40497A3767748O882283q926628j2966997j435107O357198m937298k2162912k1365496
40489d4787209j967367J4046266J3368046M050172l105723q124991j2190901r875607
40481d8587314M17180Q863415O131176l276910o498797K633839J7745173K5377169
40473B804931J5457865p560925k3680925j6069984P476693K1530287J4414888
40466A4372830J195252k99159O323150O705698L04871j322803L632768L731888
40458C4644495n577846j2833583p986488J852570L209164m040099q227778m280773
$$ plain form
40511 25177397 38224331 25075729 -541952 -10665419 2098962 17150307 12837031
40504 12837031 -8998141 -29414877 -35802300 -30504802 -19310955 -3293956 13767748
40497 13767748 20650031 11723403 -1243594 -2678701 3678497 -1258801 -23421713 -44787209
40489 -44787209 -46754576 -32708310 -19340264 -15290092 -18395815 -26520806 -38711707 -48587314
40481 -48587314 -48170134 -39306719 -33175543 -36452453 -42951250 -40317411 -22572238 2804931
40473 2804931 18262796 10701871 -12979054 -29049038 -21572345 -42058 14372830
40466 14372830 15568082 15268923 21592073 28297771 28602642 27279839 30912607 34644495
40458 34644495 29066649 16233066 8246578 10099148 13308312 9268213 1040435 -3240338
40450c240338M14211k94768k128005k1802J529609l720252j1091087j0483636
40442b9036068k178644L924862M578197O473531J1107951J0026894J270084l046181
40434C120626M318559J1388437M993680p130122q735758j853248j843845r823386
40426e565057j1604955m565581k870040j0349203j0714877L950756J5487327P110009
40418a9121621p923991o114740Q793174J2159394j628469j0454581m6130J3817897
40410a0519067J0270514n508929j2113305m180354K605876k289714r138507m994758
40402c5868244N770248Q601198J012135m210103J538591J0665945J1516040M529633
40394C555443q27170j65387K876749N095866O730452O363840Q39166p775484j1492282
$$ plain form
40450 -3240338 -2826127 -3120895 -5248900 -5270702 -3741093 -7461345 -18552432 -29036068
40442 -29036068 -31214712 -27289850 -22711653 -16238122 -5130171 4896723 6166807 3120626
40434 3120626 7439185 18827622 23821302 16691180 7955422 6102174 4258329 -5565057
40426 -5565057 -17170012 -21735593 -24605633 -34954836 -45669713 -41718957 -26231630 -19121621
40418 -19121621 -27045612 -33160352 -24367178 -12207784 -13836253 -24290834 -24336964 -10519067
40410 -10519067 -248553 -5757482 -17870787 -22051141 -19445265 -21734979 -30873486 -35868244
40402 -35868244 -30097996 -21496798 -20484663 -24694766 -23156175 -12490230 -974190 3555443
40394 3555443 2728273 2562886 5439635 10535501 17265953 23629793 24468959 16693475 5201193
40385E201193n882156L824083Q983014P197728L242603J693905Q58073m650787
40377B0467656j4876843k0918793j5041186k635087M059851M321482R200921J9570629
40369D148630J9115738Q6924j8348592j4544181L590189J1448702M861800L18589
40361A0677799J901014m189615j8991431k2776196p473752P982457P999430L181465
40353b1688829P040516J1644480O209034M23968N640243R222032m766335k1172545
40345g447436j1556318J7939682K8957700N680420k1835714k0377048L774186
40338d864528K0294798J5724968J268555r798392j4564443j3651921o963958J617666
40330a0937255M970499J844303n65311L044834P245761K991335p597504j1122024
$$ plain form
40385 5201193 -680963 3143120 12126134 19323862 22566465 24260370 25118443 20467656
40377 20467656 5590813 -15327980 -30369166 -33004253 -28944402 -24622920 -15421999 4148630
40369 4148630 23264368 23351292 5002700 -9541481 -5951292 5497410 10359210 10677799
40361 10677799 12578813 8389198 -10602233 -33378429 -40852181 -32869724 -24870294 -21688829
40353 -21688829 -14648313 -3003833 3205201 3629169 9269412 18491444 13725109 -7447436
40345 -7447436 -19003754 -1064072 27893628 33574048 11738334 -8638714 -4864528
40338 -4864528 15430270 31155238 32423793 22625401 8060958 -5590963 -12554921 -10937255
40330 -10937255 -5966756 -4122453 -4687764 -1642930 5602831 8594166 996662 -10125362
40322a0125362j360191R388824O224316n869638q318781L054079J1686476O102942
40314A0782665l499690l322541L218084M746735Q20948j736788k463895l960064
40306D585454l017825J869501K699432m295621o671492N594478J8784062J3216836
40298C2764825m769355j1947762n109250k763830r766401q365503Q357138K0381989
40290A8781851J1041002p660451j4796583q704132n79962N503516J0429036R453752
40282B3468029k77568r619082q631907j380192J969596L77527k093365o950060
40274c137022j4494768j4301052J265318J8679070J6079838n568521k0736225
40267b2213362j2642786O110385J3525665P238730K414807O773883J1016331N885066
$$ plain form
40322 -10125362 -11485553 -2096729 4127587 -1742051 -10060832 -7006753 4679723 10782665
40314 10782665 7282975 3960434 7178518 11925253 12746201 11009413 8545518 4585454
40306 4585454 1567629 3437130 6136562 1840941 -4830551 763927 19547989 32764825
40298 32764825 27995470 16047708 10938458 8174628 -1591773 -9957276 -1600138 18781851
40290 18781851 29822853 22162402 7365819 -1338313 -1918275 3585241 14014277 23468029
40282 23468029 23190461 13571379 4939472 3559280 5528876 5906403 3813038 -3137022
40274 -3137022 -17631790 -31932842 -30667524 -11988454 4091384 -1477137 -22213362
40267 -22213362 -34856148 -28745763 -15220098 -7981368 -5566561 1207322 12223653 18108719
40259A8108719k233533j152657P002714P416767m260730j2744638n085063Q243134
40251A5294713P373988p462796j6331296q731785L942299Q594646P435660P274210
40243A7389639N360481k961423j1646674j0884705j879765N071135M443528k36842
40235D655374l654034l695307o09403L945820P848746J0741963J3073393J2209025
40227D4515577M308170q048908j5300321j0948858J228399J1074335R806266m332123
40219C2302537k2068623k7142266j3086691N719898R989291O71928m624843P19798
40211a7518971M626931j149810q140727p349495k558703O69779M735418J0021609
40203a6663969R335788J693915k178970K319085M729345j470595o543454k857140
$$ plain form
40259 18108719 15875186 14722529 21725243 29142010 24881280 12136642 7051579 15294713
40251 15294713 22668701 15205905 -1125391 -9857176 -5914877 2679769 10115429 17389639
40243 17389639 22750120 19788697 8142023 -2742682 -4622447 448688 4892216 4655374
40235 4655374 1001340 -2693967 -3303370 642450 8491196 19233159 32306552 44515577
40227 44515577 48823747 40774839 25474518 14525660 15754059 26828394 36634660 32302537
40219 32302537 10233914 -16908352 -29995043 -24275145 -14285854 -13613926 -18238769 -17518971
40211 -17518971 -12892040 -14041850 -22182577 -29532072 -32090775 -31420996 -26685578 -16663969
40203 -16663969 -7328181 -5634266 -7813236 -5494151 -764806 -2235401 -8778855 -11635995
40195a1635995J046189j334786K94771J2242054J8641059N479481j2452781j3103352
40187h23360k669525k051497q007462L94941K0397842K4043800K497330j8068640
40179A5713429j4948430J291683Q075275K431137k561490M40367P112307R414550
40171B6968828K444783j0131403j5835479p316527M850860N552425j223031J168646
40163F479102J2791045J4868540N77315j2884798j1328164l704233m004988r194460
40155f400641q321202j380929L856204N248852N833362O412794N971557L543329
40147A4763326l510095j4456685j8018139m136844J5610883J7788978K031427
40140A0072851n596715O287886J4378849p38433j9262255j1759289J2653870J9692689
$$ plain form
40195 -11635995 -10589806 -11924592 -11629821 612233 19253292 24732773 12279992 -823360
40187 -823360 -3492885 -5544382 -13551844 -13156903 7240939 31284739 33782069 15713429
40179 15713429 764999 2056682 10131957 12563094 10001604 10441971 17554278 26968828
40171 26968828 29413611 19282208 3446729 -3869798 981062 6533487 5310456 6479102
40163 6479102 19270147 34138687 34716002 21831204 10503040 6798807 2793819 -6400641
40155 -6400641 -14721843 -16102772 -12246568 -6997716 -1164354 5248440 11219997 14763326
40147 14763326 11253231 -3203454 -21221593 -25358437 -9747554 8041424 10072851
40140 10072851 4476136 10764022 25142871 24404438 5142183 -6617106 6036764 25729453
40132B5729453L805099n275523P680421J9099586M665524k3136713l4076308k1186193
40124b2694654l171133N853738R710317J4409029J6036335J0032448J600613j286855
40116C0489838K90380p74612n376220o935498k557004K051295J231337l477133
40108A4942383p985594j0838706r679164m18266J3148353J6618661K082811j7363058
40100E07420k1505988q157094O596124J0319188M798177k707916o246870j103690
40092a7500649J0224858J4184215K147966j2771744j1340938K550047Q693124
40085c813121M855830Q546876K1156383J9739602l719686k3091609j6701552n36451
40077F436272L56803p380115j582145J3469033J3060835n874834j8756987j0741115
$$ plain form
40132 25729453 29534552 24259029 31939450 51039036 55704560 32567847 -1508461 -22694654
40124 -22694654 -25865787 -20012049 -10301732 4107297 20143632 30176080 31776693 30489838
40116 30489838 30780218 30005606 24629386 17693888 15136884 17188179 18419516 14942383
40108 14942383 6956789 -3881917 -13561081 -13979347 -830994 15787667 17870478 507420
40100 507420 -20998568 -29155662 -22559538 -12240350 -7442173 -10150089 -16396959 -17500649
40092 -17500649 -7275791 6908424 9056390 -3715354 -15056292 -12506245 -3813121
40085 -3813121 1042709 9589585 30745968 50485570 46765884 23674275 6972723 6436272
40077 6436272 6793075 -587040 -2169185 11299848 24360683 18485849 -271138 -11012253
40069a1012253M810840R791528L282870n342088r150142m597410O913210J4763728
40061I460283Q313445p055543j4332793p103709L858148P789384O000845L905703
40053A0835763J960436q78404k640842j386507K086995N769466O899089L090847
40045B5736843k344651j142008P034999R168806l518214j9210311k0087572q237381
40037a2599489j358098n328646q550542m419474j409369n435116p938837k10155
40029d7249726J1994450J7365817J4652572J0992301R869555Q142972K946064
40022B8714005l425609n818812k432448J902405J371785j830408n03995L925852
40014B1902775J276019q240405q163575Q902106K3132109J2923415j0858233j8469628
$$ plain form
40069 -11012253 -6201413 3590115 6872985 1530897 -7619245 -12216655 -5303445 9460283
40061 9460283 17773728 10718185 -3614608 -10718317 -6860169 929215 6930060 10835763
40053 10835763 12796199 11917795 9276953 7890446 9977441 15746907 22645996 25736843
40045 25736843 23392192 22250184 29285183 38453989 34935775 15725464 -4362108 -12599489
40037 -12599489 -13957587 -19286233 -27836775 -32256249 -33665618 -39100734 -47039571 -47249726
40029 -47249726 -35255276 -17889459 -3236887 7755414 17624969 25767941 28714005
40022 28714005 25288396 19469584 17037136 18939541 20311326 18480918 17976923 21902775
40014 21902775 23178794 14938389 6774814 15676920 38809029 51732444 40874211 22404583
40006B2404583m739792N552803l039642j6448489j7173448q861502l601381j688484
39998b7595352L095567R888733J3666357J3056884P352506n095306j8451226j9197985
39990b3279822k739380J7163757K2704250J0509140p777446j7073993r598036
39983a0091530P802989J6537694N945475j0950193j3282633j535471N516803J655138
39975A598272l86633L909343J811234r766712j2884444J422968J3800301N612567
39967E116896j1342685j4682968n182314J559201M048229J1227920J8883352J4477947
39959B4105578J198690n343531k096391K78557r27699J685035O981177N320522
39951C1201938j793526k590173K237221r33574j1477071r319627J2619681L0911772
$$ plain form
40006 22404583 17664791 23217594 20177952 3729463 -13443985 -22305487 -25906868 -27595352
39998 -27595352 -24499785 -14611052 -944695 12112189 19464695 14369389 -4081837 -23279822
39990 -23279822 -26019202 -8855445 13848805 24357945 16580499 -493494 -10091530
39983 -10091530 -2288541 14249153 20194628 9244435 -4038198 -5573669 -56866 1598272
39975 1598272 1211639 5120982 6932216 -2834496 -15718940 -14295972 -495671 5116896
39967 5116896 -6225789 -20908757 -26091071 -24531870 -20483641 -9255721 9627631 24105578
39959 24105578 25304268 19960737 17864346 18142903 17215204 18900239 25881416 31201938
39951 31201938 29408412 26818239 29055460 28121886 16644815 7325188 19944869 50856641
39943E0856641K2397624j877121j1707107J293108J5926745J2856683k207197
39936H7539376j0669453n188315N458700J0411719Q603159O946453J1273655K0980647
39928A35355941L0473510L3783773K9144324K1409596J8662769K3435522K8802090
39921C21067525K7184542K1077287J8906361K1370902J9873838R313868n751512
39914D33042811j9255244k9282183l3733282l0353102k4274715k4843077l0782564
39907B40518644l0257388k0772693j5088444j9349394k0638116q766456L885870
39900A29532023R65225j0704888j1691312j61462Q235740O286518J251282l291474
39892A20421652j2009377k2572985k3631295j2323519J88125M348786J525513
$$ plain form
39943 50856641 73254265 71377144 59670037 60963145 76889890 89746573 87539376
39936 87539376 76869923 71681608 77140308 87552027 96155186 103101639 114375294 135355941
39928 135355941 165829451 199613224 228757548 250167144 268829913 292265435 321067525
39921 321067525 348252067 369329354 388235715 409606617 429480455 438794323 433042811
39914 433042811 413787567 384505384 350772102 320419000 296144285 271301208 240518644
39907 240518644 210261256 189488563 174400119 155050725 134412609 125646153 129532023
39900 129532023 130497248 119792360 108101048 107939586 116175326 122461844 123713126 120421652
39892 120421652 108412275 85839290 62207995 49884476 50072601 54421387 55946900
39885E5946900m040259j0303228j2858298p670528j67380K7261n746398p284829
39877G903241k492819J430375L476874R628374J6989902J4540677L284763k104669
39869E2656718K635222L532525p514810j8433548j7313131j0837894r699966r844888
39861a4819772k719918P254665J0426043Q308569Q017613P662939J273415p329328
39853A8074226q821440k664380L971169P409046P731254L053902o398781j3797025
39845H557971j4653405j3560501j2788613m482579J2594028K0451067N721638
39838A839606j3063606p340953J6010547K0352646n147560k6084864j3251314
39831b6685498J4305101J9477092Q47642j1924925n905496K295618O50977j69020
$$ plain form
39885 55946900 51906641 41603413 28745115 21074587 20907207 20934468 15188070 7903241
39877 7903241 5410422 6840797 10317671 19946045 36935947 51476624 54761387 52656718
39869 52656718 55291940 58824465 51309655 32876107 15562976 4725082 -4974884 -14819772
39861 -14819772 -17539690 -10285025 141018 8449587 16467200 24130139 25403554 18074226
39853 18074226 9252786 6588406 10559575 17968621 25699875 28753777 22354996 8557971
39845 8557971 -6095434 -19655935 -32444548 -36927127 -24333099 -3882032 1839606
39838 1839606 -11224000 -18564953 -2554406 17798240 12650680 -13434184 -26685498
39831 -26685498 -12380397 7096695 7944337 -3980588 -9886084 -7590466 -6939489 -7108509
39823g108509R089750J7392355J2012438p26926p576476q277766q637169n056691
39815A111006O495955J4155811L093777j7922599k3421229o836955J0058298R084615
39807d181321j203541l924746P95228K441255q8934n94558L20818k060773m844432
39798a3341004j889337M062117O230787O772552J1455616J4786492N952698j0789841
39790B3240080j7613252q351442J930140j258909j1717084j2244681K321423J8909077
39782d784648K0474073L291922j8263098k4491825j0512017Q855657J7539349
39775g890587J5792487J3128293J1365453N777854k443498p769907j0480681j2360351
39767E119063p309623P988743J8835627P892770j5700790k4482519j1588699J751553
$$ plain form
39823 -7108509 1981241 19373596 31386034 30659108 23082632 14804866 6167697 1111006
39815 1111006 7606961 21762772 24856549 6933950 -16487279 -23324234 -13265936 -4181321
39807 -4181321 -5384862 -9309608 -8514380 -6073125 -6162059 -6756617 -6435799 -8496572 -13341004
39798 -13341004 -15230341 -11168224 -4937437 1835115 13290731 28077223 34029921 23240080
39790 23240080 5626828 -2724614 -794474 -2053383 -13770467 -26015148 -23693725 -4784648
39782 -4784648 15689425 18981347 718249 -23773576 -34285593 -25429936 -7890587
39775 -7890587 7901900 21030193 32395646 38173500 35730002 27960095 17479414 5119063
39767 5119063 -2190560 5798183 24633810 32526580 16825790 -7656729 -19245428 -17493875
39759a7493875K261912K499815J2176421J6960463L481436j4851148j7716383
39752a2681359q477687l923433n160792m40506J0643703J6718801J4386020J0190816
39744B1255563N986815n71247l535637N578363J9261432J7903837m029840k8394500
39736C3454786l4326669j9982123n15513Q577891M271521k628729J272360J5804105
39728E927629K5251178J6940157k857659j7473787j9157757j2781601n163952
39721i315792R61083M903145O369659M304377m196910j7676375k2897329o595876
39713d4144018K0964999L0511378J1908279q653313m507580J3879364J7131941
39706C7091050Q59768j2464756r575972o32482J815730k678411j0226448j7006412
$$ plain form
39759 -17493875 -15231963 -12732148 -555727 16404736 19886172 5035024 -12681359
39752 -12681359 -21159046 -25082479 -30243271 -30683777 -20040074 -3321273 11064747 21255563
39744 21255563 27242378 26671131 23135494 28713857 47975289 65879126 61849286 33454786
39736 33454786 -871883 -20854006 -21369519 -12791628 -8520107 -11148836 -9876476 5927629
39728 5927629 31178807 48118964 45261305 27787518 8629761 -4151840 -9315792
39721 -9315792 -8354709 -3451564 2918095 7222472 3025562 -14650813 -37548142 -44144018
39713 -44144018 -23179019 7332359 19240638 10587325 6079745 19959109 37091050
39706 37091050 37950818 25486062 15910090 15277608 17093338 14414927 4188479 -12817933
39698a2817933j4867794O73096J7062293J5773565j699046j4502311j0658604
39691b1036734N07810N923526L997958n4452j103784M941642J5418905J7962627
39683B6557498O180918o170502k921090Q010948O357296o644987j1126017m279693
39675A5964371m773127j7064028k0527353m394799J3518543J6570837J2805136
39668A2099580J2844819Q209873q481442k2223616j7023209k755489J562541j930468
39660a7697411J121534Q982751Q048480j367947n899592k381437k57825k643432
39652a2094879l242531j433701l462239p932826n415475N603495J5342921J7156035
39644D520800J4091723R716346L283218l639552n313552j91175N388459M826561
$$ plain form
39698 -12817933 -27685727 -27012631 -9950338 5823227 4124181 -10378130 -21036734
39691 -21036734 -20528924 -14605398 -10607440 -10661892 -11765676 -6824034 8594871 26557498
39683 26557498 32738416 26567914 23646824 31657772 38015068 31370081 20244064 15964371
39675 15964371 11191244 -5872784 -26400137 -30794936 -17276393 -705556 12099580
39668 12099580 24944399 33154272 24672830 2449214 -14573995 -17329484 -15766943 -17697411
39660 -17697411 -16575877 -7593126 455354 -912593 -6812185 -9193622 -9451447 -12094879
39652 -12094879 -15337410 -16771111 -20233350 -28166176 -33581651 -27978156 -12635235 4520800
39644 4520800 18612523 28328869 31612087 27972535 22658983 22467808 27856267 32682828
39636C2682828j296983o724335o313398j641412P663m720847p978628n69212J1217414
39627A4663090J0336632n966994j9116217j4619744j772986K379053k699340n380772
39619b2177278j217872N395007J1652060J5526440J1022168k840797j3950258
39612C409470j0697540J327204Q035258O418909L044757n84655o684298j0015404
39604e746299l418771P728859J0592565L279907l927885m040123J148372Q410223
39596A4026848J4721119J4430369N591066m317207q725008j1959220j8030550
39589E737417j8167198m349016J2702669J6299235P956805P75846m136005j3345552
39581C474201j9230738p733232J3464453K0382116Q502716k121323j419559k506535
$$ plain form
39636 32682828 31385845 24661510 18348112 16706700 16714363 11993516 4014888 3445676 14663090
39627 14663090 24999722 19032728 -83489 -14703233 -16476219 -14097166 -16796506 -22177278
39619 -22177278 -23395150 -18000143 -6348083 9178357 20200525 17359728 3409470
39612 3409470 -7288070 -5960866 2074392 8493301 11538058 10953403 4269105 -5746299
39604 -5746299 -9165070 -1436211 9156354 12436261 8508376 4468253 5616625 14026848
39596 14026848 28747967 43178336 48769402 44452195 35727187 23767967 5737417
39589 5737417 -12429781 -16778797 -4076128 12223107 20179912 20955758 16819753 3474201
39581 3474201 -15756537 -23489769 -10025316 10356800 18859516 16738193 15318634 12812099
39573A2812099j2430315j5925218j670057J7016326K2499904J5967295O724709
39566D4994743m284078j6000437j8718576r614587k457940o414129r093434K624346
39558a8964092J8056458J8186079N552395j684485P74260J86208r022880j6575985
39550c492042j3837058n178207J850892O684900J1722947J5428870J3631256M910278
39542C1721836o566905j3011040r969228j999328K317401J159324j60304Q46379
39534D338135J235511O8286o22657k403615p508328r935218k711396O482065L819110
39525g238107n793523l432420J0325658J1765067o299370j8079334m781623J4432537
39517i101115J3852620Q37538k792138Q51596k812336o724172N189420K1076929
$$ plain form
39573 12812099 381784 -15543434 -17213491 -197165 22302739 38270034 44994743
39566 44994743 40710665 24710228 5991652 -3622935 -6080875 -12495004 -21588438 -18964092
39558 -18964092 -907634 17278445 22830840 21146355 21920615 22106823 13083943 -3492042
39550 -3492042 -17329100 -22507307 -20656415 -13971515 -2248568 13180302 26811558 31721836
39542 31721836 25154931 12143891 2174663 175335 2492736 3652060 3491756 4338135
39534 4338135 5573646 5641932 5019275 2615660 -4892668 -14827886 -17539282 -11057217 -7238107
39525 -7238107 -13031630 -16464050 -6138392 5626675 -672695 -18752029 -23533652 -9101115
39517 -9101115 4751505 5589043 2796905 3648501 836165 -5888007 -698587 20378342
39509B0378342J4013579j1623805k3184487j0431249K460881N64213j906279M602567
39501e126238N950502n158599j0772729L87562R778677L60428j2468976o691751
39493b3741124Q582272Q897206n210782j1687121l382505N436640O319361O399032
39485h387021R714765R427896K963393j259960K476809Q426736Q321286M07241
39477C2091145j1984602k2647750k3044070r495505R116263J8352744J3747362
39470F135587L543591k867405k918596P87145L280453K97556n364026m319778
39462a425473N512908J1215138J524724j3824321j5048606l08071J2389486J1965629
39454A2001414O908315O563807N506591l735936j4187639j3266026k089315N742686
$$ plain form
39509 20378342 34391921 22768116 -416371 -10847620 -8386739 -7822526 -9728805 -5126238
39501 -5126238 824264 -4334335 -15107064 -14719502 -4940825 -4580397 -17049373 -23741124
39493 -23741124 -15158852 -6261646 -11472428 -23159549 -26542054 -21105414 -14786053 -8387021
39485 -8387021 1327744 10755640 13719033 12459073 14935882 23362618 31683904 32091145
39477 32091145 20106543 -2541207 -25585277 -35080782 -25964519 -7611775 6135587
39470 6135587 9679178 6811773 3893177 4680322 7960775 8258331 2894305 -1425473
39462 -1425473 4087435 15302573 16827297 3002976 -12045630 -12353701 35785 12001414
39454 12001414 18909729 25473536 30980127 27244191 13056552 -209474 -2298789 3443897
39446C443897K919853l173609j842005O875637J2095777N117526q402959j2516855
39438D517262j005783J0745485L329257j8259825k7054793r672090J4111415J7764245
39430e524827L024081o429201k8365Q638200O105607k470873n326701j834383
39422c846462J031948J819067M042241O360303K836752o589473j2542817o187610
39414a3076051R135544J8568613R997408j1309058k5280080j8332400N76814J1655895
39406a8063315R518448O239535R003305R004798p09794j0046659o837995K962105
39398A070428M893134j006892l149906l7481p84326n097823k171960P748844J0406869
39389A1870887K291796j308679P106357J1934689K68023j4138144j1411870L097535
$$ plain form
39446 3443897 6363750 3190141 1348136 8223773 20319550 25437076 17034117 4517262
39438 4517262 3511479 14256964 17586221 -673604 -27728397 -37400487 -23289072 -5524827
39430 -5524827 -2500746 -8929947 -8958312 -320112 5785495 3314622 -2012079 -3846462
39422 -3846462 -2814514 -995447 3046794 9407097 12243849 5654376 -6888441 -13076051
39414 -13076051 -3940507 14628106 24625514 13316456 -11963624 -30296024 -29719210 -18063315
39406 -18063315 -8544867 -2305332 6697973 15702771 14992977 4946318 -1891677 1070428
39398 1070428 5963562 4956670 1806764 1769283 984957 -4112866 -6284826 1464018 11870887
39389 11870887 14162683 12854004 19960361 31895050 32163073 18024929 6613059 9710594
39381I710594Q841109J881338n133052p903064j2073613j3733335l134750J2022623
39373i522150J2355094m64005k679125J1842356J7544672k394416k5622437k1975842
39365b0915853K303807J5965018P470970o051973r413979n840965k854499j194696
39357b0532170o25947j590216R84918J1761877K1658783J5126590o209792k1379730
39349h05687j6575480j425097O899973M376823j817664n800563n581999p72147
39341b1501841N026543N520701J007517k26194M913655P604159P45781q077758
39333d987437o511263M937020J4772694J6316302J1726426K758640j1113356k4268928
39325C630098k5262931j0585737Q454569J7747465J5171255Q907688M484928m24707
$$ plain form
39381 9710594 18551703 20433041 15299989 7396925 -4676688 -18410023 -21544773 -9522150
39373 -9522150 2832944 2368939 -310186 11532170 29076842 26682426 1059989 -20915853
39365 -20915853 -18612046 -2647028 4823942 -1228031 -10642010 -16482975 -19337474 -20532170
39357 -20532170 -21158117 -22748333 -21763415 -10001538 11657245 26783835 20574043 -805687
39349 -805687 -17381167 -18806264 -11906291 -7529468 -9347132 -15147695 -20729694 -21501841
39341 -21501841 -16475298 -10954597 -9947080 -10173274 -5259619 2344540 3090321 -4987437
39333 -4987437 -11498700 -6561680 8211014 24527316 36253742 39012382 27899026 3630098
39325 3630098 -21632833 -32218570 -23764001 -6016536 9154719 18062407 22547335 22122628
39317B2122628q385720j4817568j1937760J089401J5209416J9946765J3220899
39310C6448061J458117q057601j2171543j0749836n309169J69838J148652k184681
39302G51838m154220o08761N352541P204727L114097k177935k961321J510961
39294H031927O390599O283339J706130q60024J888322L108910n571259j8655999
39286B321945j9454967k827973J3834715J1581841m390757j2089765l331973O817621
39278g539313L826114o373803r152834l117457R89223j460001l778781j001999
39270b7608851K471397J849311M86535L688016R138137J0085920N493392O68048
39262F271905j124683j298241j76331M257464R668481Q684977l69946q269429
$$ plain form
39317 22122628 13736908 -1080660 -13018420 -11929019 3280397 23227162 36448061
39310 36448061 37906178 29848577 17677034 6927198 1618029 1787867 2936519 751838
39302 751838 -3402382 -4011143 1341398 8546125 11660222 9482287 6520966 8031927
39294 8031927 14422526 20705865 22411995 21551971 23440293 26549203 20977944 2321945
39286 2321945 -17133022 -19960995 -6126280 5455561 1064804 -11024961 -14356934 -7539313
39278 -7539313 -3713199 -10087002 -19239836 -22357293 -21368070 -22828071 -26606852 -27608851
39270 -27608851 -25137454 -23288143 -22801608 -19113592 -9975455 110465 5603857 6271905
39262 6271905 5147222 3848981 3672650 7930114 17598595 26283572 25913626 17644197
39254A7644197o848332q06922O56754p69887L270900J0710077J0216320J110767
39246C5183874k933725L826120Q026885j103192j2196085r136611J962095K104119
39238B5733480r286604j3116831j202959J2074896J3760542R365685P428303M171850
39230D8928362m071255p556888J962853J3110893Q932312o566951j3159156l925673
39222C7654497O372977M458360m431958q041283m626116j693584l506227o446879
39214A9739787m910094J284396N298500N59313r138745j1877187m232670J565170
39206a711530m313682j1772387n372291Q822818J0150286k682131o596725R067057
39198d408585K2134505R636469j6111468k4052896p430933J1533873J6021119
$$ plain form
39254 17644197 10795865 9988943 10645697 9875810 13146710 23856787 34073107 35183874
39246 35183874 32250149 36076269 44103154 42999962 30803877 21667266 23629361 25733480
39238 25733480 16446876 3330045 2127086 14201982 27962524 37328209 44756512 48928362
39230 48928362 44857107 37300219 39263072 52373965 61306277 54739326 41580170 37654497
39222 37654497 44027474 48485834 44053876 36012593 31386477 29692893 26186666 19739787
39214 19739787 14829693 16114089 21412589 21971902 12833157 955970 -3276700 -1711530
39206 -1711530 -6025212 -17797599 -23169890 -14347072 -4196786 -6878917 -13475642 -4408585
39198 -4408585 17725920 27362389 11250921 -12801975 -20232908 -8699035 7322084
39191G322084J1644252P628957K190695n565766o396545M649517J6175582J4955337
39183E2604113M536159k340262l592978p042883j3107784j2574552l475373K393678
39175A7400118m305448j6600509k0761716j3555553k370880P023725J3464692
39168a9705571J3603655L526460j0585503j4014869k111911J0500654P765079
39161a1022006o172219j3094445n536605N787124R662755P962407P642114R147795
39153D376920R277157Q069358N611185j853041j4397535k1843175j4497353J458825
39145b3797659R070994K002244p604359n585753O475018J4422244Q853858n005746
39137a169159j3780706r660805K704268J2230522J3276422R798526P699531O702489
$$ plain form
39191 7322084 18966336 26595293 28785988 23220222 16823677 21473194 37648776 52604113
39183 52604113 57140272 54800010 51207032 44164149 31056365 18481813 15006440 17400118
39175 17400118 13094670 -3505839 -24267555 -37823108 -40193988 -33170263 -19705571
39168 -19705571 -6101916 -2575456 -13160959 -27175828 -29287739 -18787085 -11022006
39161 -11022006 -17194225 -30288670 -35825275 -30038151 -20375396 -12412989 -4770875 4376920
39153 4376920 13654077 21723435 27334620 25481579 11084044 -10759131 -25256484 -23797659
39145 -23797659 -14726665 -12724421 -20328780 -25914533 -19439515 -5017271 3836587 -1169159
39137 -1169159 -14949865 -24610670 -21906402 -9675880 3600542 13399068 21098599 27801088
39129B7801088K735118m173689q688321o659930N6670N528732N204560J99966
39121B2004194l214990l60191N125530M760323l340604j1112171j1173587n766722
39113c078218j278719Q96898K674680L178833J066737k26846L599521J0326278
39105A7159164J3361681R600579J021260q150841j1861971n596798M894826N483571
39097B5911471p395061j7627066j0879314K477710J877325j0778220j2514737
39090b8927892N685199K4705830K4491207R326623k711014k957510M082879J0121019
39082D3816341Q007477m443777j8812958k1943548j2452942k745038n77424K67738
39074h884131N392605Q327785K411418o276496p380155K48476J0808603J8621403
$$ plain form
39129 27801088 30536206 26362517 17674196 11014266 11070936 16599668 21804228 22004194
39121 22004194 18789204 18429013 23554543 28314866 24974262 13862091 2688504 -3078218
39113 -3078218 -4356937 -3460039 -785359 2393474 3460211 3233365 6832886 17159164
39105 17159164 30520845 40121424 41142684 32991843 21129872 15533074 20427900 25911471
39097 25911471 18516410 889344 -9989970 -7512260 -5634935 -16413155 -28927892
39090 -28927892 -23242693 1463137 25954344 35280967 32569953 29612443 33695322 43816341
39082 43816341 51823818 47380041 28567083 6623535 -5829407 -8574445 -9151869 -8884131
39074 -8884131 -3491526 4836259 7247677 971181 -6408974 -6160498 4648105 23269508
39066B3269508J7035373J713620j7491625k0779680m294309J1057549P943079
39059A8453515l616521m469192M888684J0481681Q464157L978268m215942j7845959
39051A6118691k4854210j2344820R567165J6964682M149309j1152962j3339590
39044a4891735l288084J0589631J9195963J3544854m642322j7139583j1240343
39037g871619j053251o218736j7566371j1033893R818979J7873641Q758095P085486
39029b07669K0101514K2609465K257604j5890598j0603577J748159o10311p644309
39021A1760278j249921Q413430K369569j0807500j1139420m165157p712323j4353616
39013b6884660l405531J7247032J8742157j268457j4939667j0314843n756276
$$ plain form
39066 23269508 40304881 42018501 24526876 3747196 -547113 10510436 18453515
39059 18453515 14836994 10367802 15256486 25738167 34202324 38180592 33964650 16118691
39051 16118691 -8735519 -21080339 -11513174 5451508 9600817 -1552145 -14891735
39044 -14891735 -18179819 -7590188 11605775 25150629 20508307 3368724 -7871619
39037 -7871619 -8924870 -15143606 -32709977 -43743870 -33924891 -16051250 -7293155 -207669
39029 -207669 19893845 42503310 44760914 28870316 18266739 20014898 19404587 11760278
39021 11760278 10510357 18923787 21293356 10485856 -653564 -4818721 -12531044 -26884660
39013 -26884660 -30290191 -13043159 5698998 4430541 -10509126 -20823969 -26580245
39006b6580245j1705768j2487587J173143J2192494O742140j372523N046757J7800281
38998i191308J8020164M957034p440081j1368362p793152J599724J1967080J4169734
38990A4920833P353889L047342O910557Q202140j416143j1493856r424347k103302
38982A5997113m555364j5140624j8715008r345660M866802J5224735J7490900
38975E822894Q967528n680864j1501077j359240Q767341L39902j6434334j3584811
38967b4662661J1779336K9022540J6268702r436115j7871412o348891K466751
38960A218250m631613j6210381j5487448j781461J1308403J2362804K940953n574314
38952a5854807l953627N823147J3552703J1977606K860403p084680j2325766j0709762
$$ plain form
39006 -26580245 -38286013 -50773600 -49600457 -37407963 -30665823 -32038346 -26991589 -9191308
38998 -9191308 8828856 13785890 6345809 -5022553 -12815705 -11215981 751099 14920833
38990 14920833 22274722 25322064 32232621 40434761 39018618 27524762 18100415 15997113
38982 15997113 11441749 -3698875 -22413883 -31759543 -26892741 -11668006 5822894
38975 5822894 14790422 9109558 -2391519 -3750759 5016582 5356484 -11077850 -24662661
38967 -24662661 -12883325 16139215 32407917 22971802 5100390 -1248501 1218250
38960 1218250 -3413363 -19623744 -35111192 -36892653 -25584250 -13221446 -10280493 -15854807
38952 -15854807 -19808434 -13985287 -432584 11545022 14405425 7320745 -5005021 -15714783
38944a5714783m512541k10634k044844m751722Q69815J2967597J7189812N598394
38936I391094j0246334j3419809l868501L612834J487857j873629K247072R269898
38928c399518R510563K892850k655935l932892n026007p481008o100596K273051
38920a3919492J1798031J4548363J0791820O552842L014131m184454j4063974
38913A4537267j6729385o030171R544908J5979886J1140314N029978L341611L45978
38905C7160386q600112j6579872j4596309n800798j190309l465378m406121J205121
38897a6273392P771415Q118224L552759P0887l87323K04299J023599J867500L35040
38888F283008m535053p517793k711141O239617Q450196O84481o528679k688139
$$ plain form
38944 -15714783 -20227324 -20437958 -22482802 -27234524 -26364709 -13397112 3792700 9391094
38936 9391094 -855240 -14275049 -18143550 -14530716 -13042859 -14916488 -12669416 -3399518
38928 -3399518 6111045 9003895 6347960 2415068 -2610939 -10091947 -16192543 -13919492
38920 -13919492 -2121461 12426902 23218722 29771564 32785695 28601241 14537267
38913 14537267 -2192118 -8222289 1322619 17302505 28442819 33472797 36814408 37160386
38905 37160386 28560274 11980402 -2615907 -8416705 -9607014 -13072392 -17478513 -16273392
38897 -16273392 -8501977 -383753 3169006 3239893 2852570 3056869 4080468 5947968 6283008
38888 6283008 1747955 -5769838 -8480979 -2241362 6208834 6893315 364636 -2323503
38880b323503P291926Q826783k063455j2169270q461268L978860Q899088J698326
38872E677487m468464J056684R611109O465050m889074o321576O321185J4397941
38864B7850342M313111j0330007q943792L948886O309874n648386j1200811J686208
38856G985425J7374895J6456752J792034j1840310j9530437k2348923j4503771
38849b4614335N798346K0886249J1740956j0605299j4818648O412034K4300788
38842A9100091J5069551p336924j4521556m085598K512756n393158j5109343j2702869
38834b2467050j732067N131500L411863l9435L021612J2533916J9320882J4625933
38826C3807154J552238o774761l397155L441435K681594m039476p322232n332881
$$ plain form
38880 -2323503 4968423 13795206 11731751 -437519 -8898787 -4919927 3979161 5677487
38872 5677487 1209023 2265707 11876816 18341866 13452792 7131216 13452401 27850342
38864 27850342 32163453 21833446 12889654 16838540 23148414 17500028 6299217 7985425
38856 7985425 25360320 41817072 43609106 31768796 12238359 -10110564 -24614335
38849 -24614335 -18815989 2070260 13811216 3205917 -11612731 -5200697 19100091
38842 19100091 34169642 26832718 12311162 8225564 10738320 5345162 -9764181 -22467050
38834 -22467050 -24199117 -19067617 -15655754 -15695189 -12673577 -139661 19181221 33807154
38826 33807154 35359392 28584631 25187476 28628911 31310505 27271029 19948797 14615916
38818A4615916l446117j616775N029324J2692650R505650o132336j9638089j8992629
38810g982406r283826j293810M293245J1076258J3878538N263170q656940j2917567
38802e623338m504670L958638L549492K8447O18219J263225m068572r754109n811411
38793b0344079M805663Q016364j491995j2106512j0619938J703173J3184271J6269770
38785e83283J2239969N201417j770558n445052l602319J377720M342600L973339
38777A5733833L762559N122442L850117l560817j3207353j6935151j0571959L365229
38769a2441100J8387593K6000631J8563891k895566k4081922k7938990j2674287
38762a7079750N604994J1018620L979157l868871n041323r31577M339793P223980
$$ plain form
38818 14615916 11169799 9553024 14582348 27274998 36780648 30648312 11010223 -7982406
38810 -7982406 -17266232 -18560042 -14266797 -3190539 10687999 15951169 7294229 -5623338
38802 -5623338 -10128008 -6169370 -2619878 -2591431 -1973212 -709987 -4778559 -14532668 -20344079
38793 -20344079 -15538416 -7522052 -9014047 -21120559 -31740497 -30037324 -16853053 -583283
38785 -583283 11656686 16858103 15087545 9642493 6040174 7417894 11760494 15733833
38777 15733833 19496392 24618834 28468951 24908134 11700781 -5234370 -15806329 -12441100
38769 -12441100 5946493 31947124 50511015 47615449 23533527 -4405463 -17079750
38762 -17079750 -11474756 -456136 3523021 -345850 -5387173 -6318750 -1978957 5245023
38754E245023M031985n171683j2339719q976307J227388N449726k33062m589284
38746a5355933K040114J2789743J3842308L426122p723478j1811468j0598065
38739a3390657p453595k179147M198111P064619M469502R26295J503427N120333
38731B58888O285055J762305n623209q851679l506024N678203Q401600K476214
38723F881353j198361N694238J3764706Q213087o741743j1402142n10413P628877
38715B2329602l36776j1592275p849959N725942R769594R37093o308761n182183
38707G492277m429031q688093r041844K22861J0066724J0899834P060843P104695
38699B0688266Q445412L187552o108309q639434k162283L256111L84976n236062
$$ plain form
38754 5245023 9277008 4105325 -8234394 -17210701 -15983313 -10533587 -10766649 -15355933
38746 -15355933 -13315819 -526076 13316232 16742354 9018876 -2792592 -13390657
38739 -13390657 -20844252 -23023399 -18825288 -11760669 -7291167 -6364872 -4861445 258888
38731 258888 6543943 8306248 2683039 -6168640 -9674664 -3996461 4405139 6881353
38723 6881353 5682992 11377230 25141936 33355023 26613280 15211138 14700725 22329602
38715 22329602 21992826 10400551 2550592 8276534 18046128 18983221 12674460 7492277
38707 7492277 3063246 -5624847 -14666691 -14443830 -4377106 6522728 13583571 20688266
38699 20688266 29133678 32321230 26212921 17573487 15411204 18667315 19052291 13816229
38691A3816229n532174l501273q163004j7566547j6838935J596008K3047330K5763892
38683A2621526Q762351p232927q305035l703747p087788j4399748j3061874m051906
38675c6459148J077821N94986L345006J0208230J1597425N713527L086487P601377
38667F765711P925123l926820j7772056j8860575p492819M095945P871823N434317
38659a5959351K940892O326228J5682262K0648896R768569j1556577k3133076
38652D717843j5647905k095695L832359N958340J0079062O007174j4701252l3495969
38644c5346043k2554824J3429417L7046907K5402944k281278j3696236l717895
38637a717008P580661O196675k135280o228477m047781m38460J653392K952617
$$ plain form
38691 13816229 8284055 4782782 -3380222 -20946769 -37785704 -36189696 -13142366 12621526
38683 12621526 21383877 14150950 5845915 2142168 -4945620 -19345368 -32407242 -36459148
38675 -36459148 -35381327 -34786341 -31441335 -21233105 -9635680 -3922153 -835666 6765711
38667 6765711 14690834 10764014 -7008042 -25868617 -33361436 -29265491 -21393668 -15959351
38659 -15959351 -13018459 -6692231 8990031 29638927 39407496 27850919 4717843
38652 4717843 -10930062 -13025757 -9193398 -3235058 6844004 12851178 -1850074 -35346043
38644 -35346043 -57900867 -44471450 -7424543 17978401 15697123 2000887 -1717008
38637 -1717008 5863653 12060328 9925048 3696571 -351210 -789670 863722 3816339
38629C816339L837022K722018r95593m816586o148283o174472p331048p438256
38621b2528859j655986P976215J0885372N07061j5435408k2440734j5082728j368341
38613e9143408P090128N977494M99620j377300J489033K194372k695750m835962
38605e0801773L914535J4718003J1017257n137471j3080064m581186L708956j594738
38597d1836481q898311k848936R527740J2473732P609411O246175P250184L898181
38589f578305K232252R558082J4476663L782189r891198o326665M103620n136939
38581F219699k7342731k6803923K602716K3398372J2540365m702768M54824J5869193
38573B235747J5527517L052371j820826R26222q53611m439859j175088J379096
$$ plain form
38629 3816339 7653361 10375379 9379786 4563200 -1585083 -7759555 -15090603 -22528859
38621 -22528859 -24184845 -16208630 -5323258 -4816197 -20251605 -42692339 -57775067 -59143408
38613 -59143408 -52053280 -46075786 -45576166 -46953466 -45464433 -43270061 -45965811 -50801773
38605 -50801773 -46887238 -32169235 -21151978 -26289449 -39369513 -43950699 -40241743 -41836481
38597 -41836481 -50734792 -53583728 -44055988 -31582256 -23972845 -17726670 -10476486 -6578305
38589 -6578305 -4346053 5212029 19688692 23470881 13579683 7253018 11356638 6219699
38581 6219699 -21123032 -47926955 -45324239 -21925867 -9385502 -14088270 -13633446 2235747
38573 2235747 17763264 20815635 18994809 19921031 19067420 14627561 13452473 14831569
38565A4831569o422717j2788632k725427J2135821J0848492n58291j227093N216285
38557A9310007j702116j7092017j3831159R748008K2408669Q946706p839906p299310
38549A2648882j006022m782446r360233j822618O760538P51541j0056276o302815
38541a3169449O721554P367751n863844j1712317J67015J5245590J7640628R340683
38533B5737611J07861o793889j1072482r082648j25558P747480O327721j804573
38525A1041523o887715m435543O39986J368884l591172r747728j1646680p041842
38517c0300287K263455J1892125J6867204J3934682M455747m939461p534088m233883
38509B405494l738769j1637603k0462093j5780576N366985K6471770K7858228
$$ plain form
38565 14831569 8408852 -4379780 -7105207 5030614 15879106 15320815 14093722 19310007
38557 19310007 17607891 515874 -13315285 -3567277 18841392 27788098 19948192 12648882
38549 12648882 11642860 6860414 -2499819 -4322437 2438101 3189642 -6866634 -13169449
38541 -13169449 -6447895 919856 -4943988 -16656305 -16489290 -1243700 16396928 25737611
38533 25737611 25845472 19051583 7979101 -1103547 -1229105 6518375 12846096 11041523
38525 11041523 4153808 -281735 358251 1727135 -1864037 -11611765 -23258445 -30300287
38517 -30300287 -28036832 -16144707 722497 14657179 19112926 14173465 6639377 2405494
38509 2405494 -1333275 -12970878 -33432971 -49213547 -43846562 -17374792 10483436
38502A0483436R986947o447536n690629N267516R571800M031805n31076R88439
38494B7660702Q52452o842321j5709137j6452555q472042K430430J0198202Q700934
38486B366665m603787j9739030j9265509j62440J8772189K0313080J0095333L916205
38478A1692706L638724K56018o003217n541702K606307P849985M065527l445434
38470A5118914p878947p674206l363799K995704O109797L746278K115968N957338
38462A7127047Q029929K9244j1072811j1672368k638019L527043L346793L304737
38454I981595K654952n412882j5569578j3890974k265006J484186p253281j1655904
38446d1926892k079787P782215M378509m455816m814003J999961O680094P485382
$$ plain form
38502 10483436 20470383 14022847 8332218 13599734 23171534 27203339 26672263 27660702
38494 27660702 28513154 21670833 5961696 -10490859 -18962901 -16532471 -6334269 2366665
38486 2366665 -2237122 -21976152 -41241661 -41404101 -22631912 -2318832 7776501 11692706
38478 11692706 15331430 15587448 9584231 4042529 6648836 14498821 18564348 15118914
38470 15118914 7239967 -434239 -3798038 -802334 5307463 9053741 11169709 17127047
38462 17127047 25156976 25186220 14113409 2441041 -196978 3330065 6676858 9981595
38454 9981595 12636547 7223665 -8345913 -22236887 -24501893 -23017707 -30270988 -41926892
38446 -41926892 -44006679 -36224464 -31845955 -36301771 -41115774 -39115813 -32435719 -24950337
38438b4950337O427546J806083m269964k813924O735875J0311799n38221j4138081
38430b1429224j5514338n881229N248581J4383463J9287995J4000288J343486
38423A1439022l623190M008256Q089537k561434j3765444r401363J335046J627655
38415b851915k934385L077449J4141499J2534900R4161n540953j409741j08595
38407A7002420l983912m088584k016712o768149j1931631l145114J2468873J2992180
38399A0529371r13203n551962M709827P740593o180660j6456646q773602R4283
38391a4801999o687967j5731736o948791J2249165J9623749J1106803L33442l799425
38383d656759j137253P779871J7419433J5211850r47902j3977798j1045410l212347
$$ plain form
38438 -24950337 -18522791 -16716708 -20986672 -23800596 -17064721 -6752922 -7291143 -21429224
38430 -21429224 -36943562 -42824791 -37576210 -23192747 -3904752 10095536 11439022
38423 11439022 7815832 11824088 19913625 17352191 3586747 -5814616 -4479570 -2851915
38415 -2851915 -5786300 -2708851 11432648 23967548 24061709 18520756 17111015 17002420
38407 17002420 13018508 8929924 6913212 145063 -11786568 -14931682 -2462809 10529371
38399 10529371 9616168 4064206 8774033 16514626 10333966 -6122680 -14896282 -14801999
38391 -14801999 -21489966 -37221702 -44170493 -31921328 -12297579 -1190776 -857334 -4656759
38383 -4656759 -5794012 1985859 19405292 34617142 33669240 19691442 8646032 5433685
38375E433685n469434j0888806m859706O639722O401343l836902o663326P02878
38367a2540546K535660q110887j8615601j6665572m599105Q952625J7678555J6330748
38359a5034123M622510o228783l988962O620480R379480K55567q371850q054684
38351b0800365l892237j189336K567672P598350P138970q74464q190855p883429
38343b5525694k638290K173210M446065K030621o024024j2683153q905813J393235
38335d5733843N397573K783010O949444J9658649K2845319O429748j2693605j4258451
38327h622156l058460L366223L377003P095109J1969637N833004q007528j1880648
38319G2184k555693K772292m337730r167760L58244J1995192R187629j599424
$$ plain form
38375 5433685 -35749 -10924555 -15784261 -9144539 -2743196 -6580098 -13243424 -12540546
38367 -12540546 -10004886 -18115773 -36731374 -53396946 -57996051 -49043426 -31364871 -15034123
38359 -15034123 -10411613 -16640396 -20629358 -14008878 -4629398 -4373831 -12745681 -20800365
38351 -20800365 -24692602 -25881938 -23314266 -15715916 -8576946 -9451410 -17642265 -25525694
38343 -25525694 -28163984 -25990774 -21544709 -19514088 -25538112 -38221265 -47127078 -45733843
38335 -45733843 -40336270 -37553260 -30603816 -10945167 11900152 18329900 5636295 -8622156
38327 -8622156 -11680616 -8314393 -4937390 2157719 14127356 19960360 11952832 72184
38319 72184 -2483509 288783 -4048947 -13216707 -12858463 -863271 8324358 6724934
38311F724934l101365K568119j414860j4439431j5068984M321179K0983330J3137521
38303A3710443p891907j4476801k100965Q071827L328033m426397j442714O276687
38295A048206M569662p122571j7057773j7304015q486816N773608J9039468K1618765
38287B078534J0963224q93040j374116M296202J564596q745894j0157560K702046
38279D33992J3633813Q583860m455490r791687o548001l993053l281101J307225
38271d110442P760584P740760J216112l155599j951158N36426L267747Q960698
38263B0265128J2790857M954513j1576170j9911332j2294318j055504J698937
38256e127889J725861Q043825J3317171N619869q548924j2267076n442448l790647
$$ plain form
38311 6724934 3623569 6191688 4776828 -9662603 -24731587 -20410408 572922 13710443
38303 13710443 5818536 -8658265 -10759230 -2687403 640630 -3785767 -5228481 1048206
38295 1048206 5617868 -1504703 -18562476 -35866491 -44353307 -38579699 -19540231 2078534
38287 2078534 13041758 12148718 10774602 15070804 16635400 7889506 -2268054 433992
38279 433992 14067805 22651665 18196175 8404488 1856487 -2136566 -5417667 -4110442
38271 -4110442 3650142 11390902 12607014 9451415 7500257 8036683 11304430 20265128
38263 20265128 33055985 38010498 26434328 6522996 -5771322 -6826826 -5127889
38256 -5127889 -3402028 4641797 17958968 23578837 15029913 2762837 -2679611 -6470258
38248f470258j0207629q720250O694843J7981105J0333198l299969k337051Q778294
38240A2752283Q671331n853680j4797706o799642M177099K170001o659730o106822
38232a2446866L734006P559025r0342n216132N237731K2612448K5511763P761270
38224E4662903j1909975j3052926k51061L187917j2214089k7934541k2399599
38217b9911371k53147J4872442J1458615N54458l530076P80084P915725J3927014
38209A5813744J4701848O576839n006902p412311J722254Q705979L611771m348471
38201C4364751k407782L939029k67898j3818447j9187912q443985N718828Q917856
38193H814440K921046j355805N59437M733232O155533K315294n888367j2470366
$$ plain form
38248 -6470258 -16677887 -25398137 -18703294 -722189 9611009 6311040 3973989 12752283
38240 12752283 21423614 15569934 772228 -6027414 -1850315 319686 -6340044 -12446866
38232 -12446866 -8712860 -1153835 -1244177 -6460309 -1222578 21389870 46901633 54662903
38224 54662903 42752928 29700002 29448941 32636858 20422769 -7511772 -29911371
38217 -29911371 -30164518 -15292076 -3833461 -3279003 -6809079 -6028995 1886730 15813744
38209 15813744 30515592 37092431 32085529 24673218 26395472 35101451 38713222 34364751
38201 34364751 31956969 35895998 35628100 21809653 2621741 -5822244 -103416 8814440
38193 8814440 11735486 10379681 10939118 15672350 21827883 24143177 18254810 5784444
38185E784444j0215108l26803O299340J972092p470818j0042717k565642O459736
38177a0105476P609748M97453o671915n724250K742968R488066P712243K332219
38169G881056K579809O335924J565025j3212538k1117412r203499R895332J2723762
38161b552541j999892j1301811j293626J3365919J2024543k622878j1040724n372192
38153a0793202L550484N572363K876255J84484l255444o379418k540971Q810194
38145a975255J5817921R302950k797465o575035j968272N83780j150732l35839
38137A0902053K646225m35071p291302l400427J3311614K2035633O918889j6313519
38129B8374095j8747658K328867K0081673J4235063n196658j4586672m778978
$$ plain form
38185 5784444 -4430664 -4757467 1541873 3513965 -3956853 -13999570 -16565212 -10105476
38177 -10105476 -2495728 -1998275 -8670190 -14394440 -11651472 -2163406 5548837 7881056
38169 7881056 10460865 16796789 18361814 5149276 -15968136 -25171635 -15276303 -2552541
38161 -2552541 -4552433 -15854244 -17147870 -3781951 8242592 5619714 -5421010 -10793202
38153 -10793202 -7242718 -1670355 1205900 1390384 -1865060 -8244478 -10785449 -1975255
38145 -1975255 13842666 23145616 20348151 13773116 11804844 12388624 11237892 10902053
38137 10902053 13548278 13113207 5821905 2421478 15733092 37768725 44687614 28374095
38129 28374095 9626437 11955304 32036977 46272040 41075382 26488710 21709732
38122B1709732J4049692K6767189K5074716J0519631o656849j3589388n456878
38115G2417845R426966J7759659J4512302O675217M183627Q775526J3187455J1394416
38107A58333013O959032P762674J3983077J7460828J4108869R780366J0081606
38100B38469465J1428871Q123814K035317j988078m702628q353950r725077p109313
38092B28178421q610886k0914478l3662837k9982572j1793744J101069r20360
38085A23394613o395874m735421k338715p316454j2658324q055062J347670K227319
38077H5469752o587955j4050581j3848624r762346n891285k216611N30271J053043
38069C4695664K820081J0351648J8862786J6148072j335344k0198397k3149105
$$ plain form
38122 21709732 35759424 62526613 87601329 98120960 91464111 77874723 72417845
38115 72417845 81844811 99604470 114116772 120791989 124975616 133751142 146938597 158333013
38107 158333013 165292045 173054719 187037796 204498624 218607493 228387859 238469465
38100 238469465 249898336 258022150 260057467 258069389 253366761 245012811 235287734 228178421
38092 228178421 219567535 198653057 164990220 135007648 123213904 124314973 123394613
38085 123394613 116998739 112263318 109924603 102608149 89949825 81894763 83242433 85469752
38077 85469752 78881797 64831216 50982592 41220246 35328961 33112350 33642621 34695664
38069 34695664 37515745 47867393 66730179 82878251 81542907 61344510 38195405
38062C8195405q307902Q509745J1450245K046036m269201R50979P763590K637354
38054E8976251j0760659j6117212q222219Q02203J565182r852L226527O020229
38046C5480450J611522m214434k306642M364759O715458M274078J208053n547996
38038D1585248j9120714k8659850j9681641K660705J6994083J3491152L222704
38031A0491687j773516k300653k421207j040554J395895O37967j681254J665777
38023D974142Q872478Q102908l195571j1914257r221195k565913M71561M675812
38015A99965J2231534J1307739m390250j8021486j0756832Q825536J6515472P190193
38007B3101871k868463m375560l988078n213896k055689M838253N519509l58412
$$ plain form
38062 38195405 29887503 38397248 49847493 51893529 47624328 48575307 56338897 58976251
38054 58976251 48215592 32098380 23876161 24678364 26243546 26233694 29460221 35480450
38046 35480450 37091972 32877538 30570896 34935655 41651113 45925191 47133244 41585248
38038 41585248 22464534 -6195316 -25876957 -23216252 -6222169 7268983 10491687
38031 10491687 8718171 6417518 3996311 2955757 4351652 4989619 3308365 4974142
38023 4974142 13846620 21949528 18753957 6839700 -2381495 -4947408 -4475847 199965
38015 199965 12431499 23739238 19348988 1327502 -9429330 -603794 15911678 23101871
38007 23101871 20233408 15857848 11869770 6655874 4600185 9438438 14957947 14599535
37999A4599535m63436P822509J0330204K31991q700327m567487L570470L223237
37991B6046696p0728M124485R359743L686300o270043m692796M590852J828625
37983C8603134j5326411k4720872j2559493N690526Q073038l997058j1045179
37976a5282315k453204J3096434K0155553J1744953n476234j6683729j2344161
37969g242703J306942Q962211M175898n084371r045419o291885j24533N857197
37961g486663O051874l130693j3957619j2762894Q75229J1764395J0945502O530583
37953a170286N842493K668758o320726q875227K500279J1915053K592187j3309638
37945d157107j1355104O443894J6076255J0716124O418303P920255L72342j6739647
$$ plain form
37999 14599535 14136099 21958608 32288812 32520803 23820476 19252989 22823459 26046696
37991 26046696 25975968 30100453 39460196 43146496 36876453 32183657 36774509 38603134
37983 38603134 23276723 -1444149 -14003642 -8313116 -240078 -4237136 -15282315
37976 -15282315 -17735519 -4639085 15516468 27261421 21785187 5101458 -7242703
37969 -7242703 -5935761 3026450 7202348 2117977 -6927442 -13219327 -13343860 -7486663
37961 -7486663 -1434789 -4565482 -18523101 -31285995 -30410766 -18646371 -7700869 -1170286
37953 -1170286 4672207 7340965 1020239 -7854988 -5354709 6560344 9152531 -4157107
37945 -4157107 -15512211 -9068317 7007938 17724062 24142365 32062620 32434962 15695315
37937A5695315j9003025L062010K0841347P285854k0686412k5378809n53043K5396094
37929F659331L0468705J8259708j6430j8154004k7926665k0761924k414595R311910
37921d573964O662744m35549j912373K4716J76890n3001J493265J567305k560069
37912C89964p364499p755321k836374M600457R057840L681870j1165799k1531172
37904c2923034j3411776N810901J2769952L7308j1508907k527758J5246523J5852526
37896a0654265j346538r558298N562948K3609498J8663928l159106j3553943l718226
37888E845998M947804m315617j8392666j6956890m847546j971103r158712p338404
37880e2187136R473454K3115489J9248332O548686r97463k940126k727041K927549
$$ plain form
37937 15695315 -3307710 -245700 20595647 27881501 7195089 -18183720 -18736763 6659331
37929 6659331 37128036 55387744 55371314 37217310 9290645 -11471279 -13885874 -4573964
37921 -4573964 2088780 1653231 -259142 -234426 -57536 -110537 1382728 2950033 389964
37912 389964 -6974535 -14729856 -17566230 -12965773 -3907933 -226063 -11391862 -32923034
37904 -32923034 -46334810 -40523909 -27753957 -27716649 -39225556 -41753314 -26506791 -10654265
37896 -10654265 -12000803 -21559101 -15996153 7613345 26277273 23118167 9564224 5845998
37888 5845998 10793802 6478185 -11914481 -28871371 -33718917 -35690020 -44848732 -52187136
37880 -52187136 -42713682 -19598193 -349861 6198825 5201362 2261236 -465805 2461744
37872B461744J1274166P422218j1606480k2572343p034928J6517889J6439383
37865A2901649n281935j7371014o373932Q792619J0731268M875436Q43329l103534
37857F013886p523294m374658P004768J3308339O791166k888003m606785J90348
37849A3915767O078425J1622963J2544004K782294j1049258j3332980m544377
37842A8016838l429117j5117523j8767776r82373J9404845J8543664K025159q502035
37834A1191682q536382q386380r076051l623228M976987Q259762Q965861J3632729
37826A7404980J4907184K076212j5814223j9236503p831158R15814J316701N019978
37818a241015J4899170J6190886R86054j6697910j9376507o811816Q147704J3472081
$$ plain form
37872 2461744 13735910 21158128 9551648 -13020695 -20055623 -3537734 12901649
37865 12901649 7619714 -9751300 -16125232 -7332613 3398655 8274091 9117420 6013886
37857 6013886 -1509408 -5884066 1120702 14429041 21220207 18332204 13725419 13915767
37849 13915767 19994192 31617155 44161159 46943453 35894195 22561215 18016838
37842 18016838 14587721 -529802 -19297578 -20279951 -875106 17668558 19693717 11191682
37834 11191682 2655300 -5731080 -14807131 -18430359 -13453372 -5193610 3772251 17404980
37826 17404980 32312164 34388376 18574153 -662350 -8493508 -7577694 -6260993 -1241015
37818 -1241015 13658155 29849041 30835095 14137185 -5239322 -12051138 -3903434 9568647
37810I568647M039330j4334113k3951920j1111518J3635349K4311151J2556101
37803A4713027k350544k235606O164229N869296m466460j2391472j1880096q376099
37795a4953725n948283q99284R341885J8143736J5867804K920023q262450p607672
37787H602034n42425K1494o856761r360823k946268K757657K665287N661479J4490195
37778A4491869J3506347o023109k3792301j6759479L969901R323988k549636p620706
37770a5453126N84657K369417r282577j4750459l646699O019035K97688o290107
37762d0152171J984330J3864414J1932396K419205J441773O832212O508863K699096
37754G530118N301873J0579442Q145542J728068K015724M724507l253185j9107587
$$ plain form
37810 9568647 13607977 -726136 -24678056 -35789574 -22154225 2156926 14713027
37803 14713027 12362483 10126877 16291106 22160402 17693942 5302470 -6577626 -14953725
37795 -14953725 -20902008 -21801292 -12459407 5684329 21552133 24472156 16209706 8602034
37787 8602034 8059609 8081103 1224342 -8136481 -11082749 -8325092 -5659805 1674 14491869
37778 14491869 27998216 21975107 -1817194 -18576673 -14606772 -5282784 -7832420 -15453126
37770 -15453126 -14868469 -12499052 -21781629 -36532088 -40178787 -34159752 -33862064 -40152171
37762 -40152171 -38167841 -24303427 -12371031 -9951826 -8510053 -1677841 4831022 7530118
37754 7530118 12831991 23411433 31556975 33285043 35300767 40025274 36772089 17664502
37746A7664502k5427267j5836351k356234L462281K600326J187602K776939Q074533
37738g853669J3517995J2271102L640092m123737p146278j2059939j9639854j5820343
37730c7214631O458822K9503258L3067411K2460154J4153193N808170j3428390
37723F0807987l2230691k7761357m374447R607257N735408M766281J6078438J9792963
37715E2421839K497658j7701194j9801290j0568722p330478r340914o687839k211592
37707a8722532l501974m636346L682471J4215989J2761427J756992l755535j46722
37699A653770J521428m953707j2355025j1683883k020075J0942225J8507880J3841339
37691A5453952O32343p298840k613460N003821L436965l744768m898846K48324
$$ plain form
37746 17664502 -7762765 -23599116 -25955350 -22493069 -19892743 -18705141 -15928202 -7853669
37738 -7853669 5664326 17935428 21575520 17451783 10305505 -1754434 -21394288 -37214631
37730 -37214631 -30755809 -1252551 31814860 54275014 68428207 74236377 60807987
37723 60807987 28577296 815939 -3558508 6048749 11784157 16550438 32628876 52421839
37715 52421839 54919497 37218303 17417013 6848291 -482187 -9823101 -16510940 -18722532
37707 -18722532 -22224506 -26860852 -23178381 -8962392 3799035 5556027 1800492 1653770
37699 1653770 3175198 -1778509 -14133534 -25817417 -27837492 -16895267 1612613 15453952
37691 15453952 16086295 8787455 6173995 11177816 14614781 10870013 5971167 6219491
37683F219491K315928k35272M28210O065683Q360581K122531p745749j4208914
37675C322489j4648228q825666J439144R827196J0373841N521129K831588L940912
37667A3782405L289558k727933j1476965j7851224j7201526p774301L999326O155715
37659b9804945k865528p713956L415192J8870151J8923064N429366k350389J191301
37651E094256K746214k440636j477855R933229J4911529K676242j0974532p728553
37643A2739894M476583O502792n93433j536719L767115R08558j1055463j5632229
37635d22902o033780M219051M089337M65124K017023L037738m924568j6219410
37627a3772387j8191888q979831J810741O462621N809925N520972J0422565J8831792
$$ plain form
37683 6219491 8535419 8300147 8728357 14794040 23154621 25277152 17531403 3322489
37675 3322489 -11325739 -20151405 -18712261 -8885065 1488776 7009905 9841493 13782405
37667 13782405 17071963 14344030 2867065 -14984159 -32185685 -39959986 -35960660 -29804945
37659 -29804945 -32670473 -40384429 -36969237 -18099086 823978 6253344 3902955 5094256
37651 5094256 7840470 5399834 3921979 13855208 28766737 31442979 20468447 12739894
37643 12739894 17216477 23719269 23125836 21589117 25356232 26264790 15209327 -422902
37635 -422902 -6456682 -2237631 1851706 2316830 4333853 7371591 2447023 -13772387
37627 -13772387 -31964275 -40944106 -39133365 -32670744 -26860819 -21339847 -10917282 7914510
37619G914510K0373210O507003j4109773k0985202q052241O804470O945472o31515
37611D765934r85107K384337m379210j7842549j9556056n491083P833315J0122190
37603b3148229R944057J3826760J2697465O91849r872998p155025M84696m65898
37595b997323n782292l684453J984049n26363o496423r97268J2549294J4114551
37587H163772M01896p366107K625151J3125081N681932j0250765j3777871m939123
37579f336034q73265p071911j1944711p705119N47772P231167J2896100J6191995
37571B935994J2402039L876471P30437O302964J1181173O754152l279244j0130081
37563C0773905j1382998r363826m384619L147816P817919L855580o211687j3041910
$$ plain form
37619 7914510 28287720 34794723 20684950 -300252 -8352493 -1548023 5397449 4765934
37611 4765934 3780827 6165164 1785954 -16056595 -35612651 -41103734 -33270419 -23148229
37603 -23148229 -13204172 622588 13320053 14011902 4138904 -3016121 -2531425 -2997323
37595 -2997323 -8779615 -12464068 -10480019 -11006382 -17502805 -18500073 -5950779 8163772
37587 8163772 8565668 1199561 3824712 16949793 22631725 12380960 -1396911 -6336034
37579 -6336034 -7209299 -14281210 -26225921 -33931040 -33383268 -26152101 -13256001 2935994
37571 2935994 15338033 19214504 19944941 26247905 37429078 44183230 40903986 30773905
37563 30773905 19390907 10027081 5642462 8790278 16608197 20463777 14252090 1210180
37555A210180j0906688l136140L136047N063318N895070R342933J3023831R635527
37547C3264078l303903j7039632j9417979q826916M515229J1434258J1978563
$$ plain form
37555 1210180 -9696508 -12832648 -9696601 -4633283 1261787 10604720 23628551 33264078
37547 33264078 29960175 12920543 -6497436 -15324352 -10809123 625135 12603698
$$ [...]
##END NTUPLES=NMR SPECTRUM
##END=
