##TITLE=31Pdec_LR-717-C2-0
 CDCl3, 24 sc
 30.10.2020
##JCAMPDX= 6.0         $$ Bruker NMR JCAMP-DX V2.0
##DATA TYPE= NMR SPECTRUM
##DATA CLASS= NTUPLES
##ORIGIN= UXNMR, Bruker Analytische Messtechnik GmbH
##OWNER= root
$$ XWIN-NMR		Version 3.5
$$ Fri Oct 30 13:00:01 2020 Russian Standard Time (UT+4h)  she@DPX200
##.OBSERVE FREQUENCY= 81.013821
##.OBSERVE NUCLEUS= ^31P
##.ACQUISITION MODE= SIMULTANEOUS
##.ACQUISITION SCHEME= undefined
##.AVERAGES= 24
##.DIGITISER RES= 17
##SPECTROMETER/DATA SYSTEM= spect
##.PULSE SEQUENCE= zgpg30
##.SOLVENT NAME= CDCl3
##.SHIFT REFERENCE= (INTERNAL, CDCl3, 0, 182.463)
##AUDIT TRAIL= $$ (NUMBER, WHEN, WHO, WHERE, WHAT)
$$ ##TITLE= Audit trail, XWIN-NMR		Version 3.5
$$ ##JCAMPDX= 5.01
$$ ##ORIGIN= Bruker BioSpin GmbH
$$ ##OWNER= she
$$ F:/spectra/data/she/nmr/P31/1/pdata/1/auditp.txt
$$ ##AUDIT TRAIL=  $$ (NUMBER, WHEN, WHO, WHERE, WHAT)
(   1,<2020-10-30 12:59:09.82 +0400>,<she>,<DPX200>,
      <created by zg, POWCHK disabled, PULCHK disabled
       configuration hash MD5:
       00 E9 B6 7A A2 85 ED C7 34 08 36 98 17 FE 4E 26
       data hash MD5: 32K
       49 CC 60 07 7C F9 9C 1F 97 48 1E B1 B7 06 2A 5C>)
(   2,<2020-10-30 12:59:12.20 +0400>,<she>,<DPX200>,
      <Start of raw data processing
       efp BC_mod = 2 LB = 1 FT_mod = 6 PKNL = 1 PHC0 = -2412.083 PHC1 = 139.2008 SI = 64K 
       data hash MD5: 64K
       1D 0E 99 F5 89 51 3F 27 47 88 59 F1 EB 56 40 D2>)
$$ ##END=
$$ 
$$ hash MD5
$$ 25 84 8F B2 D5 2E CF 89 DA 02 25 91 3B FC DC 97
##$RELAX= 
##$RELAX= 
##$RELAX= 
##$RELAX= 
##$RELAX= 
##$RELAX= 
##$RELAX= 
##$RELAX= 
$$ Bruker specific parameters
$$ --------------------------
##$DU= <F:/spectra>
##$EXPNO= 1
##$NAME= <P31>
##$PROCNO= 1
##$TYPE= <nmr>
##$USER= <she>
##$AMP= (0..31)
100 100 100 100 100 100 100 100 100 100 100 100 100 100 100 100 100 100 
100 100 100 100 100 100 100 100 100 100 100 100 100 100 
##$AQSEQ= 0
##$AQ_mod= 1
##$AUNM= <au_zg>
##$AUTOPOS= <>
##$BF1= 81.014009
##$BF2= 200.13
##$BF3= 200.13
##$BF4= 200.13
##$BF5= 200.13
##$BF6= 200.13
##$BF7= 200.13
##$BF8= 200.13
##$BYTORDA= 1
##$CFDGTYP= 0
##$CFRGTYP= 5
##$CHEMSTR= <none>
##$CNST= (0..31)
1 1 145 1 1 1 1 1 1 1 1 1 1 1 1 1 1 1 1 1 1 1 1 1 1 1 1 1 1 1 1 1 
##$CPDPRG= <waltz16>
##$CPDPRG1= <>
##$CPDPRG2= <waltz16>
##$CPDPRG3= <>
##$CPDPRG4= <mlev>
##$CPDPRG5= <mlev>
##$CPDPRG6= <mlev>
##$CPDPRG7= <mlev>
##$CPDPRG8= <mlev>
##$CPDPRGB= <>
##$CPDPRGT= <>
##$D= (0..31)
0 1 0 0 0 0 0 0 0 0 0 0.03 2e-05 3e-06 0 0 0 0 0 0 0 0 0 0 0 0 0 0 0 0 
0 0 
##$DATE= 1604048349
##$DBL= (0..7)
120 120 120 11 120 120 24 19 
##$DBP= (0..7)
150 150 150 150 150 150 150 150 
##$DBP07= 0
##$DBPNAM0= <>
##$DBPNAM1= <>
##$DBPNAM2= <>
##$DBPNAM3= <>
##$DBPNAM4= <>
##$DBPNAM5= <>
##$DBPNAM6= <>
##$DBPNAM7= <>
##$DBPOAL= (0..7)
0.5 0.5 0.5 0.5 0.5 0.5 0.5 0.5 
##$DBPOFFS= (0..7)
0 0 0 0 0 0 0 0 
##$DE= 6
##$DECBNUC= <off>
##$DECIM= 4
##$DECNUC= <off>
##$DECSTAT= 4
##$DIGMOD= 1
##$DIGTYP= 9
##$DL= (0..7)
0 0 52 120 120 21 21 25 
##$DP= (0..7)
$$ [...]
##$SUBNAM2= <"">
##$SUBNAM3= <"">
##$SUBNAM4= <"">
##$SUBNAM5= <"">
##$SUBNAM6= <"">
##$SUBNAM7= <"">
##$SUBNAM8= <"">
##$SUBNAM9= <"">
##$SW= 369.568048894756
##$SWIBOX= (0..15)
0 1 3 0 0 0 0 0 0 0 0 0 0 0 0 0 
##$SW_h= 29940.119760479
##$TD= 32768
##$TD0= 1
##$TE= 0
##$TE2= 300
##$TE3= 300
##$TEG= 300
##$TL= (0..7)
0 120 53 12 22 120 120 120 
##$TP= (0..7)
150 150 150 150 150 150 150 150 
##$TP07= 0
##$TPNAME0= <>
##$TPNAME1= <>
##$TPNAME2= <>
##$TPNAME3= <>
##$TPNAME4= <>
##$TPNAME5= <>
##$TPNAME6= <>
##$TPNAME7= <>
##$TPOAL= (0..7)
0.5 0.5 0.5 0.5 0.5 0.5 0.5 0.5 
##$TPOFFS= (0..7)
0 0 0 0 0 0 0 0 
##$TUNHIN= 0
##$TUNHOUT= 0
##$TUNXOUT= 0
##$USERA1= <user>
##$USERA2= <user>
##$USERA3= <user>
##$USERA4= <user>
##$USERA5= <user>
##$V9= 5
##$VALIST= <valist>
##$VCLIST= <CCCCCCCCCCCCCCC>
##$VD= 0
##$VDLIST= <DDDDDDDDDDDDDDD>
##$VPLIST= <PPPPPPPPPPPPPPP>
##$VTLIST= <TTTTTTTTTTTTTTT>
##$WBST= 1024
##$WBSW= 4
##$XGAIN= (0..3)
0 0 0 0 
##$XL= 0
##$YL= 0
##$YMAX_a= 23891
##$YMIN_a= -3709
##$ZGOPTNS= <>
##$ZL1= 120
##$ZL2= 120
##$ZL3= 120
##$ZL4= 120
##$ABSF1= 0
##$ABSF2= 0
##$ABSG= 0
##$ABSL= 0
##$ALPHA= 0
##$AQORDER= 0
##$ASSFAC= 0
##$ASSFACI= 0
##$ASSFACX= 0
##$ASSWID= 0
##$AUNMP= <proc_1d>
##$AZFE= 0.1
##$AZFW= 0.5
##$BCFW= 0
##$BC_mod= 2
##$BYTORDP= 0
##$COROFFS= 0
##$CY= -3
##$DATMOD= 1
##$DC= 0
##$DFILT= <>
##$DTYPP= 0
##$F1P= 0
##$F2P= 0
##$FCOR= 1
##$FTSIZE= 65536
##$FT_mod= 6
##$GAMMA= 0
##$GB= 0
##$INTBC= 1
##$INTSCL= 5.30512e-09
##$ISEN= 30
##$LB= 1
##$LEV0= 0
##$LPBIN= 0
##$MAXI= 10000
##$MC2= 0
##$MEAN= 0
##$ME_mod= 0
##$MI= 50
##$NCOEF= 0
##$NC_proc= -11
##$NLEV= 6
##$NOISF1= 182.463
##$NOISF2= 159.3651
##$NSP= 0
##$NTH_PI= 0
##$NZP= 0
##$OFFSET= 182.463
##$PC= 4
##$PHC0= -2412.083
##$PHC1= 139.2008
##$PH_mod= 1
##$PKNL= yes
##$PPARMOD= 0
##$PSCAL= 0
##$PSIGN= 0
##$REVERSE= no
##$SF= 81.014009
##$SI= 65536
##$SIGF1= 159.3651
##$SIGF2= -187.1042
##$SINO= 113.3802
##$SIOLD= 16384
##$SREGLST= <1H.CDCl3>
##$SSB= 0
##$STSI= 65536
##$STSR= 0
##$SW_p= 29940.119760479
##$SYMM= 0
##$S_DEV= 0
##$TDeff= 32768
##$TDoff= 0
##$TI= <>
##$TILT= no
##$TM1= 0
##$TM2= 0
##$TOPLEV= 0
##$USERP1= <user>
##$USERP2= <user>
##$USERP3= <user>
##$USERP4= <user>
##$USERP5= <user>
##$WDW= 1
##$XDIM= 65536
##$YMAX_p= 277878455
##$YMIN_p= -318539732
$$ End of Bruker specific parameters
$$ ---------------------------------
##NTUPLES= NMR SPECTRUM
##VAR_NAME=  FREQUENCY,     SPECTRUM/REAL,   SPECTRUM/IMAG
##SYMBOL=    X,             R,               I
##VAR_TYPE=  INDEPENDENT,   DEPENDENT,       DEPENDENT
##VAR_FORM=  AFFN,          ASDF,            ASDF
##VAR_DIM=   65536,         65536,           65536
##UNITS=     HZ,            ARBITRARY UNITS, ARBITRARY UNITS
##FACTOR=    0.456856943014862, 1,           1
##FIRST=     14782.0589164895, 0,            0
##LAST=      -15158.0608439895, 0,           0
##MIN=       -15158.0608439895, -318539732,  0
##MAX=       14782.0589164895, 277878455,    0
$$ Real data points
##PAGE= N=1
##DATA TABLE= (X++(R..R)), XYDATA
$$ [...]
##PAGE= N=2
##DATA TABLE= (X++(I..I)), XYDATA
21513A01612638L2478546J7319501j1349130n1426604p2059758n0871605j4485190
$$ 101612638 134091184 151410685 140061555 88634951 16575193 -34296412 -48781602
21506d8781602j0089510l7815497m8071266j3387914L4357177N2170250L6886319
$$ -48781602 -58871112 -96686609 -144757875 -158145789 -123788612 -71618362 -34732043
21499c4732043J1545274p637323j4333314j0258503j1070692k4865122k4116775
$$ -34732043 -23186769 -30824092 -45157406 -55415909 -66486601 -91351723 -115468498
21492a15468498J7661075O1784302L9494320l6131423o7383331j2307720M9089740
$$ -115468498 -97807423 -36023121 3471199 -32660224 -100043555 -112351275 -63261535
21485f3261535L8541980o221742j0452122J1706775o1006l1744884j8633025L3293208
$$ -63261535 -24719555 -30941297 -41393419 -29686644 -29747650 -61492534 -80125559 -46832351
21477d6832351M8955876N402391l7296854l6557482k0776598k4113579l3701085
$$ -46832351 2123525 7525916 -29770938 -66328420 -87105018 -111218597 -144919682
21470a44919682k4717619K241839L5299655O1317808N7348531J6378422k0192551
$$ -144919682 -169637301 -167395462 -132095807 -70777999 -13429468 2948954 -17243597
21463a7243597o479029L4564695L9081544K055810j6366205R584133L5304838
$$ -17243597 -23722626 10842069 49923613 51979423 35613218 45197351 80502189
21456H0502189K6166150N643049k060166j3461047l8790431n2168305m2294249
$$ 80502189 106668339 112311388 110251222 96790175 57999744 5831439 -36462810
21449c6462810l7883354m8320695l5326169J5891491N2562868L0507445j4003290
$$ -36462810 -74346164 -122666859 -157993028 -142101537 -89538669 -59031224 -73034514
21442g3034514k2216353r16937N231675n216349R36720K4776433L6838037L1579746
$$ -73034514 -95250867 -96167804 -90936129 -96152478 -95215758 -70439325 -33601288 -2021542
21434b021542K6903705K0881668J4231j9431536j0094220J2910117R156329j8763406
$$ -2021542 24882163 45763831 45778062 26346526 16252306 29162423 38318752 19555346
21426A9555346k7361113n797993Q119112j822963P15476L8299114O8858470M0108541
$$ 19555346 -7805767 -13603760 -5484648 -7307611 -6592135 31706979 100565449 140673990
21418A40673990l4006839q9422960q7599633m2056377J6442841O3694014P4991460
$$ 140673990 106667151 17244191 -70355442 -112411819 -95968978 -32274964 42716496
21411D2716496L4739281l1741758o4171562k9390466L5121035O1733443L0173804
$$ 42716496 77455777 45714019 -18457543 -47848009 -12726974 49006469 79180273
21404G9180273j7742552l8389019l3364619k6726532k2731021j0526819M910863
$$ 79180273 61437721 23048702 -10315917 -37042449 -59773470 -70300289 -65389426
21397f5389426N866935p375130j3827116j826794J8195830L3047541M0289235
$$ -65389426 -59522491 -66897621 -80724737 -82551531 -64355701 -31308160 8981075
21390H981075M0089718L1705089K1319918J6539965J0510388j1170274m4444485
$$ 8981075 49070793 80775882 102095800 118635765 129146153 117975879 73531394
21383G3531394o4397532n3057261j6926886K2281929M1038756K5102514j3076090
$$ 73531394 9133862 -43923399 -60850285 -38568356 2470400 27572914 14496824
21376A4496824l5564267k0769426N504156Q400840j461751P624127K2858698K918677
$$ 14496824 -21067443 -41836869 -36332713 -27931873 -29393624 -21769497 1089201 4007878
21368D007878m0290536m2595904J0637207M9686640K2888557k5780053k9313617
$$ 4007878 -36282658 -78878562 -68241355 -18554715 4333842 -21446211 -50759828
21361e0759828K824622J5088293k869702j6534545j1590929J47894J8936405M3983572
$$ -50759828 -47935206 -32846913 -35716615 -52251160 -63842089 -63694195 -44757790 -774218
21353g74218M2007009r239418o1341647m7340177J2739521L1419838j4744690
$$ -774218 41232791 31993373 -29348274 -76688451 -63948930 -32529092 -47273782
21346d7273782m8638039j2258538M5932836M6362553r094548m9867584l3338787
$$ -47273782 -95911821 -108170359 -62237523 -15874970 -24969518 -74837102 -108175889
21339a08175889J5326510M6065955L4769291q07296j7955706O453149M0331632
$$ -108175889 -92849379 -46783424 -12014133 -12821429 -30777135 -24323986 16007646
21332A6007646K9595090k3042007m9001006p856026M6842095L6572919l3127314
$$ 16007646 45602736 22560729 -26440277 -34296303 12545792 49118711 15991397
21325A5991397q2459083o6083835k0974040k77691o399674j0388791k350224P241643
$$ 15991397 -66467686 -132551521 -153525561 -153803252 -160202926 -170591717 -172941941 -165700298
21317a65700298J6198652L0213934M1574132L3965469Q088037j7139143k9571212
$$ -165700298 -149501646 -119287712 -77713580 -43748111 -35660074 -52799217 -82370429
21310h2370429l2113931k5757928o650679J3695433J0269262j7371448l1329385
$$ -82370429 -114484360 -140242288 -146892967 -133197534 -122928272 -140299720 -171629105
21303a71629105l978935L7468158M6487293K5179079J7597822L8043404N0617753
$$ -171629105 -175608040 -138139882 -91652589 -66473510 -48875688 -10832284 39785469
21296C9785469L0521701J741307p985124r963458k2562373l1722212k0332746
$$ 39785469 70307170 72048477 64063353 54099895 31537522 -184690 -20517436
21289b0517436p273843j4439426j9717149P256289M0424366K6815055k4104892
$$ -20517436 -27791279 -42230705 -61947854 -54691565 -14267199 12547856 -11557036
21282a1557036m2603443j221236M4155867M0978306J4077416J2703763K5942384
$$ -11557036 -54160479 -55381715 -11225848 29752458 43829874 56533637 82476021
21275H2476021O297361m2854665o3773015l3361656k438743j8755872m8903484
$$ 82476021 88773382 45918717 -17854298 -51215954 -53654697 -72410569 -121314053
21268a21314053k3127219N4695364R6112490M5237082l9518409o3129970k1532413
$$ -121314053 -144441272 -89745908 6366582 51603664 12085255 -51044715 -72577128
21261g2577128J0026532L417584J2930722O4780039R3669147M4658702k6927449
$$ -72577128 -62550596 -59133012 -46202290 18577749 112246896 156905598 129978149
21254A29978149l3659254J0579259K2732703j0569262k3672390L292739J1564807
$$ 129978149 96318895 106898154 129630857 119061595 95389205 98681944 110246751
21247A10246751k4591592m8901010k4680046O31378j3759338k3463415J8949098
$$ 110246751 85655159 36754149 12074103 12705481 -1053857 -24517272 -5568174
21240e568174O4651883L5090401m9168376r0684328n1306012R748618L1747957
$$ -5568174 59083709 94174110 45005734 -45678594 -96984606 -87235988 -55488031
21233e5488031J7847685m640451k9406884n4204947o0187476l3085334J5043188
$$ -55488031 -37640346 -42280797 -71687681 -125892628 -186080104 -219165438 -204122250
21226b04122250N6134880O5427687L5731753q510688k2836719O084789L4624498
$$ -204122250 -147987370 -82559683 -46827930 -55338618 -78175337 -72090548 -37466050
21219c7466050J8412837k2187957l3898575j3975604r151874l3566725m6047429
$$ -37466050 -19053213 -41241170 -75139745 -89115349 -98267223 -131833948 -177881377
21212a77881377k2052115P338326J2984704J4599835L6220765N7006172M8511453
$$ -177881377 -199933492 -192595166 -179610462 -165010627 -128789862 -71783690 -23272237
21205b3272237K8853808L2345561M6524483L0484994j2724942l3663310j1808106
$$ -23272237 5581571 37927132 84451615 114936609 102211667 68548357 56740251
21198E6740251J3933159P855741r707988k309864J8351094Q271802l8285188p4013844
$$ 56740251 70673410 78529151 68821163 66511299 84862393 93134195 54849007 -19164837
21190a9164837o2298177k4422541m947223j1535788j3877575P639203L7678541
$$ -19164837 -81463014 -105885555 -110832778 -122368566 -136246141 -128606938 -90928397
21183i0928397N0405946L7945299J1011470j2336774j5152131M740075K4846451
$$ -90928397 -40522451 -2577152 8434318 -3902456 -19054587 -14314512 10531939
21176A0531939J8310839j0016074k5388938r193787J5547220J7049384m212370
$$ 10531939 28842778 18826704 -6562234 -15756021 -208801 16840583 12628213
21169A2628213k3223800k4881068j3255106K525196J4160795J4096568N209406
$$ 12628213 -10595587 -35476655 -48731761 -46206565 -32045770 -17949202 -12739796
21162a2739796L517479J7696739L3525616L0754575O761178k6231209n4422332
$$ -12739796 -9222317 8474422 42000038 72754613 79515791 53284582 -1137750
21155a137750o2835279m0855388j885700K2604918K5203536L3583568N7351903
$$ -1137750 -63973029 -104828417 -106714117 -84109199 -58905663 -25322095 32029808
21148C2029808N6164550p11199p0076974q1451579l4050612P299058P940271k791554
$$ 32029808 88194358 87483159 17406185 -64045394 -98096006 -90796948 -82856677 -85648231
21140h5648231J918855P073081K386694J1419333M1937926N3482360J4125556
$$ -85648231 -83729376 -76656295 -74269601 -62850268 -20912342 32570018 46695574
21133D6695574m3735837o3509901l6294463J957635K3566728K5380057J0529970
$$ 46695574 2959737 -60550164 -96844627 -94886992 -71320264 -45940207 -35410237
21126c5410237j1441373j9284928n579984M352300j3077944m0067341m1252140
$$ -35410237 -46851610 -66136538 -71716522 -67364222 -80442166 -120509507 -161761647
21119a61761647j3699447J6944115L6327647M4571433L3427961r86801l1042270
$$ -161761647 -175461094 -158516979 -122189332 -77617899 -44189938 -45176739 -76219009
21112g6219009k4129925O539593J8073974L544671k856099J0252507J2490973
$$ -76219009 -100348934 -93809341 -75735367 -72190696 -75046795 -64794288 -52303315
21105e2303315q262388j7229159P722510L2408827K0916354k442271O066336L1532978
$$ -52303315 -60565703 -77794862 -70072352 -37663525 -16747171 -19189442 -13123106 18409872
21097A8409872J9279600l5163144p0881526m7417207J129447K0037321N476516
$$ 18409872 37689472 2526328 -68355198 -115772405 -114642958 -94605637 -89129121
21090h9129121p352094j828209Q815397J5216209K3012390L1178767K7549553
$$ -89129121 -96481215 -98309424 -89494027 -74277818 -51265428 -20086661 7462892
21083G462892J1746960M82233K160918N496569L248710Q081707K8684979M5371912
$$ 7462892 19209852 19692085 21853003 27349572 30598282 38679989 67364968 112736880
21075A12736880L1856452m796494k8601582k1051198m496184j2182598m7234378
$$ 112736880 144593332 139796838 111195256 90144058 85647874 73465276 26230898
21068B6230898p8587045p1026185j7824828M7731655P4512972M1299157j5638091
$$ 26230898 -52356147 -123382332 -141207160 -93475505 -18962533 22336624 6698533
21061F698533l8121789j2662918J7073062J1420411j4266384j7015632J2998570
$$ 6698533 -31423256 -44086174 -27013112 -15592701 -29859085 -46874717 -33876147
21054c3876147M2646184L9011973K333738l9705966n4941551l0774494R432848
$$ -33876147 8770037 47782010 50115748 10409782 -44531769 -75306263 -65873415
21047f5873415K3687498K021666j4532053J0390779N0511300N1086871J0323959
$$ -65873415 -42185917 -40164251 -54696304 -44305525 6205775 57292646 67616605
21040F7616605k0699276k0273102k3059319m6969803m9817284J097048O0818776
$$ 67616605 46917329 26644227 3584908 -43384895 -93202179 -92105131 -31286355
21033c1286355O2055085J1714590k4397900j8684943n005884p887586q830203
$$ -31286355 30768730 42483320 18085420 -599523 -5605407 -13492993 -22323196
21026b2323196M160804Q074172r746055k2789161j1504595K0791j2528054k6582521
$$ -22323196 -18162392 -10088220 -19834275 -42623436 -54128031 -54107240 -66635294 -93217815
21018i3217815r181520K4185005L1976819J3248423N529786K0194976K5751603
$$ -93217815 -102399335 -78214330 -46237511 -32989088 -27459302 -7264326 18487277
21011A8487277L407706k0921393j7515666M560890J7033815J3442962Q146376
$$ 18487277 21894983 973590 -16542076 -11981186 5052629 18495591 26641967
21004B6641967O642654j426066k1429690l9828936l4833432P03508M5304537O1025834
$$ 26641967 33284621 31858555 10428865 -29400071 -64233503 -63529995 -18225458 42800376
20996D2800376K9511789k3102995m7801253k2972638K4133023M7413785K5701183
$$ 42800376 72312165 49209170 1407917 -21564721 2568302 49982087 75683270
20989G5683270k2311894n6162302m6619357k224554L5986947L6370822J1134339
$$ 75683270 53371376 -2790926 -49410283 -51634837 -15647890 20722932 31857271
20982C1857271m067279J40789j79635j7981278l0618917j2943155K5012343N0645698
$$ 31857271 27789992 27930781 27751146 9769868 -20849049 -33792204 -8779861 41865837
20974D1865837M5989816J7033567k1807093n4236138o0701334l1265042J6746448
$$ 41865837 87855653 104889220 83082127 28845989 -31855345 -63120387 -46373939
20967d6373939M6626755L5768230j88321k0953521m057044K7083724K8583289
$$ -46373939 252816 36021046 35832725 14879204 10822160 37905884 66489173
20960F6489173o119617l2841236j7285689J2667077P299041k8337872m3369296
$$ 66489173 60369556 27528320 10242631 22909708 30208749 1870877 -41498419
20953d1498419k2255514l564197p879783m288516K4995967M1352707J2418875
$$ -41498419 -63753933 -67318130 -75197913 -79486429 -54490462 -13137755 -718880
20946g18880k7805665l1461577j1595278q211345j1926122J1860124M3379142
$$ -718880 -28524545 -59986122 -71581400 -79792745 -91718867 -79858743 -36479601
20939c6479601K7936786k8273122n5436136k4241527J5675498K1396563J4409937
$$ -36479601 -8542815 -36815937 -92252073 -116493600 -100818102 -79421539 -65011602
20932f5011602K0778477J6309988k0183355m7956752j8458011M0707232N7061636
$$ -65011602 -44233125 -27923137 -48106492 -96063244 -114521255 -73814023 -16752387
20925a6752387J7230469j8015158p277378J4630446l746951n0021084o3071843
$$ -16752387 478082 -17537076 -24814454 -10184008 -13930959 -63952043 -127023886
20918a27023886j7909928L8974693N0252245J9986536j307121N916254P149642
$$ -127023886 -144933814 -105959121 -55706876 -35720340 -37027461 -31111207 -23961565
20911b3961565j9662738l7240529o557854L9577217L5882741j4741670m2175288
$$ -23961565 -43624303 -80864832 -87422686 -47845469 -11962728 -26704398 -68879686
20904f8879686j6204545J1103670o308760l7099991k9996581M481328K1266410
$$ -68879686 -85084231 -73980561 -80289321 -117389312 -147385893 -142904565 -121638155
20897a21638155J8047159K8985615N5654216N8487818J9986797k5314896l5012577
$$ -121638155 -103590996 -74605381 -18951165 39536653 59523450 34208554 -804023
20890h04023o904573K5215358K7780308j938844l0275826j9256379K4136112M6184864
$$ -804023 -7708596 17506762 45287070 43348226 13072400 -6183979 17952133 64136997
20882F4136997J2813531m0402502n3051300k0319369P870440K547473j1030757
$$ 64136997 76950528 36548026 -16503274 -36822643 -28952203 -26404730 -37435487
20875c7435487m817234N371325j0800309m5077796n7434460l1713124J383224
$$ -37435487 -42252721 -36881396 -47681705 -92759501 -150193961 -181907085 -180523861
20868a80523861O926810m870078P008153N1745952Q3622534N8519161m799591
$$ -180523861 -173597051 -178467129 -171458976 -119713024 -36090490 22428671 17629080
20861A7629080m7140507m2778144j8775477m557503l12282m88486q435107j3962803
$$ 17629080 -29511427 -72289571 -91065048 -95622551 -95934833 -96423319 -104858426 -118821229
20853a18821229N175632M0843184N0680403J8155623k0489436l1828227k6390676
$$ -118821229 -113645597 -72802413 -22122010 -3966387 -24455823 -56284050 -82674726
20846h2674726j7334661J3141797O5251543Q7227637M4365394j5811945k7571837
$$ -82674726 -100009387 -86867590 -21616047 65611590 109976984 94165039 66593202
20839F6593202l482696j614548k5294100l0286154j2444766p502625j2471004
$$ 66593202 63110506 61495958 36201858 5915704 -6529062 -14031687 -26502691
20832b6502691Q534389L9069161J9127077m6298027p4835744l0958765J9812305
$$ -26502691 -17968302 21100859 40227936 -6070091 -80905835 -111864600 -92052295
20825i2052295J8505019m211948q88769J0236834l317698j6531684L979801K7702366
$$ -92052295 -73547276 -77759224 -78647993 -68411159 -71728857 -88260541 -84280740 -56578374
20817e6578374R934555k2667780j0677163L7792088N8058810K7949247j1501111
$$ -56578374 -46643819 -69311599 -79988762 -42196674 15862136 43811383 32310272
20810C2310272k9596230l6823421l9528776k2499964J1649142L3610682L1098839
$$ 32310272 2714042 -34109379 -73638155 -96138119 -84488977 -50878295 -19779456
20803a9779456K3121933K1465041J3582636p710821k9467265l9575779l4401073
$$ -19779456 3342477 24807518 38390154 30679333 1212068 -38363711 -72764784
20796g2764784p730342L3638090M8531450J615659p1553206r0098065l2370857
$$ -72764784 -80495126 -46857036 1674414 3290073 -68263133 -158361198 -190732055
20789a90732055L4451670N0196725L5463871L5431474L9476299J1014015l3780835
$$ -190732055 -156280385 -106083660 -70619789 -35188315 4287984 15301999 -18478836
20782a8478836m0355161j084924L1146588K1475809m191767j1031226o615103
$$ -18478836 -58833997 -59918921 -28772333 -7296524 -11488291 -22519517 -29134620
20775b9134620j3733724k4850702j7828190J816556Q350247k746357j0835993
$$ -29134620 -42868344 -67719046 -85547236 -83730680 -75380433 -78126790 -88962783
20768h8962783n005554M235734R275612J6187514K6449327L0008798K2368874
$$ -88962783 -93968337 -89732603 -80456991 -64269477 -37820150 -7811352 14557522
20761A4557522R020985r812562l5664178n1304720l4741963q32323P954371j2759393
$$ 14557522 23578507 13765945 -21898233 -73202953 -107944916 -108777239 -100822868 -113582261
20753a13582261j4628147K6324015O2425867M5329968L922622l719785J5303124
$$ -113582261 -128210408 -101886393 -39460526 5869442 9792064 6072279 21375403
20746B1375403Q567621k6475711l9823098j6416223O522743J3722505K9458189
$$ 21375403 29943024 3467313 -36355785 -52772008 -46249265 -32526760 -3068571
20739c068571M8981315L0012825k3155383m4527315j0898482J4028161j4214002
$$ -3068571 45912744 75925569 52770186 8242871 -2655611 11372550 -2841452
20732b841452m5413296k5141994R463756n82974l0079658k0459145R333929j75154
$$ -2841452 -48254748 -73396742 -63932986 -64515960 -94595618 -115054763 -105720834 -105895988
20724a05895988l0452558p900909O1370470Q3102203J8785256n2025694m7221508
$$ -105895988 -136348546 -144249455 -82878985 223218 19008474 -33017220 -80238728
20717h0238728J1180671M6562420L1102683k407011j9087497j7319015j9541190
$$ -80238728 -69058057 -22495637 8607046 6200035 -12887462 -30206477 -49747667
20710d9747667m1932184o5382975m8833212P668194M2019971J5275939j4977192
$$ -49747667 -91679851 -157062826 -205896038 -198227844 -156207873 -140931934 -155909126
20703a55909126K5372715R7181519Q8796818j3309967r2353581o4760271J5390631
$$ -155909126 -130536411 -33354892 55441926 42131959 -50221622 -114981893 -99591262
20696i9591262N6090002M7197041K6221002m81730l4496156m1294240l46611M2652503
$$ -99591262 -43501260 3695781 29916783 29435053 -5061103 -46355343 -46701954 -4049451
20688d049451L8094570R829001Q453874K3631806R539268l1066153n5785371n4548898
$$ -4049451 34045119 43874120 52327994 75959800 85499068 54432915 -1352456 -55901354
20680e5901354m8023082l1926025J1280213N6234490N4977125J0948248k3341155
$$ -55901354 -103924436 -135850461 -124570248 -68335758 -13358633 -2410385 -25751540
20673b5751540j9901149L862676K9262708M7520102L6820733j1936714n2573802
$$ -25751540 -45652689 -41790013 -12527305 34992797 71813530 59876816 7303014
20666G303014l0583573K8558561M4895226J764573l3696715k1408257m319016
$$ 7303014 -23280559 5278002 50173228 51937801 18241086 -3167171 -7486187
20659g486187k3591068m7120457k8010616J7816710M0502612K6586474J94018
$$ -7486187 -31077255 -78197712 -106208328 -88391618 -47889006 -21302532 -21108514
20652b1108514j6574470j2722440J2364845L3097599J5749390k4814708l0570376
$$ -21108514 -37682984 -50405424 -38040579 -4942980 10806410 -14008298 -44578674
20645d4578674R910964L1320480o435436m3334320r510461N6979229O3252850
$$ -44578674 -34667710 -3347230 -9782666 -53116986 -62627447 -5648218 57604632
20638E7604632M721168l2925219r056335K0838601L735852l7477658n6544983
$$ 57604632 62325800 29400581 20344246 41182847 44918699 7441041 -49103942
20631d9103942m7050093k1669769J7718607N5881190N8790356K6978919Q334954
$$ -49103942 -96154035 -117823804 -100105197 -44224007 14566349 41545268 49880222
20624D9880222K1941272J9368493l1731912p6692683n1228476J0773607K6475153
$$ 49880222 71821494 91189987 59458075 -17234608 -68463084 -57689477 -31214324
20617c1214324l140359j044945M7790532O4858704J1435732l9808077k0310131
$$ -31214324 -34354683 -35399628 12390904 77249608 88685340 48877263 28567132
20610B8567132K5407255K0027093j7236175j2359170K8110865K4675584l7874331
$$ 28567132 53974387 74001480 56765305 44406135 72517000 97192584 59318253
20603E9318253p9882696n3870104j3739989j7932393l9420177k6431838P872137
$$ 59318253 -20564443 -74434547 -88174536 -106106929 -145527106 -171958944 -164086807
20596a64086807K0144512J6014326K6641382L8950356K0646620o454889O859022
$$ -164086807 -143942295 -127927969 -101286587 -62336231 -41689611 -48144500 -41285478
20589d1285478M5919562M4782404n162946l6877300j6879154M515891j1576916
$$ -41285478 4634084 49416488 44253542 7376242 -9502912 -4987021 -16563937
20582a6563937k0472675K4506418P5895950N3993687k5657700o6375147k7033502
$$ -16563937 -37036612 -12530194 63365756 117359443 91701743 25326596 -1706906
20575a706906K7614416K7610621j2048943l2002350j5979826J230937p270437
$$ -1706906 25907510 53518131 41469188 9466838 -6512988 -5282051 -12552488
20568a2552488k7695036k8745642J300932M1381406N5280282K6910583j9954694
$$ -12552488 -40247524 -68993166 -67692234 -26310828 28969454 55880037 35925343
20561C5925343m5210420l4974865q507342J3857498K7865081K8653976O774842
$$ 35925343 -9285077 -44259942 -52767284 -38909786 -11044705 17609271 24384113
20554B4384113k3964241k3582115K0371286N6575736K6568665m8174918p8956495
$$ 24384113 419872 -23162243 -2790957 53784779 80353444 32178526 -46777969
20547d6777969k1739644O1693011Q1489178L1337894j6067869j3261217Q318047
$$ -46777969 -68517613 -6824602 74664576 106002470 89934601 76673384 84991431
20540H4991431J86848k8089138k9170229O174097L3858912J9864988j5165381
$$ 84991431 85178279 57089141 27918912 34093009 67951921 87816909 72651528
20533G2651528l1280279k4400968j9905753k4361429j6998762P240834J8186135
$$ 72651528 41371249 16970281 -2935472 -27296901 -44295663 -37054829 -18868694
20526a8868694o032086l7426589l0253435J2602928L8517659J6755309k0584423
$$ -18868694 -24900780 -62327369 -92580804 -79977876 -41460217 -24704908 -45289331
20519d5289331k8048543r669132p88130n504640M675246L1583734L6308122Q67269
$$ -45289331 -73337874 -83007006 -83795136 -89299776 -84624530 -53040796 -16732674 -15865405
20511a5865405l6227659l4872767j2195303r509722k3742366j6737865J7882590
$$ -15865405 -52093064 -86965831 -99161134 -108670856 -132413222 -149151087 -131268497
20504a31268497M4587498M3331191L1242811J8851809p908708m2587257m1903343
$$ -131268497 -86680999 -43349808 -12106997 6744812 -1163896 -43751153 -85654496
20497h5654496J0365690N9455975M4438087j5266650m5398334j7473798K4675733
$$ -85654496 -75288806 -15832831 28605256 13338606 -32059728 -49533526 -24857793
20490b4857793L7933584K9138844J7701928m224471m3446193o9650844m7491506
$$ -24857793 13075791 42214635 59916563 55692092 12245899 -57404945 -104896451
20483a04896451P152707L8705882K1081683j1992664j3937724J7417645M2745833
$$ -104896451 -97743744 -59037862 -37956179 -49948843 -63886567 -46468922 -3723089
20476c723089L0914195p425124l3750536k1001782K0931699N4193423M8057855
$$ -3723089 27191106 19765982 -13984554 -34986336 -14054637 40138786 88196641
20469H8196641R517051k2010532j5888713J4668424K7545343M160430k5582853
$$ 88196641 97713692 75703160 59814447 74482871 102028214 106188644 80605791
20462H0605791k1971194J0961169L0507423J3163843j5215822j7537304M288531
$$ 80605791 58634597 69595766 100103189 113267032 98051210 80513906 84802437
20455H4802437J5210912n613795m1695599o2175588n3632015k7096295l642888
$$ 84802437 100013349 94399554 52703955 -9471633 -63103648 -90199943 -93842831
20448i3842831L820810K7375N9718J0166924J8880719J1663913q516999j9874639
$$ -93842831 -90022021 -89994646 -89934928 -79768004 -60887285 -49223372 -57740371 -77615010
20440g7615010q14631M7348634R1098389Q5630442K3133735m2876776m9297880
$$ -77615010 -78429641 -31081007 60017382 145647824 168781559 125904783 76606903
20433G6606903n040561J4443201k8020948p3339614n1017195J4467413M0445516
$$ 76606903 71566342 86009543 57988595 -15351019 -66368214 -51900801 -11455285
20426a1455285Q981734j7612988n013455M498381k3304295m9811664k9528646
$$ -11455285 -2473551 -20086539 -25099994 -20601613 -43905908 -93717572 -123246218
20419a23246218J1019868J6692622q491393j6037357M547432J6185626P04342
$$ -123246218 -112226350 -95533728 -104025121 -120062478 -115515046 -99329420 -98625078
20412i8625078j7090545j4089639N023000K8870840M7843987M0692856n892938
$$ -98625078 -115715623 -129805262 -124782262 -95911422 -48067435 -7374579 -13267517
20405a3267517n9241279o3923629j3827473L6670251M4660689K3368347J865046
$$ -13267517 -72508796 -136432425 -150259898 -113589647 -68928958 -45560611 -43695565
20398d3695565j6941464l4689737l3333517m917237K3524261K6735929J8443828
$$ -43695565 -60637029 -95326766 -128660283 -133577520 -110053259 -83317330 -64873502
20391f4873502K1218255K4588192R493345p522676K156451K4434612J7243790
$$ -64873502 -43655247 -19067055 -9573710 -17096386 -14939935 9494677 26738467
20384B6738467k2053387m8180066l4538421q965835o635243j8578137j0734860
$$ 26738467 4685080 -43494986 -78033407 -86999242 -93634485 -112212622 -122947482
20377a22947482K3275282N1309511M1093472k728483m1570083m2103622j1925819
$$ -122947482 -99672200 -48362689 -7269217 -9997700 -51567783 -93671405 -105597224
20370a05597224J2051204J3000053J2481694K5973799K6706915j2329475n8282271
$$ -105597224 -93546020 -80545967 -68064273 -42090474 -15383559 -27713034 -85995305
20363h5995305m8481101J9061734P3565155O3689086J7722049j0780750j5713617
$$ -85995305 -134476406 -115414672 -41849517 21839569 39561618 28780868 13067251
20356A3067251k1889647k7977033j0850728K6091608M8413115L3493221p645996
$$ 13067251 -8822396 -36799429 -47650157 -21558549 26854566 60347787 52701791
20349E2701791m6877466n6682482k3090421L2390295N4500555J0336776o0270044
$$ 52701791 5824325 -50858157 -73948578 -41558283 12942272 23279048 -36990996
20342c6990996q2749227l6492321K5771629M9827381L7397191K2016554J9867900
$$ -36990996 -119740223 -156232544 -130460915 -80633534 -43236343 -21219789 -1351889
20335a351889K3358234K1117083N919749k1550318m3545301l6392776k999156
$$ -1351889 22006345 43123428 49043177 27492859 -16052442 -52445218 -55444374
20328e5444374K3677761K2562095J0095670Q343630R778489k416749j7450439
$$ -55444374 -31766613 -9204518 891152 9234782 19013271 16596522 -853917
20321h53917j0936647J3691955K8707586K4053879J5689066R917993r610614m7663479
$$ -853917 -11790564 1901391 30608977 54662856 70351922 80269915 70659301 22995822
20313B2995822p5724714o3246359j6049084L2247919N6104841N1628706K6518446
$$ 22995822 -52728892 -115975251 -132024335 -99776416 -43671575 7957131 34475577
20306C4475577m292055j9004410o205926J5676541J3172455k1484357n7556147
$$ 34475577 30183522 11179112 4973186 20649727 33822182 12337825 -45218322
20299d5218322o1970392l7071625j1485600k713394l679777j633260O811403K0169649
$$ -45218322 -107188714 -144260339 -155745939 -158459333 -162139110 -163772370 -156960967 -136791318
20291a36791318L5020042M0956454K9874201J6075401K6000509N5246119N9281142
$$ -136791318 -101771276 -60814822 -30940621 -14865220 11135289 66381408 125662550
20284A25662550J1275007m9529000o1012762k0570813J3788049M808310k1860340
$$ 125662550 136937557 87408557 26395795 5824982 19613031 24421341 2561001
20277B561001k7175777j1373795K782011O473307J073269j3181777k1281388K524574
$$ 2561001 -24614776 -35988571 -33206560 -26733253 -25659984 -38841761 -60123149 -57598575
20269e7598575M6864927N4670266J347742n2947428m1020340J0676848K4538980
$$ -57598575 -10733648 43936618 45284360 -7663068 -48683408 -38006560 -13467580
20262a3467580m727513j0098515K4516503L2103935j7771523n3873073j3847940
$$ -13467580 -18195093 -28293608 -3777105 28326830 10555307 -43317766 -57165706
20255e7165706M9610302M6673520j3027121m3105767j3945197J8713213J3121949
$$ -57165706 -7555404 39118116 26090995 -17014772 -30959969 -12246756 875193
20248H75193o916673j0314451l237310L207592J4655797K1893457j910786m7689789
$$ 875193 -6041480 -16355931 -19593241 -16385649 -1729852 20163605 18252819 -29436970
20240b9436970o1409026j9252249K9473244K9862807l344766j7290613N77923
$$ -29436970 -90845996 -110098245 -80625001 -50762194 -54106960 -71397573 -70819650
20233g0819650J9024245K0030865J5707319J4236874N840018j5003123l7570322
$$ -70819650 -51795405 -31764540 -16057221 -1820347 4019671 -10983452 -48553774
20226d8553774m5512261k5908230K0641561O3866888N9333074N042307m0961388
$$ -48553774 -94066035 -119974265 -99332704 -35465816 23867258 28909565 -12051823
20219a2051823l3316155m856263j2287699l7599762j0814312O8717654J08884553
$$ -12051823 -45367978 -50224241 -62511940 -100111702 -110926014 -42208360 66676193
20212F6676193N1756067l9657897o8793442l2127457p81546o940759j4763749
$$ 66676193 118432260 78774363 9980921 -22146536 -22928082 -29868841 -44632590
20205d4632590L422861K4594650K1595082M926606l093510l008619n733903r344307
$$ -44632590 -41209729 -16615079 4980003 9906609 6813099 3804480 -1929423 -11273730
20197a1273730q688718j1199876k4862516m1448744m5135129k9245228K506712
$$ -11273730 -19962448 -31162324 -56024840 -97473584 -142608713 -171853941 -169347229
20190a69347229L8393277N5944122L5216784j2483073m4997389l3364490P035316
$$ -169347229 -130953952 -75009830 -39793046 -52276119 -97273508 -130637998 -123602682
20183a23602682M1384274N4426765M8406622K2268908k0009705n2741771n0352337
$$ -123602682 -82218408 -27791643 20614979 42883887 22874182 -29867589 -80219926
20176h0219926k1492364M633061J9735232L4529749M1640572J9607991k2068096
$$ -80219926 -101712290 -97079229 -77343997 -42814248 -1173676 18434315 -3633781
20169c633781m2658699k7596853o875923M48323J5718034M6394956M9193144m441612
$$ -3633781 -46292480 -73889333 -80765256 -80316933 -64598899 -18203943 30989201 26547589
20161B6547589o1548396m7922358K2565319O3298136L5245503j3448985l5040942
$$ 26547589 -35000807 -82923165 -60357846 2940290 38185793 24736808 -10304134
20154a0304134m0213705m4281836k2438547L5834936P9640826O0313965P151756
$$ -10304134 -50517839 -94799675 -117238222 -81403286 -1762460 58551505 65703261
20147F5703261j8106789j5784230l2626288o5812489n5903880J3234767P3151761
$$ 65703261 47596472 31812242 -814046 -66626535 -122530415 -109295648 -36143887
20140c6143887O0726447K135345l0860814j5763405J0426750J6098024P453654
$$ -36143887 24582560 26717905 -4142909 -19906314 -9479564 6618460 14072114
20133A4072114k93874p008040j3437108q857186J1204361K8767836K1127128r681557
$$ 14072114 13778240 6770200 -6666908 -15524094 -4319733 24448103 45575231 35893674
20125C5893674l7650625m2298762k6446808l663181J8116221L3091757L1856789
$$ 35893674 -1756951 -44055713 -70502521 -74165702 -56049481 -22957724 8899065
20118H899065J3955975m299777j2325538k3896149m8052268n4109324o504236
$$ 8899065 22855040 18555263 6229725 -17666424 -65718692 -119828016 -126332252
20111a26332252O7386973R5030827N7061772J3273620N367263m578137n2349484
$$ -126332252 -58945279 36085548 93147320 106420940 111788203 107210066 54860582
20104E4860582r0027911n8945149K356123J3206810j5367162n425389L9841194
$$ 54860582 -35167329 -94112478 -91756355 -78549545 -93916707 -99342096 -59500902
20097e9500902L1538328m1434233o7536578J1730687R1455988N6183274m2622354
$$ -59500902 -27962574 -69396807 -136933385 -125202698 -33746710 22436564 -20185790
20090b0185790o9393073q271663L3551193K654807l6429467k2930655J3616761
$$ -20185790 -89578863 -97850526 -64299333 -61644526 -98073993 -121004648 -107387887
20083a07387887K0974740N695525O638313L1719270N3406043M2759518m003282
$$ -107387887 -86413147 -80717622 -74079309 -42360039 11046004 53805522 49802240
20076D9802240n1270039m4115019K2849153P2015258L0267667o0056654q3628621
$$ 49802240 -1467799 -45582818 -22733665 49281593 79549260 19492606 -64136015
20069f4136015r465992O6452179N7597659m089290l5222295j8541398k00487p131910
$$ -64136015 -73602007 -7149828 50447831 46358541 11136246 -7405152 -7605639 -14737549
20061a4737549k1666532k3166943j3850371o696963q825274j1900541L705396
$$ -14737549 -36404081 -59571024 -73421395 -80118358 -88943632 -100844173 -97138777
20054i7138777L6811759M4790132n803636p1543236p1963437o386580L6326265
$$ -97138777 -60327018 -15536886 -21340522 -92883758 -164847195 -171233775 -134907510
20047a34907510R444657k4002432Q88094M9243529N7502573M0398632M3876184
$$ -134907510 -125462853 -149465285 -148577191 -99333662 -41831089 -1432457 42443727
20040D2443727M3710936r590016p6751536o8863415P057161M7799846J0993530
$$ 42443727 86154663 76564647 -186889 -69050304 -61993143 -14193297 -3199767
20033c199767k8675577r090908K7369968J8545910j8706400l1253911j2340251
$$ -3199767 -31875344 -40966252 -13596284 4949626 -13756774 -45010685 -57350936
20026e7350936J3091188L6643041M8953042K1190071m1739202p3715439l3083739
$$ -57350936 -44259748 -7616707 41336335 62526406 20787204 -52928235 -86011974
20019h6011974K3372729J8836784k4182246k0482701M0258337P7500252M5121396
$$ -86011974 -62639245 -43802461 -67984707 -88467408 -48209071 29291181 74412577
20012G4412577q090392k5715394k0469942k6068385l0274402p438493J9149061
$$ 74412577 66322185 40606791 20136849 -5931536 -36205938 -43644431 -24495370
20005b4495370L799686m5459246o5586053j9222271N3869866P8185441K3224044
$$ -24495370 -20695684 -66154930 -131740983 -150963254 -97093388 -18907947 4316097
19998D316097o3003689r8671331m9507869L4019269P0284840L6430517j3599649
$$ 4316097 -58687592 -157358923 -206866792 -172847523 -102562683 -66132166 -79731815
19991g9731815k4409734n159154k003953k8129000n1373684m1701145k231656
$$ -79731815 -104141549 -109300703 -111304656 -139433656 -190807340 -232508485 -234740141
19984b34740141M4275880P4053675O7395987K1771514l2796994n3170100k8670099
$$ -234740141 -190464261 -116410586 -49014599 -27243085 -60040079 -113210179 -141880278
19977a41880278P985700K3100216J8998627J8071093K5183973K2801162j164702
$$ -141880278 -133894578 -110794362 -91795735 -73724642 -48540669 -25739507 -26904209
19970b6904209l2467282l9112295j845740N7618142Q3877521M1098509l9128622
$$ -26904209 -59371491 -98483786 -100329526 -42711384 41166137 82264646 43136024
19963D3136024q4079018o1196263j0278171J7096791K1608526L3941830N3113755
$$ 43136024 -40942994 -102139257 -112417428 -95320637 -73712111 -39770281 13343474
19956A3343474M8135278J5156460q195836M362307L0960489L2829168J928290
$$ 13343474 61478752 76635212 68439376 72801683 103762172 136591340 138519630
19949A38519630l6807600n5974799m6586456k0224464J59267J015188n298961
$$ 138519630 101712030 45737231 -849225 -21073689 -20914422 -19899234 -25198195
19942b5198195L424028K4224515K8321837L430710k3157745j9904108M812669
$$ -25198195 -21774167 2450348 30772185 34202895 11045150 -8858958 -4046289
19935d046289J4053555p569271l3655538k8709624R804424M7209515M6436381
$$ -4046289 10007266 2437995 -31217543 -59927167 -50122743 -2913228 43523153
19928D3523153N107568m1747900n4588395k2808351L0889628O8744237O1165066
$$ 43523153 48630721 6882821 -47705574 -70513925 -39624297 29119940 90285006
19921I0285006J1436132l4768350k8961707J4675012K3742684l2707089q3800675
$$ 90285006 101721138 66952788 37991081 52666093 76408777 43701688 -40098987
19914d0098987m8503446L8867635O8573208J4701503l1551714o922097L4710665
$$ -40098987 -88602433 -49734798 18838410 33539913 1988199 -4933898 29776767
19907B9776767K4563713j1078564j3932734j910411k5851372o0767054l8148837
$$ 29776767 54340480 43261916 29329182 27418771 1567399 -59199655 -97348492
19900i7348492L0591295N9259213J8385686k7100647k7947845j5014026k2678975
$$ -97348492 -66757197 -7497984 10887702 -16212945 -44160790 -59174816 -81853791
19893h1853791k2602250J8290678O8204250P1507499K6774084j9448484l4358997
$$ -81853791 -104456041 -86165363 -17961113 53546386 80320470 60871986 26512989
19886B6512989k1066872Q53356R049735r542240l8268308m0644648p778170K5894228
$$ 26512989 5446117 6299473 15349208 5806968 -32461340 -73105988 -80884158 -54989930
19878e4989930K9833355J4343118K638632n167332j6679651k1632738q576414
$$ -54989930 -25156575 -10813457 -8174825 -13342157 -30021808 -51654546 -60230960
19871f0230960J1616192K1603293K0062513J1339718n845675k2025937j4359226
$$ -60230960 -48614768 -27011475 -6948962 4390756 -1454919 -23480856 -37840082
19864c7840082J8622381M3559113L4943275P658778j2430541k1823775k1590233
$$ -37840082 -19217701 24341412 59284687 66943465 54512924 32689149 11098916
19857A1098916o87443L2625012L7622473j325153l5608213j7747851K0796068
$$ 11098916 10411473 43036485 80658958 79333805 43725592 25977741 46773809
19850D6773809J2710485m1117840p1678603m2882362P422058L6157400M7763308
$$ 46773809 59484294 18366454 -53312149 -96194511 -88772453 -52615053 -4851745
19843d851745N6661045M6697072L907084m1863944m7723998j7868809K33403j9276236
$$ -4851745 51809300 98506372 102413456 60549512 12825514 -5043295 -4809892 -24086128
19835b4086128m4514567k7589403K8931789O8096604M8580628l46422j8261953
$$ -24086128 -68600695 -96190098 -67258309 838295 49418923 49072501 30810548
19828C0810548K731580J2070646j7641285m8411748l7936631r85371K2994656
$$ 30810548 33542128 45612774 27971489 -20440259 -58376890 -59362261 -36367605
19821c6367605K6504773J9189537p131552m9103749n9593138n613580O2974445
$$ -36367605 -9862832 9326705 2195153 -46908596 -106501734 -112115314 -49140869
19814d9140869O8400932J5984932j8742906p601573K089877j6542843k6907605
$$ -49140869 19260063 35244995 16502089 8900516 10990393 -5552450 -32460055
19807c2460055p219835L243265k3694330m9433464l2032823N539333J8425116
$$ -32460055 -39679890 -36436625 -60130955 -109564419 -141597242 -136057909 -117632793
19800a17632793Q010476l68208q744292k6197563l1366659o135871K1785445J9707134
$$ -117632793 -109622317 -109990525 -118734817 -144932380 -176299039 -182434910 -160649465 -140942331
19792a40942331O522574J7216148L6857964K7294931l91265k051439K1850162
$$ -140942331 -134419757 -117203609 -80345645 -53050714 -53441979 -55493418 -33643256
19785c3643256K7053986J690507j8219837j3542132n983833r403993j0533720
$$ -33643256 -6589270 -4898763 -23118600 -36660732 -42644565 -52048558 -62582278
19778f2582278p507688j4328530j7322406J3873430N6765106M4599443k5263009
$$ -62582278 -70089966 -84418496 -101740902 -87867472 -31102366 13497077 -11765932
19771a1765932o0580201k779099P3567049N9452489l1048434q2054808l8398120
$$ -11765932 -72346133 -75125232 -1558183 57894306 26845872 -55208936 -93607056
19764i3607056L1904791M3713853m135319n3884760o3052423k9088375K1969855
$$ -93607056 -61702265 -17988412 -22123731 -76008491 -139060914 -168149289 -146179434
19757a46179434N0364788L6202826J0624743K0682032N6240711N7148018P495926
$$ -146179434 -95814646 -59611820 -48987077 -28305045 27935666 85083684 92579610
19750I2579610l2653525k0691383O40571j9755839m6460576j2670873N9228260
$$ 92579610 59926085 39234702 39875273 20119434 -26341142 -39012015 20216245
19743B0216245P6620335J3175186n4373719o1507263l4088774k2040490k2309718
$$ 20216245 96836580 110011766 55638047 -5869216 -39957990 -61998480 -84308198
19736h4308198j2279952n570138k0949149l4188609j4559512J9118319L0222517
$$ -84308198 -96588150 -102158288 -123107437 -157296046 -171855558 -152737239 -122514722
19729a22514722K7096162L9785301N4232568L0661547k0193282m0618737j0885930
$$ -122514722 -95418560 -55633259 -1400691 29260856 9067574 -31551163 -42437093
19722d2437093K3635867K1755134n202870k8379139l9736236l7405118j3574198
$$ -42437093 -18801226 2953908 -2248962 -30628101 -70364337 -107769455 -121343653
19715a21343653K1201875L5596715J9326242l513785j7979481l7891897o2241128
$$ -121343653 -100141778 -64545063 -45218821 -48732606 -66712087 -104603984 -166845112
19708a66845112n4307933K036208N9493425O2001939K0307652p103554N614793
$$ -166845112 -221153045 -219116837 -159623412 -97621473 -77313821 -84417375 -78802582
19701g8802582K8813735K8270454M475076j9628461k4830599q363088J2609927
$$ -78802582 -49988847 -21718393 -17243317 -36871778 -61702377 -70065465 -57455538
19694e7455538J4131689m543683j5359464j630118J3374001K002387k0192122
$$ -57455538 -43323849 -47867532 -63226996 -64857114 -51483113 -49480726 -69672848
19687f9672848j5311487J7204019L7845246K4423641j947518j5192548j7043891
$$ -69672848 -84984335 -67780316 -29935070 -5511429 -7458947 -22651495 -39695386
19680c9695386j8136622j3849058N69371J0092360n77125j7285500j1237408J6224706
$$ -39695386 -57832008 -71681066 -71111695 -61019335 -61596460 -78881960 -90119368 -73894662
19672g3894662K7245421k333884m3184015m4087108K016079M7819724N1771627
$$ -73894662 -46649241 -48983125 -92167140 -136254248 -134238169 -86418445 -34646818
19665c4646818K2822548p358378k7918388l8904303k5711499J5232935M4173044
$$ -34646818 -11824270 -19182648 -47101036 -86005339 -111716838 -96483903 -52310859
19658e2310859K3635189j2091215N329193O6608439Q1617374J2669072o0568464
$$ -52310859 -28675670 -40766885 -35437692 31170747 112788121 125457193 64888729
19651F4888729n6201030o752645M423441k6148021l4854706n982286J1449047
$$ 64888729 8687699 1935054 6358495 -19789526 -54644232 -60626518 -49177471
19644d9177471l879524j5895253m388080J707946j4813576k3712066L63213L4673710
$$ -49177471 -53056995 -68952248 -73340328 -71632382 -86445958 -110158024 -109794811 -75121101
19636g5121101M3385425K2185843q969479k6373279q360189M1091540O9744241
$$ -75121101 -31735676 -9549833 -18519312 -44892591 -53252780 -12161240 57583001
19629E7583001K6594885n5727620q3765143k8097107L4399118L4457147M205765
$$ 57583001 84177886 28450266 -55314877 -83411984 -49012866 -14555719 -10349954
19622a0349954P837552L4505625K8593512r559205k8154840j2803583J338833
$$ -10349954 -2512402 31993223 60586735 51027530 22872690 10069107 11407940
19615A1407940L760043K4706445O4354067P0479940J6547448m7458628n9607901
$$ 11407940 15167983 39874428 104228495 174708435 191255883 143797255 84189354
19608H4189354k6231554K243732R762802K1156383L8780343K4903230l3696666
$$ 84189354 57957800 60201532 69964334 91120717 129901060 154804290 121107624
19601A21107624q2326722n8702201J7422571N9104564K4764469k6177244j8292233
$$ 121107624 38780902 -19921299 -2498728 56605836 81370305 55193061 36900828
19594C6900828L4288551N5538937K2239477j1091070o950398O00469k4320594
$$ 36900828 71189379 126728316 148967793 137876723 130926325 131526794 107206200
19587A07206200n1724643l6003803O631727K6694677J9666100J6101093J2841107
$$ 107206200 55481557 19477754 26109481 52804158 72470258 88571351 101412458
19580A01412458j7814710n5135528m0354426K4148163N6862179J3102028m2640015
$$ 101412458 83597748 28462220 -11892206 12255957 69118136 82220164 39580149
19573C9580149l1023139K4095374L7296072p464975m1269043k1675039J1822511
$$ 39580149 8557010 32652384 69948456 62483481 21214438 -460601 11361910
19566A1361910J2947910k088275J629447R893451j3549766n5666013o4138514
$$ 11361910 24309820 22221545 23850992 33744443 20194677 -35471336 -99609850
19559i9609850k5892276J2676184J4581294l21900K088700J5180849J1479484
$$ -99609850 -125502126 -112825942 -98244648 -98566548 -96477848 -81296999 -69817515
19552f9817515n356238p252072Q011921J1616050p412064k2340447j1404624O873193
$$ -69817515 -75173753 -82425825 -74413904 -62797854 -70209918 -92550365 -103954989 -97081796
19544i7081796K031014k1474284k9010914k272535L7146315N2792139L2371332
$$ -97081796 -95050782 -116525066 -145535980 -147808515 -110662200 -57870061 -25498729
19537b5498729j299345j5790137m414143P593154l135730k4809985k4026281R720058
$$ -25498729 -26798074 -42588211 -47002354 -39409200 -42544930 -67354915 -91381196 -81661138
19529h1661138M8767922N8536900L0698416j4547977m3695191l0276455J7179428
$$ -81661138 -32893216 25643684 56342100 41794123 -1901068 -32177523 -14998095
19522a4998095M7836047J8644338m2999783o1879299j3908884L7402431L0317844
$$ -14998095 32837952 51482290 8482507 -53396792 -67305676 -29903245 414599
19515D14599q987694j3403892K1801857M0129720J7310207p297821j827621R912543
$$ 414599 -8573095 -21976987 -175130 39954590 57264797 49966976 48139355 58051898
19507E8051898m069700k9655152l2730292j3465732q90603o398643j2273924l054877
$$ 58051898 53982198 24327046 -8403246 -21868978 -22759581 -29158224 -41432148 -44487025
19499d4487025J4721735K6641062K8693423K5736763J9809138P426592j0267698
$$ -44487025 -29765290 -3124228 25569195 51305958 71115096 78541688 68273990
19492F8273990j9448668n502261K3680620L8442597K1524609j0050673l0570384
$$ 68273990 48825322 43323061 67003681 105446278 126970887 116920214 86349830
19485H6349830l8564129m3792849l8147911j2803610O675808j2635634m7876248
$$ 86349830 47785701 3992852 -34155059 -46958669 -40282861 -52918495 -100794743
19478a00794743l7066903K2919161N0128844j0092082r1804000q7913406J546414
$$ -100794743 -137861646 -114942485 -64813641 -74905723 -166709723 -254623129 -253076715
19471b53076715P0248935N3996916P507234P567145M1109411M0794784n003594
$$ -253076715 -182827780 -128830864 -121323630 -113756485 -72647074 -31852290 -36855884
19464c6855884m0552653l2396444j0767587p235579k204239L0780411O3229527
$$ -36855884 -77408537 -109804981 -120572568 -127808147 -130012386 -99231975 -36002448
19457c6002448M3825878j7515034m8335634r681298M7391160M9995176P28902
$$ -36002448 7823430 -9691604 -58027238 -67708536 -20317376 29677800 30406702
19450C0406702l1954620j0733366K5133085K2190461j2079437k3451536J1867354
$$ 30406702 -1547918 -12281284 12851801 35042262 22962825 -488711 11378643
19443A1378643N2871422M5521958p026879m6283065l2961353J440066j268224
$$ 11378643 64250065 109772023 102745144 56462079 23500726 24940792 23672568
19436B3672568m2385010o2675299k7872947K2791094L7582647K3883657J8372549
$$ 23672568 -18712442 -81387741 -109260688 -86469594 -48886947 -25003290 -6630741
19429f630741J6540214j0827744m6105264l7305573J2454303L4993121j246708
$$ -6630741 9909473 -918271 -47023535 -84329108 -71874805 -36881684 -38128392
19422c8128392m1937086l4565934q107247j5594441m3787810m0305866N52982
$$ -38128392 -80065478 -114631412 -122738659 -138333100 -182120910 -222426776 -221873794
19415b21873794M0824969O5953332Q6105465Q5418628L7790009k8678437m9569063
$$ -221873794 -181048825 -115095493 -28990028 56428600 94218609 65540172 15971109
19408A5971109j5438827J5137497N471783j7303997k6449972l5927258m8232050
$$ 15971109 532282 15669779 21141562 3837565 -22612407 -58539665 -106771715
19401a06771715k8558299K4934848M5910761n939381o4273550m0061207M6174773
$$ -106771715 -135330014 -110395166 -64484405 -70423786 -134697336 -174758543 -128583770
19394a28583770R1008221N1066311j4302937l9913348k2988852J2623424N1010106
$$ -128583770 -37575549 13490762 -812175 -40725523 -63714375 -51090951 -80845
19387h0845O3819410J9958174n3927275p8597216k4679495L8635998L8284106
$$ -80845 63738565 83696739 29769464 -48827752 -73507247 -34871249 3412857
19380C412857m867729k3010752o811584q76693j6778098j8791718O404081K7790291
$$ 3412857 -1454872 -24465624 -31277208 -32153901 -48931999 -67723717 -61319636 -33529345
19372c3529345K7060184K3200594K4116809N059787l8120566n8880028k1303111
$$ -33529345 -6469161 16731433 40848242 45908029 7787463 -51092565 -72395676
19365g2395676L8276885N2229019R123202l7045643l9942128j1093413O478603
$$ -72395676 -34118791 18110228 27233430 -9812213 -49754341 -60847754 -54369151
19358e4369151p920894l3218111l2126133M975585M0954791K9718703k1650762
$$ -54369151 -62290045 -95508156 -127634289 -122658704 -81703913 -51985210 -73635972
19351g3635972n1758585k3438807K1434787J6589319l7951661q0101755p1075927
$$ -73635972 -125394557 -148833364 -127398577 -110809258 -148760919 -228862674 -299938601
19344b99938601l0427461J4166237N9442534R2896591P9394890J7227671l2364484
$$ -299938601 -330366062 -316199825 -256757291 -163860700 -84465810 -67238139 -99602623
19337i9602623j7482399K8305986L1129811j6565707m7103111j5420809M3606229
$$ -99602623 -117085022 -88779036 -57649225 -74214932 -121318043 -136738852 -93132623
19330i3132623O9253703M6923444O897575j8656485j7097059L615142J7321229
$$ -93132623 -23878920 23044524 29942099 11285614 -5811445 -2196303 15124926
19323A5124926J321552l1867508m4737666k6315969n931309k100016P347592L8627313
$$ 15124926 16446478 -15421030 -60158696 -86474665 -92405974 -94505990 -87158398 -48531085
19315d8531085O0445399L7980260p836555k9992147k4866533k2149132k0512481
$$ -48531085 11914314 49894574 42058019 12065872 -12800661 -34949793 -55462274
19308e5462274N917798L9598869K6677984l1643742o1556620k2817646K8467606
$$ -55462274 -49544476 -9945607 16732377 -14911365 -76467985 -99285631 -70818025
19301g0818025K8144910j300816m784317N025957j8770153n2721189k6245056
$$ -70818025 -42673115 -43973931 -48758248 -43732291 -62502444 -115223633 -141468689
19294a41468689N1101654Q0776830K0800492m5831790l6700763J0518266J3191685
$$ -141468689 -90367035 -9590205 11210287 -34621503 -71322266 -60804000 -47612315
19287d7612315j8705239r049913M7863155P2558711K7062486k9619513l9563524
$$ -47612315 -66317554 -75367467 -27504312 45054399 72116885 42497372 2933848
19280B933848k5489547k8551049k8396769J2525592O4846348O3651680Q745676
$$ 2933848 -22555699 -51106748 -79503517 -66977925 -2131577 61520103 70265779
19273G0265779l4240263l3446794k5738858l6830553l2367409J2343752M7248577
$$ 70265779 36025516 2578722 -23160136 -59990689 -92358098 -80014346 -32765769
19266c2765769J2214899o0687749p5711196l957190P2750152O7701028m080166
$$ -32765769 -20550870 -81238619 -156949815 -160907005 -88156853 -20455825 -24535991
19259b4535991n4298484l0184572L5977444P5018625N3450725j789370l7036093
$$ -24535991 -78834475 -109019047 -73041603 1977022 55427747 53638377 16602284
19252A6602284k6845105M353686J8205870J0560154O060142J1730162O268711
$$ 16602284 -10242821 -5889135 12316735 22876889 28937031 40667193 46935904
19245D6935904j9420001m2846794m4429970l2196339j6847127N837863K8093257
$$ 46935904 27515903 -15330891 -59760861 -91957200 -108804327 -102966464 -74873207
19238g4873207K2432202j0024649k1534648J2177398M2039196J9649358j4225074
$$ -74873207 -52441005 -62465654 -84000302 -71822904 -29783708 -10134350 -24359424
19231b4359424J0567961O5242723M5746959o4170598j44921763r7368362K5925897
$$ -24359424 -13791463 51451260 97198219 33027621 -111894142 -209262504 -183336607
19224a83336607J01466144R1111947N2877137L3377108K0818802n888520m0282578
$$ -183336607 -81870463 9241484 62118621 95495729 116314531 110426011 70143433
19217G0143433o4782656o6278667l6810281J1322955M0339907K8966436Q297380
$$ 70143433 5360777 -60917890 -97728171 -86405216 -46065309 -17098873 -8801493
19210h801493K0200179N1827868N4462150K1602022j029721R716291J8150078
$$ -8801493 11398686 63226554 117688704 139290726 138261005 147977296 166127374
19203A66127374r951293m9341178n0138015r129498K6813868K2554725o834121
$$ 166127374 156176081 106834903 56696888 47567390 74381258 96935983 90101862
19196I0101862k3893870j6442998m589722p468701j9733921k6277935k4870764
$$ 90101862 66207992 49764994 45175272 37706571 17972650 -8305285 -33176049
19189c3176049j9161724k047621K8981224M6910860J9391562l8366324p0364883
$$ -33176049 -52337773 -54385394 -25404170 21506690 40898252 2531928 -67832955
19182f7832955n1359663j7055587o865783j3102758r584355N808663K5033652
$$ -67832955 -119192618 -136248205 -143113988 -156216746 -165801101 -159992438 -134958786
19175a34958786N0080449O7692479M3159639k0399383n5831381j6235966M7642175
$$ -134958786 -84878337 -17185858 25973781 5574398 -50256983 -66492949 -18850774
19168a8850774N2055300m290624n0946001n0177162k5229077p85068J5933401
$$ -18850774 33204526 28913902 -22032099 -72209261 -97438338 -98223406 -82290005
19161h2290005O518072l3943063n2099419N159799Q9568854R4441133P875940
$$ -82290005 -75771933 -109714996 -161814415 -156654616 -67085762 27355371 35231311
19154C5231311o4960156n2189324J546682L1714056M0963699M3486289J2235250
$$ 35231311 -29728845 -81918169 -80371487 -48657431 -7693732 35792557 48027807
19147D8027807n2421729p6199816r607261Q2237847J02521239N0636207k441836
$$ 48027807 -4393922 -80593738 -90200999 -7963152 94558087 145194294 142752458
19140A42752458k4042344l1502992k8910862q393655P334064p842509l1475145
$$ 142752458 118710114 87207122 58296260 49902605 57236669 49394160 17919015
19133A7919015k7778042j1724036j6583089k4327326J909260L9008491L3964950
$$ 17919015 -9859027 -21583063 -38166152 -62493478 -60584218 -21575727 12389223
19126A2389223k730349j3661859L904710k832096l9126571m5606802k605574K9144437
$$ 12389223 9658874 -4002985 -98275 -2930371 -42056942 -87663744 -90269318 -61124881
19118f1124881L719011m1943432n1409278k3576239J1451363M0485715N4736849
$$ -61124881 -57405870 -99349302 -150758580 -174334819 -162883456 -122397741 -67660892
19111f7660892L5655523o847991k1871279J4626450N2248325L1216439k8943808
$$ -67660892 -32005369 -38853360 -60724639 -46098189 6150136 37366575 8422767
19104H422767n3577352j6308089K7104462J6771355l2381817n2846003j4894200
$$ 8422767 -45154585 -61462674 -34358212 -17586857 -49968674 -102814677 -117708877
19097a17708877L3306238L1790210m693762o432187M3182431P3342099L0380525
$$ -117708877 -84402639 -52612429 -57306191 -63738378 -20555947 52786152 83166677
19090H3166677l5590705m4786691q141029J141245k6998949l0408730R354699
$$ 83166677 47575972 2789281 -5351748 -4210503 -31209452 -61618182 -52263483
19083e2263483L2641592N814472k2884087r630546J4454395O766592j3702844
$$ -52263483 -19621891 -13807419 -36691506 -46322052 -31867657 -25101065 -38803909
19076c8803909j1212019j411861j5800973l5666884k1240952J8472665M0555703
$$ -38803909 -50015928 -51427789 -67228762 -102895646 -124136598 -105663933 -65108230
19069f5108230L5793768L1104512L6104194L3349815J5817727n094119k4496728
$$ -65108230 -29314462 1790050 37894244 71244059 87061786 81967667 57470939
19062E7470939m3340756m8213874k3713451J7457452M3353325L9916112J9487530
$$ 57470939 14130183 -34083691 -57797142 -40339690 3013635 42929747 62417277
19055F2417277j491454j5175765k0927822k6836747m2050847n5995148m3232315
$$ 62417277 60925823 45750058 24822236 -2014511 -44065358 -100060506 -143292821
19048a43292821k629455L1789151L7361043L3780583M3230079M6279546J0899116
$$ -143292821 -145922276 -114133125 -76772082 -42991499 238580 46518126 57417242
19041E7417242n2164115r5822145q9044306m0025910J9250248N1893625L8816900
$$ 57417242 5253127 -90569018 -179613324 -219639234 -200388986 -148495361 -109678461
19034a09678461L519603p522742J2133268J7184491j3483008l0933450J0888965
$$ -109678461 -106158858 -113681600 -101548332 -84363841 -97846849 -128780299 -117891334
19027a17891334P3310211Q0658938K6304142k8044650m4062634l7605120k5882290
$$ -117891334 -44581123 36077815 62381957 34337307 -9725327 -47330447 -73212737
19020g3212737o340769R491190L19747j7860660m025856L6890519N0325664J7176422
$$ -73212737 -79553506 -70062316 -69742569 -87603229 -91629085 -54738566 -4412902 12763520
19012A2763520j2140286L453903L1836994K0493254k3621401m9110974l3462826
$$ 12763520 623234 4077137 35914131 56407385 32785984 -16324990 -49787816
19005d9787816l660940O196986j0500327l5060644m1237019j6957651J9350342
$$ -49787816 -53448756 -47251770 -57752097 -92812741 -134049760 -151007411 -131657069
18998a31657069L4089742J9998656P997197K4977954N4324971N5381423J4084507
$$ -131657069 -97567327 -77568671 -69571474 -44593520 9731451 65112874 79197381
18991G9197381m0301477o5451987m4773709n79994K5994259J3099383k0738089
$$ 79197381 38895904 -26556083 -71329792 -71909786 -45915527 -32816144 -53554233
18984e3554233l7991621k2990707O235577K3569884K0752004Q822915M343000
$$ -53554233 -91545854 -114536561 -108300984 -84731100 -63979096 -55156181 -50813181
18977e0813181J3868068K5727015K2669970P615091K697105J3440495J5770093
$$ -50813181 -36945113 -11218098 11451872 19066963 21764068 35204563 50974656
18970E0974656k893448j6031172k398014Q249301k0446575n9826318m7597901
$$ 50974656 48081208 32050036 29652022 37901323 17454748 -42371570 -89969471
18963h9969471J2508591M6309191J7870735j9371868q677470K8389685L7676673
$$ -89969471 -77460880 -31151689 -13280954 -32652822 -41330292 -12940607 24736066
18956B4736066J5074541o423031k0558537m3856283o4234041m7874080K728960
$$ 24736066 39810607 33387576 12829039 -31027244 -95261285 -143135365 -140406405
18949a40406405M2366526M2748242K3598189J3730187J1380541L21544j5831989
$$ -140406405 -98039879 -55291637 -31693448 -17963261 -6582720 -6261176 -22093165
18942b2093165j7432099N052J6607246J4399427K564689N201941K4319803L0370719
$$ -22093165 -39525264 -39520212 -22912966 -8513539 -5948850 -746909 23572894 53943613
18934E3943613K057105l6520216m1111394o215520K7682074K9857216J4195533
$$ 53943613 56000718 19480502 -21630892 -27846412 -164338 29692878 43888411
18927D3888411O105959K104486j5287956m1515187n4448063m4595313j9046490
$$ 43888411 49994370 52098856 36810900 -4704287 -59152350 -103747663 -122794153
18920a22794153J5669044N1618494O6749606M1339901q688947l7755270k1871406
$$ -122794153 -107125109 -55506615 11242991 52582892 43893945 6138675 -15732731
18913a5732731J0541827J3976091j5536846l6127800j8622227R912860J935100
$$ -15732731 -5190904 8785187 -6751659 -42879459 -61501686 -51588826 -49653726
18906d9653726l9312345n6110639j4531146M4562015N9367803K8658917K156025
$$ -49653726 -88966071 -145076710 -159607856 -115045841 -55678038 -27019121 -24863096
18899b4863096L033421N666568q214750j7712653l249800J8810996K4444494J6134244
$$ -24863096 -21829675 -16163107 -24377857 -42090510 -45340310 -26529314 -2084820 14049424
18891A4049424O388677q027084l1160837m6773307l6811406q726885J4418951
$$ 14049424 20438101 12411017 -18749820 -65523127 -102334533 -111061418 -96642467
18884i6642467K0765508J4275974O021929R591637K7145858L3574012Q12369n2259233
$$ -96642467 -75876959 -61600985 -55579056 -45987419 -18841561 14732451 15544820 -36714413
18876c6714413o8203525k8119772J6168264J5557253p292792k995894K1955842
$$ -36714413 -104917938 -133037710 -116869446 -101312193 -108604985 -111600879 -89645037
18869h9645037K1410115q411111k1765321J254428K6095863K2962864Q543950
$$ -89645037 -68234922 -76646033 -98411354 -97156926 -71061063 -48098199 -39554249
18862c9554249Q089705J3416184N125598j0588092j5620265j2715164j7299415
$$ -39554249 -31464544 -18048360 -12922762 -23510854 -39131119 -51846283 -69145698
18855f9145698k6476526k1425176J894087K5471733L4308647L1269144K3006625
$$ -69145698 -95622224 -117047400 -115153313 -89681580 -55372933 -24103789 -1097164
18848a097164Q600411p608933p380295J8643615M7591487M6590080J7381139o352149
$$ -1097164 7503247 -105686 -7485981 11157634 58749121 105339201 122720340 116368191
18840A16368191j0031996j5286765l2448202l2293386M630427M1951235L3512223
$$ 116368191 106336195 91049430 58601228 26307842 30938269 72889504 106401727
18833A06401727o410681k7037136j9047767j4537469k0230635j3229862r80261
$$ 106401727 99991046 72953910 53906143 39368674 19138039 5908177 4927916
18826D927916j6367828m5183132l2593581J9078110L7532013k444885l0563051
$$ 4927916 -11439912 -56623044 -89216625 -70138515 -32606502 -35051387 -65614438
18819f5614438J158077L2268044m591999o4530115n8630085P550392N3391916
$$ -65614438 -64456361 -32188317 -36780316 -101310431 -159940516 -152390124 -98998208
18812i8998208M8065400K8081756J2922578j0171593k9983990k1538374m671088
$$ -98998208 -50932808 -22851052 -9928474 -20100067 -50084057 -71622431 -76293519
18805g6293519j6493883l5599168j2228208L6307071M5768120J5149760N158339
$$ -76293519 -92787402 -128386570 -140614778 -104307707 -58539587 -43389827 -38231488
18798c8231488K4219458J3691854l7684962o2922640k9371219R832438J2596150
$$ -38231488 -14012030 -320176 -38005138 -100927778 -130298997 -120466559 -107870409
18791a07870409Q087453J9545527J4575650j8029438k5987174J4991990M7299683
$$ -107870409 -99782956 -80237429 -65661779 -83691217 -109678391 -94686401 -47386718
18784d7386718L1254029J8953755N4815279P9160592K1530677p1457902r9768793
$$ -47386718 -16132689 2821066 57636345 136796937 158327614 86869712 -12899081
18777a2899081n6017213j0432801J2108304L6310697M4296214q416618q8172298
$$ -12899081 -68916294 -79349095 -67240791 -30930094 13366120 4949502 -83222796
18770h3222796j01602996l3945267K6093006K3389247Q910528L8566519P9930323
$$ -83222796 -184825792 -218771059 -192678053 -169288806 -160378278 -121811759 -41881436
18763d1881436P3048849K6059460o549470m363773R749736J6777220J5741476
$$ -41881436 31167413 57226873 50677403 46313630 56063366 72840586 88582062
18756H8582062N201316j5259617l1780317k8358794q632852Q710960J1654702
$$ 88582062 93783378 78523761 46743444 18384650 9751798 18462758 30117460
18749C0117460L456660n445682r908653j6783718l3693880m6898010k8074433
$$ 30117460 33574120 28128438 18219785 1436067 -32257813 -79155823 -107230256
18742a07230256K0853389N2019352L0943514p296650l170626L6643212M5330473
$$ -107230256 -86376867 -34357515 -3414001 -10710651 -13881277 22761935 68092408
18735F8092408k870175n1199748m2452483K202766K1329361K37201k0689067j2937478
$$ 68092408 65222233 14022485 -28429998 -26227232 -4897871 -4660670 -25349737 -38287215
18727c8287215K610872q001041m1014030n6748180k9103813J8862769L9544983
$$ -38287215 -35676343 -43677384 -84691414 -141439594 -170543407 -151680638 -112135655
18720a12135655J8877207o840691l29880K7702699L6098304P684613l3670166
$$ -112135655 -93258448 -100099139 -100429019 -72726320 -36628016 -28943403 -62613569
18713f2613569n3653845l8393156j609186K4973085J8218139o552847p444474
$$ -62613569 -116267414 -154660570 -156269756 -131296671 -113078532 -119631379 -127075853
18706a27075853K7803601N8837036M6262812L923455k8659993l9427441l5557817
$$ -127075853 -99272252 -40435216 5827596 9751051 -18908942 -58336383 -93894200
18699i3894200j0084316L7776847O9576410M6276825j0356038m2080551l0575117
$$ -93894200 -103978516 -66201669 3374741 49651566 39295528 -2785023 -33360140
18692c3360140m942506J2928935K0998668J1299732j2804824j1637211L4460032
$$ -33360140 -38302646 -25373711 -4375043 6924689 -5880135 -17517346 16942686
18685A6942686O4764942J4516189o5179528o4242878J1376760L9443856k1068288
$$ 16942686 81707628 96223817 31044289 -33198589 -21821829 17622027 -3446261
18678c446261o0934036n602237N6774656K4938700m3754101l1435566M4682182
$$ -3446261 -64380297 -69982534 -13207878 11730822 -32023279 -63458845 -18776663
18671a8776663O7496141J0372604l8302354k8116212l524641p60382L810146K0278799
$$ -18776663 48719478 59092082 20789728 -7326484 -10851125 -11611507 -7801361 12477438
18663A2477438J3691096k2793627m0744215j5313003J4595416J5854080J0146252
$$ 12477438 26168534 3374907 -37369308 -52682311 -38086895 -22232815 -12086563
18656a2086563K1224910K8794800J0999967j3386292j9587297j4314252r519566
$$ -12086563 9138347 37933147 48933114 35546822 15959525 1645273 -7874293
18649g874293K064904J6611010M973984l7453258o3148791l3096394K3270283
$$ -7874293 -5809389 10801621 15775605 -21677653 -84826444 -117922838 -94652555
18642i4652555M7144981K7985244M664249L438956J0582075K664004k2278324
$$ -94652555 -47507574 -19522330 -14858081 -11419125 -837050 1826954 -20451370
18635b0451370m3755865l5279785J0997163O4780817P5276772K3664294n0539003
$$ -20451370 -64207235 -99487020 -88489857 -23709040 51567732 75232026 24693023
18628B4693023q7640503o5007868r598013L4141017L9648184J3266318j4649136
$$ 24693023 -62947480 -127955348 -137553361 -103412344 -63764160 -50497842 -65146978
18621f5146978j7937576K479902K6851775M0112525L6324652J2522124k0886023
$$ -65146978 -83084554 -80604652 -53752877 -13640352 22684300 35206424 14320401
18614A4320401l5830548k0739004o878319k4134715m1881116m666244P2915303
$$ 14320401 -21510147 -42249151 -49127470 -73262185 -115143301 -119809545 -46894242
18607d6894242J06303661N3976047k5084835n5620768l6268999q124265J7323227
$$ -46894242 59409419 113385466 88300631 32679863 -3589136 -11713401 5609826
18600E609826M6454614N6694905K3011689k6885979m1728267k3286607j9230652
$$ 5609826 52064440 108759345 131771034 104885055 63156788 39870181 20639529
18593B0639529m0427932m2287405l269359K9740979P495208m3934666n4129683
$$ 20639529 -19788403 -62075808 -65345167 -35604188 -28108980 -72043646 -126173329
18586a26173329o808359L4332425J2250985m1186538m4884242J6597667O4028326
$$ -126173329 -132981688 -98649263 -86398278 -127584816 -172469058 -155871391 -91843065
18579i1843065L2181734l4392120m4221466P866121L9388276J0706120k1079399
$$ -91843065 -59661331 -94053451 -138274917 -130408796 -91020520 -80314400 -101393799
18572a01393799n331539J9558456k17752l6272830k4357420K7016793M8620439
$$ -101393799 -106725338 -87166882 -87384634 -123657464 -148014884 -120998091 -72377652
18565g2377652J7055302j9188380j9788349J521099J9383952L3206312M5834411
$$ -72377652 -55322350 -74510730 -94299079 -92777980 -73394028 -40187716 5646695
18558E646695M6317030L0895745J3113496K541290l988725p203596m891909n933334
$$ 5646695 51963725 82859470 95972966 98514256 94525531 87321935 82430026 76496692
18550G6496692k0430891l7482507l6152742j5662994N269710J1290149l738351
$$ 76496692 56065801 18583294 -17569448 -33232442 -27962732 -16672583 -20410934
18543b0410934l4569539m9560335j1313697N6553013O7074641j3905741r3428097
$$ -20410934 -54980473 -104540808 -115854505 -59301492 7773149 -6132592 -99560689
18536i9560689o6886827K7865874O5175597J9821035j0446894K4758914N5377559
$$ -99560689 -166447516 -138581642 -73406045 -53585010 -64031904 -39272990 16104569
18529A6104569K4929619j4192765j840024K7514994J9429807j271679R304722
$$ 16104569 41034188 26841423 25001399 52516393 71946200 70674521 79979243
18522G9979243J7786723k9093950r4161038r1889991j8394606M6098539N3016823
$$ 79979243 97765966 68672016 -25489022 -117379013 -135773619 -89675080 -36658257
18515c6658257K7701601L374939j5220576k1731258m517685K2437063L3650099
$$ -36658257 -8956656 -5581717 -20802293 -42533551 -47051236 -24614173 9035926
18508I035926L2312681L1865450J6469297k4676673m7492911r369162M2408059
$$ 9035926 41348607 73214057 89683354 65006681 17513770 8144608 50552667
18501E0552667K4681018m3580057n4918770J7857615O8356292J7752441o2055502
$$ 50552667 75233685 31653628 -23265142 -5407527 62948765 80701206 18645704
18494A8645704n8419039J5681075N2054633Q749661m6431226m9312444k0365835
$$ 18645704 -39773335 -24092260 27962373 36712034 -9719192 -59031636 -79397471
18487g9397471j0549868j8882782l280634M5118929P5960966M1368772l2735436
$$ -79397471 -89947339 -108830121 -112110755 -66991826 8969140 50337912 17602476
18480A7602476o5596296k0174169M6182326N5740742R848788k7201066k6214746
$$ 17602476 -47993820 -68167989 -21985663 33755079 43603867 16402801 -9811945
18473i811945j8889597k7220653k8866426r197844Q533216J0414623J7971252
$$ -9811945 -28701542 -55922195 -84788621 -93986465 -85453249 -75038626 -57067374
18466e7067374L7300561L2983926r192489m1529749k3458918J0797382Q196729
$$ -57067374 -19766813 13217113 4024624 -37505125 -60964043 -50166661 -41969932
18459d1969932j4544716j781920M3475053O0051940K1950951k9173878n0136226
$$ -41969932 -56514648 -58296568 -14821515 45230425 67181376 38007498 -12128728
18452a2128728m3440821k9327220j5755388q640742j4275460k0026458n463086
$$ -12128728 -55569549 -84896769 -100652157 -109292899 -123568359 -143594817 -149057903
18445a49057903J9616404K2512484O36307r957041Q514050K7462643J9835598
$$ -149057903 -129441499 -106929015 -106292708 -116249749 -107735699 -80273056 -60437458
18438f0437458J998648J825524J1440056J949381k9384517n3404935m5173561
$$ -60437458 -58438810 -56613286 -45173230 -43223849 -72608366 -126013301 -171186862
18431a71186862q815196K9951482M7080763M1347646L3417212L2838178J3716480
$$ -171186862 -180002058 -150050576 -102969813 -61622167 -28204955 4633223 18349703
18424A8349703m7379168j10616566r6900429M709493R8641137R4747327K4829920
$$ 18349703 -29029465 -139646031 -236546460 -231836967 -133195830 -38448503 -13618583
18417a3618583r190706J7651327L0647831j5636045o3252842m4152137J3453092
$$ -13618583 -22809289 -5157962 25489869 9853824 -53399018 -97551155 -84098063
18410h4098063L2166966K256150j6875494K396044K3439057J9700151J5056744
$$ -84098063 -51931097 -49674947 -66550441 -64154397 -40715340 -21015189 -5958445
18403e958445K5798672K0970270j9826676n5829010m2217656l846169M209177
$$ -5958445 19840227 40810497 20983821 -34845189 -77062845 -80909014 -76699837
18396g6699837j3349429m995301L3192808M4701366O009674l1221898k1307332
$$ -76699837 -90049266 -95044567 -61851759 -17150393 -11140719 -42362617 -63669949
18389f3669949M393137r407672n2665028o2478429j1247611N7893142Q3356944
$$ -63669949 -59276812 -68684484 -121349512 -183827941 -195075552 -137182410 -53825466
18382e3825466M7351047j4469926m9479604l5356064J146574J7765601P954322
$$ -53825466 -6474419 -20944345 -70423949 -105780013 -104633439 -86867838 -78913516
18375g8913516Q80980J1114364J8799293Q936790l937157p200832j0845359j4714525
$$ -78913516 -78032536 -66918172 -48118879 -39182089 -43119246 -50320078 -61165437 -75879962
18367g5879962N271613M6238900N5565840N629839m5177029k6563209L3688373
$$ -75879962 -70608349 -24369449 31196391 36826230 -8350799 -34914008 -1225635
18360a225635M4591535j2188976n7129614l4061443J6291745L3105876K2259317
$$ -1225635 43365900 31176924 -25952690 -60014133 -43722388 -10616512 11642805
18353A1642805K1028875K3570545j364824m2264676n0908311j5201681J8806308
$$ 11642805 32671680 56242225 54877401 12612725 -38295586 -53497267 -34690959
18346c4690959J0324961k1299458k6340661N392414L0386901J1892745k7836282
$$ -34690959 -24365998 -45665456 -72006117 -66613703 -36226802 -24334057 -52170339
18339e2170339l8771999j5397581p44259j2409027r994631L4811298P7580285
$$ -52170339 -90942338 -106339919 -107084178 -119493205 -129487836 -94676538 -17096253
18332a7096253N9711161p60108l6477963l3077014l6830548o1704076o2090047
$$ -17096253 42614908 41854800 5376837 -27700177 -64530725 -126234801 -188324848
18325a88324848j7104773K5599487K4216204M730700P688754K0315697R091636
$$ -188324848 -205429621 -179830134 -155613930 -150883230 -143194476 -122878779 -113787143
18318a13787143j5042236j3200736K0304608N3435726N8154365K8617067k1127971
$$ -113787143 -128829379 -142030115 -121725507 -68289781 -10135416 18481651 -2646320
18311b646320n2926013k7880260L6094247O3451236J4404768n4577650o6247618
$$ -2646320 -55572333 -83452593 -47358346 16092890 30497658 -24079992 -90327610
18304i0327610k4004539J3515388K5755211L3435481L2657020J542362l4481239
$$ -90327610 -114332149 -100816761 -75061550 -41626069 -8969049 -7426687 -41907926
18297d1907926k1342001L1358854M9602714N737809l8623400k9787712J741342
$$ -41907926 -63249927 -31891073 17711641 23449450 -15173950 -44961662 -43220320
18290d3220320K784301j9771746k8153065k3298075k9369789l6433252j4599299
$$ -43220320 -40436019 -60207765 -88360830 -111658905 -141028694 -177461946 -192061245
18283a92061245K8575824N5045384N4022402M7368501L9986279J0769237l9507127
$$ -192061245 -163485421 -108440037 -54417635 -7049134 32937145 43706382 4199255
18276D199255p2162205n9416770k0365168Q151240J3694227O475373k497085l300167
$$ 4199255 -67962950 -127379720 -147744888 -139593648 -125899421 -119424048 -121921133 -125221300
18268a25221300J4396083M3205439N2286005K4141140j1844937j1271833K1255765
$$ -125221300 -110825217 -67619778 -15333773 8807367 -3037570 -14309403 6946362
18261F946362L2812156j722156l7028393j9714128K8954996L5998916j8816971
$$ 6946362 39758518 38036362 1007969 -18706159 10248837 46247753 27430782
18254B7430782o7131621m2302813K8676185N9998718J7713429m4456480o1103024
$$ 27430782 -39700839 -82003652 -53327467 6671251 24384680 -20071800 -81174824
18247h1174824l0653826J437448R674644J1315088K7583716M6766073L9526176
$$ -81174824 -111828650 -110391202 -100716558 -89401470 -61817754 -15051681 24474495
18240B4474495L865381k3138153r948772K2763276K2883823k1899098o0137466
$$ 24474495 28339876 5201723 -4747049 18016227 40900050 19000952 -41136514
18233d1136514m2956885P730763K9191404N032437j6711221L177256M1814964
$$ -41136514 -84093399 -76362636 -47171232 -42138795 -58850016 -55672760 -13857796
18226a3857796N2515554K7181099n348058k4367433l2577080l5613690l2788896
$$ -13857796 38657758 65838857 60490799 36123366 3546286 -32067404 -64856300
18219f4856300k6510934k0124511p498274J5780167L2837551K1397592p050105
$$ -64856300 -91367234 -111491745 -118990019 -103209852 -70372301 -48974709 -56024814
18212e6024814j1243573K2715577N2997949L5058617j4362839l8172122j6941849
$$ -56024814 -67268387 -44552810 8445139 43503756 29140917 -9031205 -25973054
18205b5973054J0310748Q976226m414669J577258K0594458K3209344O228542o456564
$$ -25973054 -15662306 -6686080 -11100749 -9523491 11070967 34280311 40508853 34052289
18197C4052289l625713M261077J0164343J2377170l750973m7405431q4399178
$$ 34052289 30426576 34687653 44851996 57229166 53478193 6072762 -78326416
18190g8326416o2611821J0716124O0570815L7591032j8059589l6930732j0277016
$$ -78326416 -140938237 -130222113 -69651298 -32060266 -50119855 -87050587 -97327603
18183i7327603J8356816K4481778K1484358K3279505K8938461L5758654L4146528
$$ -97327603 -78970787 -54489009 -33004651 -9725146 19213315 54971969 89118497
18176H9118497K998219n4208126q6502568n3951633M985679J8373583j4118232
$$ 89118497 92116716 37908590 -48593978 -102545611 -97559932 -79186349 -93304581
18169i3304581k3408881J6459995M6449580J8685469k7918349l0629474O236719
$$ -93304581 -116713462 -100253467 -53803887 -35118418 -63036767 -93666241 -87429522
18162h7429522L3230292L4916569L4651269M0141872L4574776J4227385p110718
$$ -87429522 -54199230 -19282661 15368608 55510480 90085256 104312641 97201923
18155I7201923k6291372m5653879m5894166o529450M5357642N1360273j08989
$$ 97201923 70910551 25256672 -20637494 -27166944 18190698 69550971 69441982
18148F9441982n0990288m9886458j7297327m915963j6679221j2116367K0959373
$$ 69441982 18451694 -31434764 -48732091 -53648054 -70327275 -82443642 -61484269
18141f1484269M2393040K0609957j7455061k2949973Q632893L6844826L2813162
$$ -61484269 -19091229 1518728 -15936333 -38886306 -30253413 6591413 39404575
18134C9404575P383118j5871925k7070585k3749000m758604J8481038K6713148
$$ 39404575 46787693 30915768 3845183 -19903817 -24662421 -6181383 20531765
18127B0531765J9128178J2683275P942629j2811397m0488758l3413092J5597140
$$ 20531765 39659943 52343218 60285847 47474450 6985692 -26427400 -10830260
18120a0830260M8193251J8535880l5264757n0907633l8452967m8104241o6771974
$$ -10830260 37362991 55898871 20634114 -30273519 -68726486 -116830727 -183602701
18113a83602701l3849739M2132649P5284331L2908066j1583921N114658M4411778
$$ -183602701 -217452440 -175319791 -100035460 -67127394 -78711315 -73596657 -29184879
18106b9184879M1553707N623853j7469078k5542385l5909057k7184479K0376405
$$ -29184879 12368828 17992681 523603 -25018782 -60927839 -88112318 -67735913
18099f7735913O0631170L5261517k9378363n4813379k6524017p83511o76877J2766901
$$ -67735913 -7104743 28156774 -1221589 -56034968 -82558985 -83342496 -84019373 -71252472
18091g1252472N2760123O8252622K6036240k9529020m0033774j3632183j398228
$$ -71252472 -18492349 49760273 75796513 46267493 6233719 -7398464 -8796692
18084h796692k1727868m6462826m7647561k7823317p659191q79886k172525K780240
$$ -8796692 -30524560 -76987386 -124634947 -152458264 -160117455 -160997341 -163169866 -160389626
18076a60389626J3431689J1347737o797942j1137848K0372079N9072418O0518920
$$ -160389626 -146957937 -135610200 -142408142 -153545990 -133173911 -74101493 -13582573
18069a3582573L1646309J8713415L1457018L0161671k545965k8261462j3934018
$$ -13582573 18063736 36777151 68234169 98395840 95849875 67588413 53654395
18062E3654395J5955436J8112845r413472l4670876l6694019j7869477J0305017
$$ 53654395 69609831 87722676 78309204 43638328 6944309 -10925168 -620151
18055f20151L2216697L2973673J3802094r413546k8434315m4560566m7889419
$$ -620151 31596546 64570219 78372313 68958767 40524452 -4036114 -51925533
18048e1925533k5375466N494309Q533572j4203194j8294368J2487755L6148955
$$ -51925533 -77300999 -71806690 -63273118 -77476312 -95770680 -83282925 -47133970
18041d7133970K0466708l820893L425765K4958204K1292054J037195O05732J4256009
$$ -47133970 -26667262 -30488155 -27062390 -2104186 19187868 20225063 20830795 35086804
18033C5086804L825513k8853054l7122303l086735L3267629L1754686J62996k8365275
$$ 35086804 38912317 10059263 -27063040 -30149775 3117854 34872540 35035536 6670261
18025F670261l4147529j6364669J1478935K3168923M854219j6420638j325673
$$ 6670261 -27477268 -43841937 -32363002 -9194079 -4339860 -20760498 -22086171
18018b2086171L8999562M7688574L314862m4716601m5992752j5968787M24759
$$ -22086171 16913391 64601965 67916827 23200226 -22792526 -38761313 -38336554
18011c8336554j751804J370609O197398r416833k9913486j2735032L6032540N2826740
$$ -38336554 -40088358 -38717749 -32520351 -41937184 -71850670 -84585702 -48553162 4273578
18003D273578R092970l7370868k5878756J2080757J860423m9530122n1580830
$$ 4273578 13366548 -24004320 -49883076 -37802319 -35941896 -85472018 -137052848
17996a37052848L3074425J18359974J04536766J2582338m8293863k5737505K3261690
$$ -137052848 -103978423 14381551 118918317 131500655 83206792 57469287 80730977
17989H0730977K5716360j6070818m7763824m0510129j5574734o663337j9260994
$$ 80730977 106447337 90376519 42612695 2102566 -13472168 -20135505 -39396499
17982c9396499k5839487J952053N1495031P0349815K9565298k6350078k9813499
$$ -39396499 -65235986 -63283933 -11788902 58560913 88126211 61776133 31962634
17975C1962634J2396231K2368135l2020256p7700045l6612376N4484678Q5387310
$$ 31962634 44358865 66727000 34706744 -42993301 -79605677 -25120999 60266311
17968F0266311K0463002n6976040o0005150n472494K5684546K109342k8627473
$$ 60266311 80729313 23753273 -36251877 -41724371 -16039825 -13930483 -42557956
17961d2557956j9057019J1730666J3049783j7994494k8769668J2635553O7235928
$$ -42557956 -61614975 -49884309 -36834526 -54829020 -83598688 -70963135 -3727207
17954c727207P5693754L6218643l138284j7487048k6589703m2113688m1155860
$$ -3727207 71966547 108185190 105046906 87559858 60970155 18856467 -22299393
17947b2299393j1650913J5184527O634057k4208108m0232428k8320764j638060
$$ -22299393 -33950306 -18765779 -12131722 -36339830 -76572258 -104893022 -106531082
17940a06531082K5444599M1292431L5901175J8621048J6905947L6275787M5204208
$$ -106531082 -81086483 -39794052 -3892877 14728171 31634118 67909905 113114113
17933A13114113K2611975p091645j3708250o951407j0253329j8125097j6664658
$$ 113114113 135726088 128634443 114926193 107974786 97721457 79596360 62931702
17926F2931702j7713345l0885909l0687105L44403K4034437j164113m3811527
$$ 62931702 45218357 14332448 -16354657 -16010254 8024183 6860070 -36951457
17919c6951457l9359448R182568L7733449J9856580q995350k1396922k2246546
$$ -36951457 -76310905 -67128337 -29394888 -9538308 -18533658 -39930580 -62177126
17912f2177126o197417L2689873M7910588j5261132j09590097j15549736j1835002
$$ -62177126 -68374543 -35684670 12225918 -3035214 -112625311 -228175047 -240010049
17905b40010049Q0403942P1031210K1727668K4874063N3404754K8093018l3394672
$$ -240010049 -159606107 -88574897 -66847229 -41973166 11431588 39524606 6129934
17898F129934m7338194p387086J3449056q432766j9501599M435820J7900362n712982
$$ 6129934 -41208260 -48595346 -35146290 -43579056 -63080655 -58644835 -40744473 -46457455
17890d6457455k4147653R39951M0561264M5025356J4006667j2050342o359792
$$ -46457455 -70605108 -69665157 -29103893 15921463 29928130 17877788 11517996
17883A1517996J8257353K2997882j9370157q3054156r8455178l3537757N1000927
$$ 11517996 29775349 52773231 33403074 -49651082 -148106260 -181644017 -130643090
17876a30643090P0855184K7021185p751808K59498J4647686R391546P367245J9946525
$$ -130643090 -59787906 -32766721 -40518529 -40259031 -25611345 -16219799 -8852554 11093971
17868A1093971J7519335q688588j7710065R876802K8612742J789424l2491833
$$ 11093971 28613306 19924718 2214653 12091455 40704197 42493621 10001788
17861A0001788k2853281R358509O396604l1795328n2173228l3003998n646512
$$ 10001788 -12851493 -3492984 2903620 -28891708 -81064936 -114068934 -119715446
17854a19715446M379283P081269J5227021K4016093K9552919L3699418K7000542
$$ -119715446 -115336163 -108254894 -93027873 -69011780 -39458861 -5759443 21241099
17847B1241099j569926l5264741m2137760k2345479j1781772k8993814m7142170
$$ 21241099 19671173 -15593568 -57731328 -80076807 -91858579 -120852393 -167994563
17840a67994563l4293188K50804J9620002Q871328p318879J632884K9951166L7669307
$$ -167994563 -202287751 -202036947 -182416945 -173545617 -180864496 -179231612 -149280446 -111611139
17832a11611139J760194m4412475m4470046P197358N3896555N1914664K6674074
$$ -111611139 -109850945 -154263420 -198733466 -191536108 -137639553 -85724889 -59050815
17825e9050815K7877602N4901777O3675512L3238050j2681580m4841121n5047768
$$ -59050815 -31173213 23728564 87404076 120642126 107960546 63119425 8071657
17818H071657m6068413k6063525j1573013q596047L029934L5989626N7567620
$$ 8071657 -37996756 -64060281 -75633294 -84229341 -81199407 -45209781 12357839
17811A2357839K8052905k7836296m0074690O721224M5105173K0361931l1908779
$$ 12357839 40410744 12574448 -27500242 -20779018 24326155 44688086 12779307
17804A2779307l9570728P205643N0583219M1452066j2167093o4078240p2167722
$$ 12779307 -26791421 -19585778 30997441 72449507 60282414 -3795826 -75963548
17797g5963548k8663484L2402754O3127592M8792980J8981696O565183J2086827
$$ -75963548 -104627032 -72224278 -9096686 39696294 58677990 65243173 77330000
17790G7330000J5757906M299963k3262496n4842150o2428628k6578135K6945979
$$ 77330000 93087906 97387869 74125373 19283223 -43145405 -69723540 -42777561
17783d2777561M6552636K2971801J450106J0161004K0908748O863862r573861
$$ -42777561 3775075 26746876 28196982 38357986 59266734 66130596 56556735
17776E6556735n971140r376228m3838587o9030701l4800810L2057468O2051626
$$ 56556735 50585595 41209367 -2629220 -71659921 -106460731 -74403263 -12351637
17769a2351637M2625355J6701981J811944j5275376j9187137J4269636M4805584
$$ -12351637 30273718 46975699 48787643 33512267 14325130 28594766 73400350
17762G3400350O608598p2074373q6211805j3185026M6214258K4674578j6545173
$$ 73400350 80008948 7934575 -78277230 -91462256 -45247998 -20573420 -37118593
17755c7118593q617246R194115j9960095n0172429j0490260N6602436N0704410
$$ -37118593 -45735839 -36541724 -56501819 -106674248 -117164508 -60562072 -9857662
17748i857662k5678167p5130917n8472068k9924079k1357936j272743L4671443
$$ -9857662 -35535829 -110666746 -169138814 -199062893 -220420829 -221693572 -187022129
17741a87022129L6505198l118340j6904830K7538097O5969841L7937407j8828267
$$ -187022129 -150516931 -153635271 -170540101 -143002004 -77032163 -39094756 -57923023
17734e7923023l3352822o291895J2546094J0887136J4679419K6670005K2397449
$$ -57923023 -91275845 -97567740 -85021646 -74134510 -59455091 -32785086 -10387637
17727a0387637k122837k2470154k0478681K162597L4134061N5564783M6028415
$$ -10387637 -12510474 -34980628 -55459309 -53296712 -19162651 36402132 82430547
17720H2430547J3197808o985678J325221J1767921L021873o283373M13563k031588
$$ 82430547 95628355 88642677 89967898 101735819 104757692 98474319 98887882 96856294
17712I6856294l6141800o9351933n6290240j2443854O897838j0177288k1128671
$$ 96856294 60714494 -8637439 -64927679 -77371533 -70473695 -80650983 -101779654
17705a01779654J680993L6292586M9246886L1962318l166356l2994425l2770475
$$ -101779654 -100098661 -63806075 -14559189 17403129 14236773 -18757652 -51528127
17698e1528127l208088J9966012J2833230M000601L0303973O8763208O3413127
$$ -51528127 -54736215 -34770203 -21936973 -17936372 12367601 81130809 144543936
17691A44543936J2194252k8973956l1510482k6650319l9698436m6925397k3976627
$$ 144543936 156738188 127764232 96253750 69603431 29904995 -17020402 -40997029
17684d0997029O699814Q714383j6389540l5956825k5495154J3303342N3395706
$$ -40997029 -34297215 -25582832 -41972372 -77929197 -103424351 -90121009 -36725303
17677c6725303N5216071O124376m8597005m8460722J360944L0626210k295433
$$ -36725303 18490768 24615144 -23981861 -72442583 -71081639 -40455429 -42750862
17670d2750862n7383761p1340783l1536259K8166900P0550648P4427754M4028255
$$ -42750862 -100134623 -171475406 -203011665 -174844765 -104294117 -29866363 14161892
17663A4161892J5956582K4000182M7757395L8694030K926101l200901K3769626
$$ 14161892 30118474 54118656 101876051 140570081 143496182 140295281 164064907
17656A64064907J3073459n9004797j07010221o0837377J8273959L1102036o020224
$$ 164064907 177138366 118133569 11123348 -49714029 -31440070 -338034 -6358258
17649f358258j488050N2614558P1302110J9277595l9062467m3955083r110624
$$ -6358258 -7846308 44768250 116070360 135347955 96285488 52330405 43219781
17642D3219781K8104778M8166233K9024921l7792968r7081898p6595371r3977
$$ 43219781 71324559 119490792 148515713 110722745 13640847 -62954524 -63048501
17635f3048501L2849228Q27422o193809N2772348Q6006945J8802598p0843563
$$ -63048501 -30199273 -29371851 -35565660 17206688 103213633 122016231 51172668
17628E1172668o7371735K928403K2357614l1917791p0642476m4984086k418394
$$ 51172668 -16199067 -13270664 9086950 -22830841 -93473317 -138457403 -140875797
17621a40875797J6300437L2624401N8176072N6544899J4889719j7564852m665352
$$ -140875797 -124575360 -91950959 -33774887 22770012 37659731 20094879 15429527
17614A5429527J9395047Q913710k4618667m3765270m5004214m4603038l5827936
$$ 15429527 34824574 43738284 19119617 -24645653 -69649867 -114252905 -150080841
17607a50080841l556001L8144581O0545127N8996939M6804649K4012262j6534300
$$ -150080841 -153636842 -115492261 -54947134 4049805 50854454 74866716 58332416
17600E8332416n9117547o9592641l2644386K9273230P3361582O8622904K1613473
$$ 58332416 -785131 -70377772 -103022158 -73748928 -387346 68235558 89849031
17593H9849031k5052216l4653300j9182824j8464988l6126153l3507126P31808
$$ 89849031 64796815 30143515 10960691 -7504297 -43630450 -77137576 -76405768
17586g6405768K1928724K003414j4762611J9680559O7390281N2227157j7303976
$$ -76405768 -54477044 -52473630 -67236241 -47555682 19834599 72061756 54757780
17579E4757780n0856784j0925246L3187452J8699274j4953756j006777L9078385
$$ 54757780 3900996 -7024250 26163202 44862476 29908720 28901943 67980328
17572F7980328L2600664j9936645m3134234r455990K0031974K103620j8651818
$$ 67980328 100580992 80644347 37510113 28054123 48086097 50189717 31537899
17565C1537899N123401L2033930l925894p7268977j00542548n5542245j1946041
$$ 31537899 36661300 68695230 64769336 -12499641 -113042189 -168584434 -180530475
17558a80530475q445132J309728N3916845J03179959R3499451M7356660J7477931
$$ -180530475 -188975607 -187665879 -133749034 -30569075 62930376 110287036 127764967
17551A27764967j958108m4036303q2266147n9329600P868639L6887598L118574
$$ 127764967 125806859 81770556 -495591 -59825191 -51956552 -15068954 -11950380
17544a1950380k4642732L670830M4252257L4812024j5792211n8911891p6185225
$$ -11950380 -36593112 -32922282 11329975 46141999 30349788 -28562103 -104747328
17537a04747328o9592689k8112133L8930559P4115560M1918263k361857J6281704
$$ -104747328 -174340017 -202452150 -163521591 -89406031 -47487768 -49849625 -33567921
17530c3567921P1809688O7096995j6469442q3570522o3503014q088768l533424
$$ -33567921 38241767 105338762 88869320 5298798 -58204216 -66292984 -69826408
17523f9826408m2014329m5888285R137898O2539201O0615964K4344637N710724
$$ -69826408 -111840737 -157729022 -148591124 -86051923 -25435959 -1091322 4619402
17516D619402J3203494J2418037j3808557l8778766l2284583m601436R708825
$$ 4619402 17822896 30240933 16432376 -22346390 -54630973 -59232409 -49523584
17509d9523584J651088m657565M285090R616467l585653j6572254r752549j602795
$$ -49523584 -47872496 -52530061 -48244971 -38628504 -42214157 -58786411 -68538960 -70141755
17501g0141755j7719980l6647249j3784029M1696560O4486439K3715367k9127755
$$ -70141755 -87861735 -124508984 -138293013 -96596453 -32110014 -8394647 -37522402
17494c7522402l1854056M193800K0350988p93226j8027120n28817K6007983J8734931
$$ -37522402 -69376458 -65182658 -44831670 -45624896 -63652016 -64180833 -38172850 -19437919
17486a9437919j9963926m3248872k0332074K2546840L4358536N633533j8732312
$$ -19437919 -39401845 -82650717 -102982791 -80435951 -46077415 -40443882 -59176194
17479e9176194j584928L3475304L5031606l981769l9442287l8056041j1860590
$$ -59176194 -60761122 -27285818 7745788 3764019 -35678268 -73734309 -85594899
17472h5594899J3509961K9792057L3796779J8656180l964114l900114K2220048
$$ -85594899 -72084938 -42292881 -8496102 10160078 6195964 2295850 24515898
17465B4515898L3675790N80190m8237943o2159522l3281656O718804L4757112
$$ 24515898 58191688 58771878 10533935 -51625587 -84907243 -78188439 -43431327
17458d3431327M5945460L1038731j3204566n5177687n0492743P53343M9391367
$$ -43431327 2514133 33552864 20348298 -34829389 -85322132 -84568789 -35177422
17451c5177422N5807743K7042888p784043l0243383l3208320j6440791M832330
$$ -35177422 20630321 47673209 39889166 9645783 -23562537 -40003328 -35170998
17444c5170998P635085q906764j7592491M67009K7173570K8863716j730260l6981020
$$ -35170998 -27535913 -36442677 -54035168 -53568159 -26394589 2469127 738867 -36242153
17436c6242153m4932172k0160782J6224080M1440965M8462310L7038119K348835
$$ -36242153 -81174325 -101335107 -85111027 -43670062 4792248 41830367 44179202
17429D4179202m7598943p3035401l7232001L2678110O0227822J6926288l4354399
$$ 44179202 -3419741 -76455142 -113687143 -81009033 -20781211 -3854923 -38209322
17422c8209322k6918782J6871072K7937549n041836l2747125k8240757r212658
$$ -38209322 -65128104 -48257032 -20319483 -25361319 -58108444 -86349201 -95561859
17415i5561859J3674145M4057078N7132343K0683177l3656672l4938922J4004702
$$ -95561859 -81887714 -37830636 19301707 39984884 6328212 -28610710 -14606008
17408a4606008K7465998k8308958p4241463m2979665J4390613J7155436j5622521
$$ -14606008 12859990 -15448968 -89690431 -132670096 -118279483 -101124047 -116746568
17401a16746568j1868342K4887947L1310716L701484K589903M0974428N9533894
$$ -116746568 -128614910 -103726963 -72416247 -68714763 -66124860 -25150432 34383462
17394C4383462K6038983j9987148m0305812m3795565l8722541r828613K9737360
$$ 34383462 60422445 40435297 129485 -43666080 -82388621 -92217234 -62479874
17387f2479874L1928920o234253k1549279J4758984L9896649j509130n8593956
$$ -62479874 -30550954 -36785207 -58334486 -43575502 -3678853 -5187983 -63781939
17380f3781939m5379000K8451765P4304686N1678302M493497k2417615l2064454
$$ -63781939 -109160939 -80709174 -6404488 45273814 49767311 27349696 -4714758
17373d714758l4130093j9337378O937352J6676712L874715o026838m850161j1723168
$$ -4714758 -38844851 -58182229 -51244877 -34568165 -30693450 -36720288 -41570449 -53293617
17365e3293617j8671842J5247499Q2752764J01210006K2742289p5079547q1466511
$$ -53293617 -71965459 -56717960 26034804 127244810 149987099 74907552 -6558959
17358f558959q007581L1563443q289332m6767768j4052394M1535805M1516161
$$ -6558959 -14566540 16996903 8707571 -38060197 -52112591 -10576786 30939375
17351C0939375L618516j140121K3677227R806898m7348091o6699214j1137291
$$ 30939375 34557891 33417770 57094997 66901895 19553804 -47145410 -58282701
17344e8282701M4836433K4723542l7343283n5497661j9129166R462061J277162
$$ -58282701 -13446268 11277274 -26066009 -81563670 -100692836 -91230775 -89953613
17337h9953613q173679O965822K3464803K0747325J9027455L7747123N3607119
$$ -89953613 -98127292 -91161470 -67696667 -46949342 -27921887 9825236 63432355
17330F3432355L2489259j8005308n5701725n3045378k0324279J2383608K2562163
$$ 63432355 95921614 77916306 22214581 -30830797 -51155076 -38771468 -16209305
17323a6209305J0336295l944337J39358K2723771M6241558N2463097K9595646
$$ -16209305 -5873010 -9817347 -9677989 13045782 59287340 111750437 141346083
17316A41346083k3528844q1354346r4846052m2961662K6229374M3407181O269439
$$ 141346083 117817239 36462893 -58383159 -101344821 -75115447 -31708266 -25438827
17309b5438827k2039699p922813R441428r393786l7955680k8845979J1074069
$$ -25438827 -47478526 -55401339 -45959911 -55353697 -93309377 -122155356 -111081287
17302a11081287L6556148L3906646K9282856L5702462L3326137O286362k9676311
$$ -111081287 -74525139 -40618493 -11335637 24366825 57692962 63979324 34303013
17295C4303013m3936295k2394759J6828151L4034897P329258l3931821l8898584
$$ 34303013 -9633282 -32028041 -15199890 18835007 26164265 -7767556 -46666140
17288d6666140o288848R841890j7048664m1846718k0681766J6483641J6922574
$$ -46666140 -52954988 -43113098 -60161762 -102008480 -122690246 -106206605 -89284031
17281h9284031p631187o893856K0183360L1091320J7432381O617164m331488m0084109
$$ -89284031 -96915218 -103809074 -83625714 -52534394 -35102013 -28484849 -32816337 -72900446
17273g2900446p2605767l8925576N0691527J03001694O8344680L001523k6844945
$$ -72900446 -145506213 -184431789 -133740262 -30738568 37606112 40607635 13762690
17266A3762690k8168077k7767877j3375538J6321666J4130435l5939031o4498620
$$ 13762690 -14405387 -42173264 -55548802 -39227136 -25096701 -61035732 -125534352
17259a25534352j7353986M7595112M9614309J8888119L8207129Q7835963O7884845
$$ -125534352 -142888338 -95293226 -45678917 -26790798 11416331 99252294 167137139
17252A67137139l1473000j01002388p4095275j2105659Q126084r34688N685138
$$ 167137139 135664139 34661751 -39433524 -51539183 -43413099 -44347787 -38662649
17245c8662649K1712919K0432866J0799160Q326160l133048l2519304m8276348
$$ -38662649 -16949730 3483136 14282296 22608456 19475408 -13043896 -61320244
17238f1320244k9260365o283929q185792j0350602J4734042L9691928L0031778
$$ -61320244 -90580609 -96864538 -105050330 -115400932 -100666890 -60974962 -30943184
17231c0943184R364024J6296759L1590262J4269152j8653569j8896215Q234446
$$ -30943184 -21579160 -5282401 26307861 40577013 21923444 3027229 11261675
17224A1261675J7663432O367942N704047M743640l3809142q2166508o3592517
$$ 11261675 28925107 35293049 40997096 45740736 11931594 -70234914 -133827431
17217a33827431K2944483Q2809174O0774669J2319582L73057M666027j0856251
$$ -133827431 -110882948 -28073774 32700895 45020477 45393534 50059561 39203310
17210C9203310j9819228M400693J6304729k5161980o2607679k2838099M5368207
$$ 39203310 19384082 23784775 40089504 14927524 -47680155 -70518254 -25150047
17203b5150047L0337709o0140437r7789591l0622195M0007335K5190634j9602673
$$ -25150047 5187662 -54952775 -152742366 -183364561 -143357226 -118166592 -137769265
17196a37769265n204340L8781241K5921599k8816480k9609990L8443789Q0583302
$$ -137769265 -142973605 -104192364 -78270765 -107087245 -136697235 -98253446 -17670144
17189a7670144M1336672j5546531j5622596J7213516J6822915j7896774l7751476
$$ -17670144 23666528 8119997 -7502599 9710917 26533832 8637058 -29114418
17182b9114418k9315014j8857393q820952K2629593O1038293N8790944J1869409
$$ -29114418 -58429432 -77286825 -86107777 -63478184 -2439891 56351053 68220462
$$ [...]
##END NTUPLES=NMR SPECTRUM
##END=
