##TITLE=31Pdec_LR-717-C1
 CD3OD, 124 sc
 3.7.2020
##JCAMPDX= 6.0         $$ Bruker NMR JCAMP-DX V2.0
##DATA TYPE= NMR SPECTRUM
##DATA CLASS= NTUPLES
##ORIGIN= UXNMR, Bruker Analytische Messtechnik GmbH
##OWNER= root
$$ XWIN-NMR		Version 3.5
$$ Fri Jul  3 13:23:24 2020 Russian Standard Time (UT+4h)  she@DPX200
##.OBSERVE FREQUENCY= 81.013821
##.OBSERVE NUCLEUS= ^31P
##.ACQUISITION MODE= SIMULTANEOUS
##.ACQUISITION SCHEME= undefined
##.AVERAGES= 124
##.DIGITISER RES= 17
##SPECTROMETER/DATA SYSTEM= spect
##.PULSE SEQUENCE= zgpg30
##.SOLVENT NAME= CDCl3
##.SHIFT REFERENCE= (INTERNAL, CDCl3, 0, 182.463)
##AUDIT TRAIL= $$ (NUMBER, WHEN, WHO, WHERE, WHAT)
$$ ##TITLE= Audit trail, XWIN-NMR		Version 3.5
$$ ##JCAMPDX= 5.01
$$ ##ORIGIN= Bruker BioSpin GmbH
$$ ##OWNER= she
$$ F:/spectra/data/she/nmr/P31/1/pdata/1/auditp.txt
$$ ##AUDIT TRAIL=  $$ (NUMBER, WHEN, WHO, WHERE, WHAT)
(   1,<2020-07-03 13:22:14.84 +0400>,<she>,<DPX200>,
      <continue with go, POWCHK disabled, PULCHK disabled
       configuration hash MD5:
       00 E9 B6 7A A2 85 ED C7 34 08 36 98 17 FE 4E 26
       data hash MD5: 32K
       DC 43 B0 58 2D 8F 23 4D DF 94 4D 4F 1B 0A D3 C5>)
(   2,<2020-07-03 13:22:19.06 +0400>,<she>,<DPX200>,
      <Start of raw data processing
       efp BC_mod = 2 LB = 1 FT_mod = 6 PKNL = 1 PHC0 = -1646.444 PHC1 = -38.39789 SI = 64K 
       data hash MD5: 64K
       CD 90 85 2F 62 E4 20 14 93 B2 D5 4B 93 16 56 CE>)
(   3,<2020-07-03 13:22:47.54 +0400>,<she>,<DPX200>,
      <pk PHC0 = 53.62832 PHC1 = -143.2 
       data hash MD5: 64K
       7F 7A 87 8C A5 78 87 63 4E 4D 34 44 EA 11 00 C3>)
(   4,<2020-07-03 13:22:51.01 +0400>,<she>,<DPX200>,
      <abs ABSG = 5 
       data hash MD5: 64K
       D3 16 79 83 02 82 95 90 09 7B F6 C6 9E 9D F2 0B>)
$$ ##END=
$$ 
$$ hash MD5
$$ 4B FD 79 46 08 92 B0 0F 58 F7 03 F4 B3 C9 01 2D
##$RELAX= 
##$RELAX= 
##$RELAX= 
##$RELAX= 
##$RELAX= 
##$RELAX= 
##$RELAX= 
##$RELAX= 
$$ Bruker specific parameters
$$ --------------------------
##$DU= <F:/spectra>
##$EXPNO= 1
##$NAME= <P31>
##$PROCNO= 1
##$TYPE= <nmr>
##$USER= <she>
##$AMP= (0..31)
100 100 100 100 100 100 100 100 100 100 100 100 100 100 100 100 100 100 
100 100 100 100 100 100 100 100 100 100 100 100 100 100 
##$AQSEQ= 0
##$AQ_mod= 1
##$AUNM= <au_zg>
##$AUTOPOS= <>
##$BF1= 81.014009
##$BF2= 200.13
##$BF3= 200.13
##$BF4= 200.13
##$BF5= 200.13
##$BF6= 200.13
##$BF7= 200.13
##$BF8= 200.13
##$BYTORDA= 1
##$CFDGTYP= 0
##$CFRGTYP= 5
##$CHEMSTR= <none>
##$CNST= (0..31)
1 1 145 1 1 1 1 1 1 1 1 1 1 1 1 1 1 1 1 1 1 1 1 1 1 1 1 1 1 1 1 1 
##$CPDPRG= <waltz16>
##$CPDPRG1= <>
##$CPDPRG2= <waltz16>
##$CPDPRG3= <>
##$CPDPRG4= <mlev>
##$CPDPRG5= <mlev>
##$CPDPRG6= <mlev>
##$CPDPRG7= <mlev>
##$CPDPRG8= <mlev>
##$CPDPRGB= <>
##$CPDPRGT= <>
##$D= (0..31)
0 1 0 0 0 0 0 0 0 0 0 0.03 2e-05 3e-06 0 0 0 0 0 0 0 0 0 0 0 0 0 0 0 0 
0 0 
##$DATE= 1593767925
##$DBL= (0..7)
120 120 120 11 120 120 24 19 
##$DBP= (0..7)
150 150 150 150 150 150 150 150 
##$DBP07= 0
##$DBPNAM0= <>
##$DBPNAM1= <>
$$ [...]
##$SUBNAM3= <"">
##$SUBNAM4= <"">
##$SUBNAM5= <"">
##$SUBNAM6= <"">
##$SUBNAM7= <"">
##$SUBNAM8= <"">
##$SUBNAM9= <"">
##$SW= 369.568048894756
##$SWIBOX= (0..15)
0 1 3 0 0 0 0 0 0 0 0 0 0 0 0 0 
##$SW_h= 29940.119760479
##$TD= 32768
##$TD0= 1
##$TE= 0
##$TE2= 300
##$TE3= 300
##$TEG= 300
##$TL= (0..7)
0 120 53 12 22 120 120 120 
##$TP= (0..7)
150 150 150 150 150 150 150 150 
##$TP07= 0
##$TPNAME0= <>
##$TPNAME1= <>
##$TPNAME2= <>
##$TPNAME3= <>
##$TPNAME4= <>
##$TPNAME5= <>
##$TPNAME6= <>
##$TPNAME7= <>
##$TPOAL= (0..7)
0.5 0.5 0.5 0.5 0.5 0.5 0.5 0.5 
##$TPOFFS= (0..7)
0 0 0 0 0 0 0 0 
##$TUNHIN= 0
##$TUNHOUT= 0
##$TUNXOUT= 0
##$USERA1= <user>
##$USERA2= <user>
##$USERA3= <user>
##$USERA4= <user>
##$USERA5= <user>
##$V9= 5
##$VALIST= <valist>
##$VCLIST= <CCCCCCCCCCCCCCC>
##$VD= 0
##$VDLIST= <DDDDDDDDDDDDDDD>
##$VPLIST= <PPPPPPPPPPPPPPP>
##$VTLIST= <TTTTTTTTTTTTTTT>
##$WBST= 1024
##$WBSW= 4
##$XGAIN= (0..3)
0 0 0 0 
##$XL= 0
##$YL= 0
##$YMAX_a= 37468
##$YMIN_a= -9110
##$ZGOPTNS= <>
##$ZL1= 120
##$ZL2= 120
##$ZL3= 120
##$ZL4= 120
##$ABSF1= 182.463
##$ABSF2= -187.1042
##$ABSG= 5
##$ABSL= 3
##$ALPHA= 0
##$AQORDER= 0
##$ASSFAC= 0
##$ASSFACI= 0
##$ASSFACX= 0
##$ASSWID= 0
##$AUNMP= <proc_1d>
##$AZFE= 0.1
##$AZFW= 0.5
##$BCFW= 0
##$BC_mod= 2
##$BYTORDP= 0
##$COROFFS= 0
##$CY= -3
##$DATMOD= 1
##$DC= 0
##$DFILT= <>
##$DTYPP= 0
##$F1P= 0
##$F2P= 0
##$FCOR= 1
##$FTSIZE= 65536
##$FT_mod= 6
##$GAMMA= 0
##$GB= 0
##$INTBC= 1
##$INTSCL= 5.30512e-09
##$ISEN= 30
##$LB= 1
##$LEV0= 0
##$LPBIN= 0
##$MAXI= 10000
##$MC2= 0
##$MEAN= 0
##$ME_mod= 0
##$MI= 50
##$NCOEF= 0
##$NC_proc= -7
##$NLEV= 6
##$NOISF1= 182.463
##$NOISF2= 159.3651
##$NSP= 0
##$NTH_PI= 0
##$NZP= 0
##$OFFSET= 182.463
##$PC= 4
##$PHC0= -1592.816
##$PHC1= -181.5979
##$PH_mod= 1
##$PKNL= yes
##$PPARMOD= 0
##$PSCAL= 0
##$PSIGN= 0
##$REVERSE= no
##$SF= 81.0140089999434
##$SI= 65536
##$SIGF1= 159.3651
##$SIGF2= -187.1042
##$SINO= 113.3802
##$SIOLD= 16384
##$SREGLST= <1H.CDCl3>
##$SSB= 0
##$STSI= 65536
##$STSR= 0
##$SW_p= 29940.119760479
##$SYMM= 0
##$S_DEV= 0
##$TDeff= 32768
##$TDoff= 0
##$TI= <>
##$TILT= no
##$TM1= 0
##$TM2= 0
##$TOPLEV= 0
##$USERP1= <user>
##$USERP2= <user>
##$USERP3= <user>
##$USERP4= <user>
##$USERP5= <user>
##$WDW= 1
##$XDIM= 65536
##$YMAX_p= 314854723
##$YMIN_p= -46295819
$$ End of Bruker specific parameters
$$ ---------------------------------
##NTUPLES= NMR SPECTRUM
##VAR_NAME=  FREQUENCY,     SPECTRUM/REAL,   SPECTRUM/IMAG
##SYMBOL=    X,             R,               I
##VAR_TYPE=  INDEPENDENT,   DEPENDENT,       DEPENDENT
##VAR_FORM=  AFFN,          ASDF,            ASDF
##VAR_DIM=   65536,         65536,           65536
##UNITS=     HZ,            ARBITRARY UNITS, ARBITRARY UNITS
##FACTOR=    0.456856943014862, 1,           1
##FIRST=     14782.0589164792, 0,            0
##LAST=      -15158.0608439998, 0,           0
##MIN=       -15158.0608439998, -46295819,   0
##MAX=       14782.0589164792, 314854723,    0
$$ Real data points
##PAGE= N=1
##DATA TABLE= (X++(R..R)), XYDATA
$$ [...]
##PAGE= N=2
##DATA TABLE= (X++(I..I)), XYDATA
5050c495320M597030P511564J911752p406855j0818229m519352M377146P263330
5042e78934N048051L699145L028898r32258n354144l653562J714679J480026m505512
5033e3611n863251J153663P384788N893992J501993m31640l315851j0012638j4115388
5024a7857943r020657J658768R964813J3218240J2022998O313682o81644k559499
5016A3058758J86580j190943q908412j2541713n352940L816990M551993N85766
5008e793921M01510J803809j154282m213040j87882O323935O040526J371489J043523
4999E635667L367410N17977m554066k335332M553259M368118k716289m369149
4991D467595K098511N712653K342247R90367M756714L710470n692026j1120228
$$ y = [-3495320, 1101710, 8613274, 10525026, 3118171, -7700058, -12219410, -7842264, -578934, 4469117, 8168262, 11197160, 10264902, 4910758, 1257196, 2971875, 4451901, -53611, -5916862, -4763199, 2621589, 8515581, 10017574, 9585934, 6270083, -3742555, -17857943, -26878600, -25219832, -15255019, -2036779, 9986219, 16299901, 15618257, 13058758, 13245338, 12054395, 3145983, -9395730, -14748670, -10931680, -6379687, -5793921, -5392411, -3588602, -4742884, -8955924, -9143806, -2819871, 3220655, 4592144, 5635667, 9003077, 9521054, 4966988, 2631656, 7184915, 11553033, 8836744, 4467595, 6566106, 12278759, 14621006, 15611373, 20368087, 24078557, 18386531, 7266303]
4983G266303m159141N345697N639397N05353j169795j111392m227800n959222
4975B129400o88006N398799L265361l611758n427217j843655N46083R92670K394961
4966C156638J594571m847630r582993l486537P151537P496646k622864p700325
4958h840957l20836Q864476Q972488L215894p79492l479587q208549j1702897
4950a2279460q352048O28500Q436646J0222722O054545r0143k259832K055873
4942D416803P024923M514200l760062p203135j677997M282565K714205k481558
4934G829944l649320j693932k381745n323818n170362j229255J793003J549277
4926h276208J58968p37678j483293j542718j01801J146079M45296J23422L175615
$$ y = [7266303, 3107162, 8452859, 14092256, 14597609, 13427814, 12316422, 8088622, 2129400, 1441394, 6840193, 10105554, 6493796, 1066579, -777076, -230993, 761677, 3156638, 4751209, -96421, -9679414, -13165951, -6014414, 1482232, -1140632, -8840957, -9161793, -297317, 8675171, 11891065, 11111573, 7631986, -576563, -12279460, -20631508, -20003008, -11566362, -1343640, 4710905, 4620762, 2360930, 4416803, 11441726, 15955926, 12195864, 4992729, 3314732, 7597297, 10311502, 7829944, 4180624, 2486692, 104947, -5218871, -10389233, -11618488, -9825485, -8276208, -8117240, -8854918, -10338211, -11880929, -11982730, -10836651, -10391355, -10267933, -7092318]
4917g092318O715308M937055j188899l686233R82566O156311M363484k005313
4909I181961m452947o33048K591693r17525p746796r055173k015246O490665Q669404
4900B112988N190157K494181K603856R35474m844784r476864p398619j200084
4892i583695K363315K055226J838456K347220j37227n214884o046039P06000P964158
4883c707470O604289k234877q616683o333304J077792O728474P851993N531626
4875F901840J292809l147248n359320m479768k626071j710119n16690K240684
4867g403883L846008R11750l933508m074365J232887M618523J255506l489078
4859g036160k080697L657661N831818L061567J951579N677767Q727237N740537
$$ y = [-7092318, -377010, 4560045, 3371146, -315087, 667479, 6823790, 11187274, 9181961, 4729014, 4095966, 6687659, 5770134, -1976662, -11031835, -13047081, -6556416, 2112988, 7303145, 9797326, 12401182, 13336656, 8491872, -984992, -8383611, -9583695, -7220380, -5165154, -3326698, -979478, -1116705, -6331589, -12377628, -11671628, -3707470, 2896819, 661942, -7954741, -14288045, -13210253, -6481779, 1370214, 6901840, 8194649, 5047401, -311919, -4791687, -7417758, -9127877, -9644567, -7403883, -3557875, -2646125, -6579633, -10653998, -9421111, -4802588, -3547082, -7036160, -9116857, -5459196, 372622, 3434189, 5385768, 11063535, 19790772, 25531309]
4851B5531309m49687l436693j695015J145823J359453k325345q215875j1456669
4843D57301p793927K27803M701977K318607j659622k137021j327503k850653m370521
4834a2433559k208298J369920K305119K151280L878845M098858j606444q282588
4826a0726867o698388J988060P162047N063993L270283O230753P399103J300898
4818A4989882o033671o195011j044546J581318q2337j578397q55445K9659J52791
4809I64243R29942K896331N074745O213268M379163j508093p414539o368171J480886
4800F647775O637127L126850k531529k061807J090022j437121p298594o453550
4792b280827J781633O938965L940770q5504J173086M030482L601633K079436J682835
$$ y = [25531309, 25081622, 21644929, 19949914, 21095737, 22455190, 20129845, 11913970, 457301, -7336626, -7108823, -2406846, -88239, -1747861, -3884882, -5212385, -8063038, -12433559, -14641857, -13271937, -10966818, -8815538, -4936693, -837835, -2444279, -10726867, -17425255, -15437195, -8275148, -3211155, 59128, 6289881, 13688984, 14989882, 8956211, 2761200, 1716654, 3297972, 3215635, 1637238, 781793, 811452, 964243, 1894185, 4790516, 9865261, 16078529, 20457692, 18949599, 11535060, 5166889, 6647775, 13284902, 16411752, 13880223, 11818416, 12908438, 11471317, 4172723, -2280827, -499194, 6439771, 10380541, 10295037, 11468123, 15498605, 19100238, 21179674, 22862509]
4783B2862509j958549j0923170j6355865q784277O754216J5815512J3085771O421648
4775B6917795K729172l25282o014757j0764381r923683n577049k969861k750882
4767h678928k028104o20174q15842k037008j042153K235291L665437J054232k413914
4758a0681163k678391J58414L163825M424998L671190J497916L1383J803868N567752
4749F959792O159685J778513j849983O16020M891251K426018o172681j0949353
4741C859262o904587n26019J062819j79872N03707J399006j420811n088643l315524
4732a0610662L235143P373484N621880J608590o85122j112755m26089J258123
4724F262592K165766L7865l324768l184452J375055N867462O418619L496569p55515
$$ y = [22862509, 20903960, 9980790, -6375075, -15159352, -8405136, 7410376, 20496147, 26917795, 29646967, 29321685, 23306928, 12542547, 2618864, -2958185, -5928046, -8678928, -10707032, -11327206, -12143048, -14180056, -15222209, -12986918, -9321481, -8267249, -10681163, -13359554, -13201140, -10037315, -5612317, -1941127, -443211, -411828, 1392040, 6959792, 13119477, 14897990, 13048007, 13664027, 18555278, 20981296, 14808615, 3859262, -3045325, -3571344, -2508525, -2688397, -2184690, -785684, -2206495, -7295138, -10610662, -7375519, -2035, 5619845, 7228435, 6543313, 5430558, 5004469, 6262592, 8428358, 8466223, 5141455, 1957003, 3332058, 9199520, 15618139, 19114708, 18359193]
4715A8359193m651923o025790l749488p97782j123346l127665j722624K570205
4707b69220L405533n52178k091270L106362Q391628N630229k508882o979097n709854
4698B423251m666889o510626n915875J534566J0981170J2734467L737356q130278
4690F187142j2186551o647141p8585k7288l355463k090610L668515N967517K150553
4681f411911q53853J532065L864495O39668l612907j943483L245408M993655L880851
4672E333988N330999P700584M149020m024499p075871j842865L187305J553991
4664A4312652j756109K4668M249133M201045k0280l117533l376273l092946k688610
4655H735747p73542J231209M04960k106529k031011J233994L371877J552767j936000
$$ y = [18359193, 13707270, 7681480, 3931992, 3134210, 2010864, -1116801, -2839425, -269220, 3136313, 2584135, 492865, 3599227, 11990855, 17621084, 15112202, 8133105, 2423251, -2243638, -8754264, -14670139, -13135573, -2154403, 10580064, 14317420, 6187142, -5999409, -12646550, -12725135, -12752423, -16107886, -18198496, -14529981, -8562464, -6411911, -7265764, -5733699, -1869204, -1229536, -4842443, -6785926, -3540518, 1453137, 5333988, 10664987, 18365571, 22514591, 18490092, 11414221, 9571356, 12758661, 14312652, 12556543, 12581211, 16830344, 21031389, 21011109, 17893576, 14517303, 11424357, 8735747, 7962205, 9193414, 9598374, 7491845, 5460834, 6694828, 10066705, 11619472, 9683472]
4646I683472l802393l978015l833871l093781j150396M45582j18783j256321M93243
4637f611263M612753N562014O6037o930991p667629k157458J638662o69447l775973
4628a5933295j501498L482903M536708J776909M38978P16833j871906n944350
4620a4298718l824889N425942J1754354Q105492O71679j491003J84560o99372
4612E828045k741357k26383M176166K099232n625227q478293k682647K900870
4604d749594J319963k322930j334520J161818n40468l355193q92967M562692N658115
4595d93084K629281K143862M794732M221265p59920l608507k004706k102593o546004
4586a725674q054569j605539N541237M647034m11870n4289M659073M234181k410731
$$ y = [9683472, 5881079, 1903064, -1930807, -5024588, -6174984, -5729402, -5848185, -7104506, -6611263, -1998510, 3563504, 3629541, -3301450, -10969079, -13126537, -11487875, -12157322, -15933295, -17434793, -13951890, -9415182, -7638273, -7199295, -6482462, -8354368, -14298718, -18123607, -12697665, -943311, 7162181, 7833860, 6342857, 6527417, 5828045, 3086688, 2860305, 7036471, 9135703, 3510476, -4967817, -7650464, -4749594, -3429631, -5752561, -7087081, -5925263, -6465731, -9820924, -10713891, -6151199, -493084, 2136197, 4280059, 9074791, 13296056, 12536136, 8927629, 6922923, 4820330, -1725674, -9780243, -11385782, -5844545, -1197511, -1609381, -1663670, 2995403, 7229584, 4818853]
4577D818853n443078j57744N525536L881415j561720l647650k736867l101246
4569b422501l767345r00576L931732N542589L572431K171437K054649o9609l740275
4560F372532l635442J357884M377661L17459n335680l385819N342702R743599
4552A5154896L225365o736143q073811j07628N981578K799631l722433m171656
4544D349799N13326K023829j460356l262442l24435J918941o4138j390619J805956
4535D109861M301432Q50183l217395j47881O094262M971180l566922q937548o814791
4526b357619l912427l520100R60917J1843546J7797957Q508596q458691j5893616
4518D968563q446312L280703Q120443N271951K43024k533894j770634O13683M47528
$$ y = [4818853, -624225, -781969, 4743567, 8624982, 7063262, 3415612, 678745, -2422501, -6189846, -7090422, -3158690, 2383899, 5956330, 8127767, 10182416, 10112807, 6372532, 2737090, 4094974, 8472635, 8790094, 3454414, 68595, 5411297, 15154896, 18380261, 11644118, 3570307, 3462679, 9444257, 12243888, 8521455, 4349799, 4863125, 6886954, 5426598, 2164156, 1839721, 3758662, 3694524, 2303905, 4109861, 8411293, 9261476, 6044081, 5896200, 11990462, 16961642, 13394720, 4457172, -2357619, -6270046, -9790146, -8829229, 3014317, 20812274, 29320870, 20862179, 4968563, -3477749, -197046, 7923397, 13195348, 13438372, 10904478, 9133844, 9747527, 10195055]
4509A0195055l800960p369626m658020K330916N996719L512660j07583j41006
4501E958155J769681J494854j803971n789378p534364m609939K796131R377771
4493A658940Q468271P29678m852678k027853M070330L731784m085500j0439691
4485b746719q010221O68895P728001Q973900O228920L164059J524836P10992q71761
4476A7370902l937196o846316o804102l756154j826201m401706q362452o723226
4468b5286451J889670R906585R660745K965108j799707n78907K647283K733537
4460B137863k91454k641396j308094L509811P732642N500275m093680j2744120
4452b198153j0907822o69385N912069L162894j261683K21975L301289P12392m212382
$$ y = [10195055, 6394095, -975531, -5633551, -3302635, 2694084, 6206744, 6099161, 5958155, 7727836, 9222690, 7418719, 1629341, -5905023, -10514962, -7718831, 1658940, 10127211, 10856889, 6004211, 3976358, 8046688, 11778472, 7692972, -2746719, -10756940, -10088045, -2360044, 6613856, 12842776, 16006835, 17531671, 18242663, 17370902, 13433706, 6587390, -216712, -3972866, -5799067, -10200773, -18563225, -25286451, -23396781, -13490196, -3829451, -864343, -2664050, -3242957, -595674, 2137863, 1846409, -794987, -2103081, 1406730, 9139372, 14639647, 10545967, -2198153, -13105975, -13775360, -7863291, -4700397, -5962080, -5740105, -2438816, -1726424, -5938806]
4443e938806l040983L220229O099710L875512K460558K718466r66939p613744
4435H14003p375255K720716J1313668P849238l016679r340564p526632k758029
4427g319534O41116J897043J054103N9272K664297P666020P284257j410438r137760
4418C398376o378336K434552N741575J509585k947212m256117m955391m304113
4410i757081R88445P146023O157997p95420l998963o47375J951649M70290J69709
4401A685274K151863k62998o834224o250839M799305J1983352M248526p532565
4393C987694o840250L199120O785942R74829l066805j050873l39143l429039k967103
4384b745628L517052P868001M892367K3579j230511j139070k589071l758212m274859
$$ y = [-5938806, -8979789, -5759560, 340150, 4215662, 6676220, 9394686, 8427747, 814003, -6561252, -3840536, 7473132, 15322370, 12305691, 2965127, -4561505, -7319534, -6678418, -4781375, -3727272, -3668000, -1003703, 6662317, 13946574, 12536136, 3398376, -2979960, -545408, 5196167, 6705752, 3758540, -497577, -5452968, -9757081, -8768636, -1622613, 4535384, 3739964, -258999, -906374, 1045275, 1515565, 1685274, 3837137, 3574139, -3260085, -9510924, -4711619, 7271733, 11520259, 3987694, -2852556, 346564, 7132506, 8107335, 5040530, 3989657, 3650514, 221475, -2745628, 771424, 8639425, 13531792, 13555371, 12324860, 11185790, 8596719, 4838507, 563648]
4375E63648p312597j1304130r196047n50829N629138N393596O390623J3046391
4367B659793J6249285P467334o134619j1776754q984446n998757m453327j74096
4359a1145587M882332M511511L36793k05934K505166N73413o515873r034156k348648
4350a6440983N083212M101972k513891n324784r09059N608244P522045K847651
4342b5593m067717n982730m32812O180659N839686n47214m894065l634444j272125
4333h836355j610414k382693r85400O51388L02020m22872L81574J442501J739775
4324i720476L616526Q641140J2964482J0641529R49744r616971j2671888n583018
4316g78932N092592R173545L876226k966979l717259j358025l473789q995921
$$ y = [563648, -6748949, -18053079, -27249126, -27799955, -22170817, -16777221, -10386598, 2659793, 18909078, 26376412, 20241793, 8465039, -519407, -6518164, -10971491, -11145587, -6263255, -1751744, -1414951, -1620885, 884281, 1457694, -5058179, -14092335, -16440983, -11357771, -7255799, -9769690, -15094474, -16003533, -10395289, -2873244, -25593, -4093310, -10076040, -10508852, -4328193, 1511493, 964279, -3929786, -7564230, -8836355, -10446769, -12829462, -13814862, -13163474, -12861454, -13284326, -12902752, -11460251, -9720476, -6103950, 2537190, 15501672, 26143201, 27092945, 17475974, 4804086, -778932, 4313660, 13487205, 17363431, 14396452, 10679193, 9321168, 5847379, -3148542]
4308c148542r238026j422620P451341J1168248J0426719O876780j00872p470949
4300A4542079p955554l25787O522088M820537k357355o988927o140822j908626
4292B07633L047465N425543J988137n241728r207939o747203k142128Q24749L486858
4283h358613N834084L799395k264575n050620k034473o08497m475454n028788
4275a8187541L922255J2471657Q414363k668979n583149R41673M114015j316482
4267B107812o336883l768978K110158M983662M640298K524790j577648n342906
4259f59695m284886J130913N300373N345223K751832j915683p946380r605397
4251i883700k291074P061608O877342j401246m735705Q56712M604043p895m441836
$$ y = [-3148542, -12386568, -13809188, -6357847, 4810401, 15237120, 22113900, 22013028, 14542079, 6586525, 6260738, 12782826, 17603363, 15246008, 8257081, 2116259, 207633, 3255098, 8680641, 10668778, 5427050, -3780889, -10528092, -12670220, -11845471, -8358613, -2524529, 1274866, -989709, -6040329, -8074802, -8683299, -13158753, -18187541, -14265286, -1793629, 6620734, 3951755, -1631394, -689721, 3424294, 2107812, -4229071, -7998049, -5887891, -904229, 3736069, 6260859, 4683211, -659695, -4944581, -3813668, 1486705, 6831928, 9583760, 7668077, -278303, -9883700, -12174774, -5113166, 1764176, 362930, -4372775, -3516063, 1087980, 1080085, -3361751]
4242c361751p09208M626194K082437m547406m756612K075918P187287N960244
4234H557103J941549o76939j326549p94351J62717P01284J048546J743955Q83275
4225A2240590l384495p000614l625787M132363N894307n07252m144046J788897
4217E393963P968966L367047o799753r025265j834355L934140K373933j444616
4209C934060k226514j239285j063198j104276O9513K790720O597143Q785382N168110
4200B1711655l213446q030336m308053J208115k00783n537609n591137o68411
4192d630005N14387l530315m640797K68472L639751L44896l756219j971689K498642
4183a1262877K545918j692295m040727j341281L855318P627238P984731N312031
$$ y = [-3361751, -4070959, 555235, 2637672, -1909734, -6666346, -4590428, 2596859, 8557103, 10498652, 9821713, 8495164, 7700813, 7863530, 8564814, 9613360, 11357315, 12240590, 8856095, 1855481, -1770306, 2362057, 8256364, 7749112, 3605066, 5393963, 13362929, 16729976, 9930223, 904958, -929397, 3004743, 5378676, 3934060, 1707546, 468261, -594937, -1699213, -1629700, 1161020, 7758163, 16543545, 21711655, 18498209, 10467873, 6159820, 7367935, 7167152, 1629543, -3961594, -4630005, -4115618, -7645933, -12286730, -12018258, -8378507, -8033611, -11789830, -13761519, -11262877, -8716959, -10409254, -14449981, -15791262, -11935944, -4308706, 3676025, 8988056]
4175H988056J955817J34857o89938k448785m475926m100443j494147m6383r64552
4166c141444j367006Q30443L651592M324444K879038J047728k132R4779Q29039
4157I146481Q03401k16356k31127J364963J136903l229630p284083n098413J261782
4148b346079M344392K597572J098675P81002l545334j1609792j3861898n122534
4140b7663996N891094Q220420L808937K424310N619657N637729n11400n432487
4132b005736k588938L872175N384482J085256k055632n16833J66776n639752j2894957
4123a5193159j0713669J636547J1025398P209919l072476o131855n40339L760453
4115a2019181K967259L524213P464544O818003j754641q355759m522127K658665
$$ y = [8988056, 10943873, 11078730, 10388792, 7940007, 3464081, -636362, -2130509, -2176892, -3141444, -4508450, -3678007, -26415, 4298029, 7177067, 8224795, 8222663, 8317442, 9146481, 9949882, 9733526, 9502399, 10867362, 12004265, 8774635, 1490552, -3607861, -2346079, 1998313, 4595885, 5694560, 6475562, 2930228, -8679564, -22541462, -27663996, -21772902, -13552482, -9743545, -7319235, -1699578, 3938151, 3426751, -2005736, -4594674, -722499, 4661983, 5747239, 3691607, 3174774, 3341550, -2298202, -15193159, -25906828, -24270281, -13244883, -6034964, -9107440, -15239295, -15779634, -12019181, -9051922, -5527709, 1936835, 8754838, 7000197, -1355562, -5877689, -3219024]
4107c219024J571822n342472n659044L760378J2819724J2771629N103850m363445
4099A7443418j1495511j2900639p038179J514369N230771K886064J22879k5489
4091d262317o58129l536670n080464k858090R4218J141393K659657O436745Q521523
4082B457866N076387l97513j650390Q04045Q88448l072213n584014k421028K945999
4073i52413M051748j63282m551821m395976m55570K918498L088451J239459l20951
4064D58143j083794j540611j086906R52278K835079J839513j441877l253769k179362
4055d501306j122002j669823k38766N900399J1482228Q424449j939957q446732
4047G888490m448849L251823M345558q76531l988524k283482j784208n665239
$$ y = [-3219024, -1647202, -6989674, -12648718, -8888340, 3931384, 16703013, 21806863, 17443418, 5947907, -6952732, -13990911, -12476542, -7245771, -4359707, -4236828, -4262317, -4920446, -8457116, -13537580, -16395670, -16301452, -15160059, -12500402, -6063657, 2457866, 7534253, 7136740, 5486350, 6290395, 7178843, 4106630, -1477384, -3898412, -952413, 3099335, 2936053, -1615768, -6011744, -6467314, -3548816, -460365, 779094, 458143, -625651, -2166262, -3253168, -2300890, 534189, 2373702, 931825, -2321944, -4501306, -5623308, -7293131, -7531897, -1631498, 9850730, 18275179, 16335222, 7888490, 3439641, 6691464, 11037022, 10160491, 6171967, 3888485, 2104277, -3560962]
4039c560962p944746l059274M312411N280731n13986m645486j682074M385988
4031g427398O440318K786181k231293l583147k23719M099715M335232l97452n485242
4022a686805o501753m648899l930045m632850l513771M48243M786766P733976
4014a1945138R322635Q554319M512296N67451J609656N666096M590561l856179
4006A9021697j0648872o997775L418793R362818O222369l81034l628245k729031
3998A3640720r76569o77137j318514j170629j38651o58636m087678o853610m150747
3989f391451K002748L700228j610152o463322l850334K944154O114752M299035
3981G45658J732878K86487j026178j437081J25785J331915K66685n7265K485014
$$ y = [-3560962, -11505708, -14564982, -10252571, -4971840, -5485826, -10131312, -11813386, -7427398, -987080, 1799101, -432192, -4015339, -4239058, -139343, 4195889, 3798437, -1686805, -8188558, -12837457, -16767502, -21400352, -24914123, -24465880, -19679114, -11945138, -2622503, 5931816, 10444112, 11011563, 12621219, 18287315, 22877876, 19021697, 8372825, 1375050, 4793843, 14156661, 20379030, 19997996, 16369751, 13640720, 12664151, 11987014, 10668500, 9497871, 9359220, 8700584, 4612906, -2240704, -6391451, -4388703, -688475, -2298627, -8761949, -12612283, -9668129, -3553377, 745658, 2478536, 2765023, 1738845, 301764, 427549, 1759464, 2026149, 1968884, 4453898]
3972D453898K936643k545762o480320M32715J1894517J1933359q85484j0004399
3964A1735167n936656K88852k846499p867704j944557J0097553J2317273K389681
3956A8233110n950929m501016j43279m29280k512975j679526n08301k557072m487503
3947d536771j977490J834238J369444j487298k58124M913768O524240R36645o039692
3938A278960p103015k207128L451310O302935N809404K114361l259671o043785
3930C43371l362122J156706J325177k068670j426628N545183J0036544M002255
3922A5551816o608676q374861J172872R959646P755545j333699o425662l778114
3914G918867J914954N565002N107073j79854q416453j3277356r352724K44092
$$ y = [4453898, 7390541, 4844779, -1635541, -1202826, 10691691, 22625050, 21739566, 11735167, 5798511, 6087363, 3240864, -4626840, -6571397, 3526156, 15843429, 18233110, 12282181, 7781165, 7637886, 7208606, 4695631, 3016105, 2507804, -49268, -4536771, -6514261, -4680023, -3310579, -4797877, -5056001, -142233, 6382007, 7318652, 1278960, -5824055, -8031183, -4579873, 1723062, 7532466, 9646827, 6387156, 343371, -3018751, -1862045, -536868, -2605538, -4032166, 1513017, 11549561, 15551816, 8943140, 568279, 1741151, 11700797, 19456342, 18122643, 11696981, 7918867, 9833821, 15398823, 20505896, 20326042, 11909589, -1367767, -10720491, -10476399]
3906a0476399O448373N115660R29313m18494Q02798J353282P71544P18075J266268
3897F510420J371712J429092K131908K001691n50438l437251k967861K26127J470329
3888H185729o81050j994862N9896J284009k005723m839208m12319O856614N151952
3879A1605038n945348j1353153j658992J1175901R826966l334297j0609317n508330
3871e801532K98683j742779m332953L46105N876023K878571m495043n668530j180224
3862a3821679m15409m892640o310881j102384M194416L882274L31949k012330
3854b0146684k271238o76024K818785N745152N098231K960306L588256M763557
3846A880341K48336q236015j1006244n071763Q68945K48193k101929j36573L094062
$$ y = [-10476399, -4028026, 1087634, 2016947, 1598453, 2401251, 3754533, 4526077, 5244152, 6510420, 7882132, 9311224, 11443132, 13444823, 12894385, 9457134, 6489273, 6715400, 8185729, 7504679, 5509817, 5569713, 6853722, 4847999, 8791, -403528, 6453086, 11605038, 5659690, -5693463, -7352455, 3823446, 13650412, 10316115, -293202, -5801532, -5502849, -7245628, -11578581, -11232476, -5356453, -2477882, -6972925, -12641455, -13821679, -14237088, -19129728, -25440609, -26542993, -22348577, -18466303, -18134354, -20146684, -22417922, -23093946, -20275161, -14530009, -9431778, -6471472, -2883216, 1880341, 2128677, -6107338, -17113582, -22185345, -21316400, -21068207, -23170136, -23306709, -20212647]
3837b0212647K527198M65225R07412J605251R4005P74817O700327J0776756N768036
3828I406380k443503l286635J337961J345446l094597j901462O351951J0827714
3820A8543255N966305p23077k522477k730199m654311m085761J177871M385871
3812A5357477L78123n208179n139873j714930q64191j716701r2899L109309M539436
3803H647572M326406K809160k544862r966935j0433209p54276P631403L825539
3795C540798n058496m575133L864281N788699k071541o633875o8344Q398964Q021147
3786A1206500J633166k077229j911559k014202l308596m237602n004425n255307
3778a0969254k100252M398390Q135036M487011k602945n583901k345680L296884
$$ y = [-20212647, -17685449, -17220224, -16312812, -14707561, -14613556, -13838739, -7138412, 3638344, 9406380, 6962877, 3676242, 5014203, 6359649, 3265052, 1363590, 7715541, 18543255, 24509560, 23786483, 21264006, 18533807, 13879496, 9793735, 10971606, 15357477, 15735600, 10527421, 5387548, 3672618, 2808427, 1091726, 998827, 4108136, 8647572, 12973978, 15783138, 13238276, 3271341, -7161868, -7916144, -284741, 3540798, -1517698, -6092831, -2228550, 3560149, 1488608, -5145267, -5213611, 3185353, 11206500, 12839666, 10762437, 8850878, 6836676, 3528080, -709522, -5713947, -10969254, -13069506, -8671116, -536080, 3950931, 1347986, -4235915, -6581595, -3284711]
3770c284711P048642O840192L125242q05511j674387q84729k461559n495940m462326
3761b055087J065217L950746L47820l806262k152403K323079K818313j001859
3753A489564m476499n669339n581695m027316r86323Q24093k88639j722926j311496
3744b1750576j077952j695582J200106Q760392J2706978N992157m548941o036402
3736f449820K213443Q301116N081883j886806m909560l634440j214135J418781
3728a079538L603380K874020j186884m559806l329521J537071N649925N830076
3720I338723K750186J80867R03411K429096n88639p851666j1548483o771349O85065
3711a0472789K502846j90529p2130M032113O053907K949678j384687k744764j242806
$$ y = [-3284711, 3763931, 10604123, 13729365, 12923854, 11249467, 10364738, 7903179, 2407239, -2055087, -989870, 2960876, 3308696, -497566, -2649969, -326890, 2491423, 1489564, -2986935, -8656274, -14237969, -18265285, -19251608, -18427515, -18716154, -20439080, -21750576, -22828528, -24524110, -23324004, -14563612, -1856634, 4135523, -413418, -6449820, -4236377, 4064739, 9146622, 7259816, 2350256, -1284184, -2498319, -1079538, 2523842, 5397862, 4210978, -348828, -3678349, -2141278, 3508647, 9338723, 12088909, 12269776, 13173187, 15602283, 15013644, 7161978, -4386505, -11157854, -10472789, -7969943, -8160472, -8232602, -4200489, 1853418, 4803096, 3418409, 673645, -569161]
3702e69161Q59137J371311q26985l282958j400413L641262L745152l514708q270988
3693h248351l047062L742626J222471m285390P64269J2278706J2898087M33415
3685A5758771q348951n199110j199846l989575m464884L721316R874741M555298
3677A0707760l429060k598736K055313M82958l793676k415673P11134k127548
3669d07528n418747N28444R959284R124230r22838o750748n079881m980495q299864
3660a2248143n936138M043232J0888113Q052167J859622j053303k462432m130478
3652i87360k364587L468985O876144M132040J6099p63081j15567p42280j390068
3643H130325j546323l556409o731053o470659k244006P35336M52701J103958M375462
$$ y = [-569161, 289976, 1661287, 834302, -2448656, -3849069, -207807, 3537345, 22637, -8248351, -11295413, -7552787, -6330316, -10615706, -9851437, 2427269, 15325356, 15758771, 7409820, 2210710, 1010864, -2978711, -7443595, -3722279, 6152462, 10707760, 7278700, 4679964, 6735277, 7218235, 3424559, 1008886, 1720020, -407528, -5826275, -5297831, 4661453, 13785683, 12862845, 6112097, 1032216, -3948279, -12248143, -18184281, -14141049, -3252936, 4799231, 6658853, 5605550, 3143118, -987360, -3351947, 117038, 6993182, 11125222, 11141321, 10378240, 10262673, 9520393, 8130325, 6584002, 3027593, -3703460, -10174119, -12418125, -11682789, -11230088, -10126130, -5750668]
3634e750668N744441K969885M50078J178352J784942l86266k569015l052183m900449
3625d530883q526547p907140J63142R350838J1987111Q575023M049778J43787
3617A3305109l077082l291163L88207L530591J552019l882177p374470o024240
3609d873206q71163M352927M697121r53264n757327k469895M553640M098705l637799
3600h60261n430038L495798R366851N82622j2701595j2456345J247285J1757758
3592d997925R328220L00436n560488n505879j487046L251437M563732J346143
3584A238630j432063M96144L381653J630220k148984j593351J841117J169814
3576D583180l916841o566630l827180N09192L479078N057226L870359n46456k807619
$$ y = [-5750668, -6227, 2963658, 3413736, 4592088, 6377030, 5990764, 3421749, 369566, -4530883, -13057430, -20964570, -20801428, -11450590, 536521, 9111544, 13161322, 13305109, 10228027, 6936864, 7325071, 10855662, 12407681, 8525504, 1151034, -4873206, -5744369, -1391442, 3305679, 2352415, -3404912, -5874807, -1321167, 2777538, -860261, -6290299, -2794501, 6572350, 7154972, -5546623, -18002968, -16755683, -4997925, 4330295, 4630731, -929757, -6435636, -7922682, -4671245, -107513, 1238630, -193433, 302711, 3684364, 5314584, 3165600, 1572249, 3413366, 4583180, 666339, -5900291, -9727471, -9218279, -5739201, -681975, 3188384, 2641928, -165691]
3567a65691J578029O436527K722613n665417o618602K19297K885023j883399l143839
3558c635459L872684Q181396K334150l700470M71228P460308M701886m408613
3550A5277110o945873j496681K117578K28696j697958j355164j702267j894174
3542B531267J342416L878013j418927j0040995r113699K266551R492194M053320
3534B990140m107688l085834L488002N050349J375107N760J944540J413190k332802
3525F740764l470550k10085J891639p26026l846606k230589K499017M303459Q20158
3516E771181l874821m339842k93832K835833O77342l785273l699798J642961M851613
3507b14636R57617m758682m152755J957031N276805J758380m162261o844424n455900
$$ y = [-165691, 1412338, 7848865, 10571478, 4906061, -1712541, -1493244, 1391779, -491620, -3635459, 237225, 8418621, 10752771, 7052301, 7523529, 14983837, 19685723, 15277110, 8331237, 6834556, 8952134, 9180830, 7482872, 6127708, 4425441, 2531267, 3873683, 7751696, 6332769, -3708226, -12821925, -10555374, -1063180, 2990140, -1117548, -4203382, -715380, 4334969, 5710076, 5715836, 7660376, 9073566, 6740764, 3270214, 3060129, 4951768, 4225742, 379136, -1851453, 647564, 4951023, 5771181, 1896360, -2443482, -2737314, 98519, 775861, -3009412, -6709210, -5066249, -214636, 742981, -4015701, -8168456, -6211425, -934620, 823760, -3338501, -10182925, -15638825]
3498a5638825k051400J433801K976923J361888j243034q50776L091075O738026
3490d182322O611348K802610k121774m535892j548598M593100N965582j440847
3482F143207r602901p712254J542343M867663j467949n970209p13403O057291
3474f856212M109617k246771k563803K454618M147182J302913j6759J038355J31847
3465A500987j507030J088767M548320J67550r526645j0858960J50637R923635
3457d512739O967661k036424m485127o53726L92723k806471l250121J655739O297880
3448b430605N771766J341494l222684n325407l775851J05922K151599L5990k789484
3439h137260j718223J936138K844673m12894l831365m089288k101051j63311J119683
$$ y = [-15638825, -17690225, -16256424, -13279501, -11917613, -13160647, -14011423, -10920348, -4182322, 2429026, 5231636, 3109862, -1426030, -2974628, 1618472, 7584054, 6143207, -3459694, -11171948, -9629605, -4761942, -6229891, -12200100, -12913503, -6856212, -2746595, -4993366, -7557169, -5102551, -955369, 347544, 330785, 1369140, 1500987, -6043, 1082724, 5631044, 5798594, -3728051, -14587011, -14436374, -4512739, 2454922, 418498, -4066629, -4720355, -4327632, -7134103, -10384224, -8728485, -2430605, 3341161, 4682655, 1459971, -3865436, -7641287, -7535365, -5383766, -5347776, -8137260, -9855483, -7919345, -5074672, -5487566, -9318931, -13408219, -15509270, -15672581, -14552898]
3430a4552898K313325L604106M208453K619096j568821n535301n231394p59985
3422a4903419K900147K233448n49906j346497Q89798M778649Q275889P904915
3414A0183024J189871p280605q118059J8072N982942R81279p919430p695833J452736
3405a1206003P101671L108027l444688m686460j666016J137476K857687L974972
3397b823334L257277O99661j195429j646358k477041l071904r3413N507877P398736
3388E556072L176005j180864m69692J770860p0397l881924l441390J198457L917128
3379F574255J896924j584127l563131m669230n128985k939900J841573N243087
3371b329534M511233J999344J183851J385779k90912l552380n178992l993648
$$ y = [-14552898, -12239573, -8635467, -4427014, -1807918, -3376739, -8912040, -14143434, -14903419, -12003272, -9769824, -10319730, -11666227, -10776429, -5997780, 2278109, 10183024, 11372895, 4092290, -4025769, -4007697, 1975245, 2956524, -4962906, -12658739, -11206003, -4104332, -996305, -4440993, -9127453, -10793469, -9655993, -6798306, -2823334, 433943, 1133604, -61825, -1708183, -4185224, -7257128, -7350541, -1842664, 5556072, 8732077, 7551213, 7081521, 8852381, 8781984, 4900060, 1458670, 2657127, 6574255, 8471179, 6887052, 3323921, -1345309, -6474294, -9414194, -7572621, -2329534, 2181699, 4181043, 5364894, 6750673, 6459761, 2907381, -2271611, -6265259]
3363f265259j767185Q77594N136997R268555P969628J07035o872553n630613M44066
3354C268265J813238l075314o010251k529030J263352m59592l262004j90151O005883
3345c175604O794318J223008l074119j713650J152808L67076l678363p566744
3337i671270q816980n888190R95452P393381P541050J838324k401426n5368N225259
3328c839768O297354K100814j176845J784535Q170164R294722Q31643j0406895
3320A3055724j3072115n143527L214574L030964k231692l381289J149277N243933
3312A865849N308516L095164M3808l567963m676283n26969M320532K236635n403699
3303B695590q779666m107926J002609l8624l248561j836814L262279O322062N320482
$$ y = [-6265259, -8032444, -7154850, -2017853, 7250702, 15220330, 15327365, 8454812, 2824199, 3268265, 5081503, 2006189, -4004062, -6533092, -5269740, -5729332, -8991336, -9181487, -3175604, 3618714, 4841722, 1767603, 53953, 1206761, 1573837, -2104526, -9671270, -18488250, -24376440, -23380988, -15987607, -8446557, -6608233, -9009659, -9065027, -3839768, 2457586, 4558400, 3381555, 5166090, 13336254, 22630976, 23462619, 13055724, -16391, -5159918, -1945344, 1085620, -1146072, -4527361, -3378084, 1865849, 7174365, 10269529, 10313337, 6745374, 2069091, 1542122, 5862654, 8099289, 2695590, -6084076, -10192002, -9189393, -9228017, -12476578, -14313392, -11051113, -4729051, 591431]
3294E91431K264040j076418l264554k505164L16155J226757j088751k914739j731353
3285h182596l06122j143063j553453J459281N483029O392519M414236K339603
3277H903434Q09172p01024j185366r8990P66652M64130O87191J667265M48011
3268A1760475l521560n702895l264566J39382P18210O76924K791417L825367j70966
3259G251788n950789p341509m380495j400146J183309N683893R604440P280996
3251A1931487q56667p538731q066628m902368k090437k15596J898395M573747
3243e266798P434740R169959P094862O7212q296883j2258661r720889l416962
3235a5193420K335564M067552Q55280l491522k746630L710920Q362471N362245
$$ y = [591431, 2855471, 1779053, -1485501, -3990665, -3674510, -2447753, -3536504, -6451243, -8182596, -8488718, -9631781, -11185234, -9725953, -4242924, 2149595, 6563831, 8903434, 9712606, 9011582, 7826216, 7727226, 8493878, 8958008, 9645199, 11312464, 11760475, 8238915, 2536020, -728546, -589164, 129046, 805970, 3597387, 7422754, 7251788, 1300999, -6040510, -10421005, -11821151, -10637842, -4953949, 4650491, 11931487, 11074820, 3536089, -4530539, -9432907, -11523344, -11738940, -9840545, -5266798, 2167942, 11337901, 18432763, 18499975, 10203092, -2055569, -11776458, -15193420, -12857856, -8790304, -7935024, -11426546, -14173176, -10462256, -2099785, 3262460]
3227C262460n93761r70847L900966N925289J807148k969436l498604k091084l112014
3218A660117n989702o483314k622360K719283M666758J660006k118951j558171
3210h066334J985376K059358k832100o154277l558593J42207l66689j475733K460911
3201a5805874P852108O793547K52263l197313l39489L943192N831272N574935
3193A0904641K300749m627705r313279m589283N441415Q394050J148591n862859
3185C796320m918957r66285n03490p74334K671139N832755K405834n034577q158586
3176e650181m419865J061866L318003J977297q51998l064161l576180l090882
3168a4296101k703577j242886L030040P662505P430056J930517k928526k996862
$$ y = [3262460, 2668699, 1697852, 5598818, 11524107, 13331255, 10361819, 6863215, 4772131, 1660117, -4329585, -10812899, -13435259, -10715976, -6049218, -4389212, -6508163, -8066334, -6080958, -4021600, -6853700, -13007977, -16566570, -16424363, -16791052, -18266785, -15805874, -7953766, -1160219, -907956, -4105269, -4444758, -501566, 5329706, 10904641, 13205390, 8577685, -735594, -5324877, 116538, 8510588, 9659179, 3796320, -1122637, -2088922, -2592412, -3366746, -695607, 5137148, 7542982, 2508405, -5650181, -10070046, -9008180, -5690177, -3712880, -4564878, -7629039, -11205219, -14296101, -16999678, -18242564, -15212524, -7550019, -119963, 1810554, -1117972, -4114834]
3160d114834q12654l28107j454942k410240l011392l011911j245344J494238K926987
3151a1968199L865593O966237R851712O593899j625275n465014j207166K600361
3143I612148j732892q888129r237038l435086N86011P09140J251754L066489K397542
3134e670061r13566k349555m62033J330501J704713L697949Q035071R773238M893160
3125B0039417l171328o999768m057936L44783m13504n827653q455532l674081
3117a2215602L499167N033832J079706j388178J9196R55030K71580K573611P429144
3108G257486O101020m376868j2926652r144235J111670N187243K683973L027687
3100a078676P757279Q460288K032085m286808n032625l142174j843088M07717
$$ y = [-4114834, -4927488, -5255595, -6710537, -9120777, -12132169, -15144080, -16389424, -14895186, -11968199, -8102606, -1136369, 8715343, 15309242, 13683967, 8218953, 7011787, 9612148, 7879256, -1008873, -10245911, -13680997, -13094986, -12385846, -11134092, -8067603, -5670061, -6583627, -8933182, -9395215, -8064714, -6360001, -2662052, 5373019, 15146257, 20039417, 16868089, 9868321, 5810385, 6155168, 5741664, -85989, -8541521, -12215602, -8716435, -3682603, -2602897, -3991075, -3971879, -3016849, -2745269, -171658, 7257486, 13358506, 8981638, -3945014, -13089249, -11977579, -6790336, -4106363, -1078676, 6678603, 15138891, 17170976, 12884168, 7851543, 4709369, 2866281, 3273998]
3092C273998L480027K957605j818632m933326l517314k653492n600846o564681
3084a5376661j24073Q041050Q129855O23798m509731k016319K730953L040163
3076E39035j11536j332024Q53457K668546R79022k340433k736866J359943O350612
3067F229756P274338L156204k255278m809959l999443k542544k795098m090129
3059c832153l554346M16339N586973P412228L500844l787918r234942q902787
3051a2395762l132068L396032N391692K467887j52579J243200K973934m32816
3043f40480o313405o265010J030629P083391O255761L108005K688667J949302
3035H896860k164460m045541J377746P051445L197920n837281p445027j579801
$$ y = [3273998, 6754025, 9711630, 7892998, 2959672, -557642, -3211134, -8811980, -15376661, -15500734, -7459684, 670171, 1293969, -3215762, -5232081, -2501128, 539035, 427499, -904525, -51068, 2617478, 3596500, 1256067, -1480799, -120856, 6229756, 13504094, 16660298, 14405020, 9595061, 5595618, 3053074, 257976, -3832153, -7386499, -6970160, -1383187, 6029041, 9529885, 5741967, -3492975, -12395762, -15527830, -12131798, -6740106, -4272219, -4424798, -3181598, -207664, -640480, -6953885, -13218895, -12188266, -5104875, 1150886, 4258891, 6947558, 8896860, 6732400, 2686859, 4064605, 11116050, 14313970, 8476689, 1031662, -548139]
3027e48139p87740p891395r472237K058256J4107497J1955026L63021n269314
3019D514975j918989N83958j808159k585945J112534K745680j186948l784912
3011b327806P21800O211069L631211m182934n662924K677300J0685874P905146
3003A9658736l162443j0716430p761156R32489N301737J057191o345606q188010
2995i223492k267040M959012O513490K949020k88835j239670k080140k226466
2987b904121J951871Q329989P811514k496748j1706260q926014N42827L079275
2979d317667k329322l463335M474017J0690822N816291m264267q666580o647286
2971h707327m221638k514130J416484O329501P838461N572520K832743J057306
$$ y = [-548139, -1335879, -9227274, -18699511, -16641255, -2533758, 9421268, 9784289, 4514975, 2595986, 3179944, 1371785, -1214160, -101626, 2644054, 1457106, -2327806, -1606006, 4605063, 8236274, 4053340, -1609584, 1067716, 11753590, 19658736, 16496293, 5779863, -1981293, -1048804, 4252933, 5310124, -1035482, -9223492, -11490532, -6531520, -18030, 2930990, 2642155, 1402485, -677655, -2904121, -952250, 7377739, 15189253, 12692505, 986245, -7939769, -7396942, -4317667, -6646989, -10110324, -5636307, 5054515, 10870806, 6606539, -2060041, -8707327, -12928965, -15443095, -14026611, -7697110, 141351, 5713871, 8546614, 9603920]
2963I603920k13521m03631L92279j71506k284636j960943K105560M576366J676536
2954A3320424j995302j144732J258975L2492k598366j787525M28648m99971k278550
2945D736093n38204J280644k425616p517073n583561J322732L799033J127226
2937c798726R99549L920072K145046m373595n385968K465500Q948588N971802
2929A0892268j395734n060726m670530k913637K8254J978627j646253q338336
2921a1126067q201483J100408Q673403N970670j274016l480881n48766K639470
2913f247262N416493P935448O242918r12448o796112n756056j429996O61964J644430
2904G59379L669056L616831j1369j877610M53429R6143o663846j0560727l397825
$$ y = [9603920, 9390399, 8986768, 9379047, 9207541, 6922905, 4961962, 7067522, 11643888, 13320424, 11325122, 10180390, 11439365, 11471857, 8873491, 7085966, 7514614, 7014643, 4736093, 4197889, 5478533, 3052917, -4464156, -10047717, -8724985, -4925952, -3798726, -2799177, 1120895, 3265941, -1107654, -6493622, -4028122, 4920466, 10892268, 9496534, 4435808, -234722, -3148359, -3120105, -1141478, -2787731, -11126067, -19327550, -18227142, -9553739, -3583069, -4857085, -8337966, -8886732, -6247262, -830769, 7104679, 13347597, 12435149, 5639037, -117019, -1547015, -885051, 759379, 4428435, 8045266, 8033897, 6156287, 6609716, 6705859, 42013, -10518714, -13916539]
2895a3916539O435859N859316k129785m193835J539687M882462K379351R80965
2887A837481K871998J850568k755649k696789M184202P917409J533386p667594
2879G075012q687854j251841O562939R298144O950218J263135n271384q922346
2871G016023p112729p23497O695982J0473108O870361k579322r841266q458211
2863B340449k356115r07112n254668o521611L48771P896364O046038l721186r938393
2854a2067463n721632L255961O843039L184912k99280J733534N245804M171251
2846F346126M94020J90568J922281p17645o013766m729281L296518N788920k350001
2837D227740q690329k480691P342861O603228j108625j818980M849084O662854
$$ y = [-13916539, -7480680, -1621364, -3751149, -7944984, -6405297, -1522835, 856516, 1837481, 4709479, 6560047, 3804398, 1107609, 5291811, 13209220, 14742606, 7075012, -1612842, -2864683, 3698256, 12996400, 19946618, 21209753, 15938369, 7016023, -96706, -820203, 5875779, 16348887, 23219248, 20639926, 10798660, 2340449, -15666, -922778, -6177446, -12699057, -12350286, -4453922, 1592116, -2129070, -12067463, -17789095, -14533134, -7690095, -4505183, -4804463, -3070929, 2174875, 6346126, 6840146, 7030714, 8952995, 8235350, 2221584, -2507697, 788821, 6577741, 4227740, -4462589, -6943280, 399581, 7002809, 5894184, 4075204, 8924288, 15587142]
2829A5587142Q55245k653020m77910j037010p428595j0755710n799320K57193
2821a1451985P71082p36169n4679p5781k377873j619698M072033O629018L14254
2812d529798p554441o834097Q88693O408788O448058M842089L741570J328790
2804D739652l076495p021685p463723l102816L627322O340151J054020o567471
2796a1471045o634217J005039N935836K825611r44006K043716P559578P513636
2788G834148K471546j183066j491215j112316j137410j071630j766344l084047
2780e40334k101692J665287L344044j01846m038816k759031K108950N033527M587624
2771G197713K853503O08773j651097j428507J851194L805009P22121m789742p725320
$$ y = [15587142, 16442387, 13789367, 13311457, 12274447, 4845852, -5909858, -11709178, -11451985, -10680903, -11417072, -11471751, -11547532, -13925405, -15545103, -11473070, -4844052, -4529798, -12084239, -18918336, -18029643, -11620855, -5172797, -330708, 3410862, 4739652, 1663157, -5358528, -12822251, -15925067, -12297745, -5957594, -4903574, -11471045, -18105262, -17100223, -11164387, -8338776, -9282782, -7239066, 320512, 7834148, 10305694, 9122628, 7631413, 6519097, 5381687, 4310057, 2543713, -540334, -2642026, -976739, 2367305, 2265459, -1773357, -4532388, -2423438, 2610089, 7197713, 10051216, 10659989, 9008892, 7580385, 9431579, 13236588, 13958709, 9168967, 1443647]
2762A443647o720390k852207K895617P376292O064213K74376k500951M1709N89948
2753F612254n125451r503421n018951K683458L702470m01027j028431K109921
2745e969178K210374q66585k75568N077561Q537374O754878L098260r1196l529894
2736A4946026n522135l615510j269184l481719o733866l904695J744034K94239
2728g542810o490646n336112O121137J2442833L942199o868683m145261P065519
2720h11824J0030740K655434j614178K976116O476286J508447m252104j283720
2712A5685197N712354M746449n156289j2479275r570528j936225J374331j20317
2704a744303q03374R85585J992946J391700K056659L890684K571649k651696o036800
$$ y = [1443647, -5276743, -8128950, -5233333, 2142959, 8207172, 8481548, 5980597, 6022306, 6612254, 1486803, -8016618, -13035569, -10352111, -6649641, -7050668, -8079099, -5969178, -3758804, -4625389, -4900957, 176604, 8713978, 15468856, 18567116, 18475920, 14946026, 9423891, 5808381, 4539197, 1057478, -5676388, -9581083, -7837049, -7542810, -14033456, -19369568, -13248431, -805598, 3136601, -3732082, -7877343, -811824, 9218916, 11874350, 10260172, 13236288, 19712574, 21221021, 16968917, 15685197, 21397551, 26144000, 20987711, 8508436, -1062092, -2998317, -1623986, -1744303, -2547677, -1562092, 430854, 1822554, 3879213, 7769897, 10341546, 7689850, 1653050]
2695A653050l896550m90467o52505j850183K10116K701224K79542m486963m207114
2686a0739850R59331L277988M41095q21443L122369O070127K490933k741624k025803
2677C3123K905770M477984J743258R06875L799967M181711j672591p466027n425641
2668C484429J524987K953954m235720j0837920p747436J978046P986690N997696
2660A104726P08896k635027l307802k144456K62295J721064M68805n10355K493027
2651a838827N423820N51855r178142j0354360J226553J1552467P518540l854219
2643A047687o294434K089670Q545124N671401p75253l550159k500555n16829L94118
2634D110770j567114n272394m528734L220929Q614797J511960j1261328j2504977
$$ y = [1653050, -2243500, -2733967, -3386472, -5236655, -5026539, -2325315, -2045773, -6532736, -10739850, -9780519, -6502531, -6061436, -6882879, -3760510, 2309617, 4800550, 2058926, 33123, 2938893, 7416877, 9160135, 10067010, 13866977, 18048688, 16376097, 8910070, 3484429, 5009416, 7963370, 3727650, -7110270, -14857706, -12879660, -4892970, 1104726, 1813622, -821405, -4129207, -6273663, -6011368, -4290304, -3821499, -4331854, -1838827, 3584993, 4136848, -5041294, -15395654, -14169101, -2616634, 4901906, 1047687, -5246747, -3157077, 5388047, 11059448, 10284195, 6734036, 4233481, 3716652, 4110770, 2543656, -2728738, -7257472, -4036543, 4578254, 6090214, -5171114, -17676091]
2626a7676091q2063Q540881K017995q176122n470265P842595J5372694R460591
2618A1830215j333682n632181j935374K678642J871479l184994n554703j589400
2610b849998L432064K333512l281350n719153l512865k597825m347159k228221
2602a8770995N824303J0935676N508625m993697r378367n024153J462101M325387
2594a0111120L695922K697295L587479N304566L487112l866373j0632929q243432
2586a4081480J924588R035745P660791L891165L349642K454768k576095o801712
2578D857412m571254L58029J136003j033206l30161L340054N403619M593820K635899
2569A6390215o13056m671504m785560J522750P430558M566558m312217q577415
$$ y = [-17676091, -17758154, -9217273, -7199278, -15375400, -20845665, -13003070, 2369624, 11830215, 10496533, 4864352, 2928978, 5607620, 7479099, 4294105, -1260598, -2849998, 582066, 2915578, -365772, -6084925, -9597790, -12195615, -16542774, -18770995, -12946692, -2011016, 3497609, -1496088, -10874455, -15898608, -14436507, -10111120, -6415198, -3717903, -130424, 5174142, 8661254, 4794881, -5838048, -14081480, -12156892, -3121147, 4539644, 8430809, 11780451, 14235219, 11659124, 4857412, 286158, 644187, 1780190, 746984, 416823, 3756877, 9160496, 13754316, 16390215, 15777159, 11105655, 6320095, 7842845, 15273403, 19839961, 15527744, 6950329]
2561F950329m577129P02486R07503k048159l138413j414500L22284Q0327p09794
2552b925066J331799O637566R713346M783346m977929r247031l789156L823735
2544E350610M890671K03159l771291l687067l69963L546965L854056j402310o316027
2535B298803l387579L094748J347754p418058p796141M254503J1913433M396960
2527H704423m525079l15025P518518M387251j914581K536991Q527504Q98616o214769
2518A9603849J1624449L8796168L0436743j8521685n6172288m3810737p329529
2511b5373030P133302j730832k996626J0211586J5335921L383426p638654m274403
2503e949310M493545O392052K286928k494665p089732r739376o260498J622315
$$ y = [6950329, 2373200, 3075686, 3983189, 1935030, -1203383, -2617883, -2295599, -2215272, -2925066, -1593267, 5044299, 14757645, 19540991, 14563062, 5316031, 1526875, 5350610, 10241281, 10444440, 6673149, 2986082, 2616119, 6163084, 10017140, 8614830, 2298803, -1088776, 2005972, 3353726, -4064332, -11860473, -7605970, 4307463, 8704423, 4179344, 3864319, 11382837, 15770088, 13855507, 16392498, 24920002, 25818618, 19603849, 31228298, 70024466, 100461209, 81939524, 25767236, -18043501, -25373030, -18239728, -19970560, -22967186, -12755600, 2580321, 5963747, -1674907, -5949310, -1455765, 4936287, 7223215, 4728550, -2361182, -12100558, -18361056, -16738741]
2495a6738741O573480O547417N839641M920253J45160n835607n267196J223677
2487b591916L978957j4427k274145K231143O354580L054416k896895k819797K890128
2478G912044O762234M830379o27030n692736p476366m723414N30798L748186K556203
2469G820298j204027m703714o344237m641732P05471N958926O432338L467093
2461G490416K901776N137982L262413n576352j3270429j0853973j265631M314106
2453g859692R35799n170989o019715j380862K761764K487084K39672Q08508M380247
2444h818184N814531J948094k953741k528529K421885M909260J961064j752406
2436A001974k066071j331426k855253m360882k006047K499432M315288K973035
$$ y = [-16738741, -10165261, -3617844, 2221797, 7142050, 7287210, 1451603, -3815593, -2591916, 1387041, 1372614, -901531, 1329612, 7684192, 10738608, 7841713, 5021916, 7912044, 14674278, 19504657, 18877627, 13184891, 5708525, 985111, 1515909, 5264095, 7820298, 6616271, 1912557, -4431680, -9073412, -8367941, -2409015, 4023323, 7490416, 10392192, 15530174, 18792587, 13216235, -54194, -10908167, -12173798, -7859692, -6923893, -12094882, -18114597, -19495459, -16733695, -14246611, -14006939, -13198431, -8818184, -3003653, -1055559, -4009300, -6537829, -4115944, 793316, 2754380, 1001974, -1064097, -2395523, -5250776, -9611658, -11617705, -9118273, -4802985, -1829950]
2428a829950J870933J286176k135413q163416j0767535n707233L368674R313467
2420a2764297R515761O735793L751167N14306l581923p350121q740950p009325
2412a8929589l316586L89346L009236N079084P527007R356615P773793J974722
2404A2863628m184792n590265j955320J753251J536762j243124k765839j838201
2396a423900l26281r9507j320978k649997j961303J561263N142484M791035J208248
2387D921064m05159J327904R19057m241653o798937J4405Q969006O841026n238881
2378F307832j1607711m669902M519308M093916j402723q27699N121458O616617
2370H151096R38334n167791p100081o335470l848451R92681N023265L565685j141328
$$ y = [-1829950, 40983, 1327159, -808254, -8971670, -19739205, -25446438, -22077764, -12764297, -3248536, 3487257, 7238424, 7752730, 4170807, -3179314, -11920264, -18929589, -22246175, -21856829, -18847593, -13768509, -6241502, 3115113, 10888906, 12863628, 8678836, 3088571, 1133251, 2886502, 4423264, 3180140, 414301, -1423900, -1750181, -1849688, -3170666, -5820663, -7781966, -6220703, -1078219, 3712816, 4921064, 4515905, 5843809, 6762866, 2521213, -4277724, -4263319, 4705687, 11546713, 6307832, -5299879, -9969781, -5450473, -1356557, -2759280, -3586979, 1534479, 8151096, 9089430, 3921639, -3178442, -9513912, -13362363, -12369682, -7346417, -3780732, -4922060]
2361d922060j803264K719881N899047M379538K079131J281999j859800q840206
2353a065734j3178422q804734R87214Q017888Q824316N566102J020387k866059
2345a499042m030843j864171J710097M773494O831619O649867K492250l748966
2337A1314305o955828n507632l072150j536979J967342P456482Q241706Q30486
2329A2737732o946749n645320J694987L898224j754783o393640l377346L272265
2321b514630O502326N188801K295789j88093j034346P69178K973366Q11357n634803
2312I168945r029322m197109L620292N335296N15217k756764J57199M856852N496961
2303A3167567K379514q08158k724499l399745j202465L894227O145983k97468
$$ y = [-4922060, -6725324, -4005443, 1893604, 6273142, 8352273, 9634272, 7774472, -1065734, -14244156, -23048890, -22061676, -14043788, -5219472, 346630, 1367017, -1499042, -5529885, -7394056, -5683959, -910465, 5921154, 12571021, 15063271, 11314305, 4358477, -1149155, -4221305, -5758284, -3790942, 3665540, 11907246, 12737732, 5790983, 145663, 1840650, 5738874, 3984091, -2409549, -5786895, -2514630, 3987696, 9176497, 11472286, 11284193, 10249847, 11019025, 13992391, 14803748, 9168945, 139623, -4057486, -437194, 4898102, 5413319, 2656555, 2813754, 7670606, 13167567, 15547081, 14738923, 12014424, 8614679, 7412214, 11306441, 17452424, 17154956]
2295A7154956j1259236j4825438o541687L785853N337988R96020J307208P012494
2287B968158P665985j273142j0006755q245165K07992M211026J491495p85209
2279c765615P27401J373654j425367k742519J194484N484237L348593l402234
2271G92634o594976k922860K215797K408631k073704n558920l769780J958818
2263a3544360O479086O280990L082641J333676K245082K303797j302669o276703
2255F01540q486165p410733n005635r53343O182228J3284300J3559539N158078
2247A6929809n199454r903582q391881m611866l65504M259652O551945L315066
2239B584185k911024n331029j895184J831078Q72745k245841k072903J275084
$$ y = [17154956, 5895720, -8929718, -15471405, -11685552, -6347564, -5351544, -4044336, 2968158, 10634143, 9361001, -645754, -8890919, -8682927, -4471901, -2980406, -3765615, -3038214, -1664560, -3089927, -5832446, -4637962, 846275, 4194868, 792634, -5802342, -8725202, -6509405, -4100774, -6174478, -11733398, -15503178, -13544360, -7065274, -784284, 2298357, 3632033, 5877115, 8180912, 6878243, 601540, -7884625, -15295358, -20300993, -21254336, -15072108, -1787808, 11771731, 16929809, 11730355, 1826773, -6565108, -11176974, -11542478, -7282826, -730881, 2584185, -326839, -5657868, -7553052, -5721974, -4849229, -7095070, -9167973, -7892889]
2231g892889K439178j186247n557092n086321M93243N983817O902664M271102
2223C67455K297538K332417J738507o87376j776506O31765K612617n03334n579624
2214A433459m972476J559459N446238K040534k342194n54246M333008M474565
2206A1418347l76791l254413j113839J258633r85963o161176q654358n283249
2198a3152809J662733O275642M624690n00736k591100j46100J606976j96687q97702
2189c315093L279213P482090N792392J663760K089238M772205J389085p485006
2181A5667884j1521240o187531O79973J036375k988375m820501k676808J020148
2173i790075L977933M331955J221280k573223l007325q62585l32460j517149r80584
$$ y = [-7892889, -5453711, -6639958, -12197050, -17283371, -16790128, -10806311, -3903647, 367455, 2664993, 4997410, 6735917, 6048541, 4272035, 4903800, 7516417, 7013083, 1433459, -3539017, -1979558, 3466680, 5507214, 3165020, 2610774, 6943782, 11418347, 11041556, 7787143, 6673304, 7931937, 6945974, 784798, -7869560, -13152809, -11490076, -5214434, -589744, -1090480, -3681580, -3827680, -2220704, -2417391, -3315093, -35880, 7446210, 13238602, 14902362, 16991600, 21763805, 23152890, 15667884, 4146644, -2040887, -1360914, -324539, -3312914, -8133415, -10810223, -9790075, -5812142, -1480187, -258907, -2832130, -5839455, -6702040, -7034500, -8551649, -9532233]
2164i532233N25972n37591j291892M597586J3060049J1345619j920994j1561405
2156D685111p922749j071161k805071o917294j277055R913794J2263634M349052
2148A1218261j532176K1101J373486k578215o098952l446782K030004L653367
2140D640094l13193o454088r554385o222481O98192L830150J795191K574844R671137
2131F65461J2649517K556214j0381973r525872K167741O303552k007753q028319
2123e601432k696202M551089M416890K146470M300475N744083N51379n700732
2115G712020n273766p18153J456776J192791O84294j548066m547101k358242M322750
2106I23303M554758n334090j2010970m676320O784758P450978J112570J399356
$$ y = [-9532233, -9006261, -9543852, -10835744, -6238158, 6821891, 18167510, 16246516, 4685111, -3237638, -4308799, -7113870, -14031164, -15308219, -5394425, 6869209, 11218261, 9686085, 9707186, 11080672, 8502457, 2403505, -1043277, 986727, 4640094, 4326901, -2127187, -11681572, -17904053, -17205861, -13375711, -11580520, -9005676, 665461, 13314978, 15871192, 5489219, -4036653, -1868912, 4434640, 2426887, -5601432, -8297634, -3746545, 670345, 2816815, 7117290, 12861373, 13412752, 7712020, 2438254, 1720101, 3176877, 4369668, 5053962, 3505896, -1041205, -3399447, 923303, 5478061, 143971, -11866999, -16543319, -9758561, -2307583, -1195013, 204343]
2098B04343O907683M576943n796740j0210520l979804J605439q63898m723653
2090a2280207l553386j146985j273614j20334M480627P134940M794706L010774
2082A046521N802134Q033811M542002j015557l137909l235460m679447n442212
2074A913883k525573J599898L361216L945190M811457K652663m250221r298588
2066B209925n198119M366271Q326907K514276o099840r205838n769607n08461
2058i364486J871870J08922l092618l508995N6365M267490N427388L567193J096851
2049D29980m05904l72729J429066L785487M350167K653671N24993j486936m800603
2040F107192q601329r054430m847125N95869M639829Q292135J0735935P190685
$$ y = [204343, 7112026, 11688969, 5892229, -4318291, -8298095, -6692656, -7556554, -12280207, -15833593, -16980578, -18254192, -18374526, -13893899, -6758959, -1964253, 1046521, 6848655, 14882466, 19424468, 18408911, 15271002, 12035542, 7356095, 1913883, -611690, 988208, 4349424, 8294614, 13106071, 15758734, 11508513, 2209925, -2988194, 1378077, 9704984, 12219260, 6119420, -3086418, -8856025, -9364486, -7492616, -7383694, -10476312, -13985307, -13928942, -9661452, -4234064, -666871, 429980, 24076, -348653, 1080413, 4865900, 9216067, 11869738, 12394731, 10907795, 6107192, -2494137, -11548567, -16395692, -15799823, -11159994, -2867859, 7868076, 15058761]
2032A5058761k634357r643612o139322K405327M407559j289624m610736J93848
2024b252156O637268N934050j639820q560711r015601l497879K537762L151340
2016f705747k256607p209999n368498J054546M635530M020567N207916R995000
2008C372708J0888513K666448p195346p460037N55802M277197k241226j0030409
2000e166350q463509k99447L074588j620858n368538n17858Q089098J0092326
1992a80548L648753l381212m799483k404839k94199J008167J889575N05520l019364
1983g027630l287078L376349J0802561Q795202k706185j1787696r133528P76384
1975a0191621O403258L221669l030442m929135r89843M846552Q063124P032877
$$ y = [15058761, 12424404, 2780792, -3358530, -953203, 3454356, 2164732, -2446004, -2252156, 4385112, 10319162, 8679342, 118631, -8896970, -12394849, -9857087, -6705747, -8962354, -16172353, -21540851, -20486305, -15850775, -11830208, -6622292, 3372708, 14261221, 16927669, 9732323, 2272286, 2828088, 7105285, 4864059, -5166350, -13629859, -13929306, -10854718, -12475576, -17844114, -18361972, -10272874, -180548, 3468205, 86993, -4712490, -7117329, -7411528, -6403361, -4513786, -4008266, -7027630, -10314708, -6938359, 3864202, 12659404, 9953219, -1834477, -10968005, -10191621, -3788363, -566694, -3597136, -8526271, -9516114, -4669562, 3393562, 10426439]
1967A0426439L115459j735596o794941j1076421j1217498m333754O269638J2284496
1959c062178R846685M276997K084989K132836r0635l036830j828460J075185k217511
1950I181078j0594804j1838859p28352J0096105O701263n474897r311813q98676
1942a2868955O300942K378141o753600j1325217j0250909o253350J012905R698912
1934b8061131J2597275P397717K288450L028707K849845m559608j0691088m657561
1926a9807394O514822O696767l156495n660925N095208J4426429J0823086J932812
1918A6864310j443848k130923o145382q080101o31697R720765J0486758J772563
1910B0412445n259810n398201l525037l616631m091914l779828l605391k090263
$$ y = [10426439, 13541898, 11806302, 5011361, -6065060, -17282558, -21616312, -15346674, -3062178, 6784507, 11061504, 13146493, 15279329, 15188694, 12151864, 10323404, 11398589, 9181078, -1413726, -13252585, -13980937, -3884832, 2816431, -2658466, -11970279, -12868955, -6568013, -4189872, -10943472, -22268689, -32519598, -38772948, -37760043, -28061131, -15463856, -8066139, -5777689, -2748982, 100863, -4458745, -15149833, -19807394, -13292572, -6595805, -9752300, -15413225, -10318017, 4108412, 14931498, 16864310, 15420462, 13289539, 7144157, -935944, -1567641, 8153124, 18639882, 20412445, 15152635, 9754434, 6229397, 2612766, -1479148, -5258976, -8864367, -10954630]
1902a0954630L265570R636039J0274682L089888o521686j1226573p403656K329033
1894g511333R430189O387541l352955p969224l503034M62649k757397m878312
1886a3691876K778710J2011621R349801j370378m410240K778871O862420J397619
1878A5706548m313170k615242J237287Q40721r94665j49047R33752l88174j386322
1869H871688k32236o0095k273441l362779k110911k190556m382036m404256j361940
1860a1506562M28125N65557L593634Q128786O308744j788344n176605Q99413O769849
1851H222597M189021j347962k254203j429200l679972m937212m93672M800900
1843C070297M674831J616484l02542l694410r224603q833390Q46658Q181578K881627
$$ y = [-10954630, -7689060, 1946979, 12221661, 15311549, 8789863, -2436710, -9840366, -7511333, 1918856, 8306397, 4953442, -3015782, -6518816, -6056167, -8813564, -13691876, -10913166, 1098455, 10448256, 9077878, 4667638, 7446509, 14308929, 15706548, 11393378, 8778136, 10015423, 10856144, 9861479, 9712432, 10646184, 10258010, 8871688, 8639452, 8579357, 6305916, 2943137, 832226, -1358330, -5740366, -10144622, -11506562, -11078437, -10512880, -6919246, 1209540, 7518284, 5729940, 553335, 1452748, 8222597, 12411618, 11063656, 8809453, 7380253, 3700281, -1236931, -1730603, 3070297, 7745128, 9361612, 9059070, 5364660, -3859943, -12693333, -11846675, -3665097, -783470]
1834g83470o481393n947708J231791K040587k958384k147816M807062N829849
1826d409482k456556r371018p624710j497726M117598R150952J1141939N978512
1818E029509j938344k928978K376856L143409l772867q859734n908977j93751
1810a3052877L187421O582619J0436320Q710517o716p259079p117979m507978
1802c027752m814606m350296J266852O947350M949859k784353o643178j621855
1794a0077979P318832J1111014N676872l608722o933383j616442M093587K675896
1786H639675j917653k015506N20176j127604m966969l318242K444956L488926
1778A747759p22566j803370J941185L156022J53141j24653L750403M630732P43046
$$ y = [-783470, -7264863, -13212571, -11980780, -9940193, -12898577, -15046393, -10239331, -4409482, -6866038, -16237056, -23861766, -25359492, -21241894, -12090942, -949003, 5029509, 3091165, 162187, 2539043, 5682452, 1909585, -6950149, -12859126, -13052877, -9865456, -3282837, 7153483, 15864000, 15857284, 8598205, 1480226, -3027752, -7842358, -12192654, -10925802, -3978452, 971407, -1812946, -8456124, -10077979, -2759147, 8351867, 14028739, 10420017, 3486634, 1870192, 5963779, 8639675, 6722022, 4706516, 5226692, 4099088, -867881, -4186123, -1741167, 1747759, 1025193, -778177, 1163008, 4319030, 4472171, 4347518, 8097921, 12728653, 13471699]
1769A3471699j407496q58635l837844q532048n008027N122573P185806j634143
1761D501885m986429N280258J3566143N686531p728859r189836j423247J068401
1753F774847l434707n432307k654310o23850J2643K792636O212265O438696M816275
1744A4902188L821609J569051k072011j947508K459122L407204j402674l236238
1736A7500743J656728M205391k38960k595465J211262P747j0560223j4850699
1728c663476l174804Q407843M569467k278448M414388J3118064M289961j2412487
1720A3270508j2585183J958452Q649396K906854l42512J756744j377316p146138
1712G090805k686103Q019923R348350K963688K388105M404740k671118r674187
$$ y = [13471699, 12064203, 11205568, 7367724, -1164324, -6172351, -1049778, 6136028, 4501885, -484544, 4795714, 18361857, 24048388, 16319529, 7129693, 5706446, 6774847, 3340140, -2092167, -4746477, -5370327, -5357684, -2565048, 3647217, 10085913, 14902188, 18723797, 20292848, 18220837, 16273329, 18732451, 22139655, 20736981, 17500743, 19157471, 23362862, 23123902, 20528437, 21739699, 21747446, 11187223, -3663476, -6838280, 1569563, 6139030, 3860582, 8274970, 21393034, 25682995, 13270508, 685325, 2643777, 11293173, 14200027, 13857515, 15614259, 14236943, 7090805, 4404702, 12424625, 21772975, 24736663, 27124768, 31529508, 28858390, 19184203]
1704A9184203r43545J0232807Q16442j5538147p801098J3634397J1902644o321988
1696B5165715L51447K6839879K4433244j822538J2935881O7021170N6145085o7064121
1688A44005762j81767449j46174097p57139Q6628059N0661121j1849135j1256359
1681g0509237K1233840K1641923j508484n894324O297509P171596j263153l18135
1673b3148465N150932P10460o149539k414863L140218j405179n430087L363546
1665b6182977J2159800M937468p234232n896767J635578k176752j0886434n733082
1657c9377398Q951643J2241026K309396k995614J646811L245700k648153l979545
1649b0606134M991869J3399188J1737844M107406k187964n956776p210885m371747
$$ y = [19184203, 18240658, 28473465, 29289907, 13751760, 5950662, 19585059, 31487703, 25165715, 25517162, 52357041, 76790285, 74967747, 87903628, 154924798, 211069883, 144005762, -37761687, -183935784, -184692923, -98064864, -47403743, -59252878, -70509237, -49275397, -27633474, -29141958, -35036282, -28738773, -21567177, -22830330, -23148465, -17997533, -17287073, -23436612, -25851475, -22711257, -24116436, -29546523, -26182977, -14023177, -9085709, -16319941, -22216708, -20581130, -22757882, -33644316, -39377398, -30425755, -18184729, -15875333, -18870947, -17224136, -13978436, -16626589, -20606134, -15614265, -2215077, 9522767, 13630173, 11442209, 5485433, -1725452, -6097199]
1641f097199L10416J770171K78025N05965K586277K472628L82990K30377J632848
1632D072498J074911l28372Q85015J960368k756519j0528054j1883775m270101
1624b1774029M431979P067445M550201J305442L6102J569147M098953K908886
1616D194126l520361q506015m791528M232482Q287413M367007p42443k207340
1608A313341l044781o190378q167376m853626J124024L146673r50799n986261
1600b3609183n161544J873135P749715O072587K67520q00171L967988O016341
1592c623612Q79947m230882k007217L302172L566281J4048m45797K215209K342545
1583B012694q7830M36504M077449M437846o79398n598944n793611l634307k803505
$$ y = [-6097199, -5786783, -4016612, -3738587, -3232622, -646345, 1826283, 2209273, 2439650, 4072498, 5147409, 4819037, 5704052, 7664420, 4907901, -5620153, -17503928, -21774029, -17342050, -10274605, -5724404, -4418962, -4382860, -2813713, 1285240, 4194126, 673765, -7832250, -12623778, -8391296, -103883, 4263124, 3520681, 1313341, -1731440, -7921818, -16089194, -20942820, -19818796, -16672123, -17622922, -23609183, -28770727, -26897592, -19147877, -13075290, -12807770, -13607941, -9639953, -3623612, -2743665, -6974547, -8981764, -5679592, -2113311, -2099263, -2545060, -329851, 2012694, 1924864, 2361368, 6438817, 10876663, 10197265, 4598321, -1195290, -4829597, -7633102]
1574g633102k615054n35355L357301O267854N104579o08988o521908o658663j423567
1565a1266903J647858r04796j927874N135656J3789140J2607360K629880m048330
1557A7661991k416284m57861m883665j0531559q537168J087760R398268Q093697
1549I415179k463540j2585979j1619081J1158R856223Q701909K193244O90156
1541D199269L139454J360870l815840m019659K78928n59511p332134q376020R81718
1532a4142925R170449O275202r63170j672407J955473J350028k456848k073444
1524b557642J827732J738698l054979n448950l045200j386158l071839k947386
1516a7945724K240385O877001M495369j996366m066229L52796M283767K133374
$$ y = [-7633102, -10248156, -10783511, -7426210, -1158356, 3946223, 3337235, -3184673, -9843336, -11266903, -9619045, -10523841, -12451715, -7316059, 6473081, 19080441, 21710321, 17661991, 15245707, 14787846, 9904181, -627378, -9164546, -8076786, 1321482, 9415179, 6951639, -5634340, -17253421, -17242263, -7386040, 1315869, 3509113, 4199269, 7338723, 8699593, 4883753, 864094, 1143022, 583511, -6748623, -15124643, -14142925, -4972476, 1302726, 339556, -1332851, 622622, 1972650, -484198, -2557642, -729910, 1008788, -2046191, -7495141, -10540341, -11926499, -14998338, -17945724, -15705339, -8828338, -4332969, -6329335, -10395564, -10042768, -5759001, -3625627]
1508c625627k146439j187037M094591N047265j508165p286262m341718K765569
1500h187823M144913J58963j46231M651815N122271k760806r076140m591276M510690
1491f173624N630968j843106o967271l912896J157953P18272m131892p088361
1483b2609957n237363j008609K095227L099672L339315L928180M157030K942720
1475i293785J214977R72644J919100J545806o54172j788129L1871K295785J383359
1466b372544k155221l838414o14574N180859P747864M155215j629347l145809
1458C328029j91373P49323l227997o205552l217121N67875j512592m520867J305627
1449a2924648J2627487J4937196M209610o264529n420367J038367K527934n34207
$$ y = [-3625627, -5772066, -6959103, -2864512, 2182753, 674588, -6611674, -10953392, -8187823, -4042910, -3883947, -4030178, 621637, 5743908, 2983102, -6093038, -10684314, -6173624, -542656, -2385762, -9353033, -13265929, -12107976, -11389704, -15521596, -22609957, -27847320, -28855929, -26760702, -23661030, -20321715, -16393535, -12236505, -9293785, -8078808, -7106164, -5187064, -3641258, -4295430, -6083559, -6051688, -3755903, -2372544, -4527765, -8366179, -8980753, -3799894, 3947970, 8103185, 6473838, 3328029, 3136656, 3885979, 657982, -5547570, -8764691, -8196816, -9709408, -14230275, -12924648, -297161, 14640035, 18849645, 12585116, 7164749, 8203116, 10731050, 10196843]
1441A0196843j645224o96908j730669l985234m248678l666457m163513k516905
1433a2456745M022015J0360105R864027M371806K72998j484698l504597m132443
1425G312468n16055L602459K233167k960993n651221n292367n758977o054586
1417a3086105k144564L563406M577918J283982k91703K70130j593857m136997
1409a1557790q03099N808965M638589n246860r698843k09219J1555044R688197
1401D174984l292372j0603059m162866O742803R520154L215316k915198j765775
1393I13987L621671M641124j183058o068122k411060N564832O623930j851025
1385I852279j0200835r816454l265202J705726K229344O16312o97761o98052M58372
$$ y = [10196843, 8551619, 7854711, 6124042, 2138808, -2109870, -5776327, -9939840, -12456745, -8434730, 1925375, 11789402, 16161208, 16434206, 14949508, 11444911, 7312468, 6796413, 10398872, 12632039, 9671046, 4019825, -1272542, -7031519, -13086105, -15230669, -11667263, -7089345, -5805363, -6097066, -5826936, -7420793, -11557790, -12360889, -6551924, -1913335, -7160195, -16859038, -17068257, -5513213, 4174984, 882612, -9720447, -13883313, -7140510, 2379644, 5594960, 2679762, 913987, 4535658, 9176782, 7993724, 1925602, -485458, 5079374, 11703304, 9852279, -348556, -10165010, -13430212, -11724486, -9495142, -8878830, -9576591, -10274643, -9816271]
1376i816271Q23570r55203j700905K859182R503055Q996903o06204q689046n259218
1367d844137N526996J0865102N210088m752749r402934o060597p6804J456645
1359b078390k537498n595125k097269M052758M226039j765224m504109J066465
1351i232353Q125811Q457054L555964l5567o22519o20901o71282l88090j060389
1342G507728k438769j141912K720111K762283l552534p861505k358361O629435
1334B266476O804003j311655n271479k32915M192805r9291p152212o657359P24823
1325f736804N305737K473339k151139j885117J756332J813149l830648q530392
1317a1785543n160924L956684R532666P334101K521739O66834M96746r45530j938007
$$ y = [-9816271, -8992701, -9947904, -11648809, -8789627, 713428, 9710331, 9104127, 415081, -4844137, 682859, 11547961, 16758049, 12005300, 2602366, -3458231, -3535035, -2078390, -4615888, -10211013, -12308282, -8255524, -4029485, -5794709, -10298818, -9232353, -1106542, 7350512, 10906476, 10870909, 10248390, 9627489, 8956207, 8568117, 7507728, 5068959, 3927047, 6647158, 9409441, 5856907, -2004598, -4362959, 2266476, 9070479, 7758824, 2487345, 2254430, 6447235, 6347944, -804268, -7461627, -6736804, -1431067, 1042272, -1108867, -2993984, -1237652, 575497, -3255151, -11785543, -16946467, -12989783, -3457117, 3876984, 6398723, 7065557, 7562303, 6616773, 4678766]
1308D678766m18294L78574k523899m662403l65747O675583P695135K194420k053754
1299A1598381k048995k879123o313076n950402J695655R328900Q343657P72866
1291A4547863m504767l949801j654737j223780j045526J744691O190694Q123507
1283A8228144N051068n09218l620699l216589l565299p296979r735380m845471
1275i510423M596235Q822925L756476l927507o433615m240702k624501l098820
1267a2659932k643682O75459M988070O981999N230720J752988N06617K799096
1259G631335M714915J919607l530800n289494j821335J503322P42130j319728
1251D549952p77704J139326R59030j454517l778967m914703m683994k507310P56518
$$ y = [4678766, 4260472, 4639046, 2115147, -2547256, -2913003, 3762580, 11457715, 13652135, 11598381, 9549386, 6670263, 357187, -5593215, -3897560, 5431340, 13774997, 14547863, 10043096, 6093295, 4438558, 3214778, 2169252, 3913943, 10104637, 18228144, 23279212, 22769994, 19149295, 15932706, 12367407, 5070428, -4664952, -9510423, -4914188, 3908737, 7665213, 3737706, -2695909, -6936611, -9561112, -12659932, -15303614, -14628155, -9640085, -2658086, 2572634, 4325622, 4832239, 7631335, 12346250, 14265857, 10735057, 5445563, 3624228, 5127550, 5869680, 4549952, 3772248, 4911574, 5870604, 4416087, 637120, -4277583, -8961577, -11468887, -10712369]
1242a0712369K331812J491542R12127J523939J48268m025030n266516N44816P188452
1233e862959N120431l967288p640183O22027J2111446J3924053M689806n204362
1225A3792971o852864k038033Q22017k806327q492639q054924P34672J0698233
1217b196894J2380918L889362p630482j3508165j0727843k484037N353076P786416
1209g137649L822155j952611k895248K441012Q082434P906661L419346P93726
1201A4479826J304761M337m911054p371667k364362N083716O341941J862869l76607
1192A4053760J723588J604628l559365p153724m493182j204080l241352o028915
1184h298642k506782L902042M759365Q99833j5101K372889J564792k175021j582172
$$ y = [-10712369, -8380557, -6889015, -5976888, -4452949, -4304681, -8329711, -13596227, -13051411, -5862959, -742528, -4709816, -12349999, -11727972, 383474, 14307527, 18997333, 13792971, 6940107, 4902074, 5724091, 2917764, -5574875, -13629799, -12895127, -2196894, 10184024, 14073386, 6442904, -7065261, -17793104, -20277141, -14924065, -7137649, -3315494, -5268105, -8163353, -5722341, 2360093, 10266754, 13686100, 14479826, 15784587, 15788924, 10877870, 3506203, 1141841, 6225557, 12567498, 14430367, 14053760, 15777348, 17381976, 13822611, 6668887, 2175705, 971625, -2269727, -8298642, -10805424, -6903382, -2144017, -1244184, -1259285, 1113604, 2678396, 503375, -1078797]
1175a078797L228931L578306j572300k096148N076069Q059331j013926j1674944
1167B506522j1035153l443457r26048k386387K101492J0991292J1747726J474524
1159A1030511p636599o299969M35331L704746K730988J354390N39503n28017j289891
1150D040993j672512k933709m375269l432756l82992J639617K055568L042690
1142b018370L988131K079283q54274M55396M841259M200113l566831r193374n138334
1133e207001K957563M895239O87777j203062K671569O839245N674416j19418n864312
1124A1332016p244553k796366L869333N397837j217162q825848p666434J447834
1116e703343P415053L722842l067591l492471J168195J746457m258831q371899
$$ y = [-1078797, 2150134, 5728440, 4156140, 2059992, 7136061, 15195392, 14181466, 2506522, -8528631, -11972088, -12898136, -15284523, -13183031, -2191739, 9555987, 11030511, 3393912, -2906057, -2470726, 1234020, 3965008, 5319398, 5858901, 5330884, 4040993, 2368481, -565228, -4940497, -8373253, -8756245, -7116628, -5061060, -2018370, 1969761, 4049044, 3194770, 3650166, 8491425, 12691538, 9124707, -68667, -5207001, -2249438, 2645801, 3333578, 2130516, 4802085, 11641330, 17315746, 17196328, 11332016, 4087463, 1291097, 5160430, 10558267, 9341105, 515257, -7151177, -5703343, 1711710, 5434552, 2366961, -1125510, 42685, 1789142, -2469689, -10841588]
1108a0841588l550694M997967O711918N60041l547740J161850Q894180R328564
1100A3714498J001407p885979r919069n298565Q28427L766978K133424j265709
1092b924588j384317L395428Q065946O642003L07084m023835l168139j285611
1084E623971k923014o338046n988854K45444P743725Q604889m16471j2135538
1076e583894j4112849l079110R214258J0043813K196750j612097J688563K753887
1068A509321k481578n100603J145657P842305M826046l307800m650868J473412
1060A255892N163385K534650j96026N27541p2217m953050q715777o209362r69657
1051a1634621M49192j971204l204141j335533Q65249J274518R84694J464151K219888
$$ y = [-10841588, -14392282, -9394315, -2682397, -2122356, -5670096, -4508246, 4385934, 13714498, 14715905, 6829926, -3089143, -8387708, -7559281, -3792303, -1658879, -2924588, -4308905, -913477, 7152469, 13794472, 14101556, 10077721, 6909582, 5623971, 2700957, -3637089, -9625943, -9380499, -1636774, 6968115, 6551644, -5583894, -19696743, -22775853, -13561595, -3517782, -1321032, -2933129, -1244566, 1509321, -972257, -6072860, -4927203, 2915102, 7741148, 4433348, -217520, 1255892, 6419277, 8953927, 8757901, 9285442, 9213225, 4260175, -4455602, -10664964, -11634621, -11185429, -13156633, -16360774, -17696307, -16831058, -15556540, -14571846, -13107695, -10887807]
1042a0887807K087302J185955P82127J646438K768288K018949j115305l771130
1034e285183k468137J850314L777748K67865m402722l723766J635199L810529
1026d538153j232121o912810m498574M301285R158069N263856q39682j593986
1018h92116J578522K573039k18156l978025o436256n486916J604559J1981357
1010G26008J4787614L887828j0242877j1883200j817659M110046j268478p316909
1002i017627m075663L045300M411551J283348N67700K548281L334283L324708
994E421881M193228K842598k821687p189108n005439j193054l001192p013132
986a3765905m797494K076063M495711J382125O62606M749924O869251L427809
$$ y = [-10887807, -8800505, -7614550, -6832423, -5185985, -2417697, -398748, -1514053, -5285183, -7753320, -5903006, -2125258, -1857393, -6260115, -9983881, -8348682, -4538153, -5770274, -12683084, -17181658, -12880373, -3722304, 1541552, 701870, -892116, 686406, 3259445, 3041289, -936736, -7372992, -12859908, -11255349, 726008, 15513622, 19401450, 9158573, -2724627, -4542286, -432240, -1700718, -9017627, -13093290, -10047990, -5636439, -4353091, -3785391, -1237110, 2097173, 5421881, 9615109, 12457707, 9636020, 2446912, -2558527, -3751581, -6752773, -13765905, -18563399, -16487336, -11991625, -10609500, -9946894, -5196970, 1672281, 5100090]
978E100090q86758k737114m441369n605992j009658Q321771J1694157L260965
970A3696092p593773q092800Q94568P363362M710679j738821m470661l822442
962I46204n382464r813299r585214J103125J4942933J6773035L144804j0493313
954A635811r057029J853247N164596k215798o649764o56607N873848K629149n043848
945f466395n479025K045506Q283425P370878J560463m278228o729330m595552
937h288258k20146J881339O68187J9607K297480M527810L696344J398105O0629
928F041097j007009k365859j632745K306396O035921N965733K531179k317044
920A5557669p452534j0113332o559645J440051O052130L222457j627794j468886
$$ y = [5100090, 4213332, 1476218, -2965151, -8571143, -9580801, -1259030, 10435127, 13696092, 6102319, -1990481, -1095913, 6267449, 10978128, 9239307, 4768646, 946204, -4436260, -14249559, -23834773, -22731648, -7788715, 8984320, 12129124, 1635811, -7421218, -5567971, -403375, -2619173, -9268937, -9925544, -4051696, -1422547, -6466395, -11945420, -9899914, -1616489, 5754389, 7314852, 3036624, -3692706, -8288258, -8508404, -6627065, -5958878, -5939271, -3641791, 886019, 4582363, 5980468, 6041097, 5034088, 2668229, 1035484, 3341880, 9377801, 15343534, 17874713, 15557669, 8105135, -2008197, -8567842, -7127791, -1075661, 2146796, 519002, -949884]
912i49884L315987P170662O128275k77198q635982j1314331l496953P125775O625596
903E691947n433705j2964735o217053L614797K240411n749010n991910J922984
895b2886274N142423r22678o290207k475612O706397J2568495J1300293M860696
887H003533j314977j583830L216565M400459l027104j1217508r930047j966105
879a3419014K016658O31803J547852N792555N647178o29595m790561k514899J13440
870e604583j775445m119125k819365j076964k069811k116762K632112Q523598
862h426345R112428L640442l023386n651003k084902M702035P502518K586326
854H358113m154632m828161j493109j833169m463085l84262R830614J3604281
$$ y = [-949884, 2366103, 9536765, 15665040, 15387842, 6751860, -4562471, -8059424, -933649, 5691947, 258242, -12706493, -18923546, -15308749, -13068338, -18817348, -24809258, -22886274, -17743851, -18666529, -24956736, -27432348, -20725951, -8157456, 3142837, 8003533, 6688556, 5104726, 8321291, 12721750, 9694646, -1522862, -11452909, -13419014, -11402356, -10770553, -9222701, -3430146, 2217032, 1587437, -3203124, -5718023, -5604583, -7380028, -11499153, -14318518, -15395482, -17465293, -19582055, -16949943, -8426345, 686083, 4326525, 1303139, -4347864, -6432766, -1730731, 5771787, 8358113, 4203481, -624680, -2117789, -3950958, -8414043, -8798305, 1032309, 14636590]
846A4636590N520999l764749m440578j492191l150783o289123m252599n09404
838c741838k043575n183576j150118P353038Q142718j526052r421217m980568
830a2551188O616191J1540925M087506p559951j1012630l082773P177841R270689
822D486610L465594j094465N61080L910292L642741R87339p30032j754750l129456
813A0344953l597966l217480m667527p052154m570752L786818R647154O378577
805G051623j166565m665501m157343m164007l584343J150724O621389O025022
797C110999N19298k112993N53719L240851K536800J063361J257133J596396K96363
788A2061927k199131m890428o349222m095617J777137N965547L928886j172889
$$ y = [14636590, 20157589, 16392840, 11952262, 10460071, 7309288, 1020165, -3232434, -3741838, -5785413, -10968989, -12119107, -4766069, 3376649, 1850597, -7570620, -12551188, -5934997, 5605928, 9693434, 2133483, -8879147, -11961920, -4784079, 4486610, 7952204, 6857739, 7418819, 11329111, 14971852, 15959191, 15229159, 13474409, 10344953, 6746987, 3529507, -1138020, -8190174, -12760926, -8974108, 673046, 7051623, 5885058, 1219557, -2937786, -7101793, -10686136, -9535412, -2914023, 3110999, 3630297, 1517304, 2071023, 5311874, 7848674, 8912035, 10169168, 11765564, 12061927, 9862796, 4972368, -1376854, -5472471, -3695334, 2270213, 6199099, 5026210]
780E026210k766976k72340J451016K91461j560514k824253l746343k787066J095585
771f093220M121130K110738j947528j605040K681221M220709R59051j813238n22809
762B111014J770544J130797k195169n802267p542895n538063k58910L909894L825935
753h589120K769772N000421P451816M031574l531040p318534m930149j240873
745f356133R78008L230628M211425M79894m641459l041682M914872R054718M522204
736A3352475j652543l148414l427211o540531q276573l935274K353923L765919
728g508229Q79066j076219n39920O59820J762501K208938M08263k479397k203364
719g888541J443713K802725m07598k578504K44781L321856J764707o98409J258291
$$ y = [5026210, 2259234, 1986894, 3437910, 3729371, 2168857, -655396, -4401739, -7188805, -6093220, -1972090, 138648, -1808880, -3413920, -732699, 3488010, 4447061, 2633823, 2111014, 3881558, 5012355, 2817186, -2985081, -10527976, -16066039, -16324949, -12415055, -8589120, -5819348, -818927, 6632889, 10664463, 7133423, -185111, -5115260, -6356133, -5378125, -2147497, 2063928, 2543822, -2097637, -5139319, -224447, 8830271, 13352475, 11699932, 8551518, 5124307, -1416224, -9692797, -13628071, -11274148, -7508229, -6629163, -7705382, -8245302, -7585482, -5822981, -3614043, -3205780, -5685177, -7888541, -6444828, -3642103, -4049701, -6628205, -6383424, -3061568, -1296861, -1995270, -736979]
710g36979M766373L903325k69954k642880k749917k966476k203209R59995K980049
701A040327R73417p16808K114444M319272o77693p900400p113821N02274M143870
692c315118R63007q05281K590209M422836N27989l369354k622843j595742m084248
683g288545m934037P79358P446866O793421J063511r11332K046314K482990k803388
674D675158p561385n968592q76125J791483K205899M945753R994722J1002257
666B0209170M016380n883777r935579n983924J3119K097913N3797l252724n781281
657d446906n784285j742760M108084O003399K117578j748900l35936K827971J109152
648B107397m212155n813703j995004J312177Q56240P69032M395178P967494O385596
$$ y = [-736979, 4029394, 7932719, 7662765, 5019885, 2269968, -696508, -2899717, -1939722, 1040327, 2013744, 1296936, 3411380, 7730652, 7052959, -847441, -7961262, -7458988, -3315118, -2352111, -3157392, -567183, 3855653, 4383642, 1014288, -1608555, -3204297, -7288545, -12222582, -11443224, -3996358, 2797063, 3860574, 2949242, 4995556, 7478546, 4675158, -2886227, -8854819, -9730944, -7939461, -5733562, -787809, 9206913, 20209170, 24225550, 18341773, 8406194, 2422270, 2435389, 4533302, 4587099, 1334375, -4446906, -10231191, -11973951, -7865867, -1862468, 255110, -1493790, -1829726, 998245, 2107397, -2104758, -7918461, -9913465, -8601288, -7745048, -6976016, -2580838, 5386656, 11772252]
639A1772252N94891m737797p286850p120335l896360J852845O613219O960457
631D752322L936280J463722J019252M32154k170053n353205n922659k642244J997781
622b486650L864935J322082l096095n648031n109765k550451J075713M893945
614g734317O780705N049210J272301j301584k069894l021139m446835m067881
606i539434j148815J741596K416674J812127J537886J093951o35199k833541l476879
597i031634j650862J841829N130520N939992L160528j142908k566142J184453
589B865776O889061Q203963K410333n536595p473426j750071L682655J136217
581A0427913n773246o740293j82168L996173r5129m997965k663740J686384j344611
$$ y = [11772252, 12367143, 7629346, 342496, -6777839, -10674199, -8821354, -2208135, 4752322, 8688602, 10152324, 11171576, 11603730, 9433677, 4080472, -1842187, -4484431, -2486650, 1378285, 2700367, -395728, -6043759, -11153524, -13703975, -12628262, -7734317, -953612, 4095598, 5367899, 4066315, 1996421, -1024718, -5471553, -9539434, -10688249, -8946653, -6529979, -4717852, -3179966, -2086015, -2721214, -5554755, -9031634, -10682496, -8840667, -3710147, 2229845, 5390373, 4247465, 1681323, 2865776, 9754837, 17958800, 20369133, 14832538, 7359112, 5609041, 9291696, 10427913, 4654667, -2085626, -2267794, 1728379, 1633250, -3364715, -6028455, -4342071, -5686682]
572e686682q287201p676981N62476M523830K4997k937275K407499Q543631O911984
563a613722J374851j43054J343965Q03909J4165K946240N388283L69105q517267
554A966475j0024028j458975P337983P542975J123457m764463o380435l864916
546h521927J307626O111669O895093L302554r04085k406372j700694j072606j234405
537A776853r18001J295477M894731O747815L887910k061873n622276m360831k097581
528C542224k617936l707855j504741K436990L712420K337893J555126R73348k539142
519D188327p564820q488142l973543J072554L319193M742938O658517O195079
511F150103J963264k046923k226791q66503j821870m084774m005357j395998R39820
$$ y = [-5686682, -13973883, -21650864, -21088388, -16564558, -16539561, -19476836, -17069337, -8525706, -1613722, -238871, -381925, 962040, 1765949, 1780114, 4726354, 10114637, 10483742, 1966475, -8057553, -9516528, -2178545, 5364430, 6487887, 1723424, -4657011, -8521927, -7214301, -1102632, 5792461, 9095015, 8190930, 5784558, 4083864, 3011258, 1776853, 858852, 2154329, 7049060, 13796875, 17684785, 15622912, 10000636, 5639805, 3542224, 924288, -2783567, -4288308, -1851318, 1861102, 4198995, 5754121, 6727469, 4188327, -3376493, -11864635, -15838178, -14765624, -11446431, -6703493, -44976, 6150103, 8113367, 6066444, 3839653, 2973150, 1151280, -2933494, -6938851, -8334849, -7395029]
502g395029K135396L525309M752780L549763k04366l176579k487593N64864J731957
493B996502j454202o506639q091549l879797K558691O041744N807222M832819
485B304791M198049K061990j499754l170360j711616n07570k078667l766006k454276
476f623419l22001j194378l409554k006113K453527L275264k329459p752947n409368
467b3318448K556016O958893M091983J83421J541898N036112L231400l396432
459c115157o175212j329475L445905J44657o994725p288044N09641O472515M164879
450a0165016j094261j674527J589957K929342R39186j058349p70414J636886N205449
441b461747P236932L830177m186409r262258o326079o29730j58810l460343k981969
$$ y = [-7395029, -5259633, -1734324, 3018456, 6568219, 6363853, 3187274, 699681, 1264545, 2996502, 1542300, -4964339, -13055888, -16935685, -14376994, -8335250, -2528028, 2304791, 6502840, 8564830, 7065076, 3894716, 2183100, 1675530, -403137, -4169143, -6623419, -6945420, -8139798, -11549352, -13555465, -11101938, -7826674, -10156133, -17909080, -23318448, -20762432, -13803539, -9711556, -9528135, -7986237, -2950125, 281275, -3115157, -9290369, -10619844, -7173939, -7029282, -14024007, -21312051, -20802410, -14329895, -10165016, -11259277, -12933804, -11343847, -8414505, -7475319, -8533668, -9304082, -7667196, -2461747, 4775185, 8605362, 4418953, -4843305, -11169384, -11799114, -11957924, -15418267, -18400236]
432a8400236J617180L152644O6073m01576M901533Q656904M880157j077298j230334
423B165047K713860L505590J86810k414952k964798m019746m679681j217859M744491
414a981238O445924J974941k592578k304047L29752J014293M40713J489343L482069
405H299172L435695R91837j283200j450669N6350J173730m48310n143418r374405
396c743218q454281k275562M005812O041671M355951J397184j805436m068277
388d546156l021159J039898L292047K20874m769000n390167o85181M408192N716776
379c733876L669668J037844j80598J90533M73043j266680m179529m880778k353841
370a1224214N1723l9374N7619L173263O523190N815563K584695J654619K974185
$$ y = [-18400236, -16783056, -13630412, -13564339, -13965915, -9064382, -407478, 4472679, 3395381, 2165047, 4878907, 8384497, 8571307, 6156355, 3191557, -828189, -5507870, -6725729, -1981238, 4464686, 6439627, 3847049, 1543002, 1872754, 2887047, 3327760, 4817103, 8299172, 11734867, 12726704, 11443504, 9992835, 10049185, 11222915, 10774605, 5631187, -3743218, -12197499, -14473061, -10467249, -4425578, -69627, 1327557, -477879, -4546156, -7567315, -6527417, -3235370, -3014496, -7783496, -13173663, -13858844, -9450652, -3733876, -64208, 973636, 793038, 983571, 1456614, 189934, -3989595, -8870373, -11224214, -11172491, -11211865, -11154246, -7980983, -1457793, 4357770, 6942465, 8597084, 11571269]
361A1571269K287751q28709k225605p20789R4598j425099k655243k426179k809525
352H62469l376428j77913O786385J1297940R522234N035991J620089k667852r227186
343A9675729j2743063q118322M78889M548316K730691P69610J754619K928896
335A2025365J663103j202458m150484o356750o226091k891954Q53658J243402
327e042209r11963j371675Q93774K385868P86404j986685l217482k411997r1003
318a0966968L147029N354627M027616m60414m405406m865780k533558J41526K018852
309h542476L578670N138833N551528L046246j965730n653439m697459j323424
301d867251p80547l097504k285530L902988Q997677P008376J537923k42849J485263
$$ y = [11571269, 13859020, 13030311, 10804706, 10083917, 10178515, 8753416, 6098173, 3671994, 862469, -2513959, -2691872, 4094513, 15392453, 24914687, 29950678, 31570767, 28902915, 19675729, 6932666, -1185656, -706767, 3841549, 6572240, 7341850, 9096469, 12025365, 13688468, 12486010, 8335526, 1978776, -4247315, -7139269, -6285611, -5042209, -5954172, -7325847, -6432073, -4046205, -3259801, -5246486, -8463968, -10875965, -10966968, -7819939, -2465312, 1562304, 1101890, -3303516, -8169296, -10702854, -10561328, -8542476, -4963806, 175027, 5726555, 8772801, 6807071, 1153632, -3543827, -4867251, -5647798, -8745302, -11030832, -7127844, 1869833, 8878209, 10416132, 10173283, 11658546]
292A1658546J413436q92502j262369M22114J7434k749080l629768j620928j21407
283C235476l3796R33533J823204o63981m151728k342953L637069N173081J84592
274G794497k891797M51282K760986k237804q053760n854752J164789L717744R86368
265b162447q57147l84899r34660j898089j66621J627367j534627o405009m535925
256a7252057L559477P598124K956987k723662j901729K501095L871842J945480
248E55557N73782P08637Q15083M00978j017005m615590q248011o264639K079008
239a5012200Q470184N609326k001153m019300J075537M660617J202611m507879
231d522257n518123k028620J167795K173870K397350K127934M36638j536478j508121
$$ y = [11658546, 13071982, 12179480, 10917111, 11339225, 11356659, 8607579, 4977811, 3356883, 3235476, 3201680, 4135213, 5958417, 5294436, 1142708, -1200245, 2436824, 7609905, 7794497, 4902700, 5353982, 8114968, 5877164, -2176596, -8031348, -6866559, -3148815, -2162447, -3019594, -3404493, -4339153, -6237242, -6403863, -4776496, -6311123, -12716132, -17252057, -13692580, -6094456, -3137469, -5861131, -7762860, -5261765, -1389923, 555557, 1129339, 1837976, 2653059, 3054037, 2037032, -2578558, -10826569, -17091208, -15012200, -6542016, -932690, -2933843, -6953143, -5877606, -1216989, -14378, -4522257, -10040380, -12069000, -10901205, -8727335, -6329985, -4202051, -3765413, -5301891, -6810012]
222f810012j75537l94896j788161n94796L417004M624419j66636n171844l105897
213a0166356L262784M465611q18874k797003M167490J1316774P523675l879568
205A3074533r420846m536134J490693Q96494j705724J192699O850327O359302
197A4201344j295750p195221m847912J769010M820181K514896j162184l472786
189E331578m964816n338977k211080M186339Q578156O224309n67889m732098k855331
180C650191J600031L525474J597243k187646n360260n951891l333704O0711K26681
171f173170l168609n367406k732469J932114L266307N94054k228004k748578j832280
162a8458041m65955J261579K129519P68680r57696M43059M296567N691457K710711
$$ y = [-6810012, -6985549, -7380445, -9168606, -9763402, -6346398, -1721979, -1888615, -7060459, -10166356, -6903572, -2437961, -3256835, -6053838, -1886348, 9430426, 16954101, 13074533, 3653687, -882447, 608246, 1504740, -200984, 991715, 7842042, 14201344, 12905594, 5710373, 862461, 2631471, 7451652, 9966548, 8804364, 5331578, 366762, -4972215, -7183295, -2996956, 5581200, 11805509, 11237620, 6505522, 3650191, 5250222, 8775696, 10372939, 8185293, 2825033, -3126858, -6460562, -6399851, -6173170, -9341779, -14709185, -17441654, -15509540, -12243233, -11649179, -13877183, -16625761, -18458041, -18923996, -17662417, -15532898, -14764218, -15721914, -15278855, -10982288, -5290831, -2580120]
153b580120m36576o373J484177j51240l330571k824777J751531M730631K622503
144A259185q15121k07546L846146O283559N015397K735623J291887j361291o466631
135A1581208j0329691q674633l087742J179628K659833L935519M894215K119307
127D277644l314919m348434J518138O343633K741270m198085m210212K026041
119H35076L949116j980940o824719l569131K415781K918824n80216j175520J845836
110b165893L643630L111852L457514M509059K220399l270283o006801l026823
102B472654Q27555K03270l064832l514023k79339K531035K178586M5262j634012
93b33844k460247k783174k400712j263758J0074R49785J548605J680341J344257
$$ y = [-2580120, -3016696, -3023069, -1538892, -1690132, -5020703, -7845480, -6093949, -1363318, 1259185, 444064, 236518, 4082664, 10366223, 15381620, 18117243, 19409130, 18047839, 11581208, 1251517, -7423116, -10510858, -9331230, -6671397, -2735878, 2158337, 4277644, 962725, -3385709, -1867571, 4476062, 7217332, 3019247, -1190965, 835076, 4784192, 2803252, -4021467, -7590598, -5174817, -2255993, -2836209, -4011729, -2165893, 1477737, 4589589, 8047103, 12556162, 14776561, 11506278, 5499477, 2472654, 3300209, 3503479, 438647, -3075376, -3354715, -823680, 1354906, 1400168, -233844, -2694091, -5477265, -7877977, -9141735, -9131661, -8181876, -6633271, -4952930, -3608673]
84c608673J327862K125056K401646N98825j848529j616372J255295K254419j331190
75A558339n776290n750394j771334J141884J172251J488859M067819O210480M856095
66G197709R58327k299745l050898j136406K290675M232960J962266k734065m555558
57B865265j688586J630578J594066j02208n18768n77396j878041k317222O3516
48i28796K075525j0255l359689k472216J455863K029544j916709m541864k554944
39a0223541K86755L05848o42694J77647J550829J674338K102628M496214O555126
30F283150M891241J3086m345218n375863k936700R68763L056421J282910k244836
21A592954l165583n55657K071015K253710J492685J261815J05617k835278m939910
$$ y = [-3608673, -2280811, -155755, 2245891, 2844716, 996187, -620185, 635110, 2889529, 1558339, -4217951, -9968345, -11739679, -10597795, -9425544, -7936685, -3868866, 2341614, 7197709, 8156036, 5856291, 2805393, 1668987, 3959662, 8192622, 10154888, 7420823, 2865265, 1176679, 2807257, 4401323, 4299115, 3780347, 3202951, 1324910, -992312, -928796, 1146729, 1136474, -2223215, -4695431, -3239568, -1210024, -3126733, -7668597, -10223541, -9936786, -9630938, -10273632, -10095985, -8545156, -6870818, -4768190, -271976, 6283150, 11174391, 11187477, 6842259, 1466396, -1470304, -501541, 2554880, 3837790, 1592954, -1572629, -2128286, -57271, 2196439, 3689124, 4950939, 5056556, 2221278, -2718632]
12b718632l809818j170812j71496j044373k055735k492451k049185N01099N009018
3a0002385Q023743O199826P55414
0D976598
$$ y = [-2718632, -6528450, -7699262, -7870758, -8915131, -10970866, -13463317, -15512502, -15011403, -10002385, -1978642, 4221184, 4976598]
##END NTUPLES=NMR SPECTRUM
##END=
