##TITLE=31Pdec_LR-717-B3
 D2O, 24 sc
 29.10.2020
##JCAMPDX= 6.0         $$ Bruker NMR JCAMP-DX V2.0
##DATA TYPE= NMR SPECTRUM
##DATA CLASS= NTUPLES
##ORIGIN= UXNMR, Bruker Analytische Messtechnik GmbH
##OWNER= root
$$ XWIN-NMR		Version 3.5
$$ Thu Oct 29 09:46:45 2020 Russian Standard Time (UT+4h)  she@DPX200
##.OBSERVE FREQUENCY= 81.013821
##.OBSERVE NUCLEUS= ^31P
##.ACQUISITION MODE= SIMULTANEOUS
##.ACQUISITION SCHEME= undefined
##.AVERAGES= 24
##.DIGITISER RES= 17
##SPECTROMETER/DATA SYSTEM= spect
##.PULSE SEQUENCE= zgpg30
##.SOLVENT NAME= D2O
##.SHIFT REFERENCE= (INTERNAL, D2O, 0, 182.463)
##AUDIT TRAIL= $$ (NUMBER, WHEN, WHO, WHERE, WHAT)
$$ ##TITLE= Audit trail, XWIN-NMR		Version 3.5
$$ ##JCAMPDX= 5.01
$$ ##ORIGIN= Bruker BioSpin GmbH
$$ ##OWNER= she
$$ F:/spectra/data/she/nmr/P31/1/pdata/1/auditp.txt
$$ ##AUDIT TRAIL=  $$ (NUMBER, WHEN, WHO, WHERE, WHAT)
(   1,<2020-10-29 09:45:46.26 +0400>,<she>,<DPX200>,
      <created by zg, POWCHK disabled, PULCHK disabled
       configuration hash MD5:
       00 E9 B6 7A A2 85 ED C7 34 08 36 98 17 FE 4E 26
       data hash MD5: 32K
       EB D2 71 58 87 DB FB 8A F2 B8 B9 7F 8B 62 71 9B>)
(   2,<2020-10-29 09:45:48.95 +0400>,<she>,<DPX200>,
      <Start of raw data processing
       efp BC_mod = 2 LB = 1 FT_mod = 6 PKNL = 1 PHC0 = -2428.672 PHC1 = 132.0008 SI = 64K 
       data hash MD5: 64K
       34 11 7B A1 D6 22 75 5F 36 45 40 5E 6D 19 D7 F7>)
(   3,<2020-10-29 09:46:05.12 +0400>,<she>,<DPX200>,
      <pk PHC0 = -4.161716 PHC1 = 12.8 
       data hash MD5: 64K
       63 17 5E B6 41 AB 97 20 12 2D 69 41 D9 A7 D3 DD>)
$$ ##END=
$$ 
$$ hash MD5
$$ F5 51 B9 19 F0 2A B9 C4 3D 9C D5 07 A7 C5 FC 7D
##$RELAX= 
##$RELAX= 
##$RELAX= 
##$RELAX= 
##$RELAX= 
##$RELAX= 
##$RELAX= 
##$RELAX= 
$$ Bruker specific parameters
$$ --------------------------
##$DU= <F:/spectra>
##$EXPNO= 1
##$NAME= <P31>
##$PROCNO= 1
##$TYPE= <nmr>
##$USER= <she>
##$AMP= (0..31)
100 100 100 100 100 100 100 100 100 100 100 100 100 100 100 100 100 100 
100 100 100 100 100 100 100 100 100 100 100 100 100 100 
##$AQSEQ= 0
##$AQ_mod= 1
##$AUNM= <au_zg>
##$AUTOPOS= <>
##$BF1= 81.014009
##$BF2= 200.13
##$BF3= 200.13
##$BF4= 200.13
##$BF5= 200.13
##$BF6= 200.13
##$BF7= 200.13
##$BF8= 200.13
##$BYTORDA= 1
##$CFDGTYP= 0
##$CFRGTYP= 5
##$CHEMSTR= <none>
##$CNST= (0..31)
1 1 145 1 1 1 1 1 1 1 1 1 1 1 1 1 1 1 1 1 1 1 1 1 1 1 1 1 1 1 1 1 
##$CPDPRG= <waltz16>
##$CPDPRG1= <>
##$CPDPRG2= <waltz16>
##$CPDPRG3= <>
##$CPDPRG4= <mlev>
##$CPDPRG5= <mlev>
##$CPDPRG6= <mlev>
##$CPDPRG7= <mlev>
##$CPDPRG8= <mlev>
##$CPDPRGB= <>
##$CPDPRGT= <>
##$D= (0..31)
0 1 0 0 0 0 0 0 0 0 0 0.03 2e-05 3e-06 0 0 0 0 0 0 0 0 0 0 0 0 0 0 0 0 
0 0 
##$DATE= 1603950345
##$DBL= (0..7)
120 120 120 11 120 120 24 19 
##$DBP= (0..7)
150 150 150 150 150 150 150 150 
##$DBP07= 0
##$DBPNAM0= <>
##$DBPNAM1= <>
##$DBPNAM2= <>
##$DBPNAM3= <>
##$DBPNAM4= <>
##$DBPNAM5= <>
##$DBPNAM6= <>
##$DBPNAM7= <>
##$DBPOAL= (0..7)
0.5 0.5 0.5 0.5 0.5 0.5 0.5 0.5 
##$DBPOFFS= (0..7)
0 0 0 0 0 0 0 0 
$$ [...]
##$SUBNAM2= <"">
##$SUBNAM3= <"">
##$SUBNAM4= <"">
##$SUBNAM5= <"">
##$SUBNAM6= <"">
##$SUBNAM7= <"">
##$SUBNAM8= <"">
##$SUBNAM9= <"">
##$SW= 369.568048894756
##$SWIBOX= (0..15)
0 1 3 0 0 0 0 0 0 0 0 0 0 0 0 0 
##$SW_h= 29940.119760479
##$TD= 32768
##$TD0= 1
##$TE= 0
##$TE2= 300
##$TE3= 300
##$TEG= 300
##$TL= (0..7)
0 120 53 12 22 120 120 120 
##$TP= (0..7)
150 150 150 150 150 150 150 150 
##$TP07= 0
##$TPNAME0= <>
##$TPNAME1= <>
##$TPNAME2= <>
##$TPNAME3= <>
##$TPNAME4= <>
##$TPNAME5= <>
##$TPNAME6= <>
##$TPNAME7= <>
##$TPOAL= (0..7)
0.5 0.5 0.5 0.5 0.5 0.5 0.5 0.5 
##$TPOFFS= (0..7)
0 0 0 0 0 0 0 0 
##$TUNHIN= 0
##$TUNHOUT= 0
##$TUNXOUT= 0
##$USERA1= <user>
##$USERA2= <user>
##$USERA3= <user>
##$USERA4= <user>
##$USERA5= <user>
##$V9= 5
##$VALIST= <valist>
##$VCLIST= <CCCCCCCCCCCCCCC>
##$VD= 0
##$VDLIST= <DDDDDDDDDDDDDDD>
##$VPLIST= <PPPPPPPPPPPPPPP>
##$VTLIST= <TTTTTTTTTTTTTTT>
##$WBST= 1024
##$WBSW= 4
##$XGAIN= (0..3)
0 0 0 0 
##$XL= 0
##$YL= 0
##$YMAX_a= 8890
##$YMIN_a= -12934
##$ZGOPTNS= <>
##$ZL1= 120
##$ZL2= 120
##$ZL3= 120
##$ZL4= 120
##$ABSF1= 0
##$ABSF2= 0
##$ABSG= 0
##$ABSL= 0
##$ALPHA= 0
##$AQORDER= 0
##$ASSFAC= 0
##$ASSFACI= 0
##$ASSFACX= 0
##$ASSWID= 0
##$AUNMP= <proc_1d>
##$AZFE= 0.1
##$AZFW= 0.5
##$BCFW= 0
##$BC_mod= 2
##$BYTORDP= 0
##$COROFFS= 0
##$CY= -3
##$DATMOD= 1
##$DC= 0
##$DFILT= <>
##$DTYPP= 0
##$F1P= 0
##$F2P= 0
##$FCOR= 1
##$FTSIZE= 65536
##$FT_mod= 6
##$GAMMA= 0
##$GB= 0
##$INTBC= 1
##$INTSCL= 5.30512e-09
##$ISEN= 30
##$LB= 1
##$LEV0= 0
##$LPBIN= 0
##$MAXI= 10000
##$MC2= 0
##$MEAN= 0
##$ME_mod= 0
##$MI= 50
##$NCOEF= 0
##$NC_proc= -7
##$NLEV= 6
##$NOISF1= 182.463
##$NOISF2= 159.3651
##$NSP= 0
##$NTH_PI= 0
##$NZP= 0
##$OFFSET= 182.463
##$PC= 4
##$PHC0= -2432.834
##$PHC1= 144.8008
##$PH_mod= 1
##$PKNL= yes
##$PPARMOD= 0
##$PSCAL= 0
##$PSIGN= 0
##$REVERSE= no
##$SF= 81.014009
##$SI= 65536
##$SIGF1= 159.3651
##$SIGF2= -187.1042
##$SINO= 113.3802
##$SIOLD= 16384
##$SREGLST= <1H.CDCl3>
##$SSB= 0
##$STSI= 65536
##$STSR= 0
##$SW_p= 29940.119760479
##$SYMM= 0
##$S_DEV= 0
##$TDeff= 32768
##$TDoff= 0
##$TI= <>
##$TILT= no
##$TM1= 0
##$TM2= 0
##$TOPLEV= 0
##$USERP1= <user>
##$USERP2= <user>
##$USERP3= <user>
##$USERP4= <user>
##$USERP5= <user>
##$WDW= 1
##$XDIM= 65536
##$YMAX_p= 428070836
##$YMIN_p= -23770463
$$ End of Bruker specific parameters
$$ ---------------------------------
##NTUPLES= NMR SPECTRUM
##VAR_NAME=  FREQUENCY,     SPECTRUM/REAL,   SPECTRUM/IMAG
##SYMBOL=    X,             R,               I
##VAR_TYPE=  INDEPENDENT,   DEPENDENT,       DEPENDENT
##VAR_FORM=  AFFN,          ASDF,            ASDF
##VAR_DIM=   65536,         65536,           65536
##UNITS=     HZ,            ARBITRARY UNITS, ARBITRARY UNITS
##FACTOR=    0.456856943014862, 1,           1
##FIRST=     14782.0589164895, 0,            0
##LAST=      -15158.0608439895, 0,           0
##MIN=       -15158.0608439895, -23770463,   0
##MAX=       14782.0589164895, 428070836,    0
$$ Real data points
##PAGE= N=1
##DATA TABLE= (X++(R..R)), XYDATA
$$ [...]
44727 345635 1149690 1246755 -825211 -3405747 -4400735 -4326073 -4766891 -5585519 -5714464 -5393067
44717 -5393067 -5557170 -5951175 -5757368 -5323863 -5382424 -5125815 -2958324 1011526 4723248
44708 4723248 6269219 5171338 2136987 -1155529 -2616883 -1548820 489340 1797483
44700 1797483 2804117 4811531 7323205 8489186 7749657 6215595 4765753 3516740
44692 3516740 2740019 2375783 1078455 -2049305 -5077381 -5112081 -2583791 -1043805 -2310712
44683 -2310712 -4531263 -5741663 -6407009 -7096857 -6538175 -4133003 -2152629 -2912166 -5321019
44674 -5321019 -6698958 -6758801 -7088658 -7396574 -5217906 234560 6164347 9058844 8203604
44665 8203604 5671141 3739040 3026340 2813366 2648823 3231872 5264050 7680432 8173538
44656 8173538 5887370 2481489 -76224 -1507756 -2149129 -1363812 1395672 4938231
44648 4938231 7442739 8575152 8990563 8563674 7036038 5773419 6470113 8063019 7339063
44639 7339063 3301828 -1154329 -3045030 -3052710 -3914550 -6073686 -6746081 -3489510 2296767
44630 2296767 6096384 4680933 -288007 -3607061 -1884466 3066808 6812608 7301082
44622 7301082 5895732 4213273 2186292 -455790 -2852315 -4113382 -4340023 -3732670
44614 -3732670 -2062959 39510 638118 -1424121 -4956887 -8058956 -10355189 -12366267
44606 -12366267 -13582144 -12785661 -9950704 -6419033 -3276735 -682992 1255885 2018695
44598 2018695 1255363 -775895 -3288528 -5062594 -5002492 -3406307 -2199984 -2947675 -4993816
44589 -4993816 -6475911 -6583498 -5617224 -3559572 -512082 1701870 799302 -2350579 -3536965
44580 -3536965 -101307 5482657 8529625 7493227 4677790 2588277 1734049 1721950 2263675
44571 2263675 2685429 2236089 1404128 1303224 1338901 -433955 -3676573 -4853721 -1966550
44562 -1966550 1702273 1398673 -2603751 -5510630 -4754360 -2742139 -2102426 -1725817 340108
44553 340108 2802029 2953570 1141302 327133 1579053 2633842 1236364 -2038518 -4711282
44544 -4711282 -4753852 -1870681 2281144 5038906 5012509 3402895 2199571 1674649 906270
44535 906270 -118771 -853325 -1948317 -4246249 -6248400 -5239426 -1270763 2458675
44527 2458675 3688769 3117399 1898678 61916 -1557013 -888995 2090437 4316653
44519 4316653 3847651 2598339 2673996 2603148 124216 -3481537 -5215693 -4940602 -4695656
44510 -4695656 -4697015 -3706504 -2562788 -3337666 -5082489 -4490002 -1465129 -78974 -2375688
44501 -2375688 -4628108 -2176123 4280845 9714248 10749146 8402843 5535351 3577160
44493 3577160 2048607 209783 -1561989 -2239761 -1744491 -1159968 -943026 -188221 1284570
44484 1284570 1589471 -683801 -3888126 -5562376 -6107818 -7444893 -8952159 -8171945 -5235579
44475 -5235579 -2919140 -2103324 -946995 899277 1342354 205794 292461 2301039 2887684
44466 2887684 245720 -2440600 -2150469 -716023 -663724 -115472 3473835 7487383 7428834
44457 7428834 4060237 1720930 802403 -2131776 -6915924 -8621965 -5129127 -504835
44449 -504835 1244267 1200530 1813680 2248395 659266 -1915946 -3220920 -3213177 -2928514
44440 -2928514 -1809348 787325 2820191 1536393 -2302071 -5015037 -4839006 -3661309
44432 -3661309 -3457341 -3297198 -1316217 1621980 2171620 -1265147 -5838794 -7085484 -4158961
44423 -4158961 -554791 853345 1338946 3158076 4951589 3558884 -514487 -3330818
44415 -3330818 -3467910 -3693250 -5382685 -5323260 -802681 5302331 8043525 6974752 5658518
44406 5658518 5950050 6433599 5974561 5238071 4453086 2805761 712790 -5244 891172
44397 891172 1241655 -327843 -2448522 -3303731 -2924984 -1923664 173935 3531068 6340294
44388 6340294 6686368 5432824 5211356 6555305 6878363 3936831 -963690 -4181553 -3573170
44379 -3573170 -277905 3022105 4644314 4481085 3027631 960835 -448399 208607
44371 208607 2847279 5450997 6237714 5866575 6362924 7956499 8395382 6038150 2485712
44362 2485712 826395 1592383 1911446 -713902 -4778599 -6191445 -3220672 1277248
44354 1277248 3206055 1719159 -869894 -2878350 -4926853 -7557580 -9267678 -8312508
44346 -8312508 -5245121 -2120917 108223 1964503 3812508 5447322 6968211 8431718
44338 8431718 8834714 7237909 4894158 4156325 4795891 3699528 -558104 -4928738 -5552365
44329 -5552365 -2649899 432021 1874962 2429407 2384126 625162 -2668110 -5132881 -5363774
44320 -5363774 -4768162 -4722611 -3975088 -1140723 1880993 2038900 64568 -6312 3223948
44311 3223948 6015602 4377047 -794643 -5247586 -6331984 -4467067 -1123015 2192729
44303 2192729 3682286 2594957 848432 1086656 2909055 3271438 1110288 -934997
44295 -934997 -653368 223559 -1264393 -4721823 -7132756 -7393455 -7277039 -7678391 -6702902
44286 -6702902 -2985429 988457 1158561 -2924310 -7129725 -7476493 -4522738 -2061690
44278 -2061690 -2178158 -3007743 -1648157 1892370 4707229 4584338 2467453 1009433 1413275
44269 1413275 2359950 1888878 -205199 -2151998 -2386550 -1651901 -2333284 -5466238 -9098949
44260 -9098949 -10380199 -8834315 -6566042 -5414668 -5120573 -4530077 -3440907 -2618881 -2735638
44251 -2735638 -3830290 -5235996 -5698991 -4291716 -1596078 744614 1968849 2792122
44243 2792122 3697670 3862476 2677880 1326300 1662359 4077735 7381493 10131170 11125418
44234 11125418 9417229 5306970 1011966 -1023852 -535707 765310 1544928 1895241
44226 1895241 2271541 2765805 3628648 5233887 6995491 7335042 5515605 2944596 1820250
44217 1820250 2535582 3071553 1410448 -1632288 -2768465 -2046 4615333 7160598
44209 7160598 6414046 4579802 3399123 1887668 -956181 -3519469 -3839357 -2948281 -3413974
44200 -3413974 -5407329 -6736782 -6257411 -4678273 -2310215 1110009 4117450 3993572
44192 3993572 531624 -3082669 -4265757 -3750821 -3176633 -2222902 182907 3565869 6542164
44183 6542164 8415478 8742276 6872477 3532893 1271255 1364922 1691003 -136652 -2818305
44174 -2818305 -3256384 -1584409 -1209801 -3712697 -6573819 -6780187 -4308449 -979667 1984083
44165 1984083 3841891 3646934 1562232 -339791 -484315 -173192 -1591868 -4003040 -4341998
44156 -4341998 -1923844 -149937 -2138656 -6340076 -8409933 -6563848 -3043478 -592902
44148 -592902 312117 363737 -199305 -872074 -305942 1760938 3119534 1601354 -1656962
44139 -1656962 -3503434 -3093724 -2740904 -4071479 -5416371 -4144969 -233394 3711365
44131 3711365 5271462 4203022 2098343 618353 -251802 -2110297 -5565702 -8194277
44123 -8194277 -6762083 -1678431 2748493 3349324 1491388 167132 -355608 -1792035
44115 -1792035 -4030323 -4836249 -3349001 -1510375 -1252430 -1937543 -1710857 -421900 77189
44106 77189 -1531649 -4082679 -5095526 -3809104 -2344217 -3115361 -5415149 -5865070 -2748067
44097 -2748067 1280776 1953509 -1634057 -5948979 -6958102 -4260779 -886617 532385
44089 532385 547072 1402908 3422796 4379796 2873579 524786 -668520 -1506385 -3680025
44080 -3680025 -5885651 -5192825 -2071617 -350838 -1439280 -2305707 -715980 1154163
44072 1154163 613450 -1307045 -2250028 -2189488 -1635809 805602 5242352 7543944 4318456
44063 4318456 -931458 -1755667 2012638 4242114 1698197 -2056210 -2939914 -1578856
44055 -1578856 -361089 557923 1912448 3154368 3836662 4662052 5455040 4510590 1374063
44046 1374063 -2157301 -4877226 -7288466 -9048460 -8726777 -7302476 -7951269 -10513631
44038 -10513631 -10465260 -6121264 -2510277 -4185258 -7925215 -7335492 -1977912 3019231
44030 3019231 4447066 3130685 86628 -4156141 -6996822 -5603279 -1548133 662753
44022 662753 -172348 -1205475 -847120 -327035 154863 1921296 3707532 2114111 -2353552
44013 -2353552 -4680308 -2936623 -1629774 -4482495 -8303257 -7874520 -3383766 1118807
44005 1118807 3757566 5027693 4345236 1095337 -2231294 -2366805 -31585 1486651
43997 1486651 1720020 2902387 4929340 4834883 1755536 -1491185 -2553961 -1806356 88795
43988 88795 3065377 5230217 3744225 -182555 -1333376 2003161 4606412 1860581
43980 1860581 -2971721 -3715510 -858449 -392628 -4037385 -6785710 -5331206 -3331754
43972 -3331754 -5266648 -9189428 -9706801 -5897575 -2021228 -1024205 -1207075 1938 2024729
43963 2024729 2481832 683242 -2071316 -4769435 -7421273 -9545669 -9567868 -6725661 -2878491
43954 -2878491 -1138643 -2438151 -4350231 -3954372 -1253951 1098761 1021016 -1171384 -3895914
43945 -3895914 -5772658 -5713759 -3264582 36206 924017 -2326537 -7404337 -10204620 -9394783
43936 -9394783 -7380401 -6742407 -7258899 -7057732 -5458549 -3540559 -2431517 -2180584 -2428435
43927 -2428435 -3286612 -4859292 -6219917 -5881945 -3791776 -2040488 -2489605 -4110237 -4175247
43918 -4175247 -2053234 118290 1098205 2536682 5654588 8039965 6496064 1930969
43910 1930969 -1665023 -2752954 -3575041 -5647877 -7232514 -6602341 -4970135 -4128916 -3308714
43901 -3308714 -786601 2627675 4037375 1968102 -2141403 -5516450 -5929119 -2782190
43893 -2782190 2211540 5850579 6186948 4206823 2098615 697580 -393511 -1192526
43885 -1192526 -1292592 -843078 -382862 -231009 -867742 -2862844 -5363142 -6026973 -3999651
43876 -3999651 -1600965 -1199728 -1799197 -1064095 500907 296556 -2144312 -4708481 -6175993
43867 -6175993 -7035114 -6874332 -4348036 -284376 2494064 3387698 4798910 7469436 8478529
43858 8478529 5882219 2257849 1117570 2324402 3638521 4422021 4935428 4148769 1560165
43849 1560165 -516276 85078 1555775 886537 -799963 42982 2889099 3049267 -1290280
43840 -1290280 -6321049 -8295340 -7985545 -7550053 -6647069 -4328691 -1803453 -308803 1416895
43831 1416895 4449036 6443671 4464440 -327035 -4199414 -6103203 -7884199 -9826155
43823 -9826155 -9858734 -7577295 -5399050 -4652872 -3789527 -1990067 -1471294 -3912404 -6914254
43814 -6914254 -6675359 -2828633 1701182 4598680 5734523 5740914 5297050 5399549 6331897
43805 6331897 6695168 5307579 3584859 3903560 5898784 6798174 5552137 4094922 3862971
43796 3862971 3590553 1926361 215214 857040 4006916 7328343 8261832 5717028 725576
43787 725576 -3593103 -4079222 -901724 2172903 2065824 -277270 -2053616 -2438940 -2314398
43778 -2314398 -1720725 -324535 447269 -1138319 -3572614 -3129325 849307 4576258 5072547
43769 5072547 4204588 5385115 8147457 8694735 5165388 -119244 -3865548 -5341168
43761 -5341168 -5962671 -6714008 -7227620 -7043625 -6553560 -6119437 -4900210 -1716603 2651784
43752 2651784 5179321 3685741 -331559 -3177396 -3062630 -1486249 -606058 -778489 -1184234
43743 -1184234 -1432948 -1477167 -802504 1109663 3711651 5518846 5295428 2816970 -1348767
43734 -1348767 -6496607 -12098735 -17263765 -20022351 -18308701 -12645453 -6905002 -4699820
43726 -4699820 -5400505 -5554673 -3918347 -2566585 -2657570 -2084345 994964 4700752 5901911
43717 5901911 4579467 3153669 2397544 746263 -2463966 -5564906 -6903667 -6758093
43709 -6758093 -6197971 -5451919 -4213722 -2628587 -1253539 -513623 -481630 -761868 -613842
43700 -613842 244395 1116058 1287586 1187198 1573244 1816927 438959 -2329340 -3978802
43691 -3978802 -2714907 -121114 465633 -1911154 -4468928 -3930775 -390992 2964107
43683 2964107 3801216 3068653 2869398 3170788 2323054 347545 -565673 571288 1761601
43674 1761601 908259 -1200965 -2438953 -2435743 -2099257 -1200277 985154 3070969 2389480
43665 2389480 -1119801 -4233826 -4524785 -3052385 -1867977 -849071 1125635 3209821
43657 3209821 3183029 861955 -1109274 -574944 1374393 2091036 1121167 740566 2443829
43648 2443829 4377002 3695118 760581 -1056344 -41027 1558042 1103019 -437433
43640 -437433 -131288 2399851 4457088 3910427 1285612 -1685551 -3641204 -3756272 -2398691
43631 -2398691 -1790599 -3887744 -7217833 -8076587 -5565549 -3057669 -3404245 -4971578 -4388470
43622 -4388470 -1518597 677394 409692 -1050414 -1685032 -1243170 -1043280 -2112863 -3828428
43613 -3828428 -4347323 -2767355 -699069 -624002 -2710451 -4899095 -6387279 -8626788 -11716855
43604 -11716855 -12531840 -8931925 -3812553 -1755952 -2797947 -2969875 -587530 1699820
43596 1699820 1638602 636445 897027 2109946 2739344 2384547 1145301 -1278134 -3944507
43587 -3944507 -4133029 -818849 2865433 3226351 882499 -718954 -686963 -1239317 -3045240
43578 -3045240 -3693566 -1912697 -192501 -1286385 -4332235 -6472902 -6580681 -5261118
43570 -5261118 -2639959 1354095 5261600 7058929 6725311 5991152 5733863 5413095 4871905
43561 4871905 4757707 5102410 5282001 5446178 6201185 6903924 6314031 5031186 5002598
43552 5002598 6322636 7061054 6820603 7552465 9689412 10529351 8397719 5682393 5334002
43543 5334002 6708840 7465824 7319423 6962966 5437711 2105331 -487698 386215 2979214
43534 2979214 3420399 1751283 1234553 2243902 1820296 -360015 -718983 2149147 4849898
43525 4849898 4607482 3028134 2159387 947588 -1474261 -2723331 -839446 2000487
43517 2000487 2878783 2585367 3248111 4120903 3519722 2674894 3555153 4708922 3571913
43508 3571913 1453853 1686832 3768446 4064166 1963187 553816 946916 715206 -1094769
43499 -1094769 -2002720 -720943 510886 314587 953319 3953727 6329395 4642034 545298
43490 545298 -1250321 793907 4029788 5933608 6262600 5098371 1781988 -3303839
43482 -3303839 -7890938 -9924595 -9531659 -8210341 -6891270 -5584757 -4493490 -4498053 -6097162
43473 -6097162 -8236524 -8993786 -7758038 -6028789 -5326649 -4959252 -3113842 76486 2144801
43464 2144801 1447353 -614558 -1487288 -778506 -523776 -2260403 -4837232 -5788865 -4623524
43455 -4623524 -3727381 -5199408 -7491649 -6881067 -2417590 2553978 4645233 4136781 2980152
43446 2980152 1344092 -1226492 -2846891 -944325 3526645 6698938 6738937 5280564
43438 5280564 3759761 1566780 -1276914 -2706654 -1486467 787076 1986748 1798787
43430 1798787 669170 -1358098 -3412059 -3627580 -1821304 -389680 -1004751 -2385550
43422 -2385550 -2878139 -2995022 -3445467 -2924240 -376227 2432832 3373736 3408926 4619076
43413 4619076 6072136 5050956 1814995 -322206 126871 1001036 333135 -658516 271412
43404 271412 3115417 5865343 6963427 6501064 5605390 5171878 4823497 3218555 -14468
43395 -14468 -3153619 -4280439 -3829942 -3798409 -4667041 -4855263 -3440647 -1668541 -974953
43386 -974953 -815134 473629 3259846 5875120 6118146 3287221 -969237 -3834498 -3871354
43377 -3871354 -2409467 -1849487 -2661057 -2901775 -996235 1822982 2669232 453589 -2602409
43368 -2602409 -3366526 -1241139 1673283 3702652 5355898 7227708 7940466 6158818
43360 6158818 3431474 2290130 2050676 -210447 -4203589 -5639974 -2398343 1910047
43352 1910047 2951915 1459979 1028263 2231079 2362993 -428 -3279536 -5366533
43344 -5366533 -5495603 -4047106 -2327719 -1847654 -2298898 -1555221 731273 1598123 -864374
43335 -864374 -3964185 -4342776 -3124554 -3176648 -3445813 -1212623 1375575 -743224 -6779322
43326 -6779322 -9549608 -5502851 363421 2377791 1895218 3266852 6136590 6471863
43318 6471863 3034386 -1553220 -5145785 -7759895 -9249759 -8467536 -5340284 -1914968
43310 -1914968 -621365 -2038001 -4313281 -4703623 -2302676 928927 2833207 3995509
43302 3995509 6014217 7579847 5512208 40114 -4285982 -3997581 -121007 4574219
43294 4574219 8269056 8922673 4519540 -3170695 -8558622 -8530104 -5716741 -3327997 -609958
43285 -609958 3524562 6447152 5675386 3512221 3239645 3536288 1609331 -781381 -165065
43276 -165065 1682489 -40658 -4706097 -6407834 -3024650 809577 1071967 -654266
43268 -654266 -1378682 -1208490 -1460442 -2132935 -3279607 -5489866 -7369995 -6123837 -2345599
43259 -2345599 -481974 -2427212 -4357621 -2504858 1364048 3232848 2608928 1717504
43251 1717504 1354938 975303 1107203 2342569 3164942 1807139 -666216 -1764667 -1078673
43242 -1078673 128222 1690094 4021986 5652686 4488672 1559775 579582 3082736
43234 3082736 6247912 6453952 3308070 -820616 -3999362 -6225738 -8067040 -8799998
43226 -8799998 -6729234 -1783540 2916009 3621585 293193 -3223897 -3828267 -2072462
43218 -2072462 352471 3469995 7245812 9177791 6975468 2791671 1393225 3895066
43210 3895066 6295400 5098743 1757260 -63501 302850 221993 -1990322 -4424151 -3673495
43201 -3673495 1142806 6924055 9209640 6358123 1120071 -2062130 -1192830 1973205
43193 1973205 4330976 4454594 3205512 1977797 958947 -651432 -2903024 -4225772
43185 -4225772 -2940963 483829 3373756 3245093 -2410 -4036200 -5729033 -3416893
43177 -3416893 1343498 4570348 3788888 1039869 367800 2426906 3840767 2425628
43169 2425628 371259 630323 2457432 2936888 1419641 -208310 -834992 -1044055 -1003566
43160 -1003566 -18383 1427016 1382479 -904150 -3488264 -3745472 -966618 3531958 7889773
43151 7889773 10641733 10941719 8837117 5585694 3488473 4735880 9377665 14255373
43143 14255373 15177952 11026338 4923746 692830 -751411 -689974 58119 1265513 1926578
43134 1926578 1136794 80890 948633 3577599 4988230 2860422 -1798450 -5924783
43126 -5924783 -7328695 -6060460 -3809733 -2330407 -1917810 -1369670 263041 2420718
43118 2420718 4033802 4842922 4788922 3174438 -114871 -3420949 -4977792 -5048305 -4791734
43109 -4791734 -3997022 -2082589 -462170 -1167773 -3413091 -4399329 -3655847 -3558491 -4919103
43100 -4919103 -5231188 -2808532 -11287 -280506 -3725789 -7570019 -9667321 -9868575 -8942241
43091 -8942241 -7732456 -6723816 -5367241 -2684815 584273 1697438 -911473 -5142661
43083 -5142661 -7345639 -6301162 -3885237 -2403907 -2623431 -4110819 -6095010 -7648250
43075 -7648250 -7874900 -6569063 -4642087 -3515935 -3676500 -3946817 -2961369 -1370527 -1125408
43066 -1125408 -1984699 -838453 3687623 7941079 7449873 3135487 -85682 -194855 268639
43057 268639 -672698 -1895378 -2550735 -3805062 -5675067 -5925383 -3922306 -1949410 -847462
43048 -847462 1613485 5611175 6940981 3388202 -555256 229823 4027379 5837919
43040 5837919 5505499 6522336 8632393 8051401 4694365 2975096 4477443 5306438 2450803
43031 2450803 -1868564 -4293303 -4815725 -4874873 -4335623 -2922227 -2081296 -2898887 -3945925
43022 -3945925 -3239383 -948550 1380319 2920087 3627663 3603622 3498210 4207818 5227490
43013 5227490 4737020 2281337 -42045 -114658 1631123 3093045 3048924 2125408 1825189
43004 1825189 2797679 3647888 2121164 -1657665 -4441128 -4001050 -2330941 -2052948 -1401620
42995 -1401620 3094048 9786283 12836163 10607945 8092241 9101778 10722394 8458339
42987 8458339 3045170 -1474961 -3708705 -5181451 -6311386 -5573000 -2191096 2519977
42979 2519977 6158215 6701435 4250809 1835585 2430849 4760602 4948871 2816466 2440653
42970 2440653 5068548 6384371 3668602 721023 1410047 2803116 220237 -4394546
42962 -4394546 -5520153 -3220223 -2583961 -5019615 -6669785 -5562162 -4168194 -4025382
42954 -4025382 -3500856 -2192876 -2209221 -3327714 -1935841 2920121 6972095 6895680 5107001
42945 5107001 5531258 7995109 9898238 10655960 11299373 11666296 10854310 9106693 7138089
42936 7138089 4972041 3076983 2918535 4681731 6164044 5580574 3767348 2123582
42928 2123582 391381 -1733421 -2820008 -1767648 -144874 -313459 -2322060 -4453973
42920 -4453973 -5756621 -6342552 -6188135 -5229617 -3982825 -3074096 -2911145 -4036838 -6216567
42911 -6216567 -7112925 -4414564 204660 2363866 1212401 753203 3243781 5452666
42903 5452666 4448525 3027056 5069487 8778639 9680938 8043292 7616226 8286180 6098518
42894 6098518 736652 -2896724 -1954382 609511 1617416 2388440 4932349 7116675
42886 7116675 5437058 662171 -2764139 -2319655 155780 1535371 1070415 509661 1356825
42877 1356825 2613930 1793503 -1538188 -4275780 -3125794 1343610 5694335 7918284
42869 7918284 8524225 7852987 5231954 1252398 -1831231 -3014415 -3690127 -4885553 -5375685
42860 -5375685 -3669861 -130058 3884720 7312644 9014715 8056332 5497443 4094946
42852 4094946 4894486 5606049 3603765 -732063 -4639389 -5700337 -3359538 656078
42844 656078 2843796 781640 -3744898 -6431644 -5855830 -4705156 -4902863 -4806196 -2930900
42835 -2930900 -1016490 -709524 -279365 1990471 3770783 2061060 -1312021 -1941358 516816
42826 516816 2345882 1881484 1087648 882004 -413289 -2727857 -2715771 1071055 4774839
42817 4774839 3857111 -893110 -4588594 -4281964 -1557478 319704 88187 -700826 229345
42808 229345 2996173 4964176 3829120 860590 -523770 730617 2347228 2642898
42800 2642898 3006158 5188799 8129691 9312606 8094285 5963609 4224556 2996805
42792 2996805 2218464 2272821 3279488 4309164 3786182 1170841 -1655722 -1826393 716488
42783 716488 2237619 -25806 -3352523 -2761088 1843072 5421230 5015951 3187232 2970335
42774 2970335 3541452 3245933 3058222 3697455 2610088 -2025361 -6694096 -6471669 -2089153
42765 -2089153 1341336 1657481 1186203 1520159 1584758 1213411 1952179 3338092 2825620
42756 2825620 780823 1029564 4369853 6094476 3181176 -118281 1679791 6505003
42748 6505003 7295190 2369072 -2007482 -358308 4902580 7347429 4871431 1356460
42740 1356460 933983 3220652 4972941 4758771 4092544 4176293 3835213 2080093 804149
42731 804149 2234334 4666525 4186640 765464 -1116710 911573 3682801 3842854 2909399
42722 2909399 3638468 4564038 2704097 -398924 -593570 1721513 1852640 -1249238 -2796074
42713 -2796074 59360 3220254 1981938 -1316630 -620560 4633830 8401909 6298883
42705 6298883 1118664 -1377734 351353 2689058 1943203 -1620168 -4854300 -5388228
42697 -5388228 -3397738 -467056 2026605 3208726 2601227 649732 -1263759 -2227257
42689 -2227257 -2706398 -3216928 -2903575 -779749 2271869 4436613 5535602 6750572 7892093
42680 7892093 7099981 3673821 -783086 -4572395 -7253468 -8249268 -6577645 -3250101
42672 -3250101 -1572614 -3119082 -5276901 -4954070 -3066746 -2712369 -4067828 -4263936 -2192027
42663 -2192027 -352994 -973903 -2637724 -2385853 154912 2460583 2547171 1272420 777618
42654 777618 1560013 2191950 1864960 1756014 2837125 3560498 1774955 -1464422 -2472697
42645 -2472697 232509 4027245 5933186 5842146 4812591 2913623 844023 1120888 4707808
42636 4707808 8311430 8214256 5371081 3338133 2433113 22129 -3927718 -6108695 -5295997
42627 -5295997 -4235381 -4649917 -4253029 -976266 3088551 4770595 4429550 4551285 5465374
42618 5465374 5457330 4147697 2925940 2367117 1635994 481333 -203597 -41773 292883
42609 292883 540358 1368150 2867098 3795367 3217705 2073559 1929995 2404916 1311991
42600 1311991 -1819614 -3742170 -1240218 3346926 3524318 -2792903 -9099860 -8047395
42592 -8047395 -1398123 2251977 -885373 -5499805 -5500904 -1565604 2136996 4296524 5731767
42583 5731767 5620123 2936363 -275776 -1304447 -1084521 -2006522 -2742868 -239925 3454572
42574 3454572 2041499 -5671227 -12251956 -10759609 -3916348 -279025 -3270594 -8149849
42566 -8149849 -9351647 -6837331 -4028756 -2502958 -1217004 280007 602629 -1003942
42558 -1003942 -2843389 -2801260 -1280380 -524859 -1357316 -2327607 -2258838 -1741084 -1338911
42549 -1338911 -178963 2275695 4505966 4698468 3214369 1647284 351771 -1275048
42541 -1275048 -2835054 -3280367 -2755235 -2094172 -878715 1775945 4586008 4721891 1696860
42532 1696860 -1463411 -1958003 -526571 104480 -1050562 -2285183 -1562316 947152 2771376
42523 2771376 1686561 -1515811 -3491658 -2181687 658537 1695844 -175259 -3459745
42515 -3459745 -6329063 -7594544 -6578201 -4160594 -3022051 -4464123 -5908498 -4321451
42507 -4321451 -1187875 -539603 -2499383 -3041587 -686062 1075951 -351396 -2616320
42499 -2616320 -2762659 -1969840 -2765755 -4395299 -4506291 -3388785 -3014189 -3307893 -2786559
42490 -2786559 -1904083 -2416171 -3891710 -4014225 -2415984 -1449253 -2643414 -4553346 -4834906
42481 -4834906 -3025540 -676886 537644 689656 1699226 4809270 7882920 7025472
42473 7025472 1726458 -3719446 -5345740 -3889362 -2215592 -850629 1148642 2949400
42465 2949400 2997893 2051580 1858955 1872611 639930 -559168 699947 3312232 3652032
42456 3652032 1376718 213835 2268434 5252749 6407081 5789324 4494893 2784805
42448 2784805 1306164 1283087 2217340 2094081 867051 773175 2166620 2413770 409053
42439 409053 -1253059 -543072 864919 914881 396255 347724 -554967 -3008171 -4400936
42430 -4400936 -2549203 316450 789464 -633973 -1244791 -778968 -504556 448484 3457628
42421 3457628 6371821 5652666 1973653 -608456 -717179 -606409 -1230794 -923029 614013
42412 614013 1503191 1703514 3364449 5970669 5724550 1739114 -1470872 -279672 3098032
42403 3098032 4861117 5262356 6546255 8319854 8907389 8973626 9712573 9252454 5251301
42394 5251301 258 -1581684 1117265 3713539 3486389 2547620 3086063 3375086 1071951
42385 1071951 -2178510 -2540671 671391 4029595 4292376 1900151 -127644 394197 3073607
42376 3073607 5974268 7567345 7521618 6293023 4813119 4295798 5047963 5322545 2981925
42367 2981925 -1111930 -3393267 -2567206 -1987492 -4687112 -8104235 -7307919 -2322732 1980608
42358 1980608 3218724 4157383 6904509 8997920 7888490 5593987 5374651 6450723
42350 6450723 5920517 4136409 3965679 5448421 5393205 2681628 305811 910743 3157415
42341 3157415 4116149 3241691 2293087 2565396 3645574 4258202 3392299 1010113 -1802486
42332 -1802486 -3618991 -3664092 -1872038 1321932 4525955 5786117 4850619 4048167 5032429
42323 5032429 5682098 2886630 -2224292 -5152233 -4249989 -2490705 -2213252 -1961347 -384512
42314 -384512 466299 -1307190 -3581527 -3383154 -1685202 -1313283 -1837997 -744213 1339566
42305 1339566 1133889 -1542353 -2934073 -1216247 841558 777597 398106 2310818 5278794
42296 5278794 6145303 4801914 4123819 5410258 6473688 4618254 -127080 -5155571
42288 -5155571 -7611515 -6331553 -2289536 2518411 6845279 10741771 14202043 15918299
42280 15918299 14260591 9463894 4061914 639188 -665222 -1902535 -4407375 -6844946
42272 -6844946 -7074998 -5490613 -4716365 -5570907 -5482051 -2432656 1453012 2700135 1525716
42263 1525716 1081668 2288254 2787391 1236220 -756542 -1876690 -3014671 -4424639
42255 -4424639 -4052199 -925150 2233932 2295568 -180436 -2462646 -3534777 -3949423 -3365023
42246 -3365023 -1192025 1152322 1471821 -45405 -1259956 -1330066 -1240875 -1377266 -874418
42237 -874418 642242 2672634 5012783 7346731 8097661 6008728 2592380 496539
42229 496539 -363111 -2140580 -4456992 -3948794 461879 5119569 6451788 5658992 6223996
42220 6223996 8644226 10215080 8977250 5640923 2258279 800925 2332918 5759698
42212 5759698 7931032 6728992 3641897 1668823 1263052 381111 -1697095 -3009879
42204 -3009879 -2031396 -138345 308353 -931808 -2176396 -2430802 -2454379 -3312044 -4857405
42195 -4857405 -5908363 -5456056 -3566657 -1340629 78095 694268 1609053 3312162 4386673
42186 4386673 2946560 -516644 -3010980 -2564433 -684901 80246 -10124 1223807 3432428
42177 3432428 3131522 -1308106 -6655935 -8862008 -8083103 -7044293 -6007563 -3015634
42169 -3015634 1148258 2199134 -1972131 -7684298 -9670820 -7268069 -4383753 -4238205
42161 -4238205 -6055147 -6801405 -4796926 -1256725 1188580 1252755 178344 10738 1199834
42152 1199834 2685580 3791179 4617992 4807905 3729288 2193145 2180813 4149264 6117470
42143 6117470 6159124 4414330 2061089 -80325 -1242397 -851339 120246 -116919 -1025911
42134 -1025911 369085 4759015 8032503 6039651 285207 -3850552 -3508515 -328236
42126 -328236 3046143 5442251 6373151 5667436 4415771 4214778 5043156 5488994 5051125
42117 5051125 4474953 3974537 3085948 2209278 2206026 2396597 1136900 -1318859 -2666189
42108 -2666189 -1742455 90991 1240298 1641415 1766885 1833310 2544926 4665759 7237922
42099 7237922 8152102 7062893 5729288 4977175 3734850 1899466 1512185 3626993 6258577
42090 6258577 6972824 5517723 2652398 -1145588 -4194988 -3653823 470490 3685424
42082 3685424 2183950 -2196574 -4832144 -4126736 -1512163 2158582 6302415 8289058
42074 8289058 6005634 2210220 1851018 4935375 6444054 3889759 429541 -833554
42066 -833554 -1131436 -2372951 -3231957 -1953904 -4735 311224 -452317 -613264 -661973
42057 -661973 -1646059 -2141989 -339420 2275290 2976850 2481548 3611674 5818189 5423175
42048 5423175 1852088 -657719 833018 3793299 4389386 2839150 1892548 2199495 2211817
42039 2211817 1377387 557206 -44128 -790171 -887110 752683 3044224 3601761 2319957
42030 2319957 1662408 2753222 3591026 2348752 282436 -380007 275145 751810 1014428
42021 1014428 1946351 2608708 864855 -2923435 -5338357 -4060000 -642301 2000422
42013 2000422 3062065 3308066 2791123 1313993 185787 1044324 3064428 3525528 1453247
42004 1453247 -1149603 -2054702 -975035 1451396 4788801 7954630 9169654 8174240
41996 8174240 6958157 6831334 6347586 3955515 1177731 725018 2509869 4292283 5617259
41987 5617259 7842639 10158482 9220993 4145478 -1199257 -2932887 -1710437 -181942
41979 -181942 1674216 5269798 8932264 8883308 4915315 1404844 1455559 3133213 3351256
41970 3351256 2698851 3522388 5040017 4079875 518222 -1573167 456515 3721543 3524287
41961 3524287 -317285 -3453380 -2947759 -741028 -484234 -2843080 -5320190 -5652588 -3901526
41952 -3901526 -1580541 44883 808991 1590073 3259367 5125080 5050251 2144977 -1271460
41943 -1271460 -1883642 702865 3857876 5576343 6203274 6264770 5073774 2734694 1262429
41934 1262429 1664609 1601927 -1531812 -6220259 -8276707 -6434503 -3811443 -3397964 -4508793
41925 -4508793 -4654321 -2880654 133147 3757323 7458697 9896018 9580408 6532404
41917 6532404 2470011 -692254 -2064802 -1646514 380818 3727548 7276501 8867088
41909 8867088 6956777 2904496 366566 1291521 3493213 3685083 1963117 1105745 1965319
41900 1965319 2407001 1297727 663976 2371958 4934180 5696650 4761212 4606194 6521284
41891 6521284 9171908 10333081 8790928 5031951 1173635 -394479 573745 1699487
41883 1699487 864297 -1280599 -2788148 -3273345 -3632378 -3749588 -2560328 -261414 1413362
41874 1413362 1453433 748679 674501 1526281 2599665 3045246 2564391 1833224 2017099 3318375
41864 3318375 4519839 4591666 3932176 3182512 1951872 53847 -1164927 -618541 274397
41855 274397 -634854 -2717578 -3282059 -1700865 -207033 -80613 372945 2801340 5805278
41846 5805278 6641881 4771881 2234501 1092699 1635433 2864595 3965416 5066975
41838 5066975 6481093 7306020 5730634 1440875 -3272682 -6001766 -6902300 -7545599 -8302312
41829 -8302312 -8771012 -9487073 -10531280 -9506375 -4303380 2549083 6026393 5209931 3874587
41820 3874587 4134231 4045795 2752396 3017066 6069427 8523589 7825513 6545921 7192271
41811 7192271 6937979 2928147 -621785 2491810 9907669 12568185 7475097 1641338
41803 1641338 1451154 4394314 4728239 2158270 327478 133356 -509773 -1896627 -1979714
41794 -1979714 -293129 1045170 626536 -425218 -430709 764545 2090560 2504127 1911029
41785 1911029 1694088 3786150 8041829 11291157 10779465 8050313 7104774 8610005 8744735
41776 8744735 5093791 969536 1073492 4509458 5922182 3538205 1898212 4736906
41768 4736906 8792309 8246614 3040728 -1616732 -3038723 -3408725 -3868635 -1504780 5196610
41759 5196610 11968353 13441428 9659695 4696244 1129157 -619830 282447 3916821
41751 3916821 7124444 6652765 4315548 4726260 8050663 9592494 7158233 4151433
41743 4151433 3761055 4320454 2858502 -128764 -2203249 -2833996 -3226795 -4134795 -5750062
41734 -5750062 -7948539 -9097185 -6828007 -1716543 2183096 2471553 1678094 3121989
41726 3121989 5954817 7215179 6753013 6753751 7697351 8090845 7405322 6237704 4198777
41717 4198777 679392 -2623543 -2953248 -392868 2076126 2650771 2504444 3187482 4335738
41708 4335738 4442030 2356354 -1983109 -6718574 -8294148 -4536693 2420311 7996170
41700 7996170 9800856 8833776 6829018 4857775 4199026 5690361 7782013 7789456 5695824
41691 5695824 4369797 5419290 7272061 8156984 8453774 8868203 8574939 6677444 3703959
41682 3703959 450666 -2731520 -4377515 -2129101 3489509 7673177 6386367 1556842
41674 1556842 -1360899 -228414 1966619 1929519 140552 -606771 935995 3148746 3526523
41665 3526523 1452793 -988865 -1141072 1279791 3978175 4885211 4106259 2807506 1741212
41656 1741212 1762923 4064368 8146509 10798307 9238829 4744653 1200243 351377 422642
41647 422642 -678528 -2825460 -4626044 -5038184 -3472722 12035 3769948 5225925
41639 5225925 3526844 635302 -993518 -948166 -398090 -142163 -155383 -357589 -714292
41630 -714292 -906259 -770568 -782568 -1329064 -1827037 -1444927 -550612 -551190 -2170135 -4509182
41620 -4509182 -5921539 -5364995 -3038994 -388606 570512 -1147449 -4255864 -6311959
41612 -6311959 -6415328 -5903891 -5816020 -4866552 -1399299 3311718 5728566 4348637 1534244
41603 1534244 171653 191932 -49476 -354999 922207 3466437 4643985 3310805 1798473
41594 1798473 2714105 5359987 7014300 6603171 5165290 3409517 1053476 -1444227
41586 -1444227 -2689502 -2490904 -2327758 -2766358 -2121651 929431 4775927 6670749 6236779
41577 6236779 5303533 4744049 3556289 1162472 -1395588 -3073481 -3847481 -3519531 -1490743
41568 -1490743 1222750 1867722 -385299 -2561858 -2052332 -994542 -3205803 -7649548
41560 -7649548 -9024240 -5311441 -634106 1084892 1502190 4000266 7497867 8061719
41552 8061719 5113792 1972272 610375 -415324 -2480762 -4664327 -5874088 -6365694
41544 -6365694 -5990122 -3448157 1206951 5304046 6332834 4551400 1774992 -715783
41536 -715783 -1936501 -952554 1276037 1491052 -2125811 -6771725 -7770215 -4044202 986820
41527 986820 3602716 3135773 1363792 274703 625609 1580681 1757357 1319517 2272323
41518 2272323 5506686 8598636 8518752 5894670 4171526 4614363 4839464 3029117 948805
41509 948805 1092365 2816050 3546640 2728796 2212066 2969996 3630450 2835644 1451179
41500 1451179 1379608 2997683 4778381 5190083 4225838 3069065 2769519 3335934 3780199
41491 3780199 2979821 812343 -1473900 -2325863 -1431614 75744 911228 577202 -945941
41482 -945941 -3329212 -5150056 -4296233 -493782 3367282 4074944 1780098 -869526 -2624686
41473 -2624686 -4141022 -4784943 -2365626 2716447 6329467 5954993 4493227 5729589
41465 5729589 8208961 7507263 3447798 714514 2024894 4632887 4865261 2932764
41457 2932764 1454359 1566230 2388740 2792750 2191195 791594 56144 1546604 4540431
41448 4540431 6449995 6377949 6217739 7172674 7576035 5885809 3521557 2413476 1797909
41439 1797909 275024 -713746 1019448 3834741 3692466 224617 -2314164 -975094
41431 -975094 2351560 4577959 5311613 5104432 2836891 -2018249 -6362317 -6224690 -2072412
41422 -2072412 1649799 2360925 1892765 2551664 3446570 2546340 486063 -143812 1294273
41413 1294273 2590314 2099143 1253195 2499910 5645626 7709176 6551866 3639569
41405 3639569 2450742 4400779 7110245 7056916 3519895 -670311 -2104495 274430
41397 274430 5269115 11218340 16629868 19807619 19631718 17066384 14511174 12952222
41389 12952222 10948660 7391834 4025626 3553026 5877423 8223368 9079261 9969001
41381 9969001 12362603 14493155 13034892 7477379 1262908 -1731217 -883300 1478073
41373 1478073 3390548 5281792 8375634 11822305 12727999 9605372 4796656 2124207
41365 2124207 2364608 2479040 -357790 -5277035 -8962006 -9323036 -7008294 -4078507 -2369294
41356 -2369294 -2779204 -4860112 -6733499 -6117895 -2093926 3880250 8623006 9353804 6119219
41347 6119219 2323299 1865015 5111364 8473782 8625294 6168343 4045938 3313104 2387885
41338 2387885 320212 -1377687 -1155154 -175908 -1058812 -4343193 -7608612 -8244914 -6057179
41329 -6057179 -2737680 334294 2893170 4805760 5416922 4262166 1831748 -778614
41321 -778614 -2546335 -2613980 -555953 2610782 4374480 3088516 390801 -40808 3397482
41312 3397482 8310378 10934983 9824967 6424543 2908800 337831 -1463529 -2953379
41304 -2953379 -3919150 -3578236 -1929573 -406869 -26335 634222 3584106 7353749 7417626
41295 7417626 2194346 -3618158 -4142904 581410 5211444 5993629 4197364 2810749
41287 2810749 2830399 3706187 4937506 5675742 4502058 1366407 -1316361 -1220817 768006
41278 768006 1595560 159764 -1134151 341302 3563051 4609994 1433128 -3322929
41270 -3322929 -5306731 -3598653 -1256123 -770412 -1080256 -137459 1493979 1606575 -153887
41261 -153887 -1879766 -2037734 -714753 1298557 2839892 2347711 -352587 -2670094 -2133768
41252 -2133768 -417649 -1525464 -5674098 -8353704 -6704533 -3579197 -3146842 -5145549
41244 -5145549 -6132822 -4408505 -886153 3329012 7171003 8487429 5925752 1683825
41236 1683825 -467044 136436 1030667 1214908 2528940 5633500 7809132 6665079 3716198
41227 3716198 2043286 2083464 2150103 1891379 2388170 3187002 2202910 -757234 -2976891
41218 -2976891 -2772699 -2311606 -4283783 -7198619 -6913245 -2612960 1728983 2703523 1549466
41209 1549466 1189480 1609913 955546 -312263 166669 2324528 3198911 1572012 -18978
41200 -18978 579303 1727816 1004102 -471467 370520 3670387 6328230 6481892 5619134
41191 5619134 5578966 5743954 4675142 3111546 3374667 5847308 7612090 5638860 855135
41182 855135 -2314858 -1098960 2003014 2192492 -1454415 -4668411 -3285171 1842545
41174 1842545 6190105 6442710 2838282 -2217255 -6300230 -8143543 -7938296 -6674426
41166 -6674426 -5052082 -3522972 -3099645 -4519059 -6281765 -5538143 -1954731 1242774
41158 1242774 1470198 37652 -635179 -1041289 -3215184 -6745958 -9069870 -9083672 -7884901
41149 -7884901 -6431924 -4941433 -4134609 -4553036 -4948138 -3765116 -1865742 -1404719 -2634450
41140 -2634450 -4465216 -7223446 -11339766 -13982245 -11424417 -5141954 -1048744 -1549343
41132 -1549343 -2852886 -1906711 -1203046 -3643648 -6839186 -6654331 -3487745 -778913 603971
41123 603971 2215445 3784016 3501520 1969377 1836173 3465675 4444878 3656838 2693899
41114 2693899 2815808 3434195 4176678 5649637 7306643 7108917 4412795 1099820 -1175101
41105 -1175101 -2893782 -4820574 -6232673 -6385166 -6116082 -6449946 -6793699 -5974771 -4081660
41096 -4081660 -1809283 1121955 5058985 8296246 7949116 3615451 -1380458 -3625970
41088 -3625970 -3497570 -3749781 -4791952 -3923240 -135901 3041501 2148207 -518105 347367
41079 347367 4914626 7210468 3648080 -1562395 -2407193 799626 3151734 2850078 2630157
41070 2630157 4141288 5291973 3991950 1195568 -1126687 -2809712 -5018384 -8216223
41062 -8216223 -11249166 -11869086 -8829162 -4429387 -3271275 -6350642 -8399357 -4575104
41054 -4575104 1855630 3233882 -1773788 -6743041 -7393298 -6780999 -8171039 -8704310 -4730807
41045 -4730807 966540 2855939 938243 -248977 515862 1079 -2688695 -3537861 414096
41036 414096 6370342 9349733 8106525 5434386 4079674 4267550 4759801 4957494 5483632
41027 5483632 6737250 7363883 5463199 1827939 236455 2876900 6819095 7232869
41019 7232869 3275090 -1581892 -4450824 -5485073 -5541694 -4474586 -2673250 -1747563 -2277808
41010 -2277808 -2749017 -2010321 -1044332 -790778 195560 3846329 9045393 11968648 10150040
41001 10150040 5043363 296068 -1713364 -1309718 -160055 679997 1062613 726417 -772614
40992 -772614 -2716388 -3099341 -1054838 1462466 1943521 670413 1864 726754 1416314
40983 1416314 1577089 2807930 5621932 7399728 5512755 1098131 -2322085 -3101192
40975 -3101192 -2317178 -1007710 965736 2992498 3031898 282682 -2848589 -3152639 -465567
40966 -465567 2429211 3556976 3630542 3724124 3094755 982778 -920256 -459597 1001484
40957 1001484 -269149 -4574995 -7372275 -5424510 -1352437 765303 1630574 4467157
40949 4467157 8196433 7979295 2740198 -2670085 -4143711 -2872628 -1411710 474060
40941 474060 2997955 3157032 -1368571 -7303366 -9070086 -6013012 -2607949 -2090062 -3453837
40932 -3453837 -4572210 -4759034 -3818584 -1630509 622198 1357731 1197877 2153175 3890177
40923 3890177 3714262 998737 -1392033 -1341912 -258759 -851 150679 1277193 2106000
40914 2106000 1233472 118825 822894 2074517 781152 -3140273 -6452078 -6982296 -5585304
40905 -5585304 -3703830 -1808944 -695716 -1415116 -2830946 -1952212 1625536 4049921
40897 4049921 2412442 -193287 1934246 9079595 14770225 13510002 7357951 2801028
40889 2801028 2555711 3192731 942255 -2908353 -4250939 -2219458 -198692 -649739 -1707352
40880 -1707352 -551061 1870128 2099655 -708331 -3820485 -5202359 -5884243 -7017562
40872 -7017562 -7284724 -5329030 -2786472 -2157050 -2690700 -1398781 1893874 3510835 1028133
40863 1028133 -2885145 -3521531 236268 5085294 7429560 6635687 4282732 1820150
40855 1820150 -280991 -1943321 -3077986 -3734741 -4051907 -3884861 -2929377 -1518477 -800464
40846 -800464 -1406152 -2235522 -1657898 36427 764770 -292543 -1407952 -1165880 -803315
40837 -803315 -1721207 -2269033 -27474 3474045 3991721 943464 -1121304 1115731 5219783
40828 5219783 7004061 6088831 4608655 2866375 -73773 -2938905 -3277621 -1557557
40820 -1557557 -857428 -2429218 -4515436 -5598099 -5808775 -4932179 -2239085 1047204 2328054
40811 2328054 1751109 2657310 6428963 9871475 9696999 6879350 4084606 1159182 -3691621
40802 -3691621 -9642458 -13334865 -12872202 -9436534 -5296463 -2192419 -1213078 -2144044 -2999210
40793 -2999210 -1895882 729389 3167570 5095326 7314400 9241327 8946542 6095528
40785 6095528 2954738 1658561 1768215 1345034 -447026 -2619625 -3883010 -4302853 -5151576
40776 -5151576 -6957687 -8228979 -7251067 -5025599 -4553660 -6528361 -7837362 -5816822
40768 -5816822 -2057065 29287 -291778 -1382417 -2414685 -3323135 -2887874 -311044 2056111
40759 2056111 1283689 -1140197 -910284 2254722 3781902 1418212 -1213627 -435497 2155942
40750 2155942 3233620 3201436 4366572 6151730 6173328 4531101 3109458 1660441 -1407183
40741 -1407183 -4762423 -4809863 -1196295 1967011 1625588 -439057 -882346 632032 2042175
40732 2042175 2323280 2276633 2689616 3219729 2818025 621123 -2936732 -5594079 -5082676
40723 -5082676 -2121584 -180074 -1234110 -3226456 -3270653 -1997850 -2398951 -4974191 -6760963
40714 -6760963 -5644055 -3192875 -2009009 -2209484 -2183675 -1311284 13147 1808398 3609677
40705 3609677 3124849 -1148690 -6130631 -6454838 -1421053 3781006 5379663 5887017 8865655
40696 8865655 12396346 12259427 9312220 8236552 9708453 9548751 6291413 3881602
40688 3881602 4795051 5715672 3361433 261806 546073 3150553 3753341 1478384 -624731
40679 -624731 -532220 1155633 3464571 5210804 4071937 -455760 -4005109 -1697704 4604644
40670 4604644 7965404 5743113 2593629 2787285 4223409 2799891 -927051 -2920675
40662 -2920675 -1369113 1877570 4334287 4859829 3466411 1170676 -517029 -1275881
40654 -1275881 -2318912 -4076470 -4972253 -3956558 -2824120 -4031967 -7057285 -8889809
40646 -8889809 -7792468 -4853071 -1828840 1037238 4527617 8521219 11210172 10634352
40638 10634352 7237935 4240466 4377484 6667380 7889848 6918958 5428905 4217694
40630 4217694 1707767 -2601895 -5810197 -5008662 -1384747 1328880 1445796 259260
40622 259260 -805409 -1728861 -2689595 -3114840 -2329281 -288585 2390181 4739934 6199929
40613 6199929 7298982 8816992 10192672 10036498 8336901 6390268 4287187 821482
40605 821482 -3427619 -5777148 -5582937 -5701689 -7780315 -9137244 -7142150 -3896918 -3131271
40596 -3131271 -4827566 -6646331 -8377850 -10641426 -11252337 -8088511 -4231039 -4502668
40588 -4502668 -7405853 -6698911 -1464232 1948926 -136903 -3190222 -2022587 1726778
40580 1726778 3712616 3690261 3443986 1871979 -2389901 -6158977 -5236154 -1324093 -16373
40571 -16373 -2421803 -3918747 -1541245 2195344 4038507 4420465 5162360 5906370 5272028
40562 5272028 3710742 3001659 3750198 4938796 5566573 5642915 5510651 4724613 2111352
40553 2111352 -2538566 -7073573 -8567177 -6737909 -4311331 -3196445 -2164615 232026
40545 232026 2485210 2297342 442937 -418967 33400 -279825 -2017677 -3496375 -3727902
40536 -3727902 -3608922 -3637737 -2992137 -1484306 -90137 1073190 2927903 4852233 4384471
40527 4384471 762041 -3259159 -4476387 -2613477 321634 2383237 2435333 360450
40519 360450 -2176852 -2642921 -591819 1495451 1386040 -133373 -728323 411371 2074915
40510 2074915 2685298 1561527 -698441 -2567272 -3115873 -3217008 -4019324 -4553359 -2868758
40501 -2868758 522696 2889312 3311942 3640484 4710493 4785986 3102846 1738046 2112307
40492 2112307 2799767 2963295 4533980 8066075 9839273 6980414 2673936 1819543 3673868
40483 3673868 3700226 1229247 -53899 1252410 2464131 2110509 2182050 3982506 5916221
40474 5916221 6634456 6643044 5736440 2696309 -1215636 -2414033 -248699 1719351 1517252
40465 1517252 1860586 4996888 8210258 7658208 3731788 -616165 -4287270 -7416534
40457 -7416534 -8553608 -6140765 -1564347 2296532 4499383 5568294 5184016 3184632
40449 3184632 1498982 2116658 4129849 5397396 5869074 6496379 6349207 4169077 1609286
40440 1609286 1240790 2122342 1315476 -545468 410136 4759804 7907201 6514520 3327162
40431 3327162 3088302 5975084 7756292 5421524 547063 -2775472 -2229912 631276
40423 631276 2408866 1908018 1305426 2606236 4385050 3881801 1248097 -756861 -805445
40414 -805445 -155961 118235 460952 1159271 1753830 2472951 3972448 5331882 4676220
40405 4676220 2240456 469773 497272 738513 -453289 -2819575 -5212284 -6434672 -5074722
40396 -5074722 -1107141 2330127 1838775 -1287726 -2363105 -7526 2240399 1906693
40388 1906693 1046650 2105043 4316161 6281100 8244552 9512919 7672761 3241572
40380 3241572 1053173 3521351 6330896 4829612 1114933 146677 1985686 3101757
40372 3101757 2901475 3419291 4273332 3505528 2261626 3124329 4603980 2894432 -1255473
40363 -1255473 -3127325 -1660701 -846098 -2817093 -5123421 -6082032 -7342688 -9288092
40355 -9288092 -9111713 -5971871 -3418218 -3833889 -4489854 -2146855 1829965 3929885 3279210
40346 3279210 1430598 -79649 38688 2241273 4020846 1635355 -4114656 -7540979
40338 -7540979 -5864847 -3303688 -4206425 -6244044 -4813736 -850070 979822 -188331
40330 -188331 -933178 335692 1629887 1733849 2195390 4370826 7442849 9766540 10052104
40321 10052104 7629867 3767556 1900512 3937863 7031441 6707613 2637943 -1368822
40313 -1368822 -2550831 -1585552 -182334 891263 1300777 968961 486313 49349 -1350546
40304 -1350546 -3931546 -5555831 -4432608 -2059189 -857794 -352680 1159476 2552688
40296 2552688 1307035 -1842634 -3690243 -3605977 -3805655 -4726825 -4339845 -2431388 -1416922
40287 -1416922 -2025582 -1997149 -108667 2047840 3293383 4354291 5109077 3893646 760028
40278 760028 -1941542 -3313524 -4774406 -6221348 -5274947 -1748151 1129176 1657759 1932489
40269 1932489 3482244 4914538 5884112 8686409 13168673 14845948 11550236 7310047
40261 7310047 5638462 3849913 -760894 -3698528 941805 10376262 15991278 14877458
40253 14877458 11724425 9969518 8118571 5466758 4707209 6689442 7904344 5735094
40245 5735094 2163130 44999 -767711 -1495705 -1693490 -541061 1376742 3000609 3579941
40236 3579941 2103770 -1480100 -4331741 -3359977 -299549 -340060 -4607573 -8023800 -6480915
40227 -6480915 -2324603 -217409 -911849 -2119829 -2935994 -4197357 -6040915 -7655569
40219 -7655569 -8308513 -7047238 -3103594 1995627 4885427 4475718 3294220 3298358 3274657
40210 3274657 2213381 1760895 2603663 2017956 -1287008 -3216460 152242 5673770 7169901
40201 7169901 4661745 3696713 6041324 7216731 4236121 99865 -1551415 -1509450 -1967546
40192 -1967546 -2276906 -902441 1240656 2581428 3920285 6584479 9083974 8728452
40184 8728452 5898242 3893445 4446616 5588594 4583569 1528077 -907361 -816466 731177
40175 731177 1262927 266230 -348879 338886 235412 -2520853 -5865103 -6381986 -4772556
40166 -4772556 -4933948 -7330108 -7580116 -3329880 1532796 2426093 487800 -277123 298815
40157 298815 -803217 -3769187 -5417291 -4776058 -4657487 -6322509 -6476102 -2120745 4149110
40148 4149110 6757852 4134692 495448 472550 3888468 6925982 7508095 7669054 9822265
40139 9822265 12247217 10863646 5604693 1929658 4068840 9235810 11542520 9907648
40131 9907648 8200148 8303652 7669311 4615789 1644219 1262156 2119481 2231906 3035572
40122 3035572 6455748 10005265 9334780 5220281 3644175 7875136 13881627 15427136
40114 15427136 11355612 5820921 2915884 3261960 5180445 7122431 8539226 9412227
40106 9412227 9514603 8202074 5292508 2202587 1270341 3210079 5953868 7034588
40098 7034588 6596201 6697689 7808524 7779812 5089425 1632862 744040 3188411 6864846
40089 6864846 10159764 13390507 16391844 17105212 14442260 10919041 9931801 11151408
40081 11151408 11275711 9179127 7343955 7505002 7918960 6682022 5157403 5531783 6747418
40072 6747418 5885181 2784223 341411 302896 1410165 2076400 2476860 3171123 3653801
40063 3653801 3393116 2968171 3242631 4268866 5342895 5200445 2421987 -2636219 -6434105
40054 -6434105 -5176694 247084 4705324 5235188 4424279 5772941 8411906 9149474 7711929
40045 7711929 6513198 6224244 5155416 3071636 2355560 4501675 7927585 10314021
40037 10314021 11200727 11309118 10999454 10438373 9955722 9403704 8407359 7835728 9450787
40028 9450787 13198197 16411320 16983492 16121946 16612436 19292201 22588965 24902424 26247393
40019 26247393 28003433 31950871 39014078 48172651 57222676 65204219 73214417 82448188
40011 82448188 93104840 106227168 124630319 150327981 183211974 224570761 278460721
40004 278460721 343315950 402098660 428070836 406111161 347083352 278251076 220894702
39997 220894702 179332908 148131683 123104883 103454483 88078709 74535194 61409337
39990 61409337 49407735 39900483 33560538 30382643 29886374 30832340 31248572 29360366
39982 29360366 24928337 19813033 16665025 16250755 16311753 14194931 10634565 9317181
39974 9317181 11894144 15111003 14768667 11572097 10429902 13588178 16973868 15039771
39966 15039771 7758460 658750 -1611412 350089 2984719 4314102 4927866 5783614
39958 5783614 6828279 7576180 7685131 6863593 5267016 4067582 4515080 6190039 7320732
39949 7320732 7180638 6855836 7007508 6451672 4295096 2105158 1964760 3153353 3024213
39940 3024213 944528 -1042654 -1783903 -2741700 -5105016 -7303709 -6951500 -3791443 658265
39931 658265 4960951 7863030 8110995 6040475 4184681 4439400 5633490 5617247 4350738
39922 4350738 2754408 144458 -4063076 -7281171 -6242598 -2257617 26279 -642397
39914 -642397 -982758 309858 -115572 -3968333 -6998948 -4968827 -464198 933024 -1077118
39905 -1077118 -2105720 -646030 207932 -1391277 -3331436 -3592858 -2825113 -1549234 1402053
39896 1402053 5837875 8898242 8899683 7766643 7585847 7403540 5826242 4303218 4819812
39887 4819812 6091498 5228667 2196354 -308061 -842352 -417050 -113924 -83867 -666300
39878 -666300 -1897978 -1993626 853652 4836557 5732826 2748234 163112 1328379 3759739
39869 3759739 3033204 -384612 -1881997 256771 2409763 1269109 -1314312 -1479153
39861 -1479153 710649 1537239 -689908 -3156173 -2515041 834454 3862836 4906075
39853 4906075 4813241 4710435 4388984 3191039 1320877 -304214 -1007118 -877015 -694528
39844 -694528 -1403567 -3259183 -5391114 -6443244 -5610757 -2972030 714743 4099606 5675998
39835 5675998 4957716 3020365 1204149 -400439 -2381930 -4312088 -4777102 -3186444
39827 -3186444 -658127 1058363 961147 -739438 -2837425 -4006286 -4039602 -3757511 -3224378
39818 -3224378 -1349291 1556017 2555217 -158800 -3609782 -3508451 -852970 -998272 -5479980
39809 -5479980 -9056136 -7002926 -1735061 822458 -1210379 -4923503 -7378560 -7782652
39801 -7782652 -6294701 -3926605 -2864509 -4105055 -5490977 -4564396 -2269634 -1021922
39793 -1021922 -318983 2222454 6123148 8178563 7528929 7069297 9131585 12744430 15740395
39784 15740395 16702193 14459430 8957051 3355406 1806116 3934905 4922992 2564224
39776 2564224 654176 3070849 7734518 9478500 6585807 1498489 -3074176 -5756389
39768 -5756389 -5734640 -3491291 -1534295 -1821475 -3020680 -2371908 548882 3841065 5974067
39759 5974067 6468578 5156130 3054784 2740659 5281021 7909068 7487880 5164116 4401395
39750 4401395 5315899 4768520 1905896 -420549 -500972 -313544 -1827609 -3910596 -4618956
39741 -4618956 -3970544 -2762374 -980939 931467 1498587 762149 1302126 4566135 7893356
39732 7893356 7445299 2922633 -2499524 -5740790 -5640457 -2723956 767358 1855417
39724 1855417 -23431 -1904655 -1282428 275876 -1842 -1212727 -301970 2328996 2828412
39715 2828412 -85551 -3025285 -3196028 -2299487 -3096046 -4810011 -4487392 -1146314 3649628
39706 3649628 7877618 9727021 7835427 3277185 41772 894411 3574733 3703208
39698 3703208 802647 -1440781 -672860 1465224 2618840 2736816 2772105 2909634 3450187
39689 3450187 5282057 7922236 8953074 7069243 4124636 2582583 2505455 2722440 3232407
39680 3232407 4278230 4555865 2950585 1011635 969122 2036082 1620758 -215933 -796680
39671 -796680 524554 1223593 71079 -616773 1027589 3059529 2754464 808402 -208822
39662 -208822 -74744 -701189 -2484825 -3687385 -3411310 -2770026 -2657385 -2261661 -483887
39653 -483887 2457362 5316165 6690906 5463332 1671981 -2608197 -4476446 -3093846
39645 -3093846 -601304 583617 786982 2439613 6475759 10305541 10183534 5520306
39637 5520306 -104803 -2931764 -3281202 -4441126 -7547285 -9609035 -7555155 -2572423
39629 -2572423 1197675 1366598 -845329 -2809363 -2924121 -1130814 1443910 3147624
39621 3147624 3096062 1978184 1131283 1227708 2322688 4250547 6119079 6503938 5264446
39612 5264446 3957657 3214202 1446771 -1899009 -3895054 -2105434 616826 -465969
39604 -465969 -4446050 -5546352 -1958557 1311674 361368 -1905082 -1316278 710442 378697
39595 378697 -1706444 -2256572 -1783856 -3705380 -7637365 -9185415 -6969679 -4629301 -4344915
39586 -4344915 -3253492 1105801 5863386 6755055 4151896 1732100 1211400 1771360 3085142
39577 3085142 5248427 6565057 5043195 1997699 890875 2373487 3672637 3451626
39569 3451626 3840845 6153379 7708763 5386949 272123 -3792619 -4827439 -3389797
39561 -3389797 105883 5636399 11324335 13849692 11901548 7374758 2670090 -1409877
39553 -1409877 -4700741 -6733510 -7751455 -8963804 -10654252 -11431106 -10386711 -8600897
39545 -8600897 -7437435 -6837132 -6491362 -6990899 -8109363 -7560132 -3698845 1634429 5199138
39536 5199138 6289623 6271787 5400859 3232629 1449161 2386610 4473800 3213608 -2014567
39527 -2014567 -6155037 -5772793 -4346874 -6625575 -10575111 -9873961 -3518103 2061130
39519 2061130 1536179 -2582806 -3956858 -619407 3516971 4274992 1815474 -592499
39511 -592499 -646373 1176687 3133105 4148006 3849110 1915958 -1087155 -2684331 -465930
39502 -465930 4231603 6748205 4780024 1854184 2821284 7125548 9543033 7329881
39494 7329881 3437420 1814007 2405586 2603006 1564736 746232 1054737 1633293 1469479
39485 1469479 815686 762033 2038047 4158963 5461513 4592744 2421061 1538036 3027928
39476 3027928 4768314 4263513 2244414 1516540 2598896 2872610 684394 -1867925 -1757293
39467 -1757293 764697 2640381 2115627 626050 538883 2423209 4933217 6371979 5909977
39458 5909977 3974044 1858878 558875 -73540 -577533 -690605 54036 825912 213071
39449 213071 -1298099 -1358383 944213 3636143 4942353 5916512 8013122 9656483 8018421
39440 8018421 3526769 -238034 -1120901 -268506 766879 2131721 4204767 6430532
39432 6430532 8460460 10292911 10663030 7879820 3158458 165269 -189970 -1305771
39424 -1305771 -5049504 -7651686 -4763587 1983521 7418015 9880228 11404758 12214605
39416 12214605 10349984 6983034 6784033 11130022 15188252 14290384 9875510 6253243
39408 6253243 4202860 1267602 -3126903 -6408860 -6611115 -4802742 -3315078 -3104053
39400 -3104053 -3237696 -2087781 996326 4591476 6162991 4815248 2550404 1992424
39392 1992424 3436344 5059204 5446063 4726979 3558120 2307390 1403213 1412506 2293624
39383 2293624 3181686 3332745 2881804 2279425 1326832 -538614 -2853649 -3734210 -1671602
39374 -1671602 2437722 5929587 7133317 6591939 5466736 4197784 3417712 4492173
39366 4492173 7577098 10319529 10358285 8391597 6957122 6863541 6880677 6470759 6524502
39357 6524502 7414772 8415912 9147272 9735447 9698284 8627547 7593527 7638562 7547959
39348 7547959 5992516 5119340 8051126 12891499 13942564 9910941 5965637 5633659
39340 5633659 5768528 2890744 -312828 364894 3137809 2939778 -497317 -2821678 -2255404
39331 -2255404 -1318368 -1506846 -1061732 1332662 4540403 7355699 9652830 10822141 10159908
39322 10159908 8943011 9026718 9520183 8252969 6299286 6995949 10156553 11523390 8917878
39313 8917878 4907429 2248043 814903 485657 2662356 6682068 8792148 7437536
39305 7437536 5928789 6993484 8344447 7071290 4931248 5116190 6682663 6913306
39297 6913306 7037798 10414395 16083814 19251693 18147384 15866339 15044950 14996946 14901749
39288 14901749 15648393 17029494 16762080 14262299 12467844 13914101 17433840 20588476
39280 20588476 23008424 25352795 27302641 29013209 32580392 39328142 47184957 53680110
39272 53680110 60277895 70349606 83599786 96548194 108866220 124681592 145242853
39265 145242853 163866124 171914383 168061548 158095103 146821523 134591122 122040043
39258 122040043 113342755 111867553 115502797 119720089 123989859 132069636 146284549 164072981
39250 164072981 180300866 191055739 195313529 195217574 195467551 200854823 213330499 231348942
39242 231348942 250737195 264754130 265233793 247787816 216934811 183534883 155943431
39235 155943431 135145710 118244540 103356143 89871916 77130403 65298270 55820772
39228 55820772 49237204 44200351 39954675 37555753 36982650 35519965 31283940 26160371
39220 26160371 22742489 20435994 17353319 14008591 11891270 10146577 7325052 5083003
39212 5083003 6176258 9545800 11428872 11070075 11314057 13383218 15049011 14624139 13071803
39203 13071803 11327136 9100351 7311660 8070129 10829537 11983035 9952416 7565148
39195 7565148 7680671 9506181 11028511 11956489 12125125 10047804 5657884 1983602 1624144
39186 1624144 3779996 6706043 10153680 13037414 12223716 7174141 2707903 2986223
39178 2986223 5348606 4691560 1598330 688380 2465739 2947783 1122751 530169 2388105
39169 2388105 3009585 215478 -2716200 -2226081 657463 3499983 6574380 10414288
39161 10414288 12660548 11305471 8712605 8542329 10366149 10976493 9688276 8609699
39153 8609699 8414672 7498445 5303914 3409260 3053647 4031048 6023093 8586074 9846086
39144 9846086 7845495 3663437 990343 2033758 5543512 8960972 10595905 9713280
39136 9713280 6738927 3677749 2242324 1461541 -571949 -2744304 -1884535 1840339
39128 1840339 4183836 3031296 1814865 4243164 8667023 10878293 10158734 8901853
39120 8901853 7820170 5509043 2243222 503809 1409123 3466860 5104163 5908470
39112 5908470 5375332 3148789 608021 -570508 -1497622 -4561302 -8603745 -9433627 -6249271
39103 -6249271 -3539280 -4498756 -6367279 -5326609 -2662034 -2135464 -3762716 -4669095 -4488576
39094 -4488576 -5072256 -5537808 -2787735 2447852 5062331 2895076 300728 1658063
39086 1658063 4837131 4758104 1154960 -1263343 431634 4181913 6714347 7353311 7005224
39077 7005224 5816818 3716734 2050736 2668748 5293672 7089632 5612458 1828849
39069 1828849 -575933 840698 4584206 7080839 6720176 4944445 3522794 2482556
39061 2482556 1540359 1903595 4688079 8130661 8600369 5004238 544993 -1124171 -443876
39052 -443876 -943504 -3902541 -6047950 -3796421 1506867 4727013 3288043 175221
39044 175221 -431129 1444991 2564927 1586601 443923 796791 1879413 2573822 3082664
39035 3082664 3259292 1670308 -1622773 -3235717 -137769 5767548 9493057 9183826
39027 9183826 7828990 8407428 9956455 9751273 7403468 4936470 3804209 3653621 3824798
39018 3824798 4618385 6686441 9852823 12838852 13946139 12158548 8026931 3532096
39010 3532096 783091 678360 2698937 5617567 8148814 9285115 8680072 6929631
39002 6929631 5177420 4211181 4034026 4302222 4754707 4896831 3774897 1033900 -1698760
38993 -1698760 -1613683 2225826 7285633 10104200 10077327 9455037 9711165 9582682 7355703
38984 7355703 3625252 480813 -1257583 -2581265 -4262841 -5503337 -4977727 -2669151
38976 -2669151 -276212 277295 -1149065 -2579971 -2064510 120269 2306945 4184396
38968 4184396 6991797 10512921 11903243 9067451 3856510 124252 -466130 1029083
38960 1029083 3426329 6151229 7844947 6905202 3872504 1123503 -403610 -2115092
38952 -2115092 -4588768 -5678684 -3414744 678059 3065860 2396408 581269 -196141
38944 -196141 -213880 -1484840 -4913258 -8838389 -10723834 -10065309 -8743008 -8144526 -7258457
38935 -7258457 -4867043 -2251094 -1358609 -1050916 1654276 6318765 8535931 6104863
38927 6104863 2544238 2010481 3362233 2504298 -1161393 -4254443 -4488674 -2603036 478211
38918 478211 4595815 7904047 7300656 3032337 -257976 559249 2602801 1240582 -2930751
38909 -2930751 -4835488 -2135542 1766337 2745602 1193403 522038 2196620 4378306
38901 4378306 4929064 3893706 2747776 2481854 3102269 4370863 6259671 8607286 10647753
38892 10647753 11253543 10037796 8233931 7846746 9468222 11528063 12430886 12720382 13821102
38883 13821102 15217653 15002002 13374677 12921352 14049857 12846496 6318960 -1944348
38875 -1944348 -5080399 -1637672 2730169 2992634 597638 -254584 845596 729083 -2102902
38866 -2102902 -5429651 -6291486 -3994297 -185732 2636667 2910240 1520194 1206341 3429367
38857 3429367 6433467 7531109 6426484 4762574 3235435 1183747 -1310411 -3036400
38849 -3036400 -3532343 -3485020 -2913537 -767170 2922124 5974273 6225776 3986761 1557862
38840 1557862 786723 1648296 2936063 3882822 4835425 6091931 6523071 4660706 1373129
38831 1373129 -404855 343862 1051828 -288464 -1526964 66838 2418171 1141055
38823 1141055 -3080512 -4482148 -656037 3676176 3711998 1296085 1051760 2879225 2793916
38814 2793916 -253798 -2990674 -3296487 -3055312 -4261209 -5236524 -2845422 2846567 7956400
38805 7956400 8736566 5317233 1344454 132200 1540214 3044346 3380569 3711453 4957118
38796 4957118 5817213 4706423 2280165 399154 -505474 -1359769 -2413802 -3024561 -3120533
38787 -3120533 -3260990 -3407577 -3101470 -2709617 -3051400 -3860932 -4034505 -3438456 -3129500
38778 -3129500 -3629631 -4145075 -3645302 -1751627 1380564 4989854 7521288 7512693 4768855
38769 4768855 163872 -5084203 -9156281 -9910293 -7251769 -4440889 -4792447 -7351612
38761 -7351612 -8185966 -5975457 -3675241 -3955030 -5569035 -5655086 -3598832 -890516 1376116
38752 1376116 3012141 3640571 2868342 1327133 331603 493573 1268443 1659140 1041668
38743 1041668 -241075 -816940 607617 3759946 6863544 8206593 7157251 4118026
38735 4118026 632669 -906206 564368 2810294 2362762 -1066759 -4067080 -3924242
38727 -3924242 -1575054 507999 1192782 393989 -1771819 -3909462 -3560829 -582889 1496073
38718 1496073 -104300 -3123747 -3166520 -20036 1869163 -819410 -6534739 -11207663
38710 -11207663 -12222286 -9547882 -4860511 -567191 1439291 1097127 82407 228509
38702 228509 2107874 4684274 5946153 4514316 1189703 -1678848 -2640674 -1994570 -215701
38693 -215701 2482542 4451462 3173365 -787564 -3028749 -1020625 1778259 698642
38685 698642 -3258773 -5210747 -3735969 -2104778 -2597163 -3896680 -4503167 -4844042 -5238118
38676 -5238118 -5102344 -4780271 -5080763 -4923984 -2887802 -779998 -1344994 -2654011 -236742
38667 -236742 4750194 6001315 2416447 744826 4447320 7384093 4182525 41416
38659 41416 2535142 8963919 10933903 8042162 7023734 8776481 6824996 -234020
38651 -234020 -4835193 -2264386 2280026 2896967 1703746 2813296 3971637 937396
38643 937396 -4173652 -5771385 -3388401 -1257718 -1144341 -1357093 -1631826 -3297526 -5010106
38634 -5010106 -3683964 29996 1993454 912319 -69806 975920 1929062 1005398 -72671
38625 -72671 471396 1208321 327587 -879181 -160336 1862885 2646945 1371759 -536724
38616 -536724 -1560384 -914598 1631775 4739463 5459092 2682592 -159425 1219627 5616754
38607 5616754 6798420 1338252 -6692965 -10656595 -8873336 -4942619 -2154538 -678294
38599 -678294 101781 -184898 -1239525 -1236560 620608 2444192 2389926 1542497 1935095 2944777
38589 2944777 2379274 568334 338343 2625309 4968124 5225575 4190444 3288527 2155449
38580 2155449 209294 -1471174 -1790787 -1409616 -913035 1038099 5369170 9808387 11074190
38571 11074190 9068673 6599034 5665463 6199514 7563464 8832020 8373640 5774478
38563 5774478 3485680 3810889 5045816 3861115 916118 199925 2717141 5049298
38555 5049298 5064776 4775576 5793593 6038658 3623385 670898 160848 1423554 1716221
38546 1716221 305527 -1692803 -3671033 -5152870 -4913420 -3018095 -1822408 -2376613
38538 -2376613 -2111893 779427 3065594 679256 -4492283 -6610719 -3926279 -322036
38530 -322036 991422 896035 1093841 1631139 2607632 4651769 6720468 6820773 5634071
38521 5634071 5791249 6905718 5661801 2120460 1077905 4580292 7624827 5036099
38513 5036099 -939509 -4117180 -2837044 -613349 -96258 -651143 -1027349 -671277 1060978
38504 1060978 3813336 5177576 3913915 3061146 5935674 9857908 8600406 1476226
38496 1476226 -4783256 -4850754 -1334271 -20471 -2037683 -4041573 -3959336 -2949135 -2466621
38487 -2466621 -2480677 -2692281 -3149857 -3125888 -1192099 2681098 6248802 7283895 6236691
38478 6236691 5545483 6324339 6962218 5823966 4280643 5181412 8403230 10210132 8065472
38469 8065472 4015851 1521387 708108 -695961 -2867343 -3426138 -1339052 1611757
38461 1611757 3772342 5462141 6956413 6894221 4158626 -52355 -3264594 -4015976 -2538103
38452 -2538103 -150051 1540657 1680820 657676 -987953 -3395891 -5953724 -6359294
38444 -6359294 -3522219 -445264 -1044859 -4483877 -6233453 -4739433 -2809889 -1741101
38436 -1741101 947578 5849313 8663501 6377615 2494169 1967068 4117783 5029842
38428 5029842 4269766 4218571 4632359 3217432 707658 148666 1288104 656096 -2334012
38419 -2334012 -4052535 -2355782 632409 2627855 4098258 5629724 6112152 5301956
38411 5301956 4884714 5207714 4101526 876938 -1536837 -719737 1576212 2316281 1624308
38402 1624308 1888692 3924504 6161476 6730212 5056410 2407694 1436863 3561444 6495055
38393 6495055 6652620 4241647 2875610 3585511 3203995 236127 -1991245 -766947 1354654
38384 1354654 792758 -1611474 -3241494 -4592334 -6973962 -7991282 -4536039 1256323
38376 1256323 4123584 2866739 685175 -813558 -2780804 -4552885 -3375136 377391
38368 377391 2544670 1214375 -728485 -560539 679029 1223302 1550407 2344850 2647816
38359 2647816 2005714 1709141 2199053 1989022 773482 699393 2682637 4236146 2987191
38350 2987191 -150009 -3130038 -5402978 -6472182 -4809276 -703382 2501763 2714557
38342 2714557 2111881 3062420 3801159 1778545 -1018640 -507548 2908352 4586658 2326249
38333 2326249 -1071099 -2393499 -1917920 -1837194 -3265452 -5707950 -7752972 -7759106 -5283684
38324 -5283684 -2039278 -245615 -220385 -659999 -557003 428213 2262755 3450734 1203184
38315 1203184 -4724751 -9672382 -8774443 -3341834 823275 1124270 446568 1513954 3057164
38306 3057164 3048569 2259488 2376667 2967041 2432179 400553 -2302658 -4597051 -5145850
38297 -5145850 -3305853 -918459 -816088 -2478912 -1980034 2050208 5447159 4186698
38289 4186698 366052 -1080348 198587 50539 -3290929 -6633315 -6777962 -4467851
38281 -4467851 -2116932 -589123 75304 -732609 -2657031 -3294880 -1099599 1745640 1804401
38272 1804401 -859017 -2899391 -2560580 -1629661 -1822480 -1917475 -301189 1707406 1677350
38263 1677350 60543 -545511 233818 88303 -1529243 -1751673 1222820 4741999 5236354
38254 5236354 3108226 1318714 718264 72204 -273592 1400968 4224299 4773322 2222436
38245 2222436 163514 1447008 3887445 3480143 15819 -3101332 -3604219 -2435857
38237 -2435857 -1294911 -214305 1820202 4882793 7334104 6993935 3367103 -1175416
38229 -1175416 -3044753 -637359 4430165 9108922 11136425 9825538 6249336 3020452
38221 3020452 2420611 4081182 5642407 6018839 6450323 7792288 8695359 7754210 5971385
38212 5971385 5494218 6665036 7533858 5937950 1671054 -2715772 -3496944 220663 4181738
38203 4181738 3086912 -2566197 -6616885 -5193833 -1201434 997863 1776555 3875909
38195 3875909 6830643 8084852 8024237 9429038 12452523 14222555 13487469 11938944 10543824
38186 10543824 8160860 4733575 2637182 3361467 5197819 5599462 4140001 2233890
38178 2233890 1489803 2934848 6291925 9536576 10572497 9479406 7716698 5588703
38170 5588703 2556759 -432016 -1610210 -1324221 -1507169 -2121520 -1231658 941912 1494794
38161 1494794 -469387 -1911165 -382667 2329708 3084577 1557437 -423436 -1623301
38153 -1623301 -1590813 -33737 2147814 2977911 2225147 2243451 4317542 6146793 4893271
38144 4893271 1003715 -2783988 -4518463 -3603412 -473871 2554869 2581272 324989 319529
38135 319529 4395106 8039372 6708444 2796204 1748258 3497960 3238819 -346787
38127 -346787 -3457472 -3948658 -3991869 -4608692 -3019416 1833977 5615611 4090496 -786199
38118 -786199 -3974266 -4368835 -4850196 -6462734 -6567818 -3369338 676656 1573634 -1364742
38109 -1364742 -4789324 -5299740 -3272169 -2123719 -3962541 -6979042 -7787703 -5399911
38101 -5399911 -1639762 1601476 3706335 4227244 2587433 -614913 -3688399 -5796477
38093 -5796477 -7348199 -8094597 -6719033 -3166937 393903 2141406 2676823 3338200 3937875
38084 3937875 3754584 3471529 4038690 4255089 1797059 -3015973 -6385332 -5088014 -448647
38075 -448647 2921790 2171258 -1014733 -2999262 -2613251 -1821442 -2264864 -2919880 -2153038
38066 -2153038 -656354 -512414 -1988141 -3338567 -3830063 -4780637 -6729982 -7459868 -4622121
38057 -4622121 402325 3146566 1060810 -3200564 -4589576 -1615429 1870657 1750327
38049 1750327 -849736 -1457422 807860 1713401 -1398566 -5054218 -4790596 -1904149 -806482
38040 -806482 -1594909 -517784 2636246 3296078 -472358 -4344814 -3887090 -249046 2843652
38031 2843652 4028367 3289187 -369567 -6350172 -10242043 -8402867 -3170531 243885
38023 243885 585873 366941 150463 -2235256 -6651805 -9267564 -7661667 -4124616 -2191119
38014 -2191119 -2124298 -1441632 1536503 5912358 9092959 8873097 5522051 2006015 1184221
38005 1184221 2748994 3799009 2046201 -2579762 -8602942 -13461649 -14047381 -9305741
37997 -9305741 -2457987 1587183 1471808 143522 190211 826578 354106 -815869 -1342330
37988 -1342330 -1524647 -2647877 -4473503 -5262799 -4410574 -3717380 -5328917 -8835603 -11176206
37979 -11176206 -9839741 -5812315 -2490024 -1642968 -1677128 -430797 1722226 2749686
37971 2749686 1784256 -419689 -2967568 -5172128 -6143889 -5683225 -5004645 -5045488 -4836444
37962 -4836444 -3282607 -1637362 -2020186 -4146444 -5857555 -6321491 -6155220 -4892457 -1435089
37953 -1435089 2816003 4356485 1887783 -2195098 -5101695 -5958554 -4601506 -1178512
37945 -1178512 2192515 2513354 62075 -1318179 433134 2744978 2702968 1424220 1707057
37936 1707057 3411921 3873684 1809784 -1259471 -2839130 -1619629 1137469 1892366
37928 1892366 -1586264 -6360313 -6643006 -1003071 5684074 8881077 9561512 10535550 11214349
37919 11214349 9482595 6050663 3162783 986537 -1126928 -1780181 183935 2319445
37911 2319445 1791700 595026 2889648 7820164 9876981 6674143 1848392 -606015
37903 -606015 -770389 -386727 192240 913576 879150 34647 -203722 810861 2134753
37894 2134753 3339864 5104445 7014849 7271956 5492370 3497865 2479323 1601055
37886 1601055 128525 -1334759 -2363876 -3182935 -3258712 -2029076 -1270653 -3525422 -7557181
37877 -7557181 -8956434 -6411035 -3660135 -3551917 -3956652 -1952827 1443400 3637096
37869 3637096 4506663 4953683 4075596 1246013 -1070117 -112866 2952232 4660196 3838058
37860 3838058 1893081 -28497 -1466205 -1713915 -1143016 -1873850 -4473315 -5940335 -4060295
37851 -4060295 -1647572 -2729775 -6422066 -8830130 -9382291 -10420994 -11655067 -10463729
37843 -10463729 -7461608 -6161922 -6556749 -4656649 243825 3422895 2103490 -237058
37835 -237058 -1532 720094 -1689612 -6098599 -8655843 -8461677 -7420352 -6629682 -6395241
37826 -6395241 -7670804 -9952617 -9875112 -5696191 -1181630 -857270 -3155966 -2974764 248057
37817 248057 2299880 1599522 1193607 2597362 3112503 1104568 -1001198 -1478371 -2467985
37808 -2467985 -5202388 -6258402 -2699994 2358117 3978212 2705643 2615485 3837979
37800 3837979 2752180 -866555 -2890885 -1975921 -1859777 -4269957 -4974211 -745703 4137175
37791 4137175 3446962 -1709315 -4655617 -2806868 78629 1157866 2161764 4219097
37783 4219097 4390680 733926 -2994084 -1834187 3329117 7171467 7171497 5596988 4637782
37774 4637782 3480696 1251822 -225874 1293772 4837701 6685461 4441984 -62565
37766 -62565 -2237999 502468 5378775 6744178 2639124 -2605698 -3681981 -550081
37758 -550081 2882540 4703889 6093914 7139586 5864114 2339101 -216471 -311886 -700850
37749 -700850 -3647767 -6905023 -7545840 -7056738 -8666135 -11435085 -11427129 -8095634 -5205077
37740 -5205077 -5172220 -6478029 -7531945 -9244455 -11987313 -13189427 -10456988 -5169051
37732 -5169051 -821322 890456 702466 -154023 -900536 -1292338 -2035098 -3953689 -5763403
37723 -5763403 -4537367 -24760 3501108 2241774 -1660201 -2593248 1219633 5852190
37715 5852190 7097357 4945200 2134150 771165 1363120 3207512 4703626 4758923 4434413
37706 4434413 5478252 6931901 5746200 1825622 -397667 2342138 7108242 8298545
37698 8298545 4794045 456951 -1713948 -2464380 -3130326 -3042392 -1545048 -132257 -599033
37689 -599033 -2435234 -3724334 -3713788 -3065859 -2299519 -1413046 -631947 -232742 169813
37680 169813 967591 1243712 -632438 -4637131 -8212654 -8547914 -5484998 -1569316 696818
37671 696818 960056 167328 -1407623 -4018225 -6586325 -6839144 -4242585 -1315054 -446709
37662 -446709 -530992 1109951 4084008 4935069 2181400 -1256408 -1893564 124157 2244274
37653 2244274 3246594 3805042 4343012 4338743 3540914 2508334 2002128 2495994 3731796
37644 3731796 4305219 2869517 463313 -8320 2116715 3528030 1350336 -2368194
37636 -2368194 -3256346 -553446 2633727 4320224 5326037 5828200 4062813 -92523
37628 -92523 -3415049 -3393223 -1748359 -1644265 -3088364 -3557454 -2130798 -493592 -158252
37619 -158252 -951184 -2507678 -5256920 -8906543 -11214764 -9786938 -5053468 -392375
37611 -392375 1235307 136434 -1310355 -1943139 -2375961 -2560402 -1168168 1703964 3631620
37602 3631620 3475523 3655445 6216184 8647326 7204922 3098286 1126364 2503645
37594 2503645 3511252 1756605 -776705 -2145265 -3339184 -4704929 -3840641 15480
37586 15480 3245851 2837664 883676 627178 1122325 -103504 -1720670 -582818 2643786
37577 2643786 4355133 3478268 2010426 1144606 879292 2323934 5951109 8500781 6538451
37568 6538451 2624348 2624216 6688933 8587144 5207327 1018421 670836 2319879 1754062
37559 1754062 -933240 -2699639 -2616044 -1792050 -415596 1581763 2510076 946421 -1200075
37550 -1200075 -615222 2890069 6088586 6258695 3677134 590207 -1015444 -1050741 -1358328
37541 -1358328 -3207730 -4766840 -3189622 466496 1589413 -1287688 -3564096 -1013719
37533 -1013719 3776469 4906279 1079438 -3666857 -5852494 -5542215 -4193313 -3045750
37525 -3045750 -3517154 -6128892 -8900999 -9306157 -7683452 -6322552 -5603985 -3877282 -1057859
37516 -1057859 638844 22706 -1531553 -2398717 -2380789 -1732829 -666674 -122201 -904585
37507 -904585 -1836243 -979273 1133242 1917120 675473 -525382 -483690 -571382 -1792784
37498 -1792784 -2835934 -2522449 -1817880 -1717186 -1248575 514827 2233597 2127182 683135
37489 683135 -364687 -644209 -873443 -910612 39266 1834648 3659251 5432657 7469000
37480 7469000 9105400 9169187 7749207 6293247 5864436 6126538 6023826 4860816 2872679
37471 2872679 1124143 438624 189972 -941091 -2521037 -2004855 1898269 6505231 7603100
37462 7603100 4363769 162366 -1671794 -1366153 -1274764 -2123979 -2012063 815399 5006235
37453 5006235 6694900 3465479 -2507234 -6092879 -4427467 83525 2634675 1369024
37445 1369024 -1173527 -1744484 -70389 1811731 2644306 2821637 2573188 1209406 -1112654
37436 -1112654 -2522150 -1828251 -636051 -1069383 -2078175 -633834 3273796 5777487
37428 5777487 4405439 1463997 295028 693005 642111 424406 1581506 3155654 2749894
37419 2749894 803583 17607 471860 -772621 -4355584 -6605859 -4492801 320075
37411 320075 4037933 4853610 3053307 -344621 -3299905 -3592344 -1884327 -1619436 -3954492
37402 -3954492 -5388635 -2895566 1152013 2431712 1093455 984570 3459180 5752759
37394 5752759 5547211 3862956 2670409 2089262 978643 -1180544 -3661334 -4885019
37386 -4885019 -3478021 179746 3822868 5574378 5654871 4969705 3298382 409602 -2258078
37377 -2258078 -3032614 -2370473 -1938267 -2025127 -1626678 -378556 1284175 3027578 4065569
37368 4065569 3022703 324526 -870183 1277958 3823869 2770424 -1033057 -3409760
37360 -3409760 -3353565 -3750752 -5756123 -6922914 -5704637 -3670006 -2021110 148241 2545736
37351 2545736 2510143 -658537 -3591065 -3563642 -2381089 -2927656 -4485729 -4388890 -2247554
37342 -2247554 290893 2234648 3050069 1559447 -2009615 -4282986 -2214041 2417586
37334 2417586 4831915 3184239 97288 -1535633 -1749250 -2133180 -3212078 -3926121 -2837477
37325 -2837477 296795 3738780 5161604 4308179 3138106 2705376 1665151 -807627
37317 -807627 -2591891 -1324113 1850396 3673675 3064649 1674249 807248 192182 -420860
37308 -420860 -613527 -307770 207406 1052690 2162161 2551951 1767207 1196302 2097839
37299 2097839 3308360 3096241 2247623 2633431 3584044 2898691 1091699 1124699 3621849
37290 3621849 5812679 5988472 5569917 5515339 4180602 860456 -1568891 -411549 2443630
37281 2443630 2826903 -107878 -3232360 -3855763 -2409192 -700604 531324 1652285
37273 1652285 2755963 3012836 1466256 -1520869 -4050962 -4667098 -4199797 -4457605 -5327208
37264 -5327208 -4821556 -2066931 1640433 5013625 7802204 9053007 6969641 1975626
37256 1975626 -2366943 -3372879 -2295351 -1570714 -1105878 316378 1866474 1912088 1138274
37247 1138274 1286476 1664227 224531 -2329397 -3026561 -1360059 -80339 -634269 -1226864
37238 -1226864 -539364 54454 -238423 537219 3327234 4966955 2357969 -2103891 -3297626
37229 -3297626 -903602 -8029 -3519216 -7757452 -7613886 -3439067 -73597 -324573 -2155192
37220 -2155192 -2297011 -425315 1107792 475515 -1687918 -3229718 -2832138 -1379535 -820030
37211 -820030 -1425190 -796714 3239292 8854371 11058709 7342826 1158140 -1923284 -769637
37202 -769637 725043 -479525 -2684626 -2560990 98784 2822803 4240813 4914495 5025307
37193 5025307 3973853 2549959 2900494 5225625 6506651 3999498 -1335853 -6158610
37185 -6158610 -8271120 -7624705 -5223298 -2653282 -1531706 -1581762 -216218 4022012 8585297
37176 8585297 9836769 8033112 6521878 6366424 5269336 2368983 358652 1091928
37168 1091928 2319066 1284536 -997787 -1862018 -1227985 -566953 623087 3646867 6925715
37159 6925715 7412134 5583933 5203602 7398027 8485443 5198021 -610603 -4186675
37151 -4186675 -3010459 1491938 5741989 6634892 4045877 1422248 2180900 5197736
37143 5197736 6142495 3683191 1415853 2536876 5631516 7419781 6802158 4224782
37135 4224782 -507 -4213199 -5020892 -1434734 2882057 4474946 4805350 6708206
37127 6708206 8657499 7000728 2308228 -1226677 -1992439 -2123936 -2943201 -3687620 -4539119
37118 -4539119 -6302188 -7046635 -4058961 318320 200982 -4939919 -8218940 -4751389
37110 -4751389 1676673 4695235 3935872 3454414 4715359 5635244 4944354 3591810 2531125
37101 2531125 1919013 1874835 2132462 2038627 2239652 4329673 7233609 6756586 1303129
37092 1303129 -4610221 -5713869 -2583744 463030 1788275 2722923 3242882 2043017
37084 2043017 300537 942787 3968237 6147719 5557977 3098409 -369405 -4663206
37076 -4663206 -7822838 -6978613 -2779110 432956 230817 -999373 -103307 2638747 4951522
37067 4951522 5861040 5755006 4863641 3343303 1790948 563081 -566360 -1573903 -2048786
37058 -2048786 -2075650 -2042392 -1565766 47290 2427444 4616972 6377167 7383495 6157803
37049 6157803 2280568 -1258448 -1084666 1696476 3167079 2801116 3769169 6656042 7678773
37040 7678773 4891530 1722090 1690842 3400847 3923645 3925718 5687211 8254093 8427102
37031 8427102 5577215 2387341 1238678 1944005 2464998 475403 -4655052 -10238823
37023 -10238823 -12212907 -9840847 -6496596 -4743783 -3432707 -1181890 745439 1519346
37015 1519346 3071111 5885272 5949193 532615 -5680204 -5700052 -64989 3906901 2191201
37006 2191201 -1974707 -4464296 -5319642 -6037629 -6268610 -5374416 -4251876 -3904319 -4381891
36997 -4381891 -5785282 -7834817 -8283007 -4892558 648570 4154623 4660218 4879847 5397201
36988 5397201 3170551 -2271368 -5899260 -3824996 708873 1799047 -1212945 -4114176
36980 -4114176 -4277387 -2950378 -2047753 -2014633 -2561045 -2945931 -1897121 594289 2007656
36971 2007656 18550 -3992590 -6246677 -5033845 -2031052 389951 1266101 741321
36963 741321 -500757 -1422643 -1454445 -959749 -200889 1144209 2481309 1965142 -580077
36954 -580077 -2023293 354046 4696993 6868186 6014383 4782215 4461089 3413121 780207
36945 780207 -1574001 -2021539 -1340446 -555720 888337 3040666 3673279 875511 -3781257
36936 -3781257 -6720518 -6421248 -4505286 -3335169 -3884878 -5530780 -6613159 -5376512
36928 -5376512 -1526243 2933918 5017551 3148333 -1605013 -6171152 -7478309 -4933978
36920 -4933978 -1345296 -353670 -2388557 -4202303 -3046673 -22687 1808032 1467575
36912 1467575 702222 1285846 3156530 4785309 4128942 -98901 -6481258 -10819606 -10092353
36903 -10092353 -6398550 -4761215 -6759073 -8813719 -7678950 -4960458 -4189870 -5518746
36895 -5518746 -6165840 -5067170 -3948798 -3774067 -3117650 -1068989 665226 212434 -1483230
36886 -1483230 -1882897 -126327 2498755 4688724 6101527 6501009 5506513 3375460 905440
36877 905440 -1553974 -3956370 -5412636 -4538798 -1549341 969050 281789 -3672143 -7977690
36868 -7977690 -9109733 -5827669 -394740 3120485 2547328 -266132 -1691499 -482942
36860 -482942 1408675 2078215 2012118 2529542 3494918 3852161 3312858 2188782 525745
36851 525745 -1142975 -1182627 1064043 3246614 2437458 -444883 -1291033 1290067 3339355
36842 3339355 794494 -4492168 -6749867 -3757408 408110 689105 -2985957 -6291486
36834 -6291486 -5709288 -1667554 2850453 5335455 5362802 4271226 3600754 3388023 2076590
36825 2076590 -1277690 -4940278 -5717172 -2519780 2252276 5355056 5783248 4601394
36817 4601394 2877050 1139669 215010 831113 2209630 2450267 831097 -1297032 -2425592
36808 -2425592 -2785348 -3704879 -5801127 -8454163 -10499961 -10854100 -9077340 -6122948 -4086369
36799 -4086369 -4259380 -5476857 -5220875 -2607264 352113 971744 -922586 -2754745 -2328638
36790 -2328638 -338633 1171844 2135893 4250109 7139827 7299254 2745571 -3253474
36782 -3253474 -5910684 -5093102 -4361411 -4611457 -3135952 306390 1381863 -2278312 -6510247
36773 -6510247 -6310060 -3016994 -1453435 -2156519 -1579665 976451 2158519 830822 367826
36764 367826 2798354 5038097 3820934 1124105 1334093 5025097 8733716 9729990 8153368
36755 8153368 5129477 1539611 -1354166 -2389305 -2075035 -2025952 -2431477 -1653495 927289
36746 927289 3015209 1747270 -2431142 -5635064 -4845140 -1385870 1036354 1138630 920201
36737 920201 1518626 971485 -2001256 -4413161 -2547442 2196826 4881189 4104180 3216947
36728 3216947 3901112 3321346 -180577 -3012194 -1533197 2013110 3000810 1516699 1360001
36719 1360001 3341198 4467132 3622455 3333459 4887266 5780768 3882957 1022875 159877
36710 159877 1000201 640017 -2374871 -6162278 -7331966 -4226100 1110189 4399810 3655335
36701 3655335 1731247 2709884 6348835 8544031 7097892 4082085 2080208 1301448
36693 1301448 1494825 3394162 6320360 7358596 5529065 4263296 6609180 9885829
36685 9885829 8721515 2517396 -3607636 -5255483 -3166575 -952129 -1040625 -3402400
36677 -3402400 -6027053 -6003806 -2103526 3036476 5109760 3165930 597827 364833 1349537
36668 1349537 933837 -690542 -1140981 84955 784361 -279685 -1076268 804951 4162833
36659 4162833 5223655 2790866 260878 1150670 4163894 5022244 2555364 35928
36651 35928 -47634 529571 -830768 -3312789 -4507969 -4490432 -4912814 -5297871 -3723977
36642 -3723977 -736811 866091 178728 -1199201 -2768777 -5536760 -8173501 -7135620
36634 -7135620 -2521692 368240 -1676466 -4530624 -2658279 2568384 5171876 3486404
36626 3486404 1651090 2550220 4321652 4892457 5482437 7406951 8755042 7017416 3067402
36617 3067402 86967 -390669 438493 721043 -288681 -1951922 -2867527 -2396655 -1867084
36608 -1867084 -3098242 -5578330 -6969211 -6909303 -7846618 -10736743 -12497658 -10192723 -5807323
36599 -5807323 -3770545 -4752394 -5194728 -2859675 308152 1549717 894373 169216 310336
36590 310336 1033946 2001409 3198155 4835808 7292865 10180867 11364163 8599190 2863739
36581 2863739 -1650393 -2093945 -140462 718343 -341997 -1555662 -2056191 -2787929 -3963654
36572 -3963654 -4012410 -2037066 274518 506513 -1454375 -3318951 -3075871 -1107313 263104
36563 263104 -955942 -4360960 -7268484 -7386648 -5457196 -4419172 -5639990 -7123629
36555 -7123629 -6380119 -3976584 -2572563 -2929155 -2989104 -1372591 166479 -942150 -4522824
36546 -4522824 -7804724 -8436235 -6181643 -2351529 1078555 2323190 1264318 -192197
36538 -192197 -530718 -809716 -2701720 -5002872 -4688724 -1560141 1045157 1068378 386155
36529 386155 1106057 2047270 1313234 -79778 -266828 -385787 -2694369 -5877734 -6241009
36520 -6241009 -3543235 -1773223 -3341277 -5946504 -6445763 -4760737 -2459562 -331090
36512 -331090 830254 -314501 -3222484 -4741382 -3119261 -822026 -993185 -2912492
36504 -2912492 -3595842 -2341703 -770445 484408 2016395 3289467 3182631 2623308 3592944
36495 3592944 5412120 5105570 2047943 -696271 -728252 615658 964683 398582 411072
36486 411072 1086331 1367151 1282150 2081260 4256829 6536423 7004056 4936590 1641507
36477 1641507 -720628 -1608547 -2826317 -5807005 -8988974 -9664282 -7868200 -6058021
36469 -6058021 -5062261 -3252315 -333047 1217920 82669 -1322364 -405169 1723226
36461 1723226 2384815 1479579 811037 711841 121629 -991487 -1928808 -3053940 -4678661
36452 -4678661 -5205781 -3329994 -1064663 -1098939 -1996302 -335762 2576882 1427027 -4302575
36443 -4302575 -7699756 -3905591 2305052 3123637 -1263420 -3828499 -1392551 1827380
36435 1827380 1859867 642085 1669369 4053586 4291451 1736550 -864281 -1306230 93154
36426 93154 1915513 3005757 2721558 1531429 1108512 2281805 3271579 1792908 -1233542
36417 -1233542 -2257664 61434 2695301 2209381 -737372 -2614997 -1733326 296377
36409 296377 1493979 1797724 1906303 1635546 697354 70527 1025829 2979049 3723511
36400 3723511 2266019 411474 566230 2397772 2942173 463167 -2852195 -3237863 -2706
36391 -2706 3642159 4685734 3668846 2963714 3200955 3226300 2697343 2359579 1850911 -240036
36381 -240036 -3450619 -4971681 -3408373 -928793 32998 234180 1487392 2782775 1667255
36372 1667255 -1298209 -2882203 -2202359 -2190743 -5036315 -8873849 -10477001 -9159722 -6563658
36363 -6563658 -4358576 -3440730 -3582466 -2628135 1798502 8175375 11104996 7814439 2364658
36354 2364658 346022 1370201 685693 -3078794 -6411797 -7047443 -6885030 -7677564 -8031640
36345 -8031640 -6591675 -4610664 -3143419 -954222 2260601 3710238 1705942 -665937
36337 -665937 332454 3448817 4847225 4381898 4883428 6082240 4369245 -723749 -4394871
36328 -4394871 -2667301 2801445 7664727 9549302 8043817 3222277 -3174177 -7333784
36320 -7333784 -6981862 -4199756 -2572079 -2757177 -2821280 -1696783 -191266 543573 -305227
36311 -305227 -3132521 -6736488 -8262428 -6303452 -3121515 -1698378 -1544213 33095
36303 33095 3105686 4555007 2665172 -341377 -1366801 -129493 1352731 1627065 932927
36294 932927 77390 -865679 -2526624 -4838727 -5949663 -3758537 884754 4090463 3465288
36285 3465288 1318203 1406263 3817446 5659539 5843492 5975302 6698675 6505212 4768045
36276 4768045 2933096 1754420 107422 -2324916 -3782622 -3105809 -1277158 835627
36268 835627 3584800 6024113 5348558 1033353 -3208410 -4233040 -3812826 -5206650 -7563659
36259 -7563659 -7333209 -3881831 -46358 2220026 3323007 3527179 2382696 775327
36251 775327 462414 1166070 800751 -1196477 -3514848 -6045021 -10007797 -14306381 -15256227
36242 -15256227 -11652627 -7213940 -5894474 -7104153 -7751609 -6897821 -5795177 -4922315
36234 -4922315 -3890485 -3510101 -5181099 -8291736 -10443488 -10394971 -8961770 -7018589 -4659547
36225 -4659547 -2705864 -2896438 -5354672 -7250934 -5438207 60887 6047245 9190625
36217 9190625 8570953 5950208 4319960 5517484 8314485 9367849 7039184 3651614
36209 3651614 2633963 4044774 4891641 3670415 1949743 793514 -1300736 -4846512
36201 -4846512 -6543689 -3437711 1736084 3388652 774151 -1251573 461261 3443338
36193 3443338 4256443 3065651 1507680 -334090 -2073810 -1410483 2204959 4852146
36185 4852146 2825056 -1838348 -4195049 -3189366 -1790580 -1643044 -1698529 -1479452 -1635632
36176 -1635632 -1521300 -62986 1160552 -432764 -3895910 -5963778 -6652334 -8968993
36168 -8968993 -12621372 -13169867 -8957013 -4075519 -2338019 -2680778 -2863345 -3354657 -4697883
36159 -4697883 -5115188 -3998425 -4070094 -6663506 -8462896 -6641888 -3666655 -2808394 -2474579
36150 -2474579 -131841 1278112 -2814111 -9954286 -12460270 -7972171 -2411330 -1416430
36142 -1416430 -3832601 -5302250 -4130522 -1530837 937208 2353607 2885974 4109455
36134 4109455 6936484 9114833 7276421 1679320 -3618829 -5469007 -4084980 -1113388
36126 -1113388 1788872 2698330 1055580 -501599 708898 2795818 1887815 -1010528
36118 -1010528 -976124 2451264 3825872 719550 -2006249 -305351 2369349 1291515
36110 1291515 -1516698 -1468465 102861 -1405716 -4804206 -4087358 1630549 6077059 5177154
36101 5177154 2446062 2509123 4302072 4222017 2241928 804373 695 -1967469 -4505381
36092 -4505381 -4666064 -1801119 754753 -342344 -4697126 -9400044 -12418825 -13380376
36084 -13380376 -12108475 -8483750 -3942651 -1264250 -1610543 -2741922 -1687875 1183366
36076 1183366 2413954 -19534 -4006027 -5859249 -4369776 -1389304 687389 955083
36068 955083 29876 -1011357 -1744382 -2613309 -3756505 -4161341 -3286035 -3069362 -5936276
36059 -5936276 -10312689 -10991078 -5736739 939939 3176184 984117 -1058446 -914984
36051 -914984 -888477 -2419587 -3222334 -1118455 2355174 4299750 4359828 4077335 3695292
36042 3695292 1919785 -1514502 -4866073 -6151109 -4828689 -1726074 1740904 4098023
36034 4098023 4412643 2959595 1097812 61496 -253306 -1043546 -2842934 -4291280 -3480020
36025 -3480020 -703217 1192047 45354 -2780751 -3934279 -2034900 1062094 2731190
36017 2731190 2067982 -73788 -2267349 -3421046 -3510551 -3731670 -5044082 -6347626 -5211067
36008 -5211067 -995934 3687417 5544659 4177794 2278552 2318852 3742816 3881677 1493502
35999 1493502 -1309055 -1365640 1593705 4556122 5132460 4441628 5025750 7143099 8840021
35990 8840021 8972157 8182882 7078595 5396934 3241652 1440520 290017 -581411 -938334
35981 -938334 -307563 108079 -1854890 -5692760 -7496700 -4549171 934245 4523334 4750777
35972 4750777 3485131 2137370 117668 -2933604 -5762537 -7095288 -6925673 -5445841
35964 -5445841 -2274721 2086955 5326425 5535698 3858495 3253492 4579496 5585067
35956 5585067 4415730 2453877 2151739 3217658 3259579 1961303 1864004 4004207 5378635
35947 5378635 3008059 -1157050 -2259427 1093681 5217100 6244854 4193845 1597380
35939 1597380 283072 400276 906659 198349 -2259657 -4509690 -4140387 -2069515 -1780287
35930 -1780287 -3960447 -4894273 -1914869 2560167 5001643 5845320 6959296 6539437 1630526
35921 1630526 -5134423 -6959088 -2147209 3044693 3088909 371164 374932 3302985 5082530
35912 5082530 4629727 4878926 6764439 7152618 4232243 907565 346738 1244878 662204
35903 662204 -673000 200454 2751225 2998597 -140869 -2596912 -1177175 1460096 817851
35894 817851 -2780700 -5085801 -4148587 -1818385 564432 3863830 7759315 9476824
35886 9476824 7642261 4290238 1109892 -3131952 -8735486 -11724330 -8394400 -1417329
35878 -1417329 2986121 3278112 3630805 6638896 9630247 9674665 8097684 7401480 6876048
35869 6876048 4541313 1402657 275083 1236134 1403479 -798748 -3687201 -4876738
35861 -4876738 -3662535 -492837 3886383 7954862 9703070 8411352 5135949 907014
35853 907014 -4101073 -8730087 -10017813 -6428929 -1135772 600399 -2126136 -4398187
35845 -4398187 -1965263 2704408 3469652 -1154841 -5962662 -6191779 -3662844 -3416740 -6311124
35836 -6311124 -8501097 -7828228 -6855344 -8145336 -9668897 -7724983 -2801478 656174
35828 656174 89855 -2409673 -3792752 -3883484 -3954826 -3582065 -1585709 687346 121978
35819 121978 -3318513 -5125181 -1725639 4098227 6058778 2402131 -1748039 -1087858
35811 -1087858 3248225 5805932 4028484 710123 -488957 543660 1291392 258607
35803 258607 -1591613 -2408661 -1552706 -219115 -180376 -1720199 -3114793 -2805338 -1605405
35794 -1605405 -1442315 -2058872 -854126 3199141 7179375 7400881 4139280 1375172 1858369
35785 1858369 4061342 4771684 3580693 3328447 6016760 9663507 10475666 7621903 4039869
35776 4039869 2111492 657936 -2161278 -4827078 -4198097 -529582 2479261 2896195
35768 2896195 2558951 2904817 2195598 -1011987 -4548066 -5693403 -5408073 -6194576 -7301962
35759 -7301962 -5895308 -2417982 -772668 -2559574 -4660494 -3916957 -1302259 429364
35751 429364 1001907 2243008 4696309 6762189 6939980 5542293 4134794 3845140 4075185
35742 4075185 2909418 -490626 -4109295 -5073380 -3500643 -2496415 -3671003 -4739265
35734 -4739265 -3028656 413535 2310738 1641773 335670 -49859 -21076 -302875 -392167
35725 -392167 162836 505920 -349158 -1893985 -2772104 -2678855 -2582136 -2987190 -2948490 -1502921
35715 -1502921 425072 717705 -1060690 -2661393 -2032748 -320389 -384192 -2627627 -4208005
35706 -4208005 -2807696 538397 3150941 3690863 2501108 541738 -706284 294855
35698 294855 3091966 4755925 3298599 764134 895983 4175363 7278144 7455564 5478587
35689 5478587 3863438 3873210 4899988 5536407 4651522 2339458 212268 15282 1816667
35680 1816667 4226348 6130827 7279681 7625611 7409875 7527051 8293553 8247050 5994126
35671 5994126 2920178 1796127 2706354 2992031 1700302 1140416 2758046 4313276 3211874
35662 3211874 317628 -1996289 -3694853 -6097725 -8279269 -7628057 -3861792 153350
35654 153350 1989611 2140889 2548419 4173324 6348975 7393512 5873741 2366303 -345264
35645 -345264 -178354 1477094 1492052 -688420 -2335865 -1336056 986341 1784355 253856
35636 253856 -1662790 -1709639 7468 783160 -1822934 -6579259 -9024399 -6259055 -332066
35627 -332066 4327111 5633864 4396246 1739978 -1225712 -2175681 397236 3774658
35619 3774658 3199902 -1569830 -5146877 -3372003 1703362 5428066 6194070 5169117
35611 5169117 3127944 651254 -349116 1437230 4197305 5125244 4206195 3269725 2239126
35602 2239126 -563008 -4670352 -7124308 -6284332 -3547253 -907159 925238 1643242
35594 1643242 978087 -102245 48015 1214961 1276395 -546613 -2332345 -2308253 -1259935
35585 -1259935 -991700 -1928319 -3284653 -4179278 -3701081 -1512003 640868 -107073 -3923606
35576 -3923606 -7328424 -7709921 -6803624 -7430604 -8727989 -7870555 -5370616 -4688568 -6363911
35567 -6363911 -6502809 -2742375 1498079 1388106 -2651473 -5634646 -4638646 -1993697 -1557830
35558 -1557830 -3952418 -6489900 -6620678 -4374227 -1784194 -634055 -920490 -1499661 -2063575
35549 -2063575 -3717213 -7007255 -10175595 -10753065 -8750411 -6748403 -6438314 -6560055 -5137876
35540 -5137876 -2424186 -202897 1012628 2389833 4511753 6233210 6246565 4777757
35532 4777757 3113850 1950901 755451 -1205665 -3316658 -3496293 -414018 4202374
35524 4202374 6829050 6320628 5203284 5552927 5509275 2344201 -2470567 -4741879 -3680130
35515 -3680130 -2675147 -3391633 -3230609 -512972 1729507 344010 -2446620 -2052856 1570868
35506 1570868 3938097 2403743 -950530 -2873070 -2438246 -611413 1253813 2013202
35498 2013202 1644278 1587231 2521074 2448876 -703604 -5227513 -7248367 -5931576 -3926933
35489 -3926933 -2672507 -985991 999442 648319 -2475850 -4380756 -1987027 2039045
35481 2039045 2971601 543023 -1555669 -1348419 -247044 472891 1448731 2905181 3287815
35472 3287815 1540736 -845428 -1356577 684208 3627699 5496627 5820270 5494199 5357381
35463 5357381 5545069 6293509 8296132 11200868 12552506 10002247 4501121 -431282
35455 -431282 -2765942 -3493931 -3853784 -3202145 -588280 3315768 6918548 9028737 8958619
35446 8958619 6974811 5039223 5051830 5978497 5249309 3359731 3552448 5811451 5487606
35437 5487606 487600 -4354322 -3936910 -346030 1103939 329399 1173882 3428476 2767453
35428 2767453 -1238206 -3349836 -565177 3474329 4367534 2881802 2198705 2839305 3536818
35419 3536818 4488206 6352579 7612800 6069727 2369675 -345454 -246076 1270721 1538430
35410 1538430 -370345 -2709173 -3032772 -1167259 546463 674294 950291 3312290 6102774
35401 6102774 6177772 4031918 3233846 4761853 5799014 4883738 4115692 4544818 3381732
35392 3381732 -1374623 -6602474 -7576548 -3823528 1311015 5168185 7154086 7197658 5671075
35383 5671075 3932929 2717036 986817 -1681929 -3065200 -1086913 2526942 4058293
35375 4058293 2652155 969400 1308411 3132213 4329548 3375367 468789 -2393899
35367 -2393899 -3130487 -2180881 -2135735 -3880456 -5116676 -4202601 -3018671 -3565236 -3987070
35358 -3987070 -1335267 3218942 5579448 4392439 2034366 314070 -1296567 -2984300
35350 -2984300 -3516924 -2631764 -1822654 -1975835 -2518138 -3482628 -6000955 -9751686 -11901657
35341 -11901657 -9872436 -4244556 1537253 3671994 721750 -4858411 -8410129 -7632452
35333 -7632452 -4729498 -2849306 -2130659 -1363903 -1352297 -3108147 -4373491 -2378673 740320
35324 740320 228332 -3517424 -4781382 -1361471 1694581 -331666 -5064431 -7154468
35316 -7154468 -5592467 -3267196 -1861535 -904349 -291531 -471443 -932085 -774773 37398
35307 37398 1397772 3463502 5100464 4174010 983461 -1187134 -852486 -639838 -2354698
35298 -2354698 -3265388 -1089224 604534 -2747734 -8455795 -9292902 -4213546 -287814
$$ [...]
##END NTUPLES=NMR SPECTRUM
##END=
