##TITLE=31Pdec_LR-717-B2
 D2O, 24 sc
 29.10.2020
##JCAMPDX= 6.0         $$ Bruker NMR JCAMP-DX V2.0
##DATA TYPE= NMR SPECTRUM
##DATA CLASS= NTUPLES
##ORIGIN= UXNMR, Bruker Analytische Messtechnik GmbH
##OWNER= root
$$ XWIN-NMR		Version 3.5
$$ Thu Oct 29 09:54:40 2020 Russian Standard Time (UT+4h)  she@DPX200
##.OBSERVE FREQUENCY= 81.013821
##.OBSERVE NUCLEUS= ^31P
##.ACQUISITION MODE= SIMULTANEOUS
##.ACQUISITION SCHEME= undefined
##.AVERAGES= 24
##.DIGITISER RES= 17
##SPECTROMETER/DATA SYSTEM= spect
##.PULSE SEQUENCE= zgpg30
##.SOLVENT NAME= D2O
##.SHIFT REFERENCE= (INTERNAL, D2O, 0, 182.463)
##AUDIT TRAIL= $$ (NUMBER, WHEN, WHO, WHERE, WHAT)
$$ ##TITLE= Audit trail, XWIN-NMR		Version 3.5
$$ ##JCAMPDX= 5.01
$$ ##ORIGIN= Bruker BioSpin GmbH
$$ ##OWNER= she
$$ F:/spectra/data/she/nmr/P31/1/pdata/1/auditp.txt
$$ ##AUDIT TRAIL=  $$ (NUMBER, WHEN, WHO, WHERE, WHAT)
(   1,<2020-10-29 09:53:23.60 +0400>,<she>,<DPX200>,
      <created by zg, POWCHK disabled, PULCHK disabled
       configuration hash MD5:
       00 E9 B6 7A A2 85 ED C7 34 08 36 98 17 FE 4E 26
       data hash MD5: 32K
       18 E7 AB BD C5 9D 11 7A 7E 04 27 75 69 EE E8 70>)
(   2,<2020-10-29 09:53:36.82 +0400>,<she>,<DPX200>,
      <Start of raw data processing
       efp BC_mod = 2 LB = 1 FT_mod = 6 PKNL = 1 PHC0 = -2432.834 PHC1 = 144.8008 SI = 64K 
       data hash MD5: 64K
       AB C0 35 7B FB 70 31 E7 B1 7C 67 9E DA 11 FB 11>)
(   3,<2020-10-29 09:53:44.71 +0400>,<she>,<DPX200>,
      <abs ABSG = 5 
       data hash MD5: 64K
       6F F5 E9 91 7D D5 28 62 54 0B 0E DD E0 D4 D1 D3>)
$$ ##END=
$$ 
$$ hash MD5
$$ 70 3B 75 34 17 F3 EB B7 C9 FC 23 D4 C7 33 7E A2
##$RELAX= 
##$RELAX= 
##$RELAX= 
##$RELAX= 
##$RELAX= 
##$RELAX= 
##$RELAX= 
##$RELAX= 
$$ Bruker specific parameters
$$ --------------------------
##$DU= <F:/spectra>
##$EXPNO= 1
##$NAME= <P31>
##$PROCNO= 1
##$TYPE= <nmr>
##$USER= <she>
##$AMP= (0..31)
100 100 100 100 100 100 100 100 100 100 100 100 100 100 100 100 100 100 
100 100 100 100 100 100 100 100 100 100 100 100 100 100 
##$AQSEQ= 0
##$AQ_mod= 1
##$AUNM= <au_zg>
##$AUTOPOS= <>
##$BF1= 81.014009
##$BF2= 200.13
##$BF3= 200.13
##$BF4= 200.13
##$BF5= 200.13
##$BF6= 200.13
##$BF7= 200.13
##$BF8= 200.13
##$BYTORDA= 1
##$CFDGTYP= 0
##$CFRGTYP= 5
##$CHEMSTR= <none>
##$CNST= (0..31)
1 1 145 1 1 1 1 1 1 1 1 1 1 1 1 1 1 1 1 1 1 1 1 1 1 1 1 1 1 1 1 1 
##$CPDPRG= <waltz16>
##$CPDPRG1= <>
##$CPDPRG2= <waltz16>
##$CPDPRG3= <>
##$CPDPRG4= <mlev>
##$CPDPRG5= <mlev>
##$CPDPRG6= <mlev>
##$CPDPRG7= <mlev>
##$CPDPRG8= <mlev>
##$CPDPRGB= <>
##$CPDPRGT= <>
##$D= (0..31)
0 1 0 0 0 0 0 0 0 0 0 0.03 2e-05 3e-06 0 0 0 0 0 0 0 0 0 0 0 0 0 0 0 0 
0 0 
##$DATE= 1603950803
##$DBL= (0..7)
120 120 120 11 120 120 24 19 
##$DBP= (0..7)
150 150 150 150 150 150 150 150 
##$DBP07= 0
##$DBPNAM0= <>
##$DBPNAM1= <>
##$DBPNAM2= <>
##$DBPNAM3= <>
##$DBPNAM4= <>
##$DBPNAM5= <>
##$DBPNAM6= <>
##$DBPNAM7= <>
##$DBPOAL= (0..7)
0.5 0.5 0.5 0.5 0.5 0.5 0.5 0.5 
##$DBPOFFS= (0..7)
0 0 0 0 0 0 0 0 
##$DE= 6
$$ [...]
##$SUBNAM3= <"">
##$SUBNAM4= <"">
##$SUBNAM5= <"">
##$SUBNAM6= <"">
##$SUBNAM7= <"">
##$SUBNAM8= <"">
##$SUBNAM9= <"">
##$SW= 369.568048894756
##$SWIBOX= (0..15)
0 1 3 0 0 0 0 0 0 0 0 0 0 0 0 0 
##$SW_h= 29940.119760479
##$TD= 32768
##$TD0= 1
##$TE= 0
##$TE2= 300
##$TE3= 300
##$TEG= 300
##$TL= (0..7)
0 120 53 12 22 120 120 120 
##$TP= (0..7)
150 150 150 150 150 150 150 150 
##$TP07= 0
##$TPNAME0= <>
##$TPNAME1= <>
##$TPNAME2= <>
##$TPNAME3= <>
##$TPNAME4= <>
##$TPNAME5= <>
##$TPNAME6= <>
##$TPNAME7= <>
##$TPOAL= (0..7)
0.5 0.5 0.5 0.5 0.5 0.5 0.5 0.5 
##$TPOFFS= (0..7)
0 0 0 0 0 0 0 0 
##$TUNHIN= 0
##$TUNHOUT= 0
##$TUNXOUT= 0
##$USERA1= <user>
##$USERA2= <user>
##$USERA3= <user>
##$USERA4= <user>
##$USERA5= <user>
##$V9= 5
##$VALIST= <valist>
##$VCLIST= <CCCCCCCCCCCCCCC>
##$VD= 0
##$VDLIST= <DDDDDDDDDDDDDDD>
##$VPLIST= <PPPPPPPPPPPPPPP>
##$VTLIST= <TTTTTTTTTTTTTTT>
##$WBST= 1024
##$WBSW= 4
##$XGAIN= (0..3)
0 0 0 0 
##$XL= 0
##$YL= 0
##$YMAX_a= 12255
##$YMIN_a= -3727
##$ZGOPTNS= <>
##$ZL1= 120
##$ZL2= 120
##$ZL3= 120
##$ZL4= 120
##$ABSF1= 182.463
##$ABSF2= -187.1042
##$ABSG= 5
##$ABSL= 3
##$ALPHA= 0
##$AQORDER= 0
##$ASSFAC= 0
##$ASSFACI= 0
##$ASSFACX= 0
##$ASSWID= 0
##$AUNMP= <proc_1d>
##$AZFE= 0.1
##$AZFW= 0.5
##$BCFW= 0
##$BC_mod= 2
##$BYTORDP= 0
##$COROFFS= 0
##$CY= -3
##$DATMOD= 1
##$DC= 0
##$DFILT= <>
##$DTYPP= 0
##$F1P= 0
##$F2P= 0
##$FCOR= 1
##$FTSIZE= 65536
##$FT_mod= 6
##$GAMMA= 0
##$GB= 0
##$INTBC= 1
##$INTSCL= 5.30512e-09
##$ISEN= 30
##$LB= 1
##$LEV0= 0
##$LPBIN= 0
##$MAXI= 10000
##$MC2= 0
##$MEAN= 0
##$ME_mod= 0
##$MI= 50
##$NCOEF= 0
##$NC_proc= -11
##$NLEV= 6
##$NOISF1= 182.463
##$NOISF2= 159.3651
##$NSP= 0
##$NTH_PI= 0
##$NZP= 0
##$OFFSET= 182.463
##$PC= 4
##$PHC0= -2432.834
##$PHC1= 144.8008
##$PH_mod= 1
##$PKNL= yes
##$PPARMOD= 0
##$PSCAL= 0
##$PSIGN= 0
##$REVERSE= no
##$SF= 81.014009
##$SI= 65536
##$SIGF1= 159.3651
##$SIGF2= -187.1042
##$SINO= 113.3802
##$SIOLD= 16384
##$SREGLST= <1H.CDCl3>
##$SSB= 0
##$STSI= 65536
##$STSR= 0
##$SW_p= 29940.119760479
##$SYMM= 0
##$S_DEV= 0
##$TDeff= 32768
##$TDoff= 0
##$TI= <>
##$TILT= no
##$TM1= 0
##$TM2= 0
##$TOPLEV= 0
##$USERP1= <user>
##$USERP2= <user>
##$USERP3= <user>
##$USERP4= <user>
##$USERP5= <user>
##$WDW= 1
##$XDIM= 65536
##$YMAX_p= 309420611
##$YMIN_p= -290102385
$$ End of Bruker specific parameters
$$ ---------------------------------
##NTUPLES= NMR SPECTRUM
##VAR_NAME=  FREQUENCY,     SPECTRUM/REAL,   SPECTRUM/IMAG
##SYMBOL=    X,             R,               I
##VAR_TYPE=  INDEPENDENT,   DEPENDENT,       DEPENDENT
##VAR_FORM=  AFFN,          ASDF,            ASDF
##VAR_DIM=   65536,         65536,           65536
##UNITS=     HZ,            ARBITRARY UNITS, ARBITRARY UNITS
##FACTOR=    0.456856943014862, 1,           1
##FIRST=     14782.0589164895, 0,            0
##LAST=      -15158.0608439895, 0,           0
##MIN=       -15158.0608439895, -290102385,  0
##MAX=       14782.0589164895, 309420611,    0
$$ Real data points
##PAGE= N=1
##DATA TABLE= (X++(R..R)), XYDATA
$$ [...]
##PAGE= N=2
##DATA TABLE= (X++(I..I)), XYDATA
4728g742338p5499825L408412L2268545p848032l6514617j1380058J7140610R608031
$$ -7742338 -83242163 -79833751 -47565206 -55413238 -91927855 -103307913 -86167303 -76559272
4720g6559272J499065K2614703L6233211J2479455r299310P476241K5209492L52193
$$ -76559272 -75060207 -52445504 -16212293 -3732838 -13032148 -5555907 19653585 20005778
4712B0005778l2912096k3406777M59737j8512380n4689009l5333965L0032663
$$ 20005778 -12906318 -36313095 -35853358 -54365738 -109054747 -144388712 -114356049
4705a14356049N6641719K1378801o834242R820916K2190042m414224k4950276
$$ -114356049 -57714330 -36335529 -43169771 -33348855 -11158813 -15573037 -40523313
4698d0523313l146614J4717889j9262989o3956261n2928287l26569L1843238L4052118
$$ -40523313 -43669927 -28952038 -48215027 -112171288 -165099575 -165426144 -133582906 -99530788
4690i9530788L9745245M5199666K0766473j5069259j5305330Q959973L627335
$$ -99530788 -59785543 -14585877 6180596 -8888663 -24193993 -15234020 -11606685
4683a1606685k6423743j6935990M0836911P2663691L7969958r057571j6134814
$$ -11606685 -38030428 -54966418 -14129507 58534184 96504142 87446571 71311757
4676G1311757j1240430k9262148l4358518J1062023N8310351L8427653k2801980
$$ 71311757 60071327 30809179 -3549339 7512684 65823035 104250688 81448708
4669H1448708m3868580j7717404j1697583m3982235n2393075l073445N0731375
$$ 81448708 37580128 19862724 8165141 -35817094 -88210169 -91283614 -40552239
4662d0552239N1319389J5225596q218762r016888r035775j6896247k4369947k4839329
$$ -40552239 10767150 25992746 17773984 8757096 -278679 -17174926 -41544873 -66384202
4654f6384202j2580878J4772586L9214643L4323236N386233j3238616j0879489
$$ -66384202 -78965080 -64192494 -24977851 9345385 14731618 1493002 -9386487
4647i386487j3743691l2680894m0654847k2689027m256411k487382P130225M0041186
$$ -9386487 -23130178 -55811072 -96465919 -119154946 -123411357 -125898739 -118768514 -78727328
4639g8727328N9974741L1847042j4720980k3375671Q953082L5704121K8771676
$$ -78727328 -18752587 13094455 -1626525 -25002196 -16049114 19655007 48426683
4632D8426683J425599k3257802k8482363k622528L9719460N0952843O005560m9219156
$$ 48426683 49852282 26594480 -1887883 -4510411 35209049 86161892 92167452 42948296
4624D2948296m9503239o03497K9576050P051332k9104146l0820374k528203J6941514
$$ 42948296 -6554943 -7158440 22417610 29468942 364796 -30455578 -32983781 -16042267
4616a6042267O633390j6961162k1353677K784816K2188151J8394m0837668l4790177
$$ -16042267 -9408877 -26370039 -47723716 -44938900 -22750749 -22732355 -63570023 -98360200
4608i8360200K4496243N4994093O822605m6468812j4030793O2091179O5839518
$$ -98360200 -73863957 -18869864 -12047259 -58516071 -72546864 -10455685 55383833
4601E5383833p354575m3369794M347939M3862765J517255o0624113n2202413O638800
$$ 55383833 48029258 4659464 9007403 52870168 54387423 -6236690 -58439103 -51800303
4593e1800303L4011078J2944417j0401845j3785899j1641450r437315o319762
$$ -51800303 -17789225 -4844808 -15246653 -29032552 -40674002 -50111317 -56431079
4586e6431079j7469717m1123428l3909942K6385374Q4887268P5876952J7809607
$$ -56431079 -73900796 -115024224 -148934166 -122548792 -37661524 38215428 56025035
4579E6025035j9545757j8999546k0101106l5253443l2423051j241726K5903322
$$ 56025035 36479278 17479732 -2621374 -37874817 -70297868 -71539594 -45636272
4572d5636272K6677021J3244503j391737j7750471k7744387j8690426m51608P800740
$$ -45636272 -18959251 -5714748 -7106485 -24856956 -52601343 -71291769 -71743377 -63942637
4564f3942637J2561855K9284433M1035502K0102131j6523979k4263452j650938
$$ -63942637 -51380782 -22096349 18939153 39041284 22517305 -1746147 -3397085
4557c397085Q415604q462128j6737012P018902L8789714M8886493L7856219J6618013
$$ -3397085 5018519 -3443609 -20180621 -13161719 25627995 74514488 112370707 128988720
4549A28988720j1776802l7303142m3354852l2272827k0656106o984688K1120460
$$ 128988720 117211918 79908776 36553924 4281097 -16375009 -23359697 -2239237
4542b239237M7861689L9965779O86609k9781167l3430384l0199374k9801291j7050838
$$ -2239237 45622452 85588231 86274840 56493673 23063289 -7136085 -36937376 -53988214
4534e3988214M987390Q768938n161028o3906L2668313N0682183K6476046j0145929
$$ -53988214 -49000824 -40231886 -45392914 -45456820 -12788507 37893676 64369722 54223793
4526E4223793k1479902j0820298K595430J3778927J3195273j4228960m4100935
$$ 54223793 32743891 21923593 24519023 38297950 51493223 37264263 -6836672
4519f836672k0128583N5863742R5147406L4276875o7696192j01664121m6002472
$$ -6836672 -26965255 28898487 124045893 158322768 90626576 -11037545 -57040017
4512e7040017K6185118N3227402L8509255J0256620j4797885k4590612j1151638
$$ -57040017 -30854899 22372503 60881758 71138378 56340493 31749881 20598243
4505B0598243J5597909L7712656M9758791N1115906L2492797o305989m0752780
$$ 20598243 36196152 73908808 123667599 174783505 207276302 200970313 160217533
4498A60217533m8266456l6134940k3295593j4334774j0194255j7900877k8509824
$$ 160217533 111951077 75816137 52520544 38185770 27991515 10090638 -18419186
4491a8419186j7288306J0703396J4478799j4228272k3405069J6778161N4306562
$$ -18419186 -35707492 -25004096 -10525297 -24753569 -48158638 -31380477 22926085
4484B2926085L4597528p840575q026758J8740822R455640k9099084k9968592J3660377
$$ 22926085 57523613 49683038 41656280 60397102 69852742 40753658 10785066 24445443
4476B4445443L3851671N013154j6215690N100426K3220613j814075l1391767j4931800
$$ 24445443 58297114 63310268 47094578 52195004 75415617 73601542 42209775 27277975
4468B7277975K5524975L3204311K111048k5673430k3488021q4564K4221422K8857572
$$ 27277975 52802950 86007261 88118309 62444879 38956858 38872294 63093716 91951288
4460I1951288l94043m8160983p1613529m9776661j1092554Q672583J1556745J6713082
$$ 91951288 91557245 43396262 -28217267 -77993928 -89086482 -80413899 -68857154 -52144072
4452e2144072K0359390P888124j0861966j0139450J4021187L7195817L4865941
$$ -52144072 -31784682 -23896558 -34758524 -44897974 -30876787 6319030 41184971
4445D1184971N057355l1003218m4565547k6657559k396198k243655j9759867k2031629
$$ 41184971 46242326 15239108 -29326439 -55983998 -58380196 -60623851 -80383718 -102415347
4437a02415347k258133J1390810O918695J0444802L8354638O2306221M9265649
$$ -102415347 -104673480 -93282670 -86363975 -75919173 -37564535 24741686 74007335
4430G4007335J0932940j4711741j2993386Q20798R747321Q563698L72580m772000
$$ 74007335 84940275 70228534 57235148 58055946 67803267 76366965 76739545 71967545
4422G1967545J067522P700284l025952k4939685k9658976j0281264M809166m467904
$$ 71967545 73035067 80735351 77709399 52769714 23110738 12829474 17638640 13170736
4414A3170736k0498645j9324786n460423K611415j516321j5516159l3488001l6569339
$$ 13170736 -7327909 -26652695 -32113118 -29501703 -31018024 -46534183 -80022184 -116591523
4406a16591523p835080L2625501M3052828K2752345J6099541L5751383L3763386
$$ -116591523 -124426603 -91801102 -48748274 -25995929 -9896388 25854995 59618381
4399E9618381j7999626o9575844o1863586j3097203J6045254J2500334J1373576
$$ 59618381 41618755 -27957089 -89820675 -102917878 -86872624 -74372290 -62998714
4392f2998714K7741611M0204481L1341672M064747k9338184m3505757j0766370
$$ -62998714 -35257103 4947378 36289050 40353797 11015613 -32490144 -43256514
4385d3256514N0033110O9558366J6836436m4246025m0898483K288952Q879532
$$ -43256514 6776596 76334962 93171398 48925373 8026890 10315842 19195374
4378A9195374k7019829m0591202m522036L8170241M7411861K6367342q599639
$$ 19195374 -7824455 -48415657 -52937693 -14767452 32644409 59011751 50412112
4371E0412112l6867716k1954871M2159989Q5045388L6674202n8324750q8860637
$$ 50412112 13544396 -8410475 33749514 118794902 155469104 97144354 8283717
4364H283717l7160665N277145j0589346k9209405o996775J5219600L057209n201824
$$ 8283717 -28876948 -23599803 -34189149 -63398554 -70395329 -55175729 -52118520 -57320344
4356e7320344J8315211K9244853k970591k8388213o571915J4053092j4041913
$$ -57320344 -39005133 -9760280 -12730871 -41119084 -47690999 -33637907 -47679820
4349d7679820m1330906n823407M9320026M3999811k214789q967263K3733531K3667718
$$ -47679820 -89010726 -94834133 -45514107 -1514296 -3729085 -12696348 11037183 34704901
4341C4704901k1805979m9699779l4275556j6428492j5176547k833191K1400942
$$ 34704901 12898922 -36800857 -71076413 -87504905 -102681452 -105514643 -84113701
4334h4113701K1648128K718560J1419910M4662552M3423524l37493k0806894O899940
$$ -84113701 -62465573 -59747013 -48327103 -3664551 39758973 39421480 18614586 25514526
4326B5514526K0706904j4769746l7304093P286558O4173114N0084528k0586289
$$ 25514526 46221430 31451684 -5852409 1434149 65607263 115691791 95105502
4319I5105502o7636155o3510933m4542455l0062873l129564L7497672O5290273
$$ 95105502 27469347 -36041586 -80584041 -110646914 -113776478 -76278806 -10988533
4312a0988533O3868962L6811356q230018m9488522m8649044k279054K8858357
$$ -10988533 52880429 89691785 81461767 31973245 -16675799 -18954853 9903504
4305I903504o358891o7023090p0011044q716358M1147982L1910572k955030j4855278
$$ 9903504 3544613 -63478477 -133489521 -142205879 -101057897 -69147325 -72102355 -86957633
4297h6957633j129199J7784974L3285944L9134851K6085961M439874k170396K434353
$$ -86957633 -88086832 -70301858 -37015914 2118937 28204898 32644772 30474376 32908729
4289C2908729r430391l4130626l1846379L524579K0000027j3322061m8172819
$$ 32908729 23478338 -10652288 -42498667 -38974088 -18974061 -32296122 -80468941
4282h0468941k4306336L9072287P2074939N3852482K8064100K5188438K4008671
$$ -80468941 -104775277 -65702990 6371949 60224431 88288531 113476969 137485640
4275A37485640O96712k8128798l2456863j1320234J0921385J3504107p981464
$$ 137485640 138182352 110053554 77596691 66276457 77197842 90701949 82720485
4268H2720485m2305167o5745436n8209924k5206869P264096K3676785K9960147
$$ 82720485 40415318 -25330118 -83540042 -108746911 -101482815 -77806030 -47845883
4261d7845883L0287498J4734232j7324153m0491640k9660673O365175L4023856
$$ -47845883 -17558385 -2824153 -20148306 -60639946 -90300619 -83935444 -49911588
4254d9911588L1525772L722808l0415414n0076524m1096229j0518275J3026912
$$ -49911588 -18385816 -14663008 -45078422 -95154946 -136251175 -146769450 -133742538
4247a33742538J2004382O565323K5117261N3369027M5859184m559489m3971877
$$ -133742538 -121738156 -115172833 -90055572 -36686545 9172639 4613150 -39358727
4240c9358727k6141343K3520153M3598117J8363705j2227259j6530504n866451
$$ -39358727 -65500070 -41979917 1618200 19981905 7754646 -8775858 -14642309
4233a4642309L76707P109725K1397987K4639218m987956n2690979p4865502m8455098
$$ -14642309 -14265602 -7155877 14242110 38881328 33893372 -18797607 -93663109 -142118207
4225a42118207K596458L4773137L0940708J3154109J0138597J8232207P121634
$$ -142118207 -139521749 -104748612 -73807904 -60653795 -50515198 -32282991 -25161357
4218b5161357l0757536n5652767k8589396K6866050M5522779O144225m0629292
$$ -25161357 -55918893 -111571660 -140161056 -113295006 -67772227 -61628002 -102257294
4211a02257294m3899819j5190215O032665J5176847L1071897M4283334K5099936
$$ -102257294 -146157113 -161347328 -155314663 -140137816 -109065919 -64782585 -39682649
4204c9682649k1439407n1881735m1762714j2508758O530721J2481741J5485473
$$ -39682649 -61122056 -113003791 -154766505 -167275263 -160744542 -148262801 -132777328
4197a32777328J7150927J4573280P576217m294360j5826556r360361K3300001
$$ -132777328 -115626401 -101053121 -93476904 -97771264 -113597820 -122958181 -99658180
4190i9658180N6173743N5586262K8584308J0344001N441371j4384807m9016536
$$ -99658180 -43484437 12101825 40686133 51030134 56471505 42086698 -6929838
4183f929838n7191877k1461782K2652314M2749984M4164907K6865565k8025726
$$ -6929838 -64121715 -85583497 -62931183 -20181199 23983708 50849273 22823547
4176B2823547r0406600p2574576M4273410J37485298Q7713937m5974233r9714395
$$ 22823547 -67583053 -140157629 -95884219 41601079 129315016 83340783 -16373612
4169a6373612l1797434L8629714K3643461k2278773j9950813J3515204K4367727
$$ -16373612 -48171046 -9541332 14102129 -8176644 -28127457 -14612253 9755474
4162I755474J8027635K1157077J2330817l1900249p0298023n4101920j3866432
$$ 9755474 27783109 48940186 61271003 29370754 -40927269 -95029189 -108895621
4155a08895621j1365513l3797366j8468625L3670526N5386305K4802240k558362
$$ -108895621 -120261134 -154058500 -172527125 -138856599 -83470294 -58668054 -61226416
4148f1226416J0335763K8028372J3508743r325257k955577K1066781K8553335
$$ -61226416 -50890653 -22862281 -9353538 -18678795 -21634372 -567591 27985744
4141B7985744J9183784J6310158K0505243R498020k3218032n5208742n9531200
$$ 27985744 47169528 63479686 83984929 93482949 70264917 15056175 -44475025
4134d4475025l1268449O378589K0913220N491902r173023M587069K7036407J6775644
$$ -44475025 -75743474 -69364885 -48451665 -42959763 -52132786 -47545717 -20509310 -3733666
4126c733666k2968211m2468037j6518210K2332751L5850663K7015276J4988416
$$ -3733666 -26701877 -69169914 -85688124 -63355373 -27504710 -489434 14498982
4119A4498982P87774j4872808j2584806J4352001L5404724K2543119o675663j7380989
$$ 14498982 15286756 413948 -12170858 2181143 37585867 60128986 53453323 36072334
4111C6072334q932943n144582j0089183q416745K000768R785136J2784648J3373641
$$ 36072334 27139391 21994809 11905626 3488881 5489649 15274785 28059433 41433074
4103D1433074M054512j4394336j8088844L408473J5480288j4582684n6060242
$$ 41433074 45487586 31093250 13004406 16412879 31893167 17310483 -38749759
4096c8749759n1600381o501653J6666792n392407k6632633j2553885R957765J2101381
$$ -38749759 -90350140 -96851793 -80185001 -85577408 -112210041 -124763926 -114806161 -102704780
4088a02704780J5436550M1313216N4839175J6179903m0789036m3017025J6697141
$$ -102704780 -87268230 -45955014 8884161 25064064 -15724972 -58741997 -42044856
4081d2044856O6320851N3509949Q750370j0450067J99227j06042k8758998n5482832
$$ -42044856 24275995 77785944 86536314 76086247 76285474 76179432 47420434 -8062398
4073h062398m8594639j8661268N22758J860290J1803894M3143996O4890627M0902142
$$ -8062398 -56657037 -75318305 -74795547 -72935257 -61131363 -17987367 46903260 87805402
4065H7805402j4337961m7921004l5074063l081149J6303983K3392287K3640538
$$ 87805402 73467441 25546437 -9527626 -12608775 3695208 27087495 50728033
4058E0728033J747465m3652565o7481921k7549456M3360043O3407956O266393
$$ 50728033 52475498 8822933 -58658988 -86208444 -42848401 20559555 26825948
4051B6825948o3073201p3587840l1810996N924099J3995685J2634109J8084277
$$ 26825948 -36247253 -109835093 -141646089 -135721990 -121726305 -109092196 -91007919
4044i1007919J9055247N741040j0766426j9389032k4419357k6285268j0056006
$$ -91007919 -71952672 -66211632 -76978058 -96367090 -120786447 -147071715 -157127721
4037a57127721K6152434N0020347L1867803n542518q236931L3085291O2132854
$$ -157127721 -130975287 -80954940 -49087137 -54629655 -62866586 -29781295 32351559
4030C2351559L0769763l2706361n8177486k2674613K7516596M1771556K1381529
$$ 32351559 63121322 30414961 -27762525 -50437138 -22920542 18851014 40232543
4023D0232543J439629K25976M741451l175732k2704980l7642372l6959836k5790817
$$ 40232543 41672172 41898148 46639599 43463867 20758887 -16883485 -53843321 -79634138
4015g9634138j3341554L310846K9335201M8424207L4388163m049499k0883685
$$ -79634138 -92975692 -89664846 -60329645 -11905438 22482725 18433226 -2450459
4008b450459J908647J9340795q496568m4416381k7077111K4406202L2525195j2953993
$$ -2450459 -541812 18798983 10302415 -34113966 -61191077 -36784875 -4259680 -17213673
4000a7213673l4722198M189074L7355925P696117l4242211j5940400L4161083
$$ -17213673 -51935871 -47746797 -10390872 -2694755 -36936966 -52877366 -18716283
3993a8716283L7344743j378474p369112L1022779M2769097l482559m6877898l2105948
$$ -18716283 18628460 17249986 9880874 40903653 83672750 80190191 33312293 1206345
3985A206345J4182900M0790136M4727373M5403299L5010213l34283m1841660n7873897
$$ 1206345 15389245 56179381 100906754 146310053 181320266 180985983 139144323 81270426
3977H1270426m1487240o700908K6777195L1748541o393506n1733463m4510049
$$ 81270426 39783186 33082278 59859473 91608014 85214508 33481045 -11029004
3970a1029004J2292339M3322892R068749l1153531j1529380L6088757L4969204
$$ -11029004 1263335 44586227 53654976 22501445 10972065 47060822 82030026
3963H2030026j5485599m5385216k4748672M671255Q610416M976745J4603755K1653406
$$ 82030026 66544427 21159211 -3589461 1081794 9692210 14668955 29272710 50926116
3955E0926116O748023j8222335l0625898k7121434j8096813j1718662j2058139
$$ 50926116 57674139 39451804 8825906 -18295528 -36392341 -48111003 -60169142
3948f0169142j6097570j0437084J1542497L2154051K9379744R476707k538995
$$ -60169142 -76266712 -86703796 -75161299 -43007248 -13627504 -4150797 -6689792
3941f689792J553537J0702865J8410792K2331646J1469466j4651826k6101183
$$ -6689792 -5136255 5566610 23977402 46309048 57778514 43126688 17025505
3934A7025505K30274L3216790K1364179k9548979n9003039l4346291J4027775
$$ 17025505 17255779 50472569 71836748 42287769 -16715270 -51061561 -37033786
3927c7033786M4479437M5483615J9480421k5346807n6079731l7872616Q502672
$$ -37033786 7445651 52929266 72409687 47062880 -9016851 -46889467 -38386795
3920c8386795K1704262r207670k2368861K1701472P6455721P8776290L5360140
$$ -38386795 -16682533 -25890203 -48259064 -26557592 49898129 128674419 164034559
3913A64034559m169155k1620694l0851454l5060642l1179368l4357453n3745267
$$ 164034559 159865404 138244710 107393256 72332614 41153246 6795793 -46949474
3906d6949474o1436100k6376354L4101739P1513425O2708839K2022913k4522402
$$ -46949474 -108385574 -134761928 -100660189 -29146764 33562075 55584988 31062586
3899C1062586n0600453l7750174j7657K2676156J8714474J9499701L6237402L0091678
$$ 31062586 -19537867 -57288041 -57305698 -34629542 -15915068 3584633 39822035 69913713
3891F9913713j5467405m5734542j5345684L0728931K6748085o023060l504020
$$ 69913713 54446308 8711766 -6633918 24095013 50843098 44820038 41316018
3884D1316018K3906577J3723612k9273056l9259096j0016570k805837k5341288
$$ 41316018 65222595 78946207 49673151 10414055 397485 -2408352 -27749640
3877b7749640j4429043L5203741L9755228k7554115o9132413j3967715N9348729
$$ -27749640 -42178683 -6974942 32780286 5226171 -63906242 -77873957 -18525228
3870a8525228M1608089l8864808o8600389j9255892L7531350N5266807N1768064
$$ -18525228 23082861 -15781947 -84382336 -103638228 -66106878 -10840071 40927993
3863D0927993L5829521q668211n8915210n7447576J080918N3918421N7832189
$$ 40927993 76757514 68089303 9174093 -48273483 -47192565 6725856 64558045
3856F4558045L2515282K179718l9983151q1373858o8361933J6201909R7726553
$$ 64558045 97073327 99253045 59269894 -22103964 -90465897 -74263988 23462565
3849B3462565Q8959717M321901n6750119l6368049J9195797L4609448K296752
$$ 23462565 112422282 116744183 59994064 23626015 42821812 77431260 79728012
3842G9728012k6444779k3530043j3024433j6101544j2655860J4811270L4481108
$$ 79728012 53283233 29753190 16728757 627213 -12028647 2782623 37263731
3835C7263731Q477981l6040422l4610773J7724342N5072190L7078757j231439
$$ 37263731 45741712 9701290 -24909483 -7185141 47887049 84965806 83734367
3828H3734367j7325551k0214360k8283669k4456379J314892J4570613o296875
$$ 83734367 66408816 46194456 17910787 -6545592 -5230700 9339913 3043038
3821C043038j9824663J2759901N1865436L6171835j7787185m4284407l1199832
$$ 3043038 -16781625 -4021724 47843712 84015547 66228362 21943955 -9255877
3814i255877j8808116j5111237O606307L4935340K8067047m803220j0392054J4446697
$$ -9255877 -28063993 -43175230 -36568923 -1633583 26433464 21630244 11238190 25684887
3806B5684887J6438420j5277688k7974836k570312J2185504r028621k5538803
$$ 25684887 42123307 26845619 -1129217 -3699529 8485975 -542646 -26081449
3799b6081449j4729868j5527244m3367874m5043892M171755L7918765M526207
$$ -26081449 -40811317 -56338561 -99706435 -144750327 -140578572 -102659807 -98133600
3792i8133600l5880332m552298O3492339P5043255K6624863k622743J4545608
$$ -98133600 -134013932 -138566230 -75073891 -30636 26594227 23971484 38517092
3785C8517092K4948110J293505j3834793R280043L3171304J3515660l3712889
$$ 38517092 63465202 64758707 50923914 60203957 93375261 106890921 73178032
3778G3178032n4633434k1714390L7885906O3448758J6899185o3847974q9158415
$$ 73178032 18544598 -3169792 34716114 98164872 115064057 51216083 -37942332
3771c7942332k4488295N4921790N7210696p260539n3278099m1939858j0697759
$$ -37942332 -62430627 -7508837 49701859 42441320 -10836779 -52776637 -63474396
3764f3474396K769380r44999j5818179l6810669l4588574J2666139O3599733N6784156
$$ -63474396 -60705016 -61650015 -77468194 -114278863 -148867437 -136201298 -72601565 -15817409
3756a5817409Q433638p984061J6765161J3660361l8844699o8722290l0147195
$$ -15817409 -7383771 -15367832 1397329 15057690 -23787009 -92509299 -122656494
3749a22656494J8603090J4561231j0221282K25668J9662265j0567771o8512833
$$ -122656494 -104053404 -89492173 -99713455 -99487787 -79825522 -90393293 -158906126
3742a58906126p6022146j6064401N1606885Q2205943Q3983563O8789435L1316377
$$ -158906126 -234928272 -250992673 -199385788 -117179845 -33196282 35593153 66909530
3735F6909530j4857314l6252892k6959071j4371876j0341698K759983L0197630
$$ 66909530 52052216 15799324 -11159747 -25531623 -35873321 -33113338 -2915708
3728b915708M8321974M0160102J5158474j3484557l9727319m8129837k1546693
$$ -2915708 45406266 85566368 100724842 87240285 47512966 -616871 -22163564
3721b2163564K3644718M2021294J4874798k3100929k9200858o153526O316121
$$ -22163564 1481154 43502448 58377246 35276317 6075459 -78067 6238054
3714F238054j6757310n4937875o2944305k1147462L5844339N3456960K3854730
$$ 6238054 -10519256 -65457131 -128401436 -149548898 -113704559 -60247599 -36392869
3707c6392869l978161O209166K8176452K0521268o088454j1974259K242396J818474
$$ -36392869 -40371030 -34161864 -5985412 14535856 8447402 -3526857 -1284461 534013
3699E34013j5414053j3916297J5146240L7019448L0527553J2786046n117783l5765901
$$ 534013 -14880040 -28796337 -13650097 23369351 53896904 66682950 61565167 25799266
3691B5799266p0286505o7475949j6145269L6992935N2094915M5637874M2853287
$$ 25799266 -44487239 -111963188 -128108457 -91115522 -39020607 6617267 49470554
3684D9470554K7527095j6079902n1597267l5520272J2275313L5715115K1367935
$$ 49470554 76997649 60917747 9320480 -26199792 -13924479 21790636 43158571
3677D3158571M88563j0281676j8005796j6039033Q228419L4229221K8905051L252597
$$ 43158571 43647134 33365458 15359662 -679371 7549048 41778269 70683320 73935917
3669G3935917k689123J2752674J5731663M042259P215534J5370650j8024099q2451451
$$ 73935917 71246794 83999468 99731131 103773390 110988924 126359574 108335475 25884024
3661B5884024r6581850k7092306M9777447N7866676K7012634K2442764K6573615
$$ 25884024 -70697826 -97790132 -48012685 9853991 36866625 59309389 85883004
3654H5883004k0077224r4618581j06906683l4687979M4248508O5863661M7957636
$$ 85883004 65805780 -28812801 -135719484 -170407463 -126158955 -60295294 -12337658
3647a2337658K6737727R40000k9590502l6333559j3882338m583911k9002325m0962156
$$ -12337658 14400069 15340069 -14250433 -50583992 -64466330 -69050241 -98052566 -139014722
3639a39014722J263578O2182131P8696102M6702018O038779k7651239n7575964
$$ -139014722 -137751144 -75569013 3127089 49829107 55867886 28216647 -29359317
3632b9359317o0516586j4753348M0561176M1805815o135077l7459443k6983942
$$ -29359317 -89875903 -104629251 -64068075 -22262260 -28397337 -65856780 -92840722
3625i2840722j5862515k5334475j7950141K5335694N5584439K9548801j7424234
$$ -92840722 -108703237 -134037712 -151987853 -126652159 -71067720 -41518919 -58943153
3618e8943153k4745389K651085J0884017j7217131m3753173l3366404J1233974
$$ -58943153 -83688542 -81037457 -70153440 -87370571 -131123744 -164490148 -153256174
3611a53256174O3371372Q8380256N7962740j4972294o7140391m9732263N674695
$$ -153256174 -89884802 -1504546 56458194 41485900 -25654491 -75386754 -69712059
3604f9712059K6682773r62635k0669821P115615N4033746P4385025O0761731K7176189
$$ -69712059 -43029286 -43991921 -64661742 -57546127 -3512381 70872644 131634375 158810564
3596A58810564k1789588p3545759r2117952n8567439p738488J0330904p118480
$$ 158810564 137020976 63475217 -28642735 -87210174 -94948662 -84617758 -91736238
3589i1736238k3174120j8292325l469524J5277276M2217259N7504324K3352968
$$ -91736238 -114910358 -133202683 -136672207 -121394931 -79177672 -21673348 1679620
3582A679620n2794104r7994455n3294425M5590508J04994858Q3440256K7489668
$$ 1679620 -51114484 -149108939 -202403364 -156812856 -51817998 31622258 59111926
3575E9111926l543784o457685q666187j0976663N437644L1360354L1740457p72254
$$ 59111926 55568142 49110457 40444270 29467607 34905251 66265605 98006062 97233808
3567I7233808k9112807k1964472N417223J7845325P023963r702244k2649588l6056350
$$ 97233808 68121001 46156529 51573752 69419077 76443040 66740796 44091208 8034858
3559H034858m6171307l8391843j1147266J5565463K3561312J6189323P537103
$$ 8034858 -38136449 -76528292 -87675558 -72110095 -48548783 -32359460 -24822357
3552b4822357L416281L431314J2618345L4620354N4262528M5203808M878035l1836857
$$ -24822357 -21406076 -17974762 -5356417 29263937 83526465 128730273 133608308 101771451
3544A01771451l1286473o075186J643449j8110808k7165624K351606M2103756
$$ 101771451 70484978 64409792 66053241 47942433 20776809 23128415 65232171
3537F5232171M5840608J3305654j5583189j7643796m553072P298749J0717553
$$ 65232171 111072779 124378433 108795244 91151448 86598376 93897125 104614678
3530A04614678k240719k8069704l6467503q972760J4309726j9411353q3302544
$$ 104614678 102373959 74304255 37836752 28863992 43173718 23762365 -59540179
3523e9540179r1040718k4040303L5195835L0009861J2455750M1804532P2130673
$$ -59540179 -150580897 -174621200 -139425365 -109415504 -96959754 -55155222 16975451
3516A6975451K7585040n7046499p2163071L815214P1532045M9876124k9941464
$$ 16975451 44560491 -12486008 -84649079 -80833865 -9301820 40574304 10632840
3509A0632840q7235634q3242136k9250481L9418788P5111597N1580706M964293
$$ 10632840 -76602794 -159844930 -189095411 -149676623 -74565026 -22984320 -18020027
3502a8020027j917079L3074442M9086993J7895824j7084005j9159820j5098928
$$ -18020027 -19937106 13137336 62224329 80120153 63036148 43876328 28777400
3495B8777400l6459802n5233991k5863357M0151011Q4576391O9673473P445971
$$ 28777400 -7682402 -62916393 -88779750 -48628739 35947652 105621125 113067096
3488A13067096n8830897q2046441m4223489J7985498M2742739J1989446l2264110
$$ 113067096 54236199 -27810242 -72033731 -54048233 -11305494 683952 -31580158
3481c1580158m6097740k5834175J0851817M3345315M2103007n357440n3383658
$$ -31580158 -77677898 -103512073 -92660256 -49314941 -7211934 -12569374 -65953032
3474f5953032m0361534J5929315L2434508j0691860l5211172O769478N4791869
$$ -65953032 -106314566 -90385251 -57950743 -68642603 -103853775 -97084297 -42292428
3467d2292428M4737810R015319K017356L058885k1437989l0346682J6298798N4438797
$$ -42292428 2445382 11460701 13478057 16536942 -4901047 -35247729 -18948931 35489866
3459C5489866O350615o9514533m9291746N5440757J03238738L6644890m0417000
$$ 35489866 41840481 -27674052 -76965798 -21525041 81713697 118358587 77941587
3452G7941587l1886574K0726982L0963319m584286l3429466l4171835j9164459
$$ 77941587 46055013 66781995 97745314 93161028 59731562 25559727 6395268
3445F395268L42053Q601405j2038215m3066917m0217482m342763J1108123j4286102
$$ 6395268 6737321 15338726 3300511 -39766406 -79983888 -84326651 -73218528 -87504630
3437h7504630l3892579j2857752J9843654L1125897L5737967M9656404M7145709
$$ -87504630 -121397209 -134254961 -114411307 -83285410 -47547443 2108961 49254670
3430D9254670Q185073l7122217n1381499l7168426j2272232J6299322K8425021
$$ 49254670 57439743 20317526 -31063973 -68232399 -80504631 -64205309 -35780288
3423c5780288l326011n5085980o0380348j0283736K3643493N939717j945807M5827550
$$ -35780288 -39106299 -94192279 -154572627 -164856363 -141212870 -135273153 -137218960 -91391410
3415i1391410Q6685417M8795619k3931557l8212054O598399L7369307L0989923
$$ -91391410 -4705993 44089626 20158069 -18053985 -11455586 25913721 56903644
3408E6903644K3383842K0143021n875681l9533438l5333084p20795J2284653n524219
$$ 56903644 80287486 100430507 94554826 55021388 19688304 18967509 31252162 25727943
3400B5727943j8071691k2104923m6332538p4158355n2124835J5444041N9918327
$$ 25727943 7656252 -14448671 -60781209 -134939564 -187064399 -171620358 -111702031
3393a11702031N0039796K5397488J4969935o62845k5935300k5653739P182759
$$ -111702031 -61662235 -36264747 -21294812 -21957657 -47892957 -73546696 -66363937
3386f6363937K7152567J0880978o907597j688071r89651k4050442l9269811k0931464
$$ -66363937 -39211370 -28330392 -35237989 -36926060 -37915711 -61966153 -101235964 -122167428
3378a22167428L682111K729687j0304954r941894J538563J7872283M6541619P4045579
$$ -122167428 -118485317 -115755630 -126060584 -136002478 -134463915 -116591632 -70050013 3995566
3370C995566O3221735J5845887j4790310o458689m697294l7250287n5479226j6073455
$$ 3995566 67217301 83063188 68272878 61814189 57116895 19866608 -35612618 -51686073
3362e1686073L7196905L9928878O794668p436862n389641k4886530m8451292k3173115
$$ -51686073 -14489168 25439710 32234378 24797516 19407875 -5478655 -53929947 -77103062
3354g7103062L8175577O0539691J9088196k5777489k4233009l722718j1450508
$$ -77103062 -38927485 21612206 40700402 14922913 -9310096 -13032814 -24483322
3347b4483322l9819887m4694447j0368610L2662263M4700987J9054958r207056
$$ -24483322 -64303209 -108997656 -119366266 -86704003 -42003016 -22948058 -32155114
3340c2155114j888769K9159222K9120573k2186245p0659588n9055141o495042
$$ -32155114 -34043883 -4884661 24235912 2049667 -68609921 -127665062 -134160104
3333a34160104K9795743M2673318O1632154P1318733K4708117n7483186q4132951
$$ -134160104 -104364361 -61691043 -58889 71259844 95967961 38484775 -45648176
3326d5648176k1602690M6031842L1092440l7837363o5702427k3351393L0021675
$$ -45648176 -67250866 -21219024 9873416 -27963947 -93666374 -117017767 -86996092
3319h6996092L9789838J5070288o697645j0726835o483209l817836l350218k052527
$$ -86996092 -47206254 -32135966 -38833611 -49560446 -56043655 -59861491 -63211709 -65264236
3311f5264236L75691J516846K294785P676638J4248384N992118k0817292l7112940
$$ -65264236 -64888545 -63371699 -61076914 -53400276 -39151892 -33159774 -53977066 -91090006
3303i1090006j2802375L2957078M6947417J4239366k0083835j6269879Q697161
$$ -91090006 -103892381 -70935303 -23987886 -9748520 -29832355 -46102234 -37405073
3296c7405073J8153203J0623757N357419K18863j6395168k8401929r039183K9440745
$$ -37405073 -19251870 -8628113 -3270694 -3051831 -19446999 -47848928 -56888111 -27447366
3288b7447366M0861917M719878m6876486o7279657m0750869J0451782M6221406
$$ -27447366 13414551 18134429 -28742057 -96021714 -136772583 -126320801 -80099395
3281h0099395L9323332M959980p601695K4637923N7867529L4035745l3778478
$$ -80099395 -40776063 -35816083 -43417778 -18779855 39087674 73123419 39344941
3274C9344941p1847975m5778838k584989N628323o340096L624722K9383633K9216919
$$ 39344941 -32503034 -78281872 -80866861 -75238538 -81578634 -77953912 -48570279 -19353360
3266a9353360k182153k3643195j0799216J1432964J0867819q339386j9744503
$$ -19353360 -21535513 -45178708 -55977924 -44544960 -33677141 -42016527 -61761030
3259f1761030j1099685Q663030K5231930K9239319J9638290M447636q562549k2246791
$$ -61761030 -72860715 -64197685 -38965755 -9726436 9911854 14359490 5796941 -16449850
3251a6449850l9357368m4478156j8463655K5714049M8036073L4685225J9661451
$$ -16449850 -55807218 -100285374 -118749029 -93034980 -44998907 -10313682 9347769
3244I347769L1951818M5506256J4999537n1582858r4205750p6087857k4523513
$$ 9347769 41299587 86805843 101805380 50222522 -43983228 -120071085 -144594598
3237a44594598J2931824K4397154K8961930L7340458M0181662K8297858O914937
$$ -144594598 -131662774 -107265620 -78303690 -40963232 -781570 27516288 34431225
3230C4431225j0549644j4771629p549611Q2908K46264r17143P568537K1284023
$$ 34431225 23881581 9109952 1560341 1643249 1889513 972370 8540907 29824930
3222B9824930K1960187L594017j7009978k4685412k7036780l6529719m2133117
$$ 29824930 51785117 55379134 38369156 13683744 -13353036 -49882755 -92015872
3215i2015872k0138861K6669462O0036343M5820199o984034n4881834o1903559
$$ -92015872 -112154733 -85485271 -25448928 20371271 13387237 -41494597 -103398156
3208a03398156k7531892J9585228M5832191L5622003M311497j0987388J1988112
$$ -103398156 -130930048 -111344820 -65512629 -29890626 -25579129 -36566517 -24578405
3201b4578405M8574905M8477529j25550m6584370l8357390J1238374M6097123
$$ -24578405 23996500 72474029 72348479 25764109 -12593281 -1354907 44742216
3194D4742216M5001171L3163203J9038102k3770120r0661597j16807816n7180487
$$ 44742216 89743387 122906590 141944692 118174572 27512975 -89294841 -146475328
3187a46475328M0916577R2312087P4521419K9034102r862931l3707445l0197946
$$ -146475328 -105558751 -13246664 61274755 90308857 80445926 46738481 16540535
3180A6540535L017703K7710498J0417306j3014897J3090194O0666778M8443874
$$ 16540535 19558238 47268736 57686042 44671145 57761339 118428117 166871991
3173A66871991k1559337n6201126k3777367r159186o4224273j04991289m2535953
$$ 166871991 145312654 89111528 65334161 56174975 -8049298 -113040587 -155576540
3166a55576540O3441094Q6390438J7900868l7034901k3440136J0500323J8323879
$$ -155576540 -92135446 -5745008 12155860 -24879041 -48319177 -37818854 -19494975
3159a9494975J5227780K0045657J9526380J0985409J3487271J9058270m870293
$$ -19494975 -4267195 15778462 35304842 46290251 59777522 78835792 73965499
3152G3965499m8176575n5856103j3245744K7339351K9424181K2003769L4986223
$$ 73965499 25788924 -30067179 -43312923 -15973572 13450609 35454378 70440601
3145G0440601M1955647J0144688l6635431n1592489l2202864j2632162r654432
$$ 70440601 112396248 122540936 85905505 34313016 2110152 -10522010 -20176442
3138b0176442j1587759o952081M038190J6655810K2444028J5245977O829122J7070284
$$ -20176442 -31764201 -38716282 -34678092 -18022282 4421746 19667723 26496845 43567129
3130D3567129L9311628M0822720J0062597k3834352l3479322k6743723k0809971
$$ 43567129 82878757 123701477 133764074 109929722 76450400 49706677 28896706
3123B8896706j2917601j70827r96193k7289438n3517873m2823853M610785N0369726
$$ 28896706 15979105 15808278 14812085 -12477353 -65995226 -108819079 -104208294 -53838568
3115e3838568N9213703K9050161j1846304k8261312q541923K2099026K8527296
$$ -53838568 5375135 34425296 22578992 -5682320 -14224243 7874783 36402079
3108C6402079N804406k1378649l3899393l1457203j6909805M560433J5032545
$$ 36402079 42206485 20827836 -13071557 -44528760 -61438565 -56878132 -41845587
3101d1845587M195570m746513J3805728L6731031J8461617l2578091n7680550
$$ -41845587 -37650017 -42396530 -28590802 8140229 26601846 -5976245 -63656795
3094f3656795l5721925j0599584j5414425k6984051j8714982k117069J1965251
$$ -63656795 -99378720 -109978304 -125392729 -152376780 -171091762 -173208831 -161243580
3087a61243580L6985247O4476362N3755421O179027j2189078K8449509N8993694
$$ -161243580 -124258333 -59781971 -6026550 152477 -12036601 16412908 75406602
3080G5406602J3509878n9415167o5529048r077324J7055017k6853198p3884860
$$ 75406602 88916480 29501313 -36027735 -45105059 -28050042 -54903240 -128788100
3073a28788100m8368283L9211693J10896650J02929235K3315852n4446987o3740784
$$ -128788100 -177156383 -137944690 -27048040 75881195 99197047 44750060 -18990724
3066a8990724k0075462K961485k0062949l5934861r835646J5694008M698588O2498
$$ -18990724 -39066186 -36104701 -56167650 -92102511 -101938157 -86244149 -81545561 -81483063
3058h1483063M3121243Q3594690N5055109r003083k7729445k836645K458301j6001865
$$ -81483063 -38361820 45232870 100287979 91284896 63555451 60718806 63177107 47175242
3050D7175242r137035J7819527J2706557j5018766k240046M6854360N4994043
$$ 47175242 38038207 55857734 68564291 53545525 51305479 98159839 153153882
3043A53153882J219892m6477377m7724581l9766548m7161347l9634820j0020066
$$ 153153882 154373774 107896397 60171816 20405268 -26756079 -66390899 -76410965
3036g6410965l48688j7634204j3601432K1385756L6293533J9284941J9319295
$$ -76410965 -76759653 -94393857 -107995289 -86609533 -50316000 -31031059 -11711764
3029a1711764L7784976J1905121n2013938n3697480L0777697Q1771485K3111271
$$ -11711764 26073212 37978333 -14035605 -67733085 -36955388 44816097 67927368
3022F7927368m8718999k8443524K3010695j173371n8794705l7677542M1053076
$$ 67927368 19208369 -9235155 13775540 12602169 -46192536 -83870078 -42817002
3015d2817002O0148744N974692k5016578O57437K2103426J8607570L2435147N2506719
$$ -42817002 17331742 23306434 -1710144 -1052707 21050719 39658289 72093436 124600155
3007A24600155J5306306o0314099p4694843j3587707J8136120k8102677o2284238
$$ 124600155 139906461 79592362 4897519 -8690188 9445932 -18656745 -80940983
3000h0940983j0432888O2551303O3215615J0884194j5809170m057133L518887
$$ -80940983 -91373871 -28822568 34393047 45277241 29468071 25410938 28929825
2993B8929825o468418j7059992k6418821l4589910k0177164J9406871M1940095
$$ 28929825 22461407 5401415 -21017406 -55607316 -75784480 -56377609 -14437514
2986a4437514K0477936j1253670j7143912j5084246k6589265k2359031K0610319
$$ -14437514 6040422 -5213248 -22357160 -37441406 -64030671 -86389702 -65779383
2979f5779383N5198579K9495693k0997677k3400271J7643392L5923904J6767150
$$ -65779383 -10580804 18914889 -2082788 -25483059 -7839667 28084237 44851387
2972D4851387P483159J7686771o27976n4722755p6147926k2957807M9208413O6392755
$$ 44851387 52334546 70021317 69393341 14670586 -61477340 -84435147 -35226734 31166021
2964C1166021L5908469J3273973Q425411j1884365m5980856m7788698m171778
$$ 31166021 67074490 80348463 88773874 76889509 30908653 -16880045 -21051823
2957b1051823L2295879J5046600k7545501l0579541J7255523N9184420M5450027
$$ -21051823 11244056 26290656 -1254845 -31834386 -14578863 44605557 90055584
2950I0055584r174969n3347785n8866607l4850914j939547K3670067L0399297
$$ 90055584 80880615 27532830 -31333777 -66184691 -68124238 -44454171 -14054874
2943a4054874J9007699O565324M101136l691846l5066048p3173157p7926193l7187575
$$ -14054874 4952825 11518149 15619285 11927439 -23138609 -96311766 -174237959 -211425534
2935b11425534J7597439M9141934M5591346J5017950k3594137m1073591j9654958
$$ -211425534 -193828095 -144686161 -99094815 -84076865 -107671002 -148744593 -168399551
2928a68399551J8908700L4603922K3712076J9795427L4262517L7127155J2673021
$$ -168399551 -149490851 -114886929 -91174853 -71379426 -37116909 10246 12683267
2921A2683267r684206o757863k100220j9629094l4322160j2988933K6029570M1563486
$$ 12683267 2999061 -3758802 -5859022 -25488116 -59810276 -72799209 -46769639 -5206153
2913e206153L2801897K3115976M764545l9132496p3155290m1978808L3780874
$$ -5206153 27595744 50711720 55476265 16343769 -56811521 -98790329 -65009455
2906f5009455O6049543K0856096l5852449m1439735j9910456j9496500k5975703
$$ -65009455 1040088 21896184 -13956265 -55396000 -75306456 -94802956 -120778659
2899a20778659J447745M7397280N9253857K8990771l268499j6599378k5451853
$$ -120778659 -119330914 -71933634 -12679777 16310994 13042495 -3556883 -29008736
2892b9008736l4708116l1949401k3770735k9106203l5808004j5889674J5073357
$$ -29008736 -63716852 -95666253 -119436988 -148543191 -184351195 -200240869 -185167512
2885a85167512J3721435q999823Q130891O8428234Q9655758K8935462l6834263
$$ -185167512 -171446077 -180445900 -172315009 -103886775 -14231017 14704445 -22129818
2878b2129818k0792882M3688631O3485486L0262077R685002J4436833n174990
$$ -22129818 -42922700 765931 64251417 94513494 104198496 118635329 113460339
2871A13460339m7067766m3238154J7800723N5483968K4177201j5756618o737651
$$ 113460339 66392573 23154419 40955142 96439110 120616311 104859693 98122042
2864I8122042J0668783k0086074o5465198n9353433j3888668J1215110J1244127
$$ 98122042 108790825 88704751 23239553 -36113880 -50002548 -38787438 -27543311
2857b7543311K3758946M0909522K0141340l0576017n6467150l8930866o552294
$$ -27543311 -3784365 37125157 57266497 26690480 -29776670 -68707536 -75259830
2850g5259830K6172531O1447124P2678601L3400751j7536127k1379731k078949
$$ -75259830 -49087299 12359825 85038426 118439177 100903050 79523319 77444370
2843G7444370l0418813q6907758p1148098K9007523R2958142M3573618l6481279
$$ 77444370 47025557 -39882201 -111030299 -82022776 10935366 54508984 18027705
2836A8027705l7465262J6510524K8959630j1473952l3448336p530915K1955612
$$ 18027705 -19437557 -2927033 26032597 14558645 -18889691 -26420606 -4464994
2829d464994J6912022j2662004l9712082m1531888m455884M8676174N9465999
$$ -4464994 12447028 -214976 -39927058 -81458946 -85914830 -37238656 22227343
2822B2227343Q461218m0416662k2129299L2939061M5167477L233572l1691532
$$ 22227343 30688561 -9728101 -31857400 1081661 46249138 49482710 17791178
2815A7791178k4573946j743808R008414J2099060J3522752O680476o102590j5366009
$$ 17791178 -6782768 -8526576 481838 12580898 26103650 32784126 26681536 11315527
2807A1315527k3640410l1288302k1712839L746518P157705k2609702k7049805
$$ 11315527 -12324883 -43613185 -65326024 -61579506 -54421801 -77031503 -104081308
2800a04081308L5790660J00532902P5667844j1106501m9106321j5485471J926127
$$ -104081308 -68290648 32242254 107910098 96803597 47697276 32211805 34137932
2793C4137932l5930907n4198518l47680N9332577M5649424j0526349k5609968
$$ 34137932 -1792975 -55991493 -56339173 2993404 48642828 38116479 12506511
2786A2506511R842932L1865216l03563o2069358r8399123p0479701O959702O1128818
$$ 12506511 22349443 54214659 53911096 -8158262 -106557385 -177037086 -170077384 -108948566
2778a08948566L5358256k4956044k1930042M8617188Q3603183L2976814k4266962
$$ -108948566 -73590310 -98546354 -120476396 -71859208 11743975 44720789 20453827
2771B0453827j8426435k465909m2899405q7284701n0974103K9912131N4276499
$$ 20453827 2027392 -438517 -43337922 -130622623 -181596726 -151684595 -97408096
2764i7408096K1293593J3852823M2331784L6195997j1379803k1388934K6878107
$$ -97408096 -76114503 -62261680 -19929896 16266101 4886298 -16502636 10375471
2757A0375471M9777223k044434o2931862o1155891k0213014M329780J2997256
$$ 10375471 60152694 58108260 -4823602 -65979493 -86192507 -81862727 -68865471
2750f8865471K8204477L5967398K1737017J1958115K4160129K3528762j6047589
$$ -68865471 -40660994 -4693596 17043421 29001536 53161665 76690427 60642838
2743F0642838n2830856l6988186Q645707K5673720O676523j1804750j6396236
$$ 60642838 7811982 -29176204 -20530497 5143223 11819746 14996 -16381240
2736a6381240k1629532k8056643k6440946k5540361l0766573j8988371J8201495
$$ -16381240 -38010772 -66067415 -92508361 -118048722 -148815295 -167803666 -149602171
2729a49602171L5840215j260392m3800400j7537793N8204539R0288418M9055450
$$ -149602171 -113761956 -115022348 -158822748 -176360541 -118156002 -27867584 21187866
2722B1187866M149261P204504J9346523p396398m4807881l7693617Q109713M1639668
$$ 21187866 25337127 32541631 51888154 44491756 -316125 -38009742 -29900029 11739639
2714A1739639M1822591K7778776J3965424k43774q358290l671660j017392j7872386
$$ 11739639 53562230 81341006 95306430 95062656 86704366 83032706 82015314 64142928
2706F4142928m0460571m0183547j7118573M587860J7607377L1355645L4852869
$$ 64142928 23682357 -16501190 -33619763 -29031903 -11424526 19931119 54783988
2699E4783988L563975m8201714o6573513l2258936M211901m401969k6654355Q83799
$$ 54783988 58347963 10146249 -56427264 -88686200 -84474299 -88876268 -115530623 -114646824
2691a14646824O8893211R7026624M7730071j8215751k8512260L685316J3209523
$$ -114646824 -45753613 51273011 99003082 80787331 52275071 55960387 69169910
2684F9169910j7355755m4868300l9818667j7888168N069102L5821840O6097339
$$ 69169910 51814155 6945855 -32872812 -50760980 -45691878 -9870038 56227301
2677E6227301O1726811J6725744k2431564j8646838M342407O436803p118958j0351299
$$ 56227301 117954112 134679856 112248292 93601454 97943861 104380664 97261706 86910407
2669H6910407j2139381l5234879n9939506m5279512J532929L0540153K2294198
$$ 86910407 74771026 39536147 -20403359 -65682871 -64149942 -33609789 -11315591
2662a1315591N131546p93767m939139q420000K149387J5318823K701227k4607661
$$ -11315591 -6184045 -6977812 -11916951 -20336951 -18187564 -2868741 -167514 -24775175
2654b4775175k3784472M979292J4942678n70703P875547M7065842M9136164j2054453
$$ -24775175 -48559647 -43580355 -28637677 -29208380 -21332833 25733009 74869173 62814720
2646F2814720n4788267j2557989M8834970L0176120m0125535n2029019J0376708
$$ 62814720 8026453 -4531536 44303434 74479554 34354019 -17675000 -7298292
2639g298292N2870630K4380721k2502524l5966002k9893808k1093311N917042
$$ -7298292 45572338 69953059 47450535 11484533 -18409275 -39502586 -33585544
2632c3585544L8971429K8331761k4114417m4824493k016479L7084947J4451168
$$ -33585544 5385885 33717646 9603229 -35221264 -37237743 -152796 14298372
2625A4298372k6462377k0149739J4365125K0479824M692681R205179K2352175
$$ 14298372 -12164005 -32313744 -17948619 2531205 7223886 16429065 38781240
2618C8781240N24598m3618425n6106655l2607523j7393393j7259274N541376M9280592
$$ 38781240 39305838 -4312587 -60419242 -93026765 -110420158 -127679432 -122138056 -72857464
2610g2857464N9034908J7367687j9700482q446925J8491821J2492754j3066521
$$ -72857464 -13822556 3545131 -16155351 -24602276 -6110455 6382299 -6684222
2603f684222j1399908K1060175M3797935L5128069J5135366N981076J205085j5949613
$$ -6684222 -18084130 2976045 46773980 81902049 97037415 103018491 104223576 88273963
2595H8273963m3259639o1647039n8535356l7962987r849606J8600978L6708258
$$ 88273963 45014324 -16632715 -75168071 -113131058 -122980664 -104379686 -67671428
2588f7671428K9546121k183492l1018159l1316882j2561741n02002P069423L0495793
$$ -67671428 -38125307 -40308799 -71326958 -102643840 -115205581 -115707583 -108638160 -78142367
2580g8142367N6291812M1945149j4205018n5849565m6383401j8495685j3700556
$$ -78142367 -21850555 20094594 5889576 -49959989 -96343390 -114839075 -128539631
2573a28539631j6873627N514675L9489913M6038961K2882320k056266j4442074
$$ -128539631 -145413258 -139898583 -100408670 -54369709 -31487389 -33543655 -47985729
2566d7985729j0212744J9289923N4518190M0312947l2764707q2508669m0303386
$$ -47985729 -58198473 -38908550 15609640 55922587 23157880 -59350789 -99654175
2559i9654175L8340765N2106026O339388j3140744P488957K311784l4672527l0794530
$$ -99654175 -61313410 -9207384 -2867996 -16008740 -8519783 -6207999 -40880526 -71675056
2551g1675056K3202539L9722231j3259816m7060278k037330M9515010K9860782
$$ -71675056 -48472517 -8750286 -22010102 -69070380 -71107710 -21592700 8268082
2544H268082j5120547q749465J9399895j941629m8037102m0732356J1507959K9563470
$$ 8268082 -6852465 -15601930 3797965 1856336 -46180766 -86913122 -75405163 -45841693
2536d5841693l97804j2647379K0349905N0286572M1420274J7667885P773557O295994
$$ -45841693 -46239497 -58886876 -38536971 11749601 53169875 70837760 78611317 84907311
2528H4907311J064426r157140k7129323m6783190m1175662j707386L3070785L3371594
$$ 84907311 85971737 76814597 49685274 2902084 -38273578 -39980964 -6910179 26461415
2520B6461415K7639094L8032872J3648552q5278236j75857004j38717659l507797
$$ 26461415 54100509 92133381 105781933 20503697 -155353307 -294070966 -297578763
2513b97578763P3077834K8436922k7020539R520154Q6003932R3979454K7939611
$$ -297578763 -224500929 -196064007 -223084546 -213564392 -127560460 -33581006 -5641395
2506e641395k9448852k6258205J8717688N7323119M8934698q326353n7253675
$$ -5641395 -35090247 -61348452 -42630764 14692355 63627053 55300700 -1952975
2499a952975l9674761J0402243K875961n8752175o1018668L7661291J15996933
$$ -1952975 -41627736 -31225493 -28349532 -87101707 -148120375 -110459084 5537849
2492E537849O6392654l3154855l9909452L2814871N2781326j4458723p2790071
$$ 5537849 71930503 38775648 -1133804 31681067 84462393 70003670 -2786401
2485b786401p0655313o1940232o9707160l0483625O9917979J27335411O6986957
$$ -2786401 -73441714 -135381946 -205089106 -235572731 -165654752 -38319341 28667616
2478B8667616l3310246n7410170j5420308L389125j3091148j684721M2816085
$$ 28667616 -4642630 -62052800 -77473108 -74083983 -87175131 -88859852 -46043767
2471d6043767M9982699p89257l6452637n955202M0193235L5032644j424160m722033
$$ -46043767 3938932 3149675 -33302962 -39258164 935071 35967715 34543555 29821522
2463B9821522K7840565M0389462J1378760k0780979k7321591k6652948l5034192
$$ 29821522 57662087 98051549 109430309 88649330 61327739 34674791 -359401
2456c59401l0026684M747605L6271071K5793006p260893j1768136J4639371K1730713
$$ -359401 -30386085 -25638480 10632591 36425597 29164704 17396568 32035939 53766652
2448E3766652j1453689m0788010k5626690R272664J6994808K770867P282116L0636773
$$ 53766652 42312963 1524953 -24101737 -14829073 2165735 4936602 12218718 42855491
2440D2855491K7891925j2995984m0846995j5895028K5135783J9867464k6652017
$$ 42855491 70747416 57751432 16904437 1009409 26145192 46012656 19360639
2433A9360639m7922229j0812457M2913014O0912699M3166653J7621640q385527
$$ 19360639 -28561590 -39374047 3538967 64451666 107618319 125239959 116854432
2426A16854432l5979486m3564814j4993272J7781625J2175978j2310727K068587
$$ 116854432 80874946 37310132 22316860 40098485 52274463 39963736 42032323
2419D2032323N0002549N3057881k2667421j02959931j04760785m5263942L982393
$$ 42032323 92034872 145092753 122425332 19465401 -85295384 -130559326 -126576933
2412a26576933K4454425M2343616N0147344K1556029j2859901M359445N0577415
$$ -126576933 -102122508 -59778892 -9631548 11924481 -935420 3424025 54001440
2405E4001440L8121319m4196187r5131910m6072446L9242654O4706964L2042343
$$ 54001440 92122759 47926572 -47205338 -93277784 -54035130 10671834 42714177
2398D2714177M557395k935655k0151489m2559305l4794087K002539L1620133M1515136
$$ 42714177 47271572 44335917 24184428 -18374877 -53168964 -51166425 -19546292 21968844
2390B1968844M2605556K3183743l4243382r4831930r4326465k8741992L2973661
$$ 21968844 64574400 87758143 53514761 -41317169 -135643634 -164385626 -131411965
2383a31411965L8095970O159105j4713560m430496K7766162N9712512O2878592
$$ -131411965 -93315995 -87156890 -101870450 -106300946 -78534784 -18822272 44056320
2376D4056320K6543568j8353984l2418945k3192530k7580695m4638936l8588399
$$ 44056320 70599888 52245904 19826959 -3365571 -30946266 -75585202 -114173601
2369a14173601q872965N315406K88758J8122748N9014823N7907430r478797o7210666
$$ -114173601 -123046566 -117731160 -117442402 -99319654 -40304831 17602599 8123802 -59086864
2361e9086864m4384864J9198648M1612904K2936956J9127875K8283114k109849
$$ -59086864 -103471728 -84273080 -42660176 -19723220 -595345 27687769 25577920
2354B5577920o5626307q8683929m3605374J1281791K5767435J8875651J8341093
$$ 25577920 -40048387 -128732316 -172337690 -161055899 -135288464 -116412813 -98071720
2347i8071720R382521j6211807k1819112J2864467M1892678J9489237k2385831
$$ -98071720 -88689199 -104901006 -126720118 -113855651 -71962973 -52473736 -74859567
2340g4859567k1998717J4692379K7840361K021291j1366736K5318966Q1808561
$$ -74859567 -96858284 -82165905 -54325544 -52304253 -63670989 -38352023 43456538
2333D3456538R8445288M7505020m7100880j23718140j22527202m5747339K7728154
$$ 43456538 141901826 189406846 142305966 18587826 -103939376 -149686715 -121958561
2326a21958561K7094663j7390236j5138581N1646095R7104811N4060774l1536442
$$ -121958561 -94863898 -112254134 -127392715 -75746620 21358191 75418965 43882523
2319D3882523o7498590l2621162J9237407M1641655L3100135R058836j7043662
$$ 43882523 -23616067 -56237229 -36999822 4641833 37741968 46800804 29757142
2312B9757142k8770392j8663306m489545p235919j8112848j2726266Q536110K0620314
$$ 29757142 986750 -17676556 -22166101 -29402020 -47514868 -60241134 -51705024 -31084710
2304c1084710J0655901p902208j4835014m07791K8144370M3410396J8730576k9966411
$$ -31084710 -20428809 -28331017 -43166031 -43573822 -15429452 27980944 46711520 16745109
2296A6745109m7880564j1738790L2464281L5146848J3404089J0050935J6444487
$$ 16745109 -31135455 -42874245 -10409964 24736884 38140973 48191908 64636395
2289F4636395j053177k3455099n441177L2130468K2234531l0812437m4636907
$$ 64636395 63583218 40128119 34686942 66817410 89051941 58239504 13602597
2282A3602597P857079M9521108K3394975k1813418k7881163k5864782o0878795
$$ 13602597 21459676 70980784 94375759 72562341 44681178 18816396 -42062399
2275d2062399q7275632l6065300N6299508Q7803120L8934033j4994820l0569198
$$ -42062399 -129338031 -165403331 -109103823 -21300703 17633330 2638510 -27930688
2268b7930688l7727188m7578809j8389485N3215086R2752083N1420401j4623453
$$ -27930688 -65657876 -113236685 -131626170 -78411084 14340999 65761400 51137947
2261E1137947k5833726P573815J6134918j6553034l8945144k1021080K567727
$$ 51137947 25304221 32878036 49012954 32459920 -6485224 -27506304 -24938577
2254b4938577o831498l2371415k9867623P886950M2873649M1037158P510304k8438556
$$ -24938577 -31770075 -64141490 -94009113 -86122163 -43248514 -2211356 5298948 -23139608
2246b3139608m4343716l2832999K361041M1395244N2594530K5289218q805016
$$ -23139608 -67483324 -100316323 -97955282 -56560038 -3965508 21323710 12518694
2239A2518694j2582831M799618N787624j1041640r020839J8301373K9073009L568911
$$ 12518694 -64137 4735481 10523105 -518535 -9539374 8761999 37835008 41403919
2231D1403919j9749980r807326P724247P853799J8671713N8765283P2966797P998808
$$ 41403919 21653939 11846613 19570860 27424659 46096372 104861655 177828452 185827260
2223A85827260q2656579r8090270l7927608P78839k5498081n2312904k2795871
$$ 185827260 103170681 5080411 -32847197 -32068358 -57566439 -109879343 -132675214
2216a32675214K9587396M9407085L7110742J7086117q702783l0601606j2063744
$$ -132675214 -103087818 -53680733 -16569991 516126 -8186657 -38788263 -50852007
2209e0852007M8946739Q6907585N0275317k1106076n1302394k9433194m213973
$$ -50852007 -1905268 85002317 135277634 114171558 62869164 33435970 29221997
2202B9221997l424904j2685816j9446582k6992862k8609807r787844K2284559
$$ 29221997 25797093 13111277 -6335305 -33328167 -61937974 -71725818 -49441259
2195d9441259M2651865M2588471L5183049K8362933J4045392j4162475m5620602
$$ -49441259 -6789394 35799077 70982126 99345059 113390451 99227976 53607374
2188E3607374n6647126l0282422J7968750M0253126P138582m3697605m4236327
$$ 53607374 -3039752 -33322174 -15353424 24899702 32038284 -11659321 -55895648
2181e5895648J3410924O3375459N4553900R098161k5668713l6686386k9968546
$$ -55895648 -42484724 20890735 75444635 84542796 58874083 22187697 -7780849
2174g780849m294566K3215786R847341m9954945r2455936o2204613J1463929O1686941
$$ -7780849 -12075415 11140371 20987712 -28967233 -121423169 -183627782 -172163853 -110476912
2166a10476912P2180960O5618990M0567860j3331209o1003725n3606066m925563
$$ -110476912 -38295952 27323038 67890898 54559689 -6444036 -60050102 -64975665
2159f4975665K7787601L1062341L7953596M9505993K7263371k6445205n2102712
$$ -64975665 -37188064 -6125723 31827873 81333866 108597237 82152032 30049320
2152C0049320k0624408K2420440K8542066J0642503M018154P834412K010278j0300457
$$ 30049320 9424912 31845352 60387418 71029921 75048075 82882487 84892765 74592308
2144G4592308j2164654l168830O288140J2362254R577245j3821531n2074441p2202621
$$ 74592308 62427654 59258824 65546964 77909218 87486463 73664932 21590491 -50612130
2136e0612130m8275702P613668O1554867Q9348156Q1223630L5902189l1176975
$$ -50612130 -98887832 -91274164 -29719297 59628859 140852489 176754678 145577703
2129A45577703q5602112r7324023o4750408j2493068K7603063L4720177J2746826
$$ 145577703 59975591 -37348432 -102098840 -114591908 -86988845 -52268668 -39521842
2122c9521842j1305177j3200400L788962J7851229J5806102P36041j6961563k2457471
$$ -39521842 -50827019 -64027419 -60238457 -42387228 -26581126 -25845085 -42806648 -65264119
2114f5264119l712648K8251940M2501471K8512190J1400518Q005403K95280j9316902
$$ -65264119 -68976767 -40724827 1776644 30288834 41689352 49694755 49990035 30673133
2106C0673133j8678823J2655525J8605857m0025896r8002091o9149037J0776763
$$ 30673133 11994310 24649835 43255692 3229796 -94772295 -163921332 -153144569
2099a53144569L0840626j5140376j8209379N7130514J03865130M7013506l2324255
$$ -153144569 -122303943 -137444319 -155653698 -98523184 5341946 52355452 20031197
2092B0031197l1868040J2187435N541510l8138115l0098958L5766786P3514501
$$ 20031197 -11836843 350592 5892102 -32246013 -62344971 -26578185 46936316
2085D6936316M0240193j7502730n0151242n4195473l4526536N733594L4091075
$$ 46936316 87176509 69673779 19522537 -34672936 -69199472 -63465878 -29374803
2078b9374803J6029943k3124487k6023347R452980L5142719L8382812M8546160
$$ -29374803 -13344860 -36469347 -62492694 -53039714 -17896995 20485817 69031977
2071F9031977N8573961K3510206m7621881q0089638m2278383N317672K871645
$$ 69031977 127605938 151116144 103494263 23404625 -18873758 -13556086 -10684441
2064a0684441l1871612n3702712n4167450l7416303P326000O4220327P6931805
$$ -10684441 -42556053 -96258765 -150426215 -187842518 -180516518 -116296191 -39364386
2057c9364386K5807186k8795237k9055945J071165J0674371P772888K6838366
$$ -39364386 -13557200 -42352437 -71408382 -70337217 -59662846 -51889958 -25051592
2050b5051592M9562912L0573222j9742009m6609137l2682309o957530J6195111
$$ -25051592 24511320 55084542 35342533 -11266604 -43948913 -50906443 -34711332
2043c4711332M3841931N8391481L1686696j3034987j8601210J7302741L3795233
$$ -34711332 9130599 67522080 99208776 86173789 67572579 84875320 118670553
2036A18670553K697514l0158425k4606586o550519j1484283k0942484m520790
$$ 118670553 121368067 91209642 66603056 60052537 48568254 27625770 23104980
2029B3104980J4864611m877984m8063491n6809154j9120624J1904989j039702
$$ 23104980 37969591 33091607 -14971884 -71781038 -90901662 -78996673 -80036375
2022h0036375k2736896K480839O5738436R6244472N0945497k6055105n5033555
$$ -80036375 -102773271 -100292432 -34553996 61690476 112635973 86580868 31547313
2015C1547313j9734719J7541452O887757k0994182q959397L3717403M4840954
$$ 31547313 11812594 29354046 36241803 15247621 6288224 40005627 84846581
2008H4846581P165894k5811677j4413755J1058842O355548j9340918k8579392
$$ 84846581 92012475 66200798 51787043 62845885 69201433 49860515 21281123
2001B1281123j4630866L019973J6500635K5659656J8401252p952769k5549345
$$ 21281123 6650257 9670230 26170865 51830521 70231773 62279004 36729659
1994C6729659j4042306j59879j7574639m5003545l2990199J6890184N0099893
$$ 36729659 22687353 22527474 4952835 -40050710 -73040909 -56150725 -6050832
1987f050832L6419529K799550j5473661j4169196m886827K27913j5673011n3330794
$$ -6050832 30368697 33168247 17694586 3525390 -1361437 -1133524 -16806535 -70137329
1979g0137329p0059620k0531616O6924517J06261042O3606088R37056j5089056
$$ -70137329 -140196949 -160728565 -93804048 12456994 76063082 77000138 61911082
1972F1911082J915861Q85661k1842088k8473417n178943K4559889M0414802M2042544
$$ 61911082 63826943 64712604 42870516 14397099 9218156 33778045 74192847 116235391
1964A16235391L1518962Q505502j8348495l4082158l0259858r149911J3975922
$$ 116235391 147754353 156259855 137911360 103829202 73569344 64419433 78395355
1957G8395355J2131363k6644804o9958550o8243336j9375041K6526149L6059727
$$ 78395355 90526718 63881914 -6076636 -74319972 -93695013 -67168864 -31109137
1950c1109137K8267176K9303219L5273608L8531260M5169040M4747937J1719762
$$ -31109137 -2841961 26461258 61734866 100266126 145435166 190183103 201902865
1943B01902865l9332479n5814277l1866421k4324873m7338919l1909997M9796287
$$ 201902865 162570386 106756109 74889688 50564815 3225896 -28684101 21112186
1936B1112186J04566527N0054915m7417989p3472718m1186407m0671995o2488047
$$ 21112186 125678713 175733628 128315639 54842921 13656514 -27015481 -89503528
1929h9503528k0853514O5812351P8184159l228910n4462563q314088M4739889
$$ -89503528 -110357042 -44544691 33639468 30410558 -24052005 -32366093 12373796
1922A2373796J8954422l4916117m1847479k9564696m6156890m9952740R089529
$$ 12373796 31328218 -3587899 -45435378 -75000074 -121156964 -171109704 -162020175
1915a62020175P5612106O9735595K3688638K5515266O8984264P1087228J3494671
$$ -162020175 -86408069 -16672474 7016164 32531430 101515694 172602922 186097593
1908A86097593l9242989n1375787n0136813n0972132l4593997k880839J5515150
$$ 186097593 146854604 95478817 45342004 -5630128 -40224125 -43104964 -27589814
1901b7589814J8687652K6997174K9351797j230382m4239259n1114403k4218578
$$ -27589814 -8902162 18095012 47446809 46216427 1977168 -49137235 -73355813
1894g3355813q970634j1104438O054529M0836332M5844705J2023421j2822763
$$ -73355813 -82326447 -93430885 -87376356 -46540024 -695319 11328102 -1494661
1887a494661o263035k364221j9563977k5559179k468456J5971754N891443m658317
$$ -1494661 -7757696 -10121917 -29685894 -55245073 -57713529 -41741775 -35850332 -40508649
1879d0508649Q452340J9015598Q1025k4665541k2064813o052325j0071142k9998827
$$ -40508649 -32056309 -13040711 -12959686 -37625227 -59690040 -65742365 -75813507 -105812334
1871a05812334l4864520j5772520R846705K8870834M0505426M5768855M8664788
$$ -105812334 -140676854 -156449374 -146602669 -117731835 -77226409 -31457554 17207234
1864A7207234N4714624N5019637L0273903j6480807n2116830n1869398k5263569
$$ 17207234 71921858 126941495 157215398 140734591 88617761 36748363 11484794
1857A1484794N644974K8236954L0085498J025039l7280779l6556589J6756690
$$ 11484794 17129768 45366722 75452220 76477259 39196480 2639891 19396581
1850A9396581P1161501O9997659K2263290j5468048j4046369R78594p181153m0008976
$$ 19396581 90558082 160555741 182819031 167350983 153304614 154283208 147102055 107093079
1842A07093079o5596032n6836789k3095153o04847p513964j9071828k855053L2303258
$$ 107093079 41497047 -15339742 -38434895 -39039742 -46553706 -65625534 -68480587 -36177329
1834c6177329M7698330K9054566M32335j4167962j2933530n86376J7030300K1463619
$$ -36177329 11521001 40575567 41007902 26839940 13906410 13320034 30350334 51813953
1826E1813953j393774l0070318k7741526L647289K5460711J9678671M113746r579052
$$ 51813953 50420179 20349861 -7391665 -3744376 21716335 41395006 45508752 35929700
1818C5929700k5861383l1044691l691141L3111777K9936761n706635j1126714
$$ 35929700 10068317 -20976374 -24667515 8444262 38381023 32674388 21547674
1811B1547674K6157019M0050648k370374l9808166k0345047R455020j0483479
$$ 21547674 47704693 87755341 85384967 45576801 25231754 34686774 24203295
1804B4203295m5768166l0246489J4089261J5323922k2631464l0426113N831178
$$ 24203295 -21564871 -51811360 -37722099 -22398177 -45029641 -75455754 -69624576
1797f9624576K9275905J6576818P529777K0797873K3948352O140386L444489K5567188
$$ -69624576 -40348671 -23771853 -16242076 4555797 28504149 34644535 38089024 63656212
1789F3656212K7263074j4749661n7294043n8114464l4048990j5711650N750611
$$ 63656212 90919286 76169625 18875582 -39238882 -73287872 -88999522 -83248911
1782h3248911M3422399O6197438L4034362l9203910r5747283r4753355m0845734
$$ -83248911 -39826512 26370926 60405288 21201378 -74545905 -169299260 -210144994
1775b10144994L0240937P4316298O6119307K4436309m604267j926217N108015
$$ -210144994 -179904057 -105587759 -39468452 -15032143 -19636410 -21562627 -16454612
1768a6454612j2087264m1444783m7824746j4944131L9715696P6513442O0884667
$$ -16454612 -28541876 -69986659 -117811405 -132755536 -93039840 -16526398 44358269
1761D4358269K113681m0142687k0391170K8037248L5899888K00288j5180027J3190299
$$ 44358269 46471950 6329263 -14061907 13975341 49875229 50075517 34895490 48085789
1753D8085789L0894593J622086k9937338j5528713J8235663K3951898J2528828
$$ 48085789 78980382 80602468 50665130 35136417 53372080 77323978 89852806
1746H9852806J6285031K0111459j239570j7853012O122548L1243070l006260o5563943
$$ 89852806 106137837 126249296 125009726 107156714 113279262 144522332 141516072 75952129
1738G5952129p0206064j6040903R376718k4040652m3769909m138400L9693909
$$ 75952129 5746065 -10294838 -918120 -24958772 -68728681 -72867081 -33173172
1731c3173172L5447782J9477427L4329046M1962933m36888m4572246k4316356
$$ -33173172 2274610 21752037 56081083 98044016 97607128 53034882 28718526
1724B8718526K2413653O029756o6358614r6949049m6539252J8356594L8266992
$$ 28718526 51132179 57161935 -9196679 -106145728 -152684980 -134328386 -96061394
1717i6061394L2255281L3645273L3060374J8212141N450907J94475j5622976l1373764
$$ -96061394 -63806113 -30160840 2899534 21111675 26562582 26757057 11134081 -20239683
1709b0239683q569473L7504962L2814658l5174508p2232954j6337493N4536660
$$ -20239683 -28809156 8695806 41510464 6335956 -65896998 -82234491 -27697831
1702b7697831L9674249k4664376l1001092J9046360K7469754k1160880k9285050
$$ -27697831 11976418 -12687958 -43689050 -24642690 2827064 -18333816 -47618866
1695d7618866M0744607R0098447L8060042m9752204o6023571j8952023K155800
$$ -47618866 -6874259 83224188 121284230 71532026 5508455 -13443568 -11287768
1688a1287768l0818009o4074298n8513382k9111794L703373L6148305N3693604
$$ -11287768 -42105777 -106180075 -164693457 -193805251 -190101878 -153953573 -100259969
1681a00259969L6038153l705479k6394742j9050369n934118m927591m581177R866650
$$ -100259969 -64221816 -67927295 -94322037 -113372406 -119306524 -124234115 -128815292 -118948642
1673a18948642L2106124M2131183K4877668j4278146m3015859k7006547K3996899
$$ -118948642 -86842518 -44711335 -19833667 -34111813 -77127672 -104134219 -80137320
1666h0137320N6463821L8707949L77609j7426868j8969962k5793596k5706360
$$ -80137320 -23673499 15034450 15412059 -2014809 -20984771 -46778367 -72484727
1659g2484727P34977K8378630J9411102q536096n898712K6017814L8161814J7700778
$$ -72484727 -71749750 -43371120 -23960018 -32496114 -38394826 -12377012 25784802 43485580
1651D3485580K993017P202491m944472m3465229o0702653k6240086J9107748K3414390
$$ 43485580 46478597 53681088 48736616 5271387 -55431266 -81671352 -62563604 -39149214
1643c9149214m310778k1160646j4631288j507661R251201J6236487J1238980k820975
$$ -39149214 -43459992 -64620638 -79251926 -80759587 -71508386 -55271899 -44032919 -46853894
1635d6853894j381093K4871249M4700029K7228764j3314958m2433145n2179229
$$ -46853894 -48234987 -23363738 21336291 48565055 35250097 -7183048 -59362277
1628e9362277n2218618l7508185k398792K9487136K8063011R09068j8221266j6868410
$$ -59362277 -111580895 -149089080 -151487872 -122000736 -93937725 -93028657 -111249923 -128118333
1620a28118333q876824k40745J7395098M2166045N9370703O1850096N0434974
$$ -128118333 -136995157 -137235902 -119840804 -77674759 -18304056 43546040 93981014
1613I3981014K1381604k1267990m9498975l8121695m352246R412602p726927k4560071
$$ 93981014 115362618 94094628 44595653 6473958 2121712 11534314 3807387 -20752684
1605b0752684j6547942K645645O474776r137104k5132172k0952514O926919L8719886
$$ -20752684 -37300626 -34654981 -28180205 -37317309 -62449481 -83401995 -76475076 -37755190
1597c7755190M6840954K7088424M175606n227065j5116312l4574374l5535874
$$ -37755190 9085764 36174188 40349794 35122729 20006417 -14567957 -50103831
1590e0103831M560091M7121617L3338263k3032163m3926756j412164L6850106
$$ -50103831 -45543740 1577877 34916140 11883977 -32042779 -33454943 3395163
1583C395163R609490m3061052l8422742K8320631Q0911134O8309969J9091358
$$ 3395163 13004653 -30056399 -68479141 -40158510 40752624 109062593 128153951
1576A28153951j5302539k3996050k4799055k4390424j8013276j0462462j1174453
$$ 128153951 112851412 88855362 64056307 39665883 21652607 11190145 15692
1569A5692j4810180p514689P856868J0545127p755813k4625420j2488930K1858260
$$ 15692 -14794488 -22309177 -14452309 -3907182 -11662995 -36288415 -48777345 -26919085
1561b6919085L9709440J8549311j6573432k4821572l829147J0380218j785581
$$ -26919085 12790355 31339666 14766234 -10055338 -13884485 -3504267 -5289848
1554e289848j5655032l763157J7695996J1410170k1641894l7386990r823231K9202669
$$ -5289848 -20944880 -24708037 -7012041 4398129 -17243765 -54630755 -64453986 -35251317
1546c5251317K9507257j1978715m6746431l5041010O479633K6808450L460623
$$ -35251317 -5744060 -17722775 -64469206 -99510216 -93030583 -66222133 -62761510
1539f2761510k9679411k3494180K4715143O5461889N6554749J2175565k1518872
$$ -62761510 -92440921 -115935101 -91219958 -25758069 30796680 42972245 21453373
1532B1453373k5869084j9280979j2866630P870155M4444944O1833159L2371562
$$ 21453373 -4415711 -23696690 -36563320 -28693165 15751779 77584938 109956500
1525A09956500j7347021l7175414k0168752l718433q979005j8287845j7651354
$$ 109956500 92609479 55434065 35265313 31546880 22567875 4280030 -13371324
1518a3371324k0849418l3987220l2387988m66501L2232311K7237102p087085k7067209
$$ -13371324 -34220742 -68207962 -100595950 -101062451 -68830140 -41593038 -48680123 -75747332
1510g5747332j1103964K2418541M6924496M9897061K8376788r872669m0198504
$$ -75747332 -86851296 -64432755 -17508259 32388802 60765590 50892921 10694417
1503A0694417l9638146j4423096P869822J1180598k02084j7326013k9445783k0337856
$$ 10694417 -28943729 -43366825 -35497003 -24316405 -24518489 -41844502 -71290285 -91628141
1495i1628141J1198622L4252854K0105432j1320191j4558866J3451996K9106720
$$ -91628141 -80429519 -46176665 -26071233 -37391424 -51950290 -38498294 -9391574
1488i391574J0821173j2707710j7952652k4639137m9989095o3952383l0402767
$$ -9391574 1429599 -11278111 -29230763 -53869900 -103858995 -167811378 -198214145
1481a98214145L0529306O2325010M4111155Q400848r091484p614378o949103j6448515
$$ -198214145 -167684839 -105359829 -61248674 -52847826 -61939310 -69553688 -76502791 -92951306
1473i2951306k4860018j2832153K3112204N6282750N1252872O897782l5916778
$$ -92951306 -117811324 -130643477 -107531273 -51248523 4349 6902131 -29014647
1466b9014647l9167570o135686L2626390N2395100M2867683P768117k6355382
$$ -29014647 -68182217 -74317903 -41691513 10703587 53571270 61339387 34984005
1459C4984005k4048332J3318858L6001591O374943m6190819n9982801j7985051
$$ 34984005 10935673 24254531 60256122 66631065 20440246 -39542555 -57527606
1452e7527606L8481199O3572368M6273009L835529l5160391m4537613k2777551
$$ -57527606 -19046407 44525961 90798970 94634499 59474108 14936495 -7841056
1445g841056K25837j407789j4626635r785756J2423702K4120973J3828499j916005
$$ -7841056 -7615219 -9023008 -23649643 -33435399 -21011697 3109276 16937775 15021770
1437A5021770p792828m159049M717388J1526613L35141l2064385n5265342l7506478
$$ 15021770 7228942 3069893 7787281 19313894 19649035 -12415350 -67680692 -105187170
1429a05187170N488313K8845671K2893771J8910739K8884023K6507880J636994
$$ -105187170 -99698857 -70853186 -47959415 -29048676 -164653 26343227 27980221
1422B7980221j3678286q420R498687j9373992o0585711o1072126j9248557J3070687
$$ 27980221 14301935 14293515 23792202 4418210 -56167501 -117239627 -136488184 -123417497
1414a23417497N223131j4055034l488761L2586146N1319835K6639436j7290325
$$ -123417497 -118194366 -132249400 -135738161 -103152015 -51832180 -25192744 -42483069
1407d2483069l1328215K106158M3969280M0659143q380971m3012232j5609546
$$ -42483069 -73811284 -71705126 -27735846 12923297 4542326 -38469906 -54079452
1400e4079452M3464522N9041156O373558n7277628o8385411l5932975j4729008
$$ -54079452 -10614930 48426226 54799784 -2477844 -70863255 -106796230 -121525238
1393a21525238j7444152j388N7000219J00652635P5590344R285225k2766504k899326
$$ -121525238 -138969390 -138970778 -81970559 18682076 94272420 103557645 80791141 77891815
1385G7891815J3952771o669436l0114275j7896120J1167393J9136609O783619
$$ 77891815 91844586 85175150 55060875 37164755 48332148 67468757 74252376
1378G4252376m366895j2996876k2494883j7485029L165839L529731l2302930n4608662
$$ 74252376 69885481 56888605 34393722 16908693 20074532 23604263 -8698667 -63307329
1370f3307329j6624840M1918408M8046711R277818m454194J9384862K3066547
$$ -63307329 -79932169 -38013761 10032950 19310768 14856574 34241436 57307983
1363E7307983q429354j5178226K7578940N3872148J0970143n1960042n8897552
$$ 57307983 48878629 33700403 61279343 115151491 126121634 74161592 15264040
1356A5264040j6291721J5574660J8879883K0399906K5217330J3455820r175281
$$ 15264040 -1027681 14546979 33426862 53826768 79044098 92499918 83324637
1349H3324637j5093326o745349j6817785n2758241p9036797o2559462j1210219
$$ 83324637 68231311 61485962 44668177 -8090064 -87126861 -149686323 -160896542
1342a60896542L6337299M3864819O461454l9280850m4825094l760360L8691214
$$ -160896542 -124559243 -80694424 -74232970 -113513820 -158338914 -162099274 -123408060
1335a23408060M3484311K2201845N599900l041588j3262650j2444242J4412483
$$ -123408060 -79923749 -57721904 -52122004 -55163592 -68426242 -80870484 -66458001
1328f6458001M4824848L9690834J8495l1423261k5814011R68759J4531644n48893
$$ -66458001 -21633153 18057681 18076176 -13347085 -39161096 -38192337 -23660693 -24209586
1320b4209586k8529767l5956641n737032L4114405L5138850o794707l9592732
$$ -24209586 -52739353 -88695994 -94433026 -60318621 -25179771 -31974478 -71567210
1313g1567210k6535565M375308J1483047K902042O822747J2050147o402234k4970040
$$ -71567210 -98102775 -93727467 -82244420 -79342378 -72519631 -60469484 -66871718 -91841758
1305i1841758K008811O0883536Q5534376N0271643P66148j7873034j3270640j1376468
$$ -91841758 -89832947 -28949411 56584965 106856608 107622756 89749722 76479082 65102614
1297F5102614j6174859k4053162m0864181o3394578p1195357n1521612j0360333
$$ 65102614 48927755 24874593 -15989588 -79384166 -150579523 -202101135 -212461468
1290b12461468M3487859R5549897J09744448N8469000k4710407o7219177m5614383
$$ -212461468 -168973609 -73423712 36320736 94789736 70079329 2860152 -42754231
1283d2754231r030413r47091n751058M027396J6378165J1385314M256001J5247324
$$ -42754231 -51784644 -52731735 -58482793 -54455397 -38077232 -26691918 -22435917 -7188593
1275g188593K5565819N305849l3615134n0550283l0468393M924381K9540484L1929007
$$ -7188593 18377226 23683075 -9932059 -60482342 -90950735 -86026354 -56485870 -24556863
1267b4556863J4597171m307358k631184J5844418K2984454J1784535Q469615J8120466
$$ -24556863 -9959692 -14267050 -16898234 -1053816 21930638 33715173 42184788 60305254
1259F0305254O62423n9331954r9384377n4528778L8709333Q0241134M0229725
$$ 60305254 60967677 1635723 -97748654 -152277432 -113568099 -33326965 6902760
1252F902760j1494022j4576475R491621J5100893L917347K522183R606560M457526
$$ 6902760 -4591262 -19167737 -9676116 5424777 9342124 11864307 21470867 25928393
1244B5928393j5418662l5100174m3115878l1279258M579406M4277413M9202751
$$ 25928393 10509731 -24590443 -67706321 -98985579 -94406173 -50128760 -926009
1237i26009J2842845j9169521q230822K0581223J6127355k0845807l8521423r852802
$$ -926009 11916836 -7252685 -15483507 5097716 21225071 379264 -38142159 -47994961
1229d7994961L0448622L3888562l252605m1252275m1686523l208644L8462432
$$ -47994961 -17546339 16342223 13089618 -28162657 -69849180 -73057824 -34595392
1222c4595392M4525974J2892371k0944966k7721908j4806715k541688Q149495
$$ -34595392 9930582 22822953 1877987 -25843921 -40650636 -43192324 -35042829
1215c5042829K2835918K9445728J8217178Q866232K0857559L0534594K170890
$$ -35042829 -12206911 17238817 35455995 44322227 65179786 95714380 97885270
1208I7885270m7063429o4408124m1933562k2163219j7056770J2162118P0917769
$$ 97885270 50821841 -13586283 -55519845 -77683064 -94739834 -82577716 -11659947
1201a1659947R4835536M1363066l7298327o5060256m1027522j3369651L517444
$$ -11659947 83175589 124538655 87240328 22180072 -18847450 -32217101 -28699657
1194b8699657K1810661K4628847r159823m3678726k2564650M0276868P3279267
$$ -28699657 -6888996 17739851 8580028 -35098698 -57663348 -17386480 55892787
1187E5892787M7718353K848308k5918212l9035682l4755235p580771J2646036
$$ 55892787 103611140 106459448 80541236 41505554 6750319 -830452 11815584
1180A1815584r724098m3618332k4065061L5903358N2698073Q192823j7738540
$$ 11815584 2091486 -41526846 -65591907 -29688549 23009524 31202347 13463807
1173A3463807J5681076M0691640L755240l7512994j5703986K9253657K2225450
$$ 13463807 29144883 69836523 73591763 36078769 20374783 49628440 71853890
1166G1853890k2420719l9649947k4623546j2892520L181359M1804269N7099377
$$ 71853890 49433171 9783224 -14840322 -27732842 -24551483 17252786 74352163
1159G4352163J877578o5809136m9515113L1059080O6229573K8078858m439735
$$ 74352163 76229741 10420605 -39094508 -8035428 58194145 86273003 81833268
1152H1833268K618707j0366528o3357709q0437199k2824268L2080231J7341195
$$ 81833268 84451975 74085447 10727738 -69709461 -92533729 -60453498 -43112303
1145d3112303j1844471K0742073P6051331O4522371k910021l3216936n40684K1038871
$$ -43112303 -54956774 -34214701 41836630 106359001 103448980 70232044 69691360 90730231
1137I0730231j7997952o6439228n2231377J3032530M9977243J3369939n3655987
$$ 90730231 72732279 6293051 -45938326 -32905796 17071447 30441386 -23214601
1130b3214601p3540858k8048654K3228770K5106233k65263N388816M3537642N9705226
$$ -23214601 -96755459 -124804113 -101575343 -76469110 -76734373 -71345557 -27807915 31897311
1122C1897311L4218992J1548874K2189677L2547714N152472l7379153m8329319
$$ 31897311 66116303 77665177 99854854 132402568 137555040 100175887 51846568
1115E1846568k4499461n34526J566979j2849605k7863237k6549459l757331J6966816
$$ 51846568 27347107 26812581 28379560 15529955 -12333282 -38882741 -42640072 -25673256
1107b5673256N989853k3312966k5003293Q132474K9713423J4823946j710234R759626
$$ -25673256 -19683403 -42996369 -67999662 -59867188 -30153765 -15329819 -17040053 -7280427
1099g280427K3040684P169804k1048391l5385376m1503921l7971035O890642Q4219158
$$ -7280427 15760257 22930061 1881670 -33503706 -75007627 -112978662 -106088020 -21868862
1091b1868862J09872066L4641738n9610362o1232572R086589L4468382j8572027
$$ -21868862 88003204 122644942 63034580 1802008 10888597 45356979 26784952
1084B6784952o1437315l0098007K9905156N3015731M2106342K6263057J085301
$$ 26784952 -34652363 -64750370 -34845214 18170517 60276859 86539916 87625217
1077H7625217l8212169n6092706k1778846L6659147O5206594M7597765N567598
$$ 87625217 49413048 -6679658 -28458504 8200643 73407237 121005002 126572600
1070A26572600l8025288o4865261n4750638r134534L3371536L5590884O562830
$$ 126572600 88547312 23682051 -31068587 -40203121 -6831585 28759299 35322129
1063C5322129j6126961j7549169j3455512j5084871j3775297k138215J2124449
$$ 35322129 19195168 1645999 -11809513 -26894384 -40669681 -42807896 -30683447
1056c0683447K0558939K5820924L0387774K6637214J1128528q25470N714736J4033690
$$ -30683447 -10124508 15696416 46084190 72721404 83849932 83024462 88739198 102772888
1048A02772888j0316833o3939039r1620979n3376519J5919880M8584592L0475902
$$ 102772888 92456055 28517016 -63103963 -116480482 -100560602 -51976010 -21500108
1041b1500108L440968p258837j4594485j9324131P51321L6135932M0362162L957098
$$ -21500108 -18059140 -25317977 -39912462 -59236593 -58485272 -22349340 18012822 21969920
1033B1969920k3902285j5720646n557799j3605934j428336M5792414O4690775
$$ 21969920 -1932365 -17653011 -23210810 -36816744 -38245080 7547334 72238109
1026G2238109J3173030m1162803k0420154L1864021K2409353l2065725l7751816
$$ 72238109 85411139 44248336 23828182 55692203 78101556 46035831 8284015
1019H284015O872426Q607106m7970711o2448223R069387O9597738L4823873l3958514
$$ 8284015 15156441 23763547 -24207164 -86655387 -77586000 -7988262 26835611 -7122903
1011g122903l4286307J9730307L7805950N5586l0692275j9298543K302418M066687
$$ -7122903 -41409210 -21678903 16127047 16182633 -14509642 -33808185 -31505767 -27439080
1003b7439080J64424R769031J9884158O652272k5546723m0619378r218176M7278506
$$ -27439080 -27274656 -17505625 2378533 9030805 -16515918 -57135296 -66353472 -19074966
995a9074966O5854738J7196682m3356713m0087360J6730823M2428845k45802n1416887
$$ -19074966 46779772 63976454 20619741 -19467619 -2736796 39692049 39446247 -11970640
987a1970640m6050835J089638L3303633K7737931L79230k6163139l1367215q069820
$$ -11970640 -58021475 -56931837 -23628204 4109727 4488957 -21674182 -53041397 -61111217
979f1111217J5358880M016032k0075684J029716N9394598P1271046M444028n8989709
$$ -61111217 -45752337 -41736305 -61811989 -60782273 -1387675 69883371 74327399 15337690
971A5337690m2270964J2041601J8648755j7297284k7454710j050307J0756037
$$ 15337690 -26933274 -14891673 3757082 -13540202 -40994912 -42045219 -31289182
964c1289182p639193j7325466J65207J8324090J7714410O624207p889067k0698899
$$ -31289182 -38928375 -56253841 -56088634 -37764544 -20050134 -13425927 -21314994 -42013893
956d2013893j0619633K8245490N2754302K4072676k2124132k2347838J1894696
$$ -42013893 -52633526 -24388036 28366266 52438942 30314810 7966972 19861668
949A9861668J0955248l7210783o6290649l8112810L798942J0754878m690099q171361
$$ 19861668 30816916 -6393867 -72684516 -110797326 -106998384 -96243506 -100933605 -109104966
941a09104966L610594J9190997L7528869N1152330M3613366K3921769K2631623
$$ -109104966 -105494372 -86303375 -48774506 2377824 45991190 69912959 92544582
934I2544582L6390332K3360730k4415329n4872735l3101323L403591N202174j6946834
$$ 92544582 128934914 152295644 127880315 73007580 39906257 43309848 48512022 31565188
926C1565188k6121420k7466418m6728074o5337616l8563235K6203567O4680168
$$ 31565188 5443768 -22022650 -68750724 -134088340 -172651575 -146448008 -81767840
919h1767840L9767751j1914709l4188412j9661897k370547m175564j4618643j6800575
$$ -81767840 -42000089 -53914798 -88103210 -107765107 -110135654 -114311218 -128929861 -145730436
911a45730436r582140J464896J8908931M5016789O4697106N5150961J7480991
$$ -145730436 -155312576 -153847680 -134938749 -89921960 -25224854 29926107 47407098
904D7407098j6935722k2367893q230020M49999j649624l855234p245743k2057424
$$ 47407098 30471376 8103483 -126537 323462 -1326162 -5181396 -12427139 -34484563
896c4484563m0147037l7438385r109890K0339328K9677978K3727294J5203574
$$ -34484563 -74631600 -112069985 -121179875 -100840547 -71162569 -47435275 -32231701
889c2231701M088149j0423587j2925052J2413514N1524035O3484708K3898353
$$ -32231701 -28143552 -38567139 -51492191 -39078677 12445358 75930066 99828419
882I9828419l9545688o7846356l4398401K2494950M6517001L3164450K3609953
$$ 99828419 60282731 -7563625 -41962026 -19467076 27049925 60214375 83824328
875H3824328L0697989J5748959l9452934q2023481n4825545J3321651L9757576
$$ 83824328 114522317 130271276 90818342 8794861 -46030684 -32709033 7048543
868G048543J777785l7661418k5625823J1287293J7297342j1078915k8693969j0147159
$$ 7048543 8826328 -28835090 -54460913 -43173620 -25876278 -36955193 -65649162 -75796321
860g5796321J7225008J1931016k5808901m9229000k1478528L1452144M6773223
$$ -75796321 -58571313 -46640297 -72449198 -121678198 -143156726 -111704582 -64931359
853f4931359Q198991k8826289j5821474J9133987J9060874j2226890k1522350
$$ -64931359 -56732368 -85558657 -101380131 -82246144 -63185270 -75412160 -96934510
846i6934510N261106K5174603J2546458n084171p91336J2261098J8292249L1149554
$$ -96934510 -91673404 -66498801 -53952343 -59036514 -59827850 -47566752 -29274503 1875051
838A875051N7825070O5612911K4353995l8780621o3963855l3070689Q474384Q852945
$$ 1875051 59700121 125313032 149667027 110886406 46922551 13851862 22326246 31179191
830C1179191k7045415m3620203n499632M9350467N0975044n977522m5052799j2186396
$$ 31179191 4133776 -39486427 -44986059 4364408 55339452 49361930 4309131 -7877265
822g877265M2869161L7122797k3789855n8648815l2092984Q065890J7887272J0640744
$$ -7877265 34991896 72114693 48324838 -10323977 -42416961 -34351071 -16463799 -5823055
814e823055O825047j899596j2471079M191160M4264878N3203726M738443n1921948
$$ -5823055 1001992 -897604 -13368683 -9177523 35087355 88291081 93029524 41107576
806D1107576o3163156m2477855k9485639k3416259n493244J2447197J3710128
$$ 41107576 -22055580 -64533435 -94019074 -117435333 -122928577 -110481380 -96771252
799i6771252J8200071M5874320O7156492M3918814k476012j9179294k741063J838285
$$ -96771252 -78571181 -32696861 34459631 78378445 75902433 56723139 53982076 55820361
791E5820361k4436897n0737349m7150593j8846312J2206905K8641083K2856142
$$ 55820361 31383464 -19353885 -66504478 -85350790 -73143885 -44502802 -21646660
784b1646660N880637K937129J7890750J8824835j4536950n0311642m4818012m291562
$$ -21646660 -15766023 -12828894 5061856 23886691 9349741 -40961901 -85779913 -90071475
776i0071475K9489550L6938486K6716493L932487k4230792k7576067J3438359
$$ -90071475 -60581925 -23643439 3073054 7005541 -17225251 -44801318 -31362959
769c1362959O0975996N4806436o545840o1927603o5954534l2868822o08517J2187682
$$ -31362959 29613037 84419473 77873633 15946030 -50008504 -82877326 -83485843 -71298161
761g1298161Q172346k36247j58089M904388m511051k7641662k8830461J0856731
$$ -71298161 -63125815 -63362062 -63520151 -58615763 -63126814 -90768476 -119598937 -108742206
753a08742206N0993480M1035951p375652m1060475l9778359k2674476R24244L2088752
$$ -108742206 -57748726 -16712775 -24088427 -65148902 -104927261 -127601737 -126677493 -94588741
745i4588741M7285258K2162599j6123303j7679211J4850916L6792720L6776549
$$ -94588741 -47303483 -25140884 -41264187 -58943398 -44092482 -7299762 29476787
738B9476787L6068377K3962263k5310852p2004681m0117640N4240619R7680672
$$ 29476787 65545164 89507427 64196575 -7808106 -47925746 6314873 103995545
731A03995545L8952723l5534494l5603836P362026J5243611r298629j1409934
$$ 103995545 142948268 107413774 71809938 79171964 94415575 85116946 73707012
724G3707012J1254785J6682153K19609q783336j1762322l2358787n6862815m8383585
$$ 73707012 84961797 101643950 101863559 93080223 81317901 48959114 -7903701 -56287286
716e6287286j3054727O655864K68869k968079Q224160J2938205K610221n538979
$$ -56287286 -69342013 -62686149 -62417280 -65385359 -57161199 -44222994 -41612773 -47151752
708d7151752j920275O062224J4915268K0576252M797634l3279566m8107616k607211
$$ -47151752 -49072027 -43009803 -28094535 -7518283 -2720649 -36000215 -84107831 -86715042
700h6715042N9588505N8928972l997498m4583306j8825063J6938309Q63974m0880150
$$ -86715042 -27126537 31802435 27804937 -16778369 -35603432 -18665123 -17801149 -58681299
692e8681299m1354833Q661872N8147816O6710098L6662271p587955l6530135k6937124
$$ -58681299 -100036132 -91374260 -33226444 33483654 70145925 62557970 26027835 -909289
684i09289J1876923L6509036K1746548l200367j288899J1192421o741921m5054802
$$ -909289 10967634 47476670 69223218 66022851 64733952 75926373 69184452 24129650
676B4129650m9491232p340609K7352801J3687024j8047939j9381897M067883J4893059
$$ 24129650 -25361582 -32702191 -5349390 8337634 -9710305 -29092202 -25024319 -10131260
668a0131260J0672316J8554377L6026907K9662113m822548l0063554k6140140
$$ -10131260 541056 19095433 55122340 84784453 79961905 49898351 23758211
661B3758211j6759417j8680081j1330024J4746944K4395255n058969l1323435
$$ 23758211 6998794 -11681287 -23011311 -8264367 16130888 11071919 -20251516
654b0251516n722439M2444136M2006449j2726833n5234729m6267890j5830412
$$ -20251516 -25973955 16470181 58476630 45749797 -9484932 -55752822 -71583234
647g1583234K096654J1483791J3132914j2343034n0237041m3495903J9138190
$$ -71583234 -69486580 -58002789 -44869875 -57212909 -107449950 -150945853 -131807663
640a31807663O3835798L2851815k4816589k6053608K3156754M8631302K7118488
$$ -131807663 -67971865 -35120050 -59936639 -85990247 -62833493 -14202191 12916297
633A2916297Q850048K7252093N5342937N9055523L7425618J184379l9520442n9980650
$$ 12916297 21766345 49018438 104361375 163416898 200842516 202026895 162506453 102525803
625A02525803m1116789r292992p395301k4287139j0347777L0238228L2251415
$$ 102525803 61409014 52116022 44720721 20433582 10085805 40324033 72575448
618G2575448k0670554n0283677K776021P6848528O7631150k3343166q9440483
$$ 72575448 51904894 1621217 4397238 81245766 148876916 125533750 36093267
611C6093267o1937466R753099L4606194q752024o2989096o9763028k8467584J9411613
$$ 36093267 -25844199 -16091100 18515094 9763070 -53226026 -122989054 -151456638 -132045025
603a32045025M3662261M8035232M3926903K6019945p383554k9013764j2351805
$$ -132045025 -88382764 -40347532 3579371 29599316 22215762 -6798002 -19149807
596a9149807J9777560J7468475k0847452l9740245r242415K9344809K8463806
$$ -19149807 627753 18096228 -2751224 -42491469 -51733884 -22389075 6074731
589F074731M380316K782780K4809564L2192004Q245944k7376599n2425692n4321594
$$ 6074731 10455047 13237827 38047391 70239395 78485339 51108740 -1316952 -55638546
581e5638546k2803547L1063574O1097980L3704534j7669387k8521297R552326
$$ -55638546 -78442093 -47378519 13719461 47423995 29754608 1233311 10785637
574A0785637M1366947K8808466o161399k7097618k7984381j7310811M141277K8909262
$$ 10785637 52152584 80961050 74799651 47702033 19717652 2406841 6548118 35457380
566C5457380L6049836J8572710m626277j6818711k0130253j6625249k652209Q029808
$$ 35457380 71507216 90079926 85453649 68634938 48504685 31879436 29227227 37257035
558C7257035j0003647m9120172o4263207l3566355J0445541L2757107M1782820
$$ 37257035 27253388 -21866784 -86129991 -119696346 -109250805 -76493698 -34710878
551c4710878N2846595M4162458n033567n8666884n8444273m398859M5398630N2078599
$$ -34710878 18135717 62298175 57264608 -1402276 -59846549 -64245408 -18846778 33231821
543C3231821L0764081Q604848r174357k2349856k1163311m379178J1781633J4135619
$$ 33231821 63995902 72600750 63426393 41076537 19913226 15534048 27315681 41451300
535D1451300M756344j0907372k8805192l7333607k4606945J991969K1570733K5476555
$$ 41451300 46207644 35300272 6495080 -30838527 -55445472 -53453503 -31882770 -6406215
527f406215K0525472J1754759K556197L631229J5834375J3843987k0458044n7398675
$$ -6406215 14119257 25874016 28430213 32061442 47895817 61739804 41281760 -16116915
519a6116915n2418603j4092164P485899n17145j262981J7510773J9075934r264755
$$ -16116915 -68535518 -82627682 -75141783 -75658928 -76921909 -59411136 -40335202 -49599957
511d9599957k0951441J3314582M8950255L6692359J833261k699468J5193224R019241
$$ -49599957 -70551398 -57236816 -8286561 28405798 30239059 27539591 42732815 51752056
503E1752056k1274213l2673553j4668822N12929k147855o729307q857115j7134103
$$ 51752056 30477843 -2195710 -16864532 -16351603 -18499458 -25228765 -34085880 -51219983
495e1219983j5439795J8554893N6749826M3478080j6925849n5628062l6423267
$$ -51219983 -66659778 -48104885 8644941 52123021 35197172 -20430890 -56854157
488e6854157J153266J3753789R668300P514941j394113j5821237m678721L5263930
$$ -56854157 -55700891 -41947102 -32278802 -24763861 -26157974 -41979211 -46657932 -11394002
480a1394002N1276705R882977m3485859m9091250j7972545Q60919L528150K0798371
$$ -11394002 39882703 49765680 6279821 -42811429 -60783974 -59923055 -56394905 -35596534
472c5596534M8158231M9093946J7819714j6258162l8924895n4715869m9682938
$$ -35596534 12561697 61655643 79475357 63217195 24292300 -30423569 -80106507
465h0106507p450728M0277007L8750232o719399k9111069L481181M2117216L1876943
$$ -80106507 -87557235 -47280228 -8529996 -15249395 -44360464 -40879283 1237933 33114876
457C3114876j3341577m1752096l4535570j2872243K319680P459871O593676O699314
$$ 33114876 19773299 -21978797 -56514367 -69386610 -67066930 -59607059 -53013383 -46314069
449d6314069J3759903K1333036J4912344m894105j9314780j7448253p265750L015084
$$ -46314069 -32554166 -11221130 3691214 -1202891 -20517671 -37965924 -45231674 -42216590
441d2216590J1893527R824093j3082886l7069869k4491117K3391877N5685672
$$ -42216590 -30323063 -20498970 -33581856 -70651725 -95142842 -71750965 -16065293
434a6065293L9300929L640030r473477p192376j9219653l7053258k7566823M844824
$$ -16065293 23235636 26875666 17402189 10209813 -9009840 -46063098 -73629921 -68785097
426f8785097J8119662l523128k6643991j9243541Q374108K6327847K3887612J2340563
$$ -68785097 -50665435 -54188563 -80832554 -100076095 -91701987 -65374140 -41486528 -29145965
418b9145965O716621J4055831K6550044K3707710l052553k9787632k6264667j543817
$$ -29145965 -22429344 -8373513 18176531 41884241 38831688 9044056 -17220611 -18764428
410a8764428O510098q997088j2384034J1426962K4375812j278379k4961879M576281
$$ -18764428 -12254330 -21251418 -33635452 -22208490 2167322 888943 -24072936 -19496655
402a9496655N6605689N0205027k0533216o4733695k5856459L1486543J9542902
$$ -19496655 37109034 87314061 66780845 2047150 -23809309 7677234 27220136
395B7220136l8702332n0239219j341116K4539789j3638096m7727145j5114169
$$ 27220136 -11482196 -61721415 -63062531 -38522742 -52160838 -99887983 -115002152
388a15002152L6348479K6945101k3771113k9048847K6036657O5837987M5549350
$$ -115002152 -78653673 -51708572 -75479685 -104528532 -78491875 -12653888 32895462
381C2895462P546392m182567q096888k5443624k6157674R748971L2516119n893011
$$ 32895462 40441854 36259287 28162399 2718775 -23438899 -13689928 18826191 12933180
373A2933180n9084835m4178550K6859328N9315465K2024831o427043L1095608
$$ 12933180 -46151655 -90330205 -63470877 -4155412 17869419 11442376 42537984
366D2537984P2490013L1459148o2216533r5853607l1270288M4684712M0175471
$$ 42537984 115027997 146487145 84270612 -11582995 -42853283 1831429 42006900
359D2006900k7552298o8493408l5190368L4589157P5921958O4131058K1881867
$$ 42006900 14454602 -54038806 -89229174 -54640017 21281941 85412999 107294866
352A07294866j7302279l8046752m1854090l1307007o820563K0376667K6330287
$$ 107294866 89992587 51945835 10091745 -21215262 -28035825 -7659158 18671129
345A8671129J086089k8080929k2104232J6242737L7311983Q977194l3868317l1154597
$$ 18671129 19757218 -8323711 -30427943 -14185206 23126777 32103971 -1764346 -32918943
337c2918943K0542730O0497042M2437807r002413l5361673j5601149K0341805
$$ -32918943 -12376213 48120829 90558636 81556223 46194550 30593401 50935206
330E0935206L5582736K1751375m454778k1326943j8192671l261313M821775m22442
$$ 50935206 86517942 108269317 103814539 82487596 64294925 61033612 65855387 65432945
322F5432945o120927l448389n175745k3359959m1520928l4139447r434607m107665
$$ 65432945 59312018 55863629 50687884 27327925 -14193003 -48332450 -57767057 -61874722
314f1874722l0385475n4657853m1414052J796042L8353415M6180398L1372323
$$ -61874722 -92260197 -146918050 -188332102 -186536060 -148182645 -102002247 -70629924
307g0629924R711469p508239j3250936n205756J1086805K5281306K9000845J9925823
$$ -70629924 -60918455 -68426694 -81677630 -86883386 -75796581 -50515275 -21514430 -1588607
299a588607M169411o104682n174745k448145q339133j4893614p266824O778173
$$ -1588607 2580804 -3523878 -8698623 -11146768 -19485901 -34379515 -41646339 -34868166
291c4868166K318072k1804411l3000739r997229K4890976L7279154K4283403M597615
$$ -34868166 -32550094 -54354505 -87355244 -97352473 -72461497 -35182343 -10898940 -6301325
283f301325j5199153l5255155l8563495r404088K8020184K7315344j5156432m5309907
$$ -6301325 -21500478 -56755633 -95319128 -104723216 -76703032 -49387688 -64544120 -109854027
275a09854027j8577152M0766971O8549396L6598763j9610472m4994150k1804050
$$ -109854027 -128431179 -87664208 -19114812 17483951 -2126521 -47120671 -68924721
268f8924721J8876382L4172796J3044081j7839159k8848759j8669457n315632
$$ -68924721 -50048339 -15875543 -2831462 -20670621 -49519380 -68188837 -73504469
$$ [...]
##END NTUPLES=NMR SPECTRUM
##END=
