##TITLE=31Pdec_LR-717-B1
 D2O, 124 sc
 26.10.2020
##JCAMPDX= 6.0         $$ Bruker NMR JCAMP-DX V2.0
##DATA TYPE= NMR SPECTRUM
##DATA CLASS= NTUPLES
##ORIGIN= UXNMR, Bruker Analytische Messtechnik GmbH
##OWNER= root
$$ XWIN-NMR		Version 3.5
$$ Mon Oct 26 12:56:20 2020 Russian Standard Time (UT+4h)  she@DPX200
##.OBSERVE FREQUENCY= 81.013821
##.OBSERVE NUCLEUS= ^31P
##.ACQUISITION MODE= SIMULTANEOUS
##.ACQUISITION SCHEME= undefined
##.AVERAGES= 124
##.DIGITISER RES= 17
##SPECTROMETER/DATA SYSTEM= spect
##.PULSE SEQUENCE= zgpg30
##.SOLVENT NAME= D2O
##.SHIFT REFERENCE= (INTERNAL, D2O, 0, 182.463)
##AUDIT TRAIL= $$ (NUMBER, WHEN, WHO, WHERE, WHAT)
$$ ##TITLE= Audit trail, XWIN-NMR		Version 3.5
$$ ##JCAMPDX= 5.01
$$ ##ORIGIN= Bruker BioSpin GmbH
$$ ##OWNER= she
$$ F:/spectra/data/she/nmr/P31/1/pdata/1/auditp.txt
$$ ##AUDIT TRAIL=  $$ (NUMBER, WHEN, WHO, WHERE, WHAT)
(   1,<2020-10-26 12:54:55.76 +0400>,<she>,<DPX200>,
      <continue with go, POWCHK disabled, PULCHK disabled
       configuration hash MD5:
       00 E9 B6 7A A2 85 ED C7 34 08 36 98 17 FE 4E 26
       data hash MD5: 32K
       4F E4 D4 02 FB 39 7F FD BA ED 58 66 C0 C9 4A E6>)
(   2,<2020-10-26 12:55:36.82 +0400>,<she>,<DPX200>,
      <Start of raw data processing
       efp BC_mod = 2 LB = 1 FT_mod = 6 PKNL = 1 PHC0 = -2382.604 PHC1 = 28.80069 SI = 64K 
       data hash MD5: 64K
       0E EC 97 B9 32 A6 E6 65 D8 59 18 BF 47 E6 97 53>)
(   3,<2020-10-26 12:55:41.23 +0400>,<she>,<DPX200>,
      <abs ABSG = 5 
       data hash MD5: 64K
       32 C6 37 FD 29 3A D1 C2 70 1C AF 82 0D 75 9F 19>)
$$ ##END=
$$ 
$$ hash MD5
$$ 47 64 8D 76 A9 95 D2 8D DA D9 F7 A6 EA 38 3A 1B
##$RELAX= 
##$RELAX= 
##$RELAX= 
##$RELAX= 
##$RELAX= 
##$RELAX= 
##$RELAX= 
##$RELAX= 
$$ Bruker specific parameters
$$ --------------------------
##$DU= <F:/spectra>
##$EXPNO= 1
##$NAME= <P31>
##$PROCNO= 1
##$TYPE= <nmr>
##$USER= <she>
##$AMP= (0..31)
100 100 100 100 100 100 100 100 100 100 100 100 100 100 100 100 100 100 
100 100 100 100 100 100 100 100 100 100 100 100 100 100 
##$AQSEQ= 0
##$AQ_mod= 1
##$AUNM= <au_zg>
##$AUTOPOS= <>
##$BF1= 81.014009
##$BF2= 200.13
##$BF3= 200.13
##$BF4= 200.13
##$BF5= 200.13
##$BF6= 200.13
##$BF7= 200.13
##$BF8= 200.13
##$BYTORDA= 1
##$CFDGTYP= 0
##$CFRGTYP= 5
##$CHEMSTR= <none>
##$CNST= (0..31)
1 1 145 1 1 1 1 1 1 1 1 1 1 1 1 1 1 1 1 1 1 1 1 1 1 1 1 1 1 1 1 1 
##$CPDPRG= <waltz16>
##$CPDPRG1= <>
##$CPDPRG2= <waltz16>
##$CPDPRG3= <>
##$CPDPRG4= <mlev>
##$CPDPRG5= <mlev>
##$CPDPRG6= <mlev>
##$CPDPRG7= <mlev>
##$CPDPRG8= <mlev>
##$CPDPRGB= <>
##$CPDPRGT= <>
##$D= (0..31)
0 1 0 0 0 0 0 0 0 0 0 0.03 2e-05 3e-06 0 0 0 0 0 0 0 0 0 0 0 0 0 0 0 0 
0 0 
##$DATE= 1603702319
##$DBL= (0..7)
120 120 120 11 120 120 24 19 
##$DBP= (0..7)
150 150 150 150 150 150 150 150 
##$DBP07= 0
##$DBPNAM0= <>
##$DBPNAM1= <>
##$DBPNAM2= <>
##$DBPNAM3= <>
##$DBPNAM4= <>
##$DBPNAM5= <>
##$DBPNAM6= <>
##$DBPNAM7= <>
##$DBPOAL= (0..7)
0.5 0.5 0.5 0.5 0.5 0.5 0.5 0.5 
##$DBPOFFS= (0..7)
0 0 0 0 0 0 0 0 
##$DE= 6
$$ [...]
##$SUBNAM3= <"">
##$SUBNAM4= <"">
##$SUBNAM5= <"">
##$SUBNAM6= <"">
##$SUBNAM7= <"">
##$SUBNAM8= <"">
##$SUBNAM9= <"">
##$SW= 369.568048894756
##$SWIBOX= (0..15)
0 1 3 0 0 0 0 0 0 0 0 0 0 0 0 0 
##$SW_h= 29940.119760479
##$TD= 32768
##$TD0= 1
##$TE= 0
##$TE2= 300
##$TE3= 300
##$TEG= 300
##$TL= (0..7)
0 120 53 12 22 120 120 120 
##$TP= (0..7)
150 150 150 150 150 150 150 150 
##$TP07= 0
##$TPNAME0= <>
##$TPNAME1= <>
##$TPNAME2= <>
##$TPNAME3= <>
##$TPNAME4= <>
##$TPNAME5= <>
##$TPNAME6= <>
##$TPNAME7= <>
##$TPOAL= (0..7)
0.5 0.5 0.5 0.5 0.5 0.5 0.5 0.5 
##$TPOFFS= (0..7)
0 0 0 0 0 0 0 0 
##$TUNHIN= 0
##$TUNHOUT= 0
##$TUNXOUT= 0
##$USERA1= <user>
##$USERA2= <user>
##$USERA3= <user>
##$USERA4= <user>
##$USERA5= <user>
##$V9= 5
##$VALIST= <valist>
##$VCLIST= <CCCCCCCCCCCCCCC>
##$VD= 0
##$VDLIST= <DDDDDDDDDDDDDDD>
##$VPLIST= <PPPPPPPPPPPPPPP>
##$VTLIST= <TTTTTTTTTTTTTTT>
##$WBST= 1024
##$WBSW= 4
##$XGAIN= (0..3)
0 0 0 0 
##$XL= 0
##$YL= 0
##$YMAX_a= 13369
##$YMIN_a= -42204
##$ZGOPTNS= <>
##$ZL1= 120
##$ZL2= 120
##$ZL3= 120
##$ZL4= 120
##$ABSF1= 182.463
##$ABSF2= -187.1042
##$ABSG= 5
##$ABSL= 3
##$ALPHA= 0
##$AQORDER= 0
##$ASSFAC= 0
##$ASSFACI= 0
##$ASSFACX= 0
##$ASSWID= 0
##$AUNMP= <proc_1d>
##$AZFE= 0.1
##$AZFW= 0.5
##$BCFW= 0
##$BC_mod= 2
##$BYTORDP= 0
##$COROFFS= 0
##$CY= -3
##$DATMOD= 1
##$DC= 0
##$DFILT= <>
##$DTYPP= 0
##$F1P= 0
##$F2P= 0
##$FCOR= 1
##$FTSIZE= 65536
##$FT_mod= 6
##$GAMMA= 0
##$GB= 0
##$INTBC= 1
##$INTSCL= 5.30512e-09
##$ISEN= 30
##$LB= 1
##$LEV0= 0
##$LPBIN= 0
##$MAXI= 10000
##$MC2= 0
##$MEAN= 0
##$ME_mod= 0
##$MI= 50
##$NCOEF= 0
##$NC_proc= -10
##$NLEV= 6
##$NOISF1= 182.463
##$NOISF2= 159.3651
##$NSP= 0
##$NTH_PI= 0
##$NZP= 0
##$OFFSET= 182.463
##$PC= 4
##$PHC0= -2382.604
##$PHC1= 28.80069
##$PH_mod= 1
##$PKNL= yes
##$PPARMOD= 0
##$PSCAL= 0
##$PSIGN= 0
##$REVERSE= no
##$SF= 81.014009
##$SI= 65536
##$SIGF1= 159.3651
##$SIGF2= -187.1042
##$SINO= 113.3802
##$SIOLD= 16384
##$SREGLST= <1H.CDCl3>
##$SSB= 0
##$STSI= 65536
##$STSR= 0
##$SW_p= 29940.119760479
##$SYMM= 0
##$S_DEV= 0
##$TDeff= 32768
##$TDoff= 0
##$TI= <>
##$TILT= no
##$TM1= 0
##$TM2= 0
##$TOPLEV= 0
##$USERP1= <user>
##$USERP2= <user>
##$USERP3= <user>
##$USERP4= <user>
##$USERP5= <user>
##$WDW= 1
##$XDIM= 65536
##$YMAX_p= 342427350
##$YMIN_p= -538422248
$$ End of Bruker specific parameters
$$ ---------------------------------
##NTUPLES= NMR SPECTRUM
##VAR_NAME=  FREQUENCY,     SPECTRUM/REAL,   SPECTRUM/IMAG
##SYMBOL=    X,             R,               I
##VAR_TYPE=  INDEPENDENT,   DEPENDENT,       DEPENDENT
##VAR_FORM=  AFFN,          ASDF,            ASDF
##VAR_DIM=   65536,         65536,           65536
##UNITS=     HZ,            ARBITRARY UNITS, ARBITRARY UNITS
##FACTOR=    0.456856943014862, 1,           1
##FIRST=     14782.0589164895, 0,            0
##LAST=      -15158.0608439895, 0,           0
##MIN=       -15158.0608439895, -538422248,  0
##MAX=       14782.0589164895, 342427350,    0
$$ Real data points
##PAGE= N=1
##DATA TABLE= (X++(R..R)), XYDATA
$$ [...]
$$ plain form
4713 -125652595 -24694898 65211752 71573796 28513144 23393711 75608087 120799047
4706 120799047 105078249 52569681 30419367 67460572 120317324 119700122 47724015
4699 47724015 -37093348 -58316285 -118129 80306178 111433378 67988167 -16739048
4692 -16739048 -80732173 -79818294 -23146068 36024614 54628235 39894314 26925810
4685 26925810 31813828 46443928 64663038 83873076 88069621 62768607 27218739
4678 27218739 18139351 34646264 32695767 -11315714 -61728404 -69925058 -35482856 5216426
4670 5216426 33933810 61858391 91103173 97491308 62223358 116931 -57507086
4663 -57507086 -94816258 -111154236 -99172109 -47438206 30529438 91414203 103534332
$$ packed form
4713a25652595J00957697Q9906650O362044m3060652n119433N2214376M5190960
4706A20799047j5720798n2508568k2150314L7041205N2856752o17202p1976107
4699D7724015q4817363k1222937N8198156Q0424307L1127200m3445211q4727215
4692a6739048o3993125R13879N6672226N9170682J8603621j4733921j2968504
4685B6925810M888018J4630100J8219110J9210038M196545k5301014l5549868
4678B7218739r079388J6506913j950497m4011481n0412690q196654L4442202M0699282
4670E216426K8717384K7924581K9244782O388135l5267950o2106427n7624017
4663e7507086l7309172j6337978J1982127N1733903P7967644O0884765J2120129
$$ plain form
4656 103534332 82836083 69161858 72360422 64367250 27678491 -10611012 -7301511
4649 -7301511 44210882 101904785 116100238 82008912 51043683 77287015 144147875
4642 144147875 167396305 99148403 6224609 -5514638 63720534 105870057 63684756
4635 63684756 14756426 46874457 113822928 96297508 -24563479 -141385113 -166573725
4628 -166573725 -126123026 -91441764 -87064669 -99758032 -125060440 -158469060 -171100687
4621 -171100687 -137781557 -77097895 -32690475 -21490225 -21564781 -4225430 38467871
4614 38467871 91055936 125558558 121381613 85207291 45086429 18670382 -1728411
4607 -1728411 -24881150 -36212281 -13767659 37848368 85512972 101374187 89340638
$$ packed form
4656A03534332k0698249j3674225L198564p993172l6688759l8289503L309501
4649g301511N1512393N7693903J4195453l4091326l0965229K6243332O6860860
4642A44147875K3248430o8247902r2923794j1739247O9235172M2149523m2185301
4635F3684756m8928330L2118031O6948471j7525420j20860987j16821634k5188612
4628a66573725M0450699L4681262M377095j2693363k5302408l3408620j2631627
4621a71100687L3319130O0683662M4407420J1200250p4556J7339351M2693301
4614C8467871N2588065L4502622m176945l6174322m0120862k6416047k0398793
4607a728411k3152739j1331131K2444622N1616027M7664604J5861215j2033549
$$ plain form
4600 89340638 74345098 71259985 72904647 70751122 75742189 101865074 131877739 123879037
4592 123879037 62682334 -16262805 -69168366 -89467477 -92766595 -80777065 -50140658
4585 -50140658 -18740962 -7642542 -7287697 5269634 27164479 43134133 62232047
4578 62232047 94029573 100050975 30089017 -88469146 -160682716 -141968032 -86597339
4571 -86597339 -52402962 -20220623 45808410 111656135 112393183 50962707 -3103655
4564 -3103655 -4570342 26064031 45929664 31930931 -17212899 -81958147 -123026419
4557 -123026419 -111575692 -59044349 3092969 60294265 105815386 116250108 78978117
4550 78978117 32463738 31785886 75594989 111222112 110717927 93115969 69529049 24565802
$$ packed form
4600H9340638j4995540l085113J644662k153525M991067K6122885L0012665p998702
4592A23879037o1196703p8945139n2905561k0299111l299118J1989530L0636407
4585e0140658L1399696J1098420L54845J2557331K1894845J5969654J9097914
4578F2232047L1797526O021402o9961958j18558163p2213570J8714684N5370693
4571h6597339L4194377L2182339O6029033O5847725P37048o1430476n4066362
4564c103655j466687L0634373J9865633j3998733m9143830o4745248m1068272
4557a23026419J1450727N2531343O2137318N7201296M5521121J0434722l7271991
4550G8978117m6514379o77852M3809103L5627123n04185j7601958k3586920m4963247
$$ plain form
4542 24565802 -31262439 -49904509 -19058488 3895435 -26792000 -73529523 -75320527
4535 -75320527 -42471890 -28527957 -31068829 3945995 76594018 107008845 45888903
4528 45888903 -45616840 -71979972 -24147841 24071617 21674419 -6963337 -14167184
4521 -14167184 9753344 41276378 60256464 63668892 61207480 73301735 118509143
4514 118509143 184416134 222152490 193851922 125064447 85953758 109670532 149382877
4507 149382877 139058240 86864039 73575833 145636214 241900485 262619948 197002668
4500 197002668 133508344 133910746 148942380 97755719 -5938027 -66899350 -38019145
4493 -38019145 24458698 47867670 29557317 7490900 -7290598 -22469063 -19862230
$$ packed form
4542B4565802n5828241j8642070L0846021K2953923l0687435m6737523j791004
4535g5320527L2848637J3943933k540872L5014824P2648023L0414827o1119942
4528D5888903r1505743k6363132M7832131M8219458k397198k8637756p203847
4521a4167184K3920528L1523034J8980086L412428k461412J2094255M5207408
4514A18509143O5906991L7736356k8300568o8787475l9110689K3716774L9712345
4507A49382877j0324637n2194201j3288206P2060381R6264271K0719463o5617280
4500A97002668o3494324M02402J5031634n1186661j03693746o0961323K8880205
4493c8019145O2477843K3408972j8310353k2066417j4781498j5178465K606833
$$ plain form
4486 -19862230 25444402 89928306 115663908 85642152 45868556 41298766 62334875
4479 62334875 70426367 51453275 25642646 20505536 48144103 97868521 141383390
4472 141383390 154566670 138667887 110219028 73595829 24638831 -19018042 -22644502
4465 -22644502 16583571 52259215 41743742 -3964548 -45809689 -71706476 -95284677
4458 -95284677 -113429681 -103587097 -65178904 -30307840 -23514925 -37499533 -58699815
4451 -58699815 -87585045 -115113083 -107903227 -49349012 20461666 41417402 3738265
4444 3738265 -52571684 -103004621 -157344073 -205349819 -198140081 -117689645 -22382590
4437 -22382590 23038383 31116532 51514261 74384400 45605774 -28401321 -70368624
$$ packed form
4486a9862230M5306632O4483904K5735602l0021756l9773596m569790K1036109
4479F2334875Q091492j8973092k5810629n137110K7638567M9724418M3514869
4472A41383390J3183280j5898783k8448859l6623199m8956998m3656873l626460
4465b2644502L9228073L5675644j0515473m5708290m1845141k5896787k3578201
4458i5284677j8145004R842584L8408193L4871064O792915j3984608k1200282
4451e8699815k8885230k7528038P209856N8554215O9810678K0955736l7679137
4444C738265n6309949n0432937n4339452m8005746P209738Q0450436R5307055
4437b2382590M5420973Q078149K0397729K2870139k8778626p4007095m1967303
$$ plain form
4430 -70368624 -44307141 -6179075 -12269198 -44019668 -65386752 -90368789 -136749951
4423 -136749951 -167872947 -148319573 -114338910 -116391151 -128782819 -97928916 -50852712
4416 -50852712 -60159680 -112874702 -117844847 -55135507 -15048221 -53136422 -100051808
4409 -100051808 -72808670 -1763074 22622930 -20014275 -71300309 -85861790 -72465564
4402 -72465564 -60649177 -72131768 -111002357 -147400284 -130622947 -51494185 31019934
4395 31019934 58748788 44288195 35234806 36278718 15081217 -31050512 -65441187
4388 -65441187 -66333281 -48587601 -29073590 -6509062 18400381 33274202 35646231 44026422
4380 44026422 74482224 113389645 123095197 81948173 21012773 4226365 52429268
$$ packed form
4430g0368624K6061483L8128066o090123l1750470k1367084k4982037m6381162
4423a36749951l1122996J9553374L3980663k052241j2391668L0853903M7076204
4416e0852712r306968n2715022m970145O2709340M0087286l8088201m6915386
4409a00051808K7243138P1045596K4386004m2637205n1286034j4561481J3396226
4402g2465564J1816387j1482591l8870589l6397927J6777337P9128762Q2514119
4395C1019934K7728854j4460593r053389J043912k1197501m6131729l4390675
4388f5441187q92094J7745680J9514011K2564528K4909443J4873821K372029Q380191
4380D4026422L0455802L8907421R705552m1147024o0935400j6786408M8202903
$$ plain form
4373 52429268 104932820 92307225 32070566 -919017 8441128 268492 -46625058
4366 -46625058 -68932405 -25650147 27458152 28647616 7347659 19904142 48456349
4359 48456349 47879687 44850044 93762863 164353664 173039104 113261713 59767307 47889697
4351 47889697 42431915 29068602 39945626 72238089 73506178 34038789 8342113
4344 8342113 15665635 5285802 -41875632 -64444850 -25492166 14630668 -3518217
4337 -3518217 -36178940 -9297189 58465130 87871847 60270886 25988271 10927110
4330 10927110 -7213544 -33125310 -35728056 -8377296 8356071 -15661073 -57063256
4323 -57063256 -70852823 -39878918 17521917 66540399 74192190 29862814 -38965072
$$ packed form
4373E2429268N2503552j2625595o0236659l2989583R360145q172636m6893550
4366d6625058k2307347M3282258N3108299J189464k1299957J2556483K8552207
4359D8456349n76662l029643M8912819P0590801Q685440n9777391n3494406j1877610
4351D7889697n457782j3363313J0877024L2292463J268089l9467389k5696676
4344H342113P323522j0379833m7161434k2569218L8952684M0122834j8148885
4337c518217l2660723K6881751O7762319K9406717k7600961l4282615j5061161
4330A0927110j8140654k5911766k602746K7350760J6733367k4017144m1402183
4323e7063256j3789567L0973905N7400835M9018482P651791m4329376o8827886
$$ plain form
4316 -38965072 -81326729 -63722495 1591826 67191729 90405896 69754663 40963832
4309 40963832 29648490 17794370 -23635235 -80459892 -108628766 -100045006 -92321807
4302 -92321807 -103029598 -100317995 -62118509 -21343607 -17444398 -37284631 -43516229 -34804136
4294 -34804136 -35632942 -45862116 -44183042 -30674350 -24377554 -23350261 -6145639 25115503
4286 25115503 37339203 10289842 -36577881 -69583335 -76872880 -72496511 -72886964 -71505314
4278 -71505314 -38259061 42896926 133593826 162782947 104829492 15661312 -28395227
4271 -28395227 -10417380 26965142 40712966 22564880 -7497715 -16450667 20618944
4264 20618944 90793059 145563847 150883099 118763912 73547950 16746518 -45141469
$$ packed form
4316c8965072m2361657J7604234O5314321O5599903K3214167k0651233k8790831
4309D0963832j1315342j1854120m1429605n6824657k8168874Q583760P723199
4302i2321807j0707791K711603L8199486M0774902L899209j9840233o231598Q712093
4294c4804136q28806j0229174J679074J3508692O296796J027293J7204622L1261142
4286B5115503J2223700k7049361m6867723l3005454p289545M376369l90453J381650
4278g1505314L3246253Q1155987R0696900K9189121n7953455q9168180m4056539
4271b8395227J7977847L7382522J3747824j8148086l0062595q952952L7069611
4264B0618944P0174115N4770788N319252l2119187m5215962n6801432o1887987
$$ plain form
4257 -45141469 -70578464 -29776855 34965566 48174819 -1012089 -45418335 -27574865
4250 -27574865 40424425 110471186 150373084 149264600 108451719 48550066 2662175
4243 2662175 -14222686 -13162029 -3150644 20827046 52925540 67571197 54166388
4236 54166388 39323635 50957246 73350966 64888710 19585381 -14491608 7845928
4229 7845928 68174398 103762390 86300809 51774261 35803947 12352752 -59468506
4222 -59468506 -144431234 -149225846 -44224177 88809587 157146436 153693774 118678773
4215 118678773 60808192 -24377560 -96688087 -102869525 -51513490 3818659 45425272
4208 45425272 96803055 155702368 184746063 171049819 137978483 94315875 29916947
$$ packed form
4257d5141469k5436995M0801609O4742421J3209253m9186908m4406246J7843470
4250b7574865O7999290P0046761L9901898j108484m0812881n9901653m5887891
4243B662175j6884861J060657J0011385K3977690L2098494J4645657j3404809
4236E4166388j4842753J1633611K2393720q462256m5303329l4076989K2337536
4229G845928O0328470L5587992j7461581l4526548j5970314k3451195p1821258
4222e9468506q4962728m794612J05001669J33033764O8336849l452662l5015001
4215A18678773n7870581q5185752p2310527o181438N1356035N5332149M1606613
4208D5425272N1377783N8899313K9043695j3696244l3071336m3662608o4398928
$$ plain form
4201 29916947 -32205713 -42726638 -2115255 28622839 16608287 3002436 33106774
4194 33106774 89528183 125983754 125722570 96912656 49885781 9125364 10451530 54912532
4186 54912532 96948173 103324261 90322341 82626758 78389568 79018746 102847136 134970194
4178 134970194 115912689 25878100 -66553442 -89410058 -56198064 -19016838 13774801
4171 13774801 46074445 35452730 -40552688 -97581762 -35384614 96180695 139466594
4164 139466594 50793922 -37712400 -16737666 53754986 65022606 27688607 23451007
4157 23451007 58386550 74487897 70579102 100914288 161257591 178491695 127572383
4150 127572383 70791337 55107670 48302524 12252260 -30093754 -45799726 -50148634
$$ packed form
4201B9916947o2122660j0520925M0611383L0738094j2014552j3605851L0104338
4194C3106774N6421409L6455571k61184k8809914m7026875m0760417J326166M4461002
4186E4912532M2035641O376088j3001920p695583m237190O29178K3828390L2123058
4178A34970194j9057505r0034589r2431542k2856616L3211994L7181226L2791639
4171A3774801L2299644j0621715p6005418n7029074O2197148J31565309M3285899
4164A39466594q8672672q8506322K0974734P0492652J1267620l7333999m237600
4157B3451007L4935543J6101347l908795L0335186O0343303J7234104n0919312
4150A27572383n6781046j5683667o805146l6050264m2346014j5705972m348908
$$ plain form
4143 -50148634 -62196017 -54313168 -6207773 34020291 12817898 -35074920 -32773768
4136 -32773768 14624859 24793553 -30709345 -84551387 -86014583 -76263743 -108162794
4129 -108162794 -156964800 -168858562 -150023882 -142771032 -145759148 -125980757 -92855482
4122 -92855482 -91722903 -124517110 -141006994 -121999358 -113859449 -152232055 -194737567
4115 -194737567 -169008713 -68737877 31831154 57465171 6023174 -61064754 -90703822
4108 -90703822 -86023651 -76069346 -56653113 1571611 82086377 109074830 40436076
4101 40436076 -62358504 -106202433 -83363701 -60769374 -69627946 -74274326 -53115260
4094 -53115260 -39042050 -53213437 -56479889 -5762908 78489950 136732230 137212417 92462833
$$ packed form
4143e0148634j2047383P882849M8105395M0228064k1202393m7892818K301152
4136c2773768M7398627J0168694n5502898n3842042j463196R750840l1899051
4129a08162794m8802006j1893762J8834680P252850k988116J9778391L3125275
4122i2855482J132579l2794207j6489884J9007636Q139909l8372606m2505512
4115a94737567K5728854J00270836J00569031K5634017n1441997o7087928k9639068
4108i0703822M680171R954305J9416233N8224724Q0514766K6988453o8638754
4101D0436076j02794580m3843929K2838732K2594327q858572m646380K1159066
4094e3115260J4073210j4171387l266452N0716981Q4252858N8242280M80187m4749584
$$ plain form
4086 92462833 33127861 -10429737 -20107411 -3813857 15962089 32266071 50560805
4079 50560805 60011390 47903471 42996356 89126202 160835376 168484375 82381358 -7051422
4071 -7051422 -4270237 63369084 92607524 44864555 -24902578 -59078703 -52352466 -23592307
4063 -23592307 7050972 10204250 -31335955 -83685826 -86375831 -26917245 41845033
4056 41845033 66509889 46203953 15535409 2525110 11529354 26889078 27086620 7919995
4048 7919995 -11138219 -14592644 -12127220 -16323588 -17598817 -4127588 13001808 22748309
4040 22748309 41445085 81509381 110622609 85387411 18979456 -24149256 -182084
4033 -182084 76110071 155563140 186992286 142555636 49518385 -17609547 -15988501 12338070
$$ packed form
4086I2462833n9334972m3557598r677674J6293554J9775946J6303982J8294734
4079E0560805R450585j2107919m907115M6129846P1709174P648999q6103017q9432780
4071g051422K781185O7639321K9238440m7742969o9767133l4176125O726237K8760159
4063b3592307L0643279L153278m1540205n2349871k690005N9458586O8762278
4056D1845033K4664856k0305936l0668544j3010299R004244J5359724J97542j9166625
4048G919995j9058214l454425K465424m196368j275229J3471229J7129396R746501
4040B2748309J8696776M0064296K9113228k5235198o6407955m3128712K3967172
4033a82084P6292155P9453069L1429146m4436650r3037251o7127932J621046K8326571
$$ plain form
4025 12338070 8652472 -9215814 15094272 67280029 74214351 25836242 94016
4018 94016 45637456 116991282 156731196 168919175 170277244 136880012 54589394 -28750225
4010 -28750225 -57831747 -40387880 -17341167 779513 23194101 41876280 51621631
4003 51621631 72307090 105839767 108856845 58619387 6616678 7300495 30327963 13058150
3995 13058150 -29992355 -30187294 19854298 58367348 58434493 54072455 52960668 10959598
3987 10959598 -77228186 -141404956 -133868733 -99190490 -97302080 -113798053 -103389162
3980 -103389162 -75533190 -71634282 -88355893 -89741558 -77153248 -82107777 -97375858
3973 -97375858 -80368127 -31253279 -7600623 -42158537 -95468944 -115541889 -103944232
$$ packed form
4025A2338070l685598j7868286K4310086N2185757O934322m8378109k5742226
4018I4016M5543440P1353826L9739914J2187979J358069l3397232q2290618q3339619
4010b8750225k9081522J7443867K3046713J8120680K2414588J8682179R745351
4003E1621631K0685459L3532677L017078n0237458n2002709O83817K3027468j7269813
3995A3058150m3050505j94939N0041592L8513050O7145m362038j111787m2001070
3987A0959598q8187784o4176770P536223L4678243J888410j6495973J0408891
3980a03389162K7855972L898908j6721611j385665J2588310m954529j5268081
3973i7375858J7007731M9114848K3652656l4557914n3310407k0072945J1597657
$$ plain form
3966 -103944232 -92535145 -86782162 -67102000 -27645894 16730874 50840391 64625953
3959 64625953 53005463 32188164 38253333 81056956 114589974 87442392 14169383
3952 14169383 -40264669 -43690351 -23872456 -8672431 14524055 57548100 87907549
3945 87907549 62907531 -9904453 -76892935 -95347863 -65866825 -18247247 13634728
3938 13634728 10685558 -17111291 -38486460 -36008760 -25445763 -28329901 -39307540 -38555403
3930 -38555403 -23963194 -10165678 -4617781 -3273163 -502120 12682268 44516085 76981629
3922 76981629 66137416 -1278621 -70130565 -74912408 -24652947 11860958 265562
3915 265562 -24617399 -20389525 10679160 40925191 51042648 34999675 6745198 8171291
$$ packed form
3966a03944232J1409087N752983J9680162L9456106M4376768L4109517J3785562
3959F4625953j1620490k0817299O065169M2803623L3533018k7147582p3273009
3952A4169383n4434052l425682J9817895J5200025K3196486M3024045L0359449
3945H7907549k5000018p2811984o6988482j8454928K9481038M7619578L1881975
3938A3634728k949170k7796849k1375169K477700J0562997k884138j0977639P52137
3930c8555403J4592209J3797516N547897J344618K771043J3184388L1833817L2465544
3922G6981629j0844213o7416037o8851944m781843N0259461L6513905j1595396
3915B65562k4882961M227874L1068685L0246031J0117457j6042973k8254477J426093
$$ plain form
3907 8171291 69173728 150255334 171170230 114200024 52057111 48379078 77750156
3900 77750156 79331052 46045310 14027453 -3980417 -22783495 -41229693 -43839703
3893 -43839703 -36752514 -38026177 -35904415 2501577 77637479 145432762 164780717 133956177
3885 133956177 78702811 25824440 -10463832 -33545536 -54874076 -68805828 -50615695
3878 -50615695 2301524 46522786 41548740 10728048 14799248 65301057 103672326
3871 103672326 79317673 16843280 -16993357 3906655 39112267 36359814 -5939463
3864 -5939463 -42264293 -42203473 -31514885 -55738182 -113772035 -156014404 -151014092 -123133194
3856 -123133194 -111544877 -121240382 -133502881 -137308225 -126797374 -93538450 -48667894
$$ packed form
3907H171291O1002437Q1081606K0914896n6970206o2142913l678033K9371078
3900G7750156J580896l3285742l2017857j8007870j8803078j8446198k610010
3893d3839703P087189j273663K121762L8405992P5135902O7795283J9347955l0824540
3885A33956177n5253366n2878371l6288272k3081704k1328540j3931752J8190133
3878e0615695N2917219M4221262m974046l0820692M071200N0501809L8371269
3871A03672326k4354653o2474393l3836637K0900012L5205612k752453m2299277
3864e939463l6324830O0820J0688588k4223297n8033853m2242369N000312K7880898
3856a23133194J1588317r695505j2262499l805344J0510851L3258924M4870556
$$ plain form
3849 -48667894 -28087677 -44454839 -57679930 -29562448 13882745 18194949 -16250829
3842 -16250829 -34770696 -7770328 36948560 65409834 78960750 93447848 110313607
3835 110313607 121398296 118745992 92083917 37629199 -26239406 -70423198 -82395742
3828 -82395742 -67146058 -31355515 10808908 29231193 5924824 -36368015 -62481125
3821 -62481125 -70249153 -75574244 -68370649 -27865641 26319335 47202024 26968226 7773728
3813 7773728 22071256 58985181 88114231 78960550 7166145 -108781880 -186151885
3806 -186151885 -154202444 -51306216 17585688 20715224 21658413 53946438 64763086
3799 64763086 17322665 -39532915 -59483091 -79403684 -142385091 -202744660 -187371836
$$ packed form
3849d8667894K0580217j6367162j3225091K8117482M3445193M312204l4445778
3842a6250829j8519867K7000368M4718888K8461274J3550916J4487098J6865759
3835A10313607J1084689k652304k6662075n4454718o3868605m4183792j1972544
3828h2395742J5249684L5790543M2164423J8422285k3306369m2292839k6113110
3821f2481125p768028n325091P203595M0505008N4184976K0882689k0233798j9194498
3813G773728J4297528L6913925K9129050r153681p1794405j15948025p7370005
3806a86151885L1949441J02896228O8891904L129536R43189L2288025J0816648
3799F4763086m7440421n6855580j9950176j9920593o2981407o0359569J5372824
$$ plain form
3792 -187371836 -108969613 -41696277 -16353065 -12159069 -22945954 -54434004 -76593133
3785 -76593133 -57724945 -34657955 -69839511 -140712725 -152792572 -76315563 4331164
3778 4331164 3669326 -63843701 -126585719 -147206495 -134262497 -102148151 -60761889 -25149275
3770 -25149275 -3662739 14412757 41108067 68458453 77157045 60341051 33751249
3763 33751249 26027314 53089125 94346011 107543937 79911377 44431734 26061169
3756 26061169 603914 -58079534 -118058523 -127306322 -94261597 -72655320 -73955447
3749 -73955447 -58158000 -14113665 18339909 21965649 31955698 66049046 88718880
3742 88718880 82279052 91498749 143185075 173153270 104604065 -28584864 -110001877
$$ packed form
3792a87371836P8402223O7273336K5343212M193996j0786885l1488050k2159129
3785g6593133J8868188K3066990l5181556p0873214j2079847P6477009Q0646727
3778D331164o61838o7513027o2742018k0620776J2943998L2114346M1386262L5612614
3770b5149275K1486536J8075496K6695310K7350386Q698592j6815994k6589802
3763C3751249p723935K7061811M1256886J3197926k7632560l5479643j8370565
3756B6061169k5457255n8683448n9978989r247799L3044725K1606277j300127
3749g3955447J5797447M4044335L2453574L625740R990049L4093348K2669834
3742H8718880o439828R219697N1686326K9968195o8549205j33188929q1417013
$$ plain form
3735 -110001877 -85986178 -17330479 21582373 34200663 65378655 118714128 152224029
3728 152224029 139865288 100948190 66388928 42033828 20171958 12817606 46695114
3721 46695114 117386517 171845003 162153675 107300234 70846628 76766542 82559696 49776295
3713 49776295 7318143 14576442 80810673 154760356 188799705 183184113 162771124
3706 162771124 136346671 96128979 47085298 17472262 32021815 80040344 121339463
3699 121339463 127412752 106959155 84685840 69250345 56478380 49086976 48783886 39455941
3691 39455941 10048008 -10229774 21415691 91663622 127013256 79812338 -11556293
3684 -11556293 -72142484 -76560214 -61012893 -67506772 -100913828 -130454500 -115641640
$$ packed form
3735a10001877K4015699O8655699L8912852J2618290L1177992N3335473L3509901
3728A52224029j2358741l8917098l4559262k4355100k1861870p354352L3877508
3721D6695114P0691403N4458486r691328n4853441l6453606N919914N793154l2783401
3713D9776295m2458152P258299O6234231P3949683L4039349n615592k0412989
3706A62771124k6424453m0217692m9043681k9613036J4549553M8018529M1299119
3699A21339463O073289k0453597k2273315j5435495j2771965p391404l03090r327945
3691C9455941k9407933k0277782L1645465P0247931L5349634m7200918r1368631
3684a1556293o0586191m417730J5547321o493879l3407056k9540672J4812860
$$ plain form
3677 -115641640 -42776775 49332171 94916530 67627671 6034294 -38541672 -55153622
3670 -55153622 -56553202 -40518278 -2390646 33870016 37245455 15387730 3947100
3663 3947100 12600761 13958538 -11610469 -48929900 -72230863 -74191877 -64338741 -55384258
3655 -55384258 -55409647 -60045483 -51455509 -17920765 26657254 54851332 53550875 27545922
3647 27545922 -16414298 -69825179 -109899183 -107604345 -54351557 27327571 98084009
3640 98084009 121542976 82526808 2352117 -70297203 -100345415 -96335483 -89469808
3633 -89469808 -90298278 -80400726 -43701380 4808469 22379423 -25384754 -118472613 -179592757
3625 -179592757 -147112171 -51984892 16482631 28294874 43914835 105256127 157139765
$$ packed form
3677a15641640P2864865R2108946M5584359k7288859o1593377m4575966j6611950
3670e5153622j399580J6034924L8127632L6260662L375439k1857725j1440630
3663C947100Q653661J357777k5569007l7319431k3300963j961014R853136Q954483
3655e5384258k5389m635836Q589974L3534744M4578019K8194078j300457k6004953
3647B7545922m3960220n3410881m0074004K294838N3252788Q1679128P0756438
3640I8084009K3458967l9016168q0174691p2649320l0048212M009932O865675
3633h9469808q28470R897552L6699346M8509849J7570954m7764177r3087859o1120144
3625a79592757L2480586R5127279O8467523J1812243J5619961O1341292N1883638
$$ plain form
3618 157139765 127231087 33613349 -50977018 -102059334 -137908858 -144393962 -93101834
3611 -93101834 -21152863 -2912638 -38796472 -56537149 -31101579 -14723957 -29742253
3604 -29742253 -26711812 12521412 20235444 -51581441 -145338297 -181303704 -165646343
3597 -165646343 -150428195 -141039404 -113606570 -78974458 -57435164 -26973363 32275673
3590 32275673 75360996 48244077 -20328723 -56154503 -45112359 -25544692 1377276
3583 1377276 64900088 138143182 153925740 117294197 111056192 163889055 198162335
3576 198162335 149474804 63642076 20960204 21869669 9861251 -28733339 -49536585
3569 -49536585 -21145598 34605240 70664914 56306670 -2243800 -63303897 -81002541
$$ packed form
3618A57139765k9908678r3617738q4590367n1082316l5849524o485104N1292128
3611i3101834P1948971J8240225l5883834j7740677K5435570J6377622j5018296
3604b9742253L030441L9233224P714032p1816885r3756856l5965407J5657361
3597a65646343J5218148R388791K7432834L4632112K1539294L0461801N9249036
3590C2275673M3085323k7116919o8572800l5825780J1042144J9567667K6921968
3583A377276O3522812P3243094J5782558l6631543o238005N2832863L4273280
3576A98162335m8687531q5832728m2681872R09465j2008418l8594590k0803246
3569d9536585K8390987N5750838L6059674j4358244n8550470o1060097j7698644
$$ plain form
3562 -81002541 -49024079 -3774250 19745727 15767428 -9829996 -52579349 -92617444
3555 -92617444 -96896707 -58600144 -10947855 14113895 17055365 8171758 -15281432 -49756430
3547 -49756430 -71817368 -67522199 -53225853 -47633926 -45804616 -38283185 -31296407 -31430653
3539 -31430653 -37087416 -57854046 -104471245 -140768173 -94185525 47896562 193719362
3532 193719362 245571898 209489056 158874117 124401468 83866318 38271550 22812839
3525 22812839 40253251 47816025 23306925 -6884837 -17382653 -14242591 -4422457 18213542
3517 18213542 41082559 31146120 -16739765 -68669335 -103429717 -132274219 -150158936
3510 -150158936 -118456821 -30058681 50569780 55189318 -6628039 -68852084 -85884067
$$ packed form
3562h1002541L1978462M5249829K3519977l978299k5597424m2749353m0038095
3555i2617444m279263L8296563M7652289K5061750K941470q883607k3453190l4474998
3547d9756430k2060938M295169J4296346N591927J829310P521431O986778j34246
3539c1430653n656763k0766630m6617199l6296928M6582648J42082087J45822800
3532A93719362N1852536l6082842n0614939l4472649m0535150m5594768j5458711
3525B2812839J7440412P562774k4509100l0191762j0497816L140062R820134K2635999
3517A8213542K2869017r936439m7885885n1929570l4760382k8844502j7884717
3510a50158936L1702115Q8398140Q0628461M619538o1817357o2224045j7031983
$$ plain form
3503 -85884067 -53578757 16605829 97451283 138187330 106798844 36296579 -11072133
3496 -11072133 -20798533 -27887206 -48642031 -60611510 -56478353 -65164114 -95291132 -102249007
3488 -102249007 -50827005 16667944 20823569 -51405350 -122049108 -110570036 -21781830
3481 -21781830 68628477 99242950 73250334 29316181 -11478892 -51606772 -82448155
3474 -82448155 -75798877 -23994994 34202458 54395795 42765975 41589657 62018753
3467 62018753 67925339 37159139 2171020 3452147 29345866 36675949 16346763 1861142
3459 1861142 16866843 47931408 70954776 73678413 48531211 -3278335 -49768790
3452 -49768790 -43405595 20852804 86145193 92982611 40222433 -28027844 -72430716
$$ packed form
3503h5884067L2305310P0184586Q0845454M0736047l1388486p0502265m7368712
3496a1072133r726400p088673k0754825j1969479M133157q685761l0127018o957875
3488a02249007N1422002O7494949M155625p2228919p0643758J1479072Q8788206
3481b1781830R0410307L0614473k5992616m3934153m0795073m0127880l0841383
3474h2448155O649278N1803883N8197452K0193337j1629820j176318K0429096
3467F2018753N906586l0766200l4988119J281127K5893719P330083k0329186j4485621
3459A861142J5005701L1064565K3023368K723637k5147202n1809546m6490455
3452d9768790O363195O4258399O5292389O837418n2760178o8250277m4402872
$$ plain form
3445 -72430716 -75290152 -34465375 27530244 65318090 53690625 18223700 -2159752
3438 -2159752 -4022614 191667 23195627 72701953 98410751 37950993 -79208077
3431 -79208077 -143114207 -102156150 -26918407 1061986 3430637 50738438 137998666
3424 137998666 185528994 148980986 66478685 -2706897 -34070353 -27881843 7870294
3417 7870294 47528858 54857768 19768943 -28983201 -55199508 -44737235 -5800797
3410 -5800797 39684696 66880071 71944842 82965386 124901022 177805075 195550441
3403 195550441 163046284 107117580 53456361 6361104 -25124026 -17274376 35432991
3396 35432991 101327364 141166319 142353630 117302063 84990427 59673312 41470822
$$ packed form
3445g2430716k859436M0824777O1995619L7787846j1627465l5466925k0383452
3438b159752j862862M214281K3003960M9506326K5708798o0459758j17159070
3431g9208077o3906130M0958057P5237743K7980393K368651M7307801Q7260228
3424A37998666M7530328l6548008q2502301o9185582l1363456O188510L5752137
3417G870294L9658564P328910l5088825m8752144k6216307J0462273L8936438
3410e800797M5485493K7195375N064771J1020544M1935636N2904053J7745366
3403A95550441l2504157n5928704n3661219m7095257l1485130P849650N2707367
3396C5432991O5894373L9838955J187311k5051567l2311636k5317115j8202490
$$ plain form
3389 41470822 14615612 -30283180 -74629680 -90334772 -73852794 -40274886 5202651
3382 5202651 58791419 92752173 82145236 54844878 67097246 123019525 167017990
3375 167017990 167117738 152737328 149875309 134823999 86187598 33047346 8779024 -1390754
3367 -1390754 -21253236 -30877775 -5816208 23087068 9289378 -30574096 -39375896 -10488941
3359 -10488941 6709724 -7814171 -17013984 1287470 11224073 -24595082 -86648765
3352 -86648765 -126738156 -125172057 -92285905 -38689552 23407391 64330631 56881048
3345 56881048 12802166 -24772362 -30434353 -19927583 -17180502 -16769033 1413579 30717456
3337 30717456 41339099 30728032 36199358 73510558 93994311 45205479 -45013972
$$ packed form
3389D1470822k6855210m4898792m4346500j5705092J6481978L3577908M5477537
3382E202651N3588768L3960754j0606937k7300358J2252368N5922279M3998465
3375A67017990R9748j4380410k862019j5051310m8636401n3140252k4268322j0169778
3367a390754j9862482r624539K5061567K8903276j3797690l9863474q801800K8886955
3359a0488941J7198665j4523895r199813J8301454R936603l5819155o2053683
3352h6648765m0089391J566099L2886152N3596353O2096943M0923240p449583
3345E6881048m4078882l7574528n661991J0506770K747081M11469J8182612K9303877
3337C0717456J0621643j0611067N471326L7311200K0483753m8788832r0219451
$$ plain form
3330 -45013972 -99009358 -97478176 -93964035 -111682554 -97101826 -12758223 84647544
3323 84647544 113240049 72451325 27074786 16555801 32728165 60586658 86056220
3316 86056220 83066523 45436570 14337427 24394861 43565602 21305572 -25364337
3309 -25364337 -37613604 -10368166 7901237 3393582 12135735 45527161 72995263
3302 72995263 86289709 107647187 120468840 70488024 -34371154 -98155898 -55115199
3295 -55115199 41415253 91556339 65013259 4731737 -44451370 -68165126 -70809174
3288 -70809174 -64359286 -51337393 -10229116 69437552 139117773 135557987 81340606
3281 81340606 68979391 120122072 141071494 65156959 -38309254 -65126753 -23396670
$$ packed form
3330d5013972n3995386J531182L514141j7718519J4580728Q4343603R7405767
3323H4647544K8592505m0788724m5376539j0518985J6172364K7858493K5469562
3316H6056220k989697l7629953l1099143J0057434J9170741k2260030m6669909
3309b5364337j2249267K7245438J8269403m507655Q742153L3391426K7468102
3302G2995263J3294446K1357478J2821653m9980816j04859178o3784744M3040699
3295e5115199R6530452N0141086k6543080o0281522m9183107k3713756k644048
3288g0809174O449888J3021893M1108277P9666668O9680221l559786n4217381
3281H1340606j2361215N1142681K0949422p5914535j03466213k6817499M1730083
$$ plain form
3274 -23396670 -1034952 -32174929 -77191114 -103888833 -108664673 -78302048 -8432001
3267 -8432001 51814397 46665812 631092 -7734553 42648332 91864827 87704188 40365865
3259 40365865 -12894071 -42817694 -25920780 38108120 100026967 100211627 40633331
3252 40633331 -22544766 -54070726 -61321115 -49025913 -9794195 37306444 53731898
3245 53731898 35642093 14586272 2361933 -15200675 -31004698 -21106178 319164
3238 319164 -8438103 -42852374 -51579133 -21434020 2240737 -3474229 -6338719 9509927
3230 9509927 10522794 -14254111 -17991555 23693551 62363337 56721012 41349557 57630792
3222 57630792 73523423 40676540 -16135688 -41125494 -40952001 -57783208 -79680368
$$ packed form
3274b3396670K2361718l1139977m5016185k6697719m775840L0362625O9870047
3267h432001O0246398n148585m6034720q365645N0382885M9216495m160639m7338323
3259D0365865n3259936k9923623J6896914O4028900O1918847J84660n9578296
3252D0633331o3178097l1525960p250389J2295202L9231718M7100639J6425454
3245E3731898j8089805k1055821j2224339j7562608j5804023R898520K1425342
3238C19164q757267l4414271q726759L0145113K3674757n714966k864490J5848646
3230I509927J012867k4776905l737444M1685106L8669786n642325j5371455J6281235
3222E7630792J5892631l2846883n6812228k4989806J73493j6831207k1897160
$$ plain form
3215 -79680368 -64252978 -33693540 -51820673 -103658599 -92896319 12663587 115627207
3208 115627207 115627064 38701551 -15527285 -10665638 6890318 3414916 5878770 44171252
3200 44171252 93039245 100506464 54865872 -3054624 -32166716 -34776029 -37949147 -44993707
3192 -44993707 -27720954 29809808 100271794 140793857 140700395 124714223 113358087 97956397
3184 97956397 59737418 3483124 -37668785 -34935133 608540 25982229 17288101
3177 17288101 -1576423 -893 5718648 -22841679 -72649304 -81203577 -28663988 22218554
3169 22218554 13128609 -24838145 -21202487 28452896 62544065 44376506 -1355708
3162 -1355708 -37776789 -49984008 -30899466 13847687 41238728 6346432 -62363326
$$ packed form
3215g9680368J5427390L0559438j8127133n1837926J0762280J05559906J02963620
3208A15627207j43p6925513n4228836M861647J7555956l475402K463854L8292482
3200D4171252M8867993P467219m5640592n7920496k9112092k609313l173118p044560
3192d4993707J7272753N7530762P0461986M0522063r3462j5986172j1356136j5401690
3184I7956397l8218979n6254294m1151909K733652L5543673K5373689q694128
3177A7288101j8864524J575530N719541k8560327m9807625q554273N2539589N0882542
3169B2218554r089945l7966754L635658M9655383L4091169j8167559m5732214
3162a355708l6421081j2207219J9084542M4747153K7391041l4892296o8709758
$$ plain form
3155 -62363326 -78189464 -12105274 59438980 59747216 16168224 6877675 39920716 51512422
3147 51512422 12399422 -29699402 -23595577 21441988 64228927 84489857 85818960
3140 85818960 77422933 74497467 90510164 109728560 95347293 46867609 17195476
3133 17195476 40107839 71951670 51824836 -4369150 -30976980 -24815189 -57491895
3126 -57491895 -157432270 -247625866 -241956596 -152943324 -57061360 4649366 38573616
3119 38573616 48635634 39020240 44332845 91063013 141249013 138687402 99922384 87054538
3111 87054538 96606122 62919277 -15691862 -49378098 6847377 77408035 83261682
3104 83261682 55677072 60993251 81331600 61779885 26954089 46663818 108722785
$$ packed form
3155f2363326j5826138O6084190P1544254L08236m3578992r290549L3043041J1591706
3147E1512422l9113000m2098824O103825M5037565M2786939K0260930J329103
3140H5818960q396027k925466J6012697J9218396j4381267m8479684k9672133
3133A7195476K2912363L1843831k0126834n6193986k6607830O161791l2676706
3126e7491895r9940375r0193596N669270Q9013272R5881964O1710726L3924250
3119C8573616J0062018r615394N312605M6730168N0186000k561611l8765018j2867846
3111H7054538R551584l3686845p8611139l3686236N6225475P0560658N853647
3104H3261682k7584610N316179K0338349j9551715l4825796J9709729O2058967
$$ plain form
3097 108722785 129692981 90913900 65656800 94441932 123884014 103157979 63709544
3090 63709544 55793121 64529740 41875869 -15510072 -66353272 -78476953 -49650176
3083 -49650176 1078367 35848999 19182032 -34158862 -57782633 -10573150 66300074
3076 66300074 98262692 63625407 2606793 -40120047 -49293702 -29945012 719212
3069 719212 16825777 7297779 -5974347 4782031 32595200 44885630 30066397 10665695
3061 10665695 6224257 3305782 -27093360 -90220469 -151867150 -162294251 -101320759
3054 -101320759 -4543583 62013627 61056783 14091598 -29991195 -44744882 -36338235
3047 -36338235 -17877694 6405025 31839490 44985761 34351175 5949211 -18211519
$$ packed form
3097A08722785K0970196l8779081k5257100K8785132K9442082k0726035l9448435
3090F3709544p916423Q736619k2653871n7385941n0843200j2123681K8826777
3083d9650176N0728543L4770632j6666967n3340894k3623771M7209483P6873224
3076F6300074L1962618l4637285o1018614m2726840r173655J9348690L0664224
3069G19212J6106565r527998j3272126J0756378K7813169J2290430j4819233j9400702
3061A0665695m441438k918475l0399142o3127109o1646681j0427101O0973492
3054a01320759R6777176O6557210r56844m6965185m4082793j4753687Q406647
3047c6338235J8460541K4282719K5434465J3146271j0634586k8401964k4160730
$$ plain form
3040 -18211519 -20547705 -6845112 -927488 -16852347 -38938514 -33930680 16488401 93175508
3032 93175508 144383816 120812646 26429474 -65011811 -73903508 -8009614 40835790
3025 40835790 14823856 -36015033 -39989640 -21760419 -60471443 -146898785 -172921029
3018 -172921029 -85318761 27709360 46981369 -39100151 -154559457 -243854388 -299016287
3011 -299016287 -312034933 -269390332 -191856245 -130089160 -112351759 -122438446 -125835201
3004 -125835201 -96846221 -32649424 35467963 59958178 31756404 592484 13722930
2997 13722930 53771472 69187360 47451908 21051044 15125309 26684968 44308122
2990 44308122 52557595 29238030 -25653991 -73745801 -89752479 -107074492 -160736241
$$ packed form
3040a8211519k336186J3702593N917624j5924859k2086167N007834N0419081P6687107
3032I3175508N1208308k3571170r4383172r1441285q891697O5893894M8845404
3025D0835790k6011934n0838889l974607J8229221l8711024q6427342k6022244
3018a72921029Q7602268J13028121J9272009q6081520j15459306q9294931n5161899
3011b99016287j3018646M2644601P7534087O1767085J7737401j0086687l396755
3004a25835201K8988980O4196797O8117387K4490215k8201774l1163920J3130446
2997A3722930M0048542J5415888k1735452k6400864n925735J1559659J7623154
2990D4308122Q249473k3319565n4892021m8091810j6006678j7322013n3661749
$$ plain form
2983 -160736241 -207549356 -176289940 -93814023 -77271915 -175161438 -289857606 -302011860
2976 -302011860 -213664112 -115336232 -57941922 -22289456 9327281 19753546 -811929
2969 -811929 -28347829 -36083495 -24514739 -9758931 -221277 7308215 18399423 30514893
2961 30514893 28186041 -3684084 -54960240 -90862656 -88845471 -63386991 -41960883
2954 -41960883 -30336563 -18139094 -4944439 1298096 2551153 3051202 -11346779 -58768770
2946 -58768770 -123601113 -159547188 -141423310 -93766068 -54297068 -27741828 2508003
2939 2508003 29789070 23657286 -20105690 -57747206 -47108797 -2568322 25451068
2932 25451068 17580182 2093134 5097798 19363052 33796700 56601564 82930441
$$ packed form
2983a60736241m6813115L1259416Q2475917J6542108r7889523j14696168j2154254
2976c02011860Q8347748R8327880N7394310L5652466L1616737J0426265k0565475
2969h11929k7535900p735666J1568756J4755808R537654P529492J1091208J2115470
2961C0514893k328852l1870125n1276156l5902416K017185K5458480K1426108
2954d1960883J1624320J2197469J3194655O242535J253057N00049j4397981m7421991
2946e8768770o4832343l5946075J8123878M7657242L9469000K6555240L0249831
2939B508003K7281067o131784m3762976l7641516J0638409M4540475K8019390
2932B5451068p870886j5487048L004664J4265254J4433648K2804864K6328877
$$ plain form
2925 82930441 71983111 -2906898 -99418467 -145727624 -128322647 -97058207 -82958698
2918 -82958698 -59202452 383118 65907217 84179857 44540717 -12551051 -39587069
2911 -39587069 -18626218 33042309 79336728 95348352 86911683 72182104 50175639
2904 50175639 10619642 -29045843 -31624360 6149441 40986487 38630313 12621086
2897 12621086 -7047435 -13094529 -11317980 -3099544 2033022 -12900176 -37735390 -34371568
2889 -34371568 5416138 38545859 37516877 38400383 80758313 138683096 165088660 171685079
2881 171685079 199432680 230490914 204367506 120355747 52107213 46269620 68641988
2874 68641988 70766922 52394703 30322247 -3055244 -52817119 -90054117 -83505517
$$ packed form
2925H2930441j0947330p4890009r6511569m6309157J7404977L1264440J4099509
2918h2958698K3756246N9585570O5524099J8272640l9639140n7091768k7036018
2911c9587069K0960851N1668527M6294419J6011624q436669j4729579k2006465
2904E0175639l9555997l9665485k578517L7773801L4837046k356174k6009227
2897A2621086j9668521o047094J776549Q218436N132566j4933198k4835214L363822
2889c4371568L9787706L3129721j028982Q83506M2357930N7924783K6405564O596419
2881A71685079K7747601L1058234k6123408q4011759o8248534n837593K2372368
2874F8641988K124934j8372219k2072456l3377491m9761875l7236998O548600
$$ plain form
2867 -83505517 -39097210 16180661 64550127 92676118 88046348 62677482 49152943
2860 49152943 50246006 28007681 -29321694 -70026860 -49264069 -589888 15281000
2853 15281000 6787212 33914247 103563165 147883629 119488432 54674309 17538555
2846 17538555 19563223 21450518 -11270064 -78645027 -153964758 -201446653 -200869350 -170552534
2838 -170552534 -152757379 -163152311 -169287642 -133638389 -64071223 -5143997 8903851
2831 8903851 -24689233 -90230967 -162411535 -205463225 -191504775 -131727446 -73463447
2824 -73463447 -52391584 -55607853 -44112686 -6401924 24516306 8371910 -59246355
2817 -59246355 -142840436 -194485288 -182997692 -114156183 -36327594 -11393578 -56239295
$$ packed form
2867h3505517M4408307N5277871M8369466K8125991m629770k5368866j3524539
2860D9152943J093063k2238325n7329375m0705166K0762791M8674181J5870888
2853A5281000q493788K7127035O9648918M4320464k8395197o4814123l7135754
2846A7538555K024668J887295l2720582o7374963p5319731m7481895N77303L0316816
2838a70552534J7795155j0394932o135331L5649253O9567166N8927226J4047848
2831H903851l3593084o5541734p2180568m3051690J3958450N9777329N8263999
2824g3463447K1071863l216269J1495167L7710762L0918230j6144396o7618265
2817e9246355q3594081n1644852J1487596O8841509P7828589K4934016m4845717
$$ plain form
2810 -56239295 -117020229 -123985810 -70270297 -11927642 8216361 1577620 -8668553
2803 -8668553 -26925584 -54369051 -58922131 -22402484 8113688 -27184203 -105380553
2796 -105380553 -137297941 -87546619 -22099654 -15135495 -59686030 -103244141 -126092342
2789 -126092342 -137636812 -128376399 -83408640 -31516028 -24797338 -64402258 -93406695
2782 -93406695 -77233670 -49931788 -56407131 -81996910 -77795104 -43551733 -42871623 -119262928
2774 -119262928 -221948925 -248952607 -167691991 -61954545 -33669807 -78243168 -99472230
2767 -99472230 -44540958 29769987 46364796 11374503 -14133421 -6115315 13857335
2760 13857335 34297597 54992307 49584022 -1833807 -47588269 -11261774 84135927
$$ packed form
2810e6239295o0780934o965581N3715513N8342655K0144003o638741j0246173
2803h668553j8257031k7443467m553080L6519647L0516172l5297891p8196350
2796a05380553l1917388M9751322O5446965O964159m4550535m3558111k2848201
2789a26092342j1544470R260413M4967759N1892612O718690l9604920k9004437
2782i3406695J6173025K7301882o475343k5589779M201806L4243371O80110p6391305
2774a19262928j02685997k7003682Q1260616J05737446K8284738m4573361k1229062
2767i9472230N4931272P4310945J6594809l4990293k5507924Q018106J9972650
2760A3857335K0440262K0694710n408285n1417829m5754462L6326495R5397701
$$ plain form
2753 84135927 121777664 51927101 -34827343 -45619316 -17455693 -35905788 -86527920
2746 -86527920 -86694227 -29974203 8664736 5324910 20271111 79618455 118183029 80920996
2738 80920996 5924389 -43297806 -67142026 -95493084 -113004917 -84450434 -28295552
2731 -28295552 -3133129 -28190911 -64195981 -69925994 -40987628 1723772 26712684
2724 26712684 498137 -80978156 -167575234 -193958951 -149239219 -83254380 -42982557
2717 -42982557 -31125111 -31412262 -42039672 -66734336 -95327465 -115144104 -131368236
2710 -131368236 -157725694 -190261028 -204751653 -182347342 -129315932 -68072904 -15016239
2703 -15016239 25929675 51209811 52191738 28989881 -4180 -14327797 -11211610 1987609
$$ packed form
2753H4135927L7641737o9850563q6754444j0791973K8163623j8450095n0622132
2746h6527920j66307N6720024L8638939l339826J4946201N9347344L8564574l7262033
2738H0920996p4996607m9222195k3844220k8351058j7511833K8554483N6154882
2731b8295552K5162423k5057782l6005070n730013K8938366M2711400K4988912
2724B6712684k6214547q1476293q6597078k6383717M4719732O5984839M0271823
2717d2982557J1857446k87151j0627410k4694664k8593129j9816639j6224132
2710a31368236k6357458l2535334j4490625K2404311N3031410O1243028N3056665
2703a5016239M0945914K5280136R81927k3201857k8994061j4323617L116187J3199219
$$ plain form
2695 1987609 24520352 52356406 62024302 34181329 -8605519 -21686301 -2287184
2688 -2287184 1347691 -41769389 -102213687 -134653220 -133238561 -119528237 -107126312 -105790560
2680 -105790560 -128529425 -161057924 -155695073 -96658498 -42386337 -53189605 -100382653
2673 -100382653 -106276899 -60949264 -32443821 -57594261 -88996378 -72066276 -20679413
2666 -20679413 13809926 8359802 -26175257 -71624210 -104695893 -99125644 -56091217
2659 -56091217 -15894786 -15176970 -44891975 -68275078 -66859332 -51743035 -40002651 -35326847
2651 -35326847 -28341740 -10916864 6995423 2772545 -25010493 -43810437 -32168167
2644 -32168167 -19518117 -43210784 -80586877 -75710418 -29587638 -2964439 -19040592
$$ packed form
2695A987609K2532743K7836054R667896k7842973m2786848j3080782J9399117
2688b287184L634875m3117080o0444298l2439533J414659J3710324J2401925J335752
2680a05790560k2738865l2528499N362851N9036575N4272161j0803268m7193048
2673a00382653n894246M5327635K8505443k5150440l1402117J6930102N1386863
2666b0679413L4489339n450124l4535059m5448953l3071683N570249M3034427
2659e6091217M0196431P17816k9715005k3383103J415746J5116297J1740384M675804
2651c5326847O985107J7424876J7912287m222878k7783038j8799944J1642270
2644c2168167J2650050k3692667l7376093M876459M6122780K6623199j6076153
$$ plain form
2637 -19040592 -26263372 17363184 80322692 109955089 97427409 58079099 1387010
2630 1387010 -40507221 -12854578 78777035 136964594 87673581 -14844851 -65097357
2623 -65097357 -47883678 -25015242 -15315511 15591462 55937390 38596006 -50249878
2616 -50249878 -135880210 -156405523 -130829424 -97856084 -53057144 14420408 76728852
2609 76728852 101909513 96518152 82378297 67023879 61798026 85747237 121643509
2602 121643509 112712757 39678888 -39631418 -66521097 -57300558 -58941092 -68039847 -49130654
2594 -49130654 -5434132 27647358 42116711 53281118 49380907 6686924 -48727683
2587 -48727683 -57678384 -15393455 17257742 8290430 2818830 45458773 104762888 119822754
$$ packed form
2637a9040592p222780M3626556O2959508K9632397j2527680l9348310n6692089
2630A387010m1894231K7652643R1631613N8187559m9291013j02518432n0252506
2623f5097357J7213679K2868436R699731L0906973M0345928j7341384q8845884
2616e0249878q5630332k0525313K5576099L2973340M4798940O7477552O2308444
2609G6728852K5180661n391361j4139855j5354418n225853K3949211L5896272
2602A21643509q930752p3033869p9310306k6889679R220539j640534r098755J8909193
2594d9130654M3696522L3081490J4469353J1164407l900211m2693983n5414607
2587d8727683q950701M2284929L2651197q967312n471600M2639943N9304115J5059866
$$ plain form
2579 119822754 87485250 53506550 37717058 20234266 -3655573 -6500129 21072543
2572 21072543 42690046 20703562 -35998674 -88185072 -111963753 -110041391 -93409069
2565 -93409069 -72784451 -58916462 -53642174 -48197625 -43326764 -56018315 -87606206 -104763086
2557 -104763086 -83347565 -55716278 -72440047 -123139040 -144586951 -112864523 -74657217
2550 -74657217 -70012026 -78886987 -74635409 -76221344 -101641384 -116895775 -89013072 -52280420
2542 -52280420 -56507876 -79131603 -63154708 -23727767 -33600429 -103280206 -158132579
2535 -158132579 -148532236 -106564326 -72645641 -40701965 -6390248 813072 -27938350
2528 -27938350 -55657331 -64248438 -81931128 -111715951 -105761600 -56940551 -37156617
$$ packed form
2579A19822754l2337504l3978700j5789492j7482792k3889839k844556K7572672
2572B1072543K1617503k1986484n6702236n2186398k3778681J922362J6632322
2565i3409069K0624618J3867989N274288N444549M870861j2691551l1587891j7156880
2557a04763086K1415521K7631287j6723769n0698993k1447911L1722428L8207306
2550g4657217M645191q874961M251578j585935k5420040j5254391K7882703L6732652
2542e2280420m227456k2623727J5976895L9426941r872662o9679777n4852373
2535a58132579R600343M1967910L3918685L1943676L4311717P203320k8751422
2528b7938350k7718981q591107j7682690k9784823N954351M8821049J9783934
$$ plain form
2521 -37156617 -84352389 -135370907 -150913899 -215397930 -390197683 -538422248 -458490486
2514 -458490486 -176829766 54006562 75073318 -8384153 -28252324 15353301 19498493
2507 19498493 -30376256 -56538791 -26399418 13581280 24146409 12160156 -7341652
2500 -7341652 -23146295 -10379113 43501147 104236469 130412595 132336507 141786433 144052468
2492 144052468 102530718 37555776 8723109 16859548 -2793552 -71987816 -123580274
2485 -123580274 -96595232 -17945607 51156252 97943154 136477721 146655081 99333171
2478 99333171 20804932 -31211884 -48852697 -70882967 -96562607 -69282057 28371234
2471 28371234 120689180 126291090 63861253 18348007 20676214 19500680 -23597952 -66982136
$$ packed form
2521c7156617m7195772n1018518j5542992o4484031j74799753j48224565P9931762
2514d58490486K81660720K30836328K1066756q3457471j9868171M3605625M145192
2507A9498493m9874749k6162535L0139373L9980698J0565129j1986253j9501808
2500g341652j5804643J2767182N3880260O0735322K6176126J923912R449926K266035
2492A44052468m1521750o4974942k8832667Q136439j9653100o9194264n1592458
2485a23580274K6985042P8649625O9101859M6786902L8534567J0177360m7321910
2478I9333171p8528239n2016816j7640813k2030270k5679640K7280550R7653291
2471B8371234R2317946N601910o2429837m5513246K328207j175534m3098632m3384184
$$ plain form
2463 -66982136 -47258645 30027394 98371862 116621890 108192489 108978581 110845318 81846916
2455 81846916 24936858 -18548543 -28567720 -36822107 -74208129 -112404801 -99224512
2448 -99224512 -45043608 -21137734 -54544118 -77515071 -24319176 62637075 85136746
2441 85136746 27077468 -28523034 -18367978 34320972 82957792 116239249 126088079
2434 126088079 86451546 10473318 -28628636 10631919 71743983 83434420 63769821
2427 63769821 71536735 93398650 68084124 6978967 -2045464 78242203 180475181
2420 180475181 224678875 200551598 142372049 85684447 67735702 106170271 151270879
2413 151270879 121475214 17714120 -57022655 -27673889 61392505 124895375 146292874
$$ packed form
2463f6982136J9723491P7286039O8344468J8250028q429401P86092J866737k8998402
2455H1846916n6910058m3485401j0019177q254387l7386022l8196672J3180289
2448i9224512N4180904K3905874l3406384k2970953N3195895Q6956251K2499671
2441H5136746n8059278n5600502J0155056N2688950M8636820L3281457R848830
2434A26088079l9636533p5978228l9101954L9260555O1112064J1690437j9664599
2427F3769821P766914K1861915k5314526o1105157r024431Q0287667J02232978
2420A80475181M4203694k4127277n8179549n6687602j7948745L8434569M5100608
2413A51270879k9795665j03761094p4736775K9348766Q9066394O3502870K1397499
$$ plain form
2406 146292874 154576551 144111559 87171903 -1296726 -72097260 -98724029 -81832090
2399 -81832090 -23457389 54847386 96864384 71846382 28838303 33442797 69247970
2392 69247970 65296269 8844159 -39115577 -40892085 -24593880 -16495365 2480483 44757235
2384 44757235 76120500 66248595 40427864 40584667 59100050 50406859 -971828 -56276302
2376 -56276302 -70102766 -42941481 -15422698 -14767756 -20559080 3496306 52246562 81744993
2368 81744993 73742325 61413682 71538501 79432094 55532244 22224525 18655735 36748801
2360 36748801 45280839 55846168 103700563 174298772 212148010 199776403 166437408
2353 166437408 121352079 48830570 -24054395 -33020436 25938615 75981759 69108036
$$ packed form
2406A46292874Q283677j0464992n6939656q8468629p0800534k6626769J6891939
2399h1832090N8374701P8304775M2016998k5018002m3008079M604494L5805173
2392F9247970l951701n6452110m7959736j776508J6298205Q098515J8975848M2276752
2384D4757235L1363265r871905k5820731J56803J8515383q693191n1378687n5304474
2376e6276302j3826464K7161285K7518783O54942n791324K4055386M8750256K9498431
2368H1744993q002668j2328643J0124819P893593k3899850l3307719l568790J8093066
2360C6748801Q532038J0565329M7854395P0598209L7849238j2371607l3338995
2353A66437408m5085329p2521509p2884965q966041N8959051N0043144o873723
$$ plain form
2346 69108036 49312593 66138702 91278177 76479030 40674120 35423268 59973888
2339 59973888 72252342 59879708 44839798 35343251 21920782 6880073 -3798375
2332 -3798375 -21111835 -48327357 -58421409 -36076749 -16301648 -35818185 -71394042
2325 -71394042 -76911907 -57708439 -51976843 -59982592 -55386877 -50748186 -79710206 -118912131
2317 -118912131 -104202463 -34760287 12299584 -7354965 -48038390 -57578233 -54537107
2310 -54537107 -80353006 -126463587 -156634767 -162936235 -154170274 -122366396 -67684017
2303 -67684017 -28109428 -33385837 -48545304 -15326357 59526482 108542948 97360248
2296 97360248 66738393 68338732 98295779 117118515 108623270 91436681 82694732 74743906
$$ packed form
2346F9108036j9795443J6826109K5139475j4799147l5804910n250852K4550620
2339E9973888J2278454j2372634j5039910r496547j3422469j5040709j0678448
2332c798375j7313460k7215522j0094052K2344660J9775101j9516537l5575857
2325g1394042n517865J9203468N731596q005749M595715M638691k8962020l9201925
2317a18912131J4709668O9442176M7059871j9654549m0683425r539843L041126
2310e4537107k5815899m6110581l0171180o301468Q765961L1803878N4682379
2303f7684017L9574589n276409j5159467L3218947P4852839M9016466j1182700
2296I7360248l0621855J600339K9957047J8822736q495245j7186589q741949p950826
$$ plain form
2288 74743906 51515953 14978124 -13793966 -17959132 -1558315 20099657 36872804
2281 36872804 40181918 14733698 -41194961 -89003985 -76848939 -8198698 46539011
2274 46539011 31759555 -24545751 -55237560 -45099667 -32913825 -33277925 -12542768
2267 -12542768 44427978 95617869 102311208 89300462 101561840 126637314 112654857
2260 112654857 55817772 14467532 23375914 42664396 20309838 -31220497 -58270106
2253 -58270106 -42382445 -12454629 7321265 19848974 27426285 21918898 9348829
2246 9348829 8534455 15071130 1692668 -31367368 -42945689 -9691965 36804443 60681245
2238 60681245 75438887 105959854 123807067 74533215 -36274477 -133440770 -156229707
$$ packed form
2288G4743906k3227953l6537829k8772090m165166J6400817K1657972J6773147
2281C6872804L309114k5448220n5928659m7809024J2155046O8650241N4737709
2274D6539011j4779456n6305306l0691809J0137893J2185842l64100K0735157
2267a2542768N6970746N1189891O693339j3010746J2261378K5075474j3982457
2260A12654857n6837085m1350240Q908382J9288482k2354558n1530335k7049609
2253e8270106J5887661K9927816J9775894J2527709P577311n507387j2570069
2246I348829q14374O536675j3378462l3060036j1578321L3253724M6496408K3876802
2238F0681245J4757642L0520967J7847213m9273852j10807692r7166293k2788937
$$ plain form
2231 -156229707 -116260627 -66699595 -47438325 -65577183 -95794272 -92359837 -33370890
2224 -33370890 39770817 60736468 22211857 -18516463 -27621078 -38822437 -84609169
2217 -84609169 -132655814 -132759845 -90300050 -45311908 -6650956 40430252 81249286
2210 81249286 85322921 66513259 70583395 97466615 93241273 36549258 -20785889 -29527893
2202 -29527893 -14891579 -32422140 -83038075 -117435070 -109856902 -84139760 -68643437
2195 -68643437 -61892627 -49394351 -27353872 -556691 24150578 35038682 22135805
2188 22135805 -7062060 -32470313 -46987747 -62889645 -87070471 -105533977 -102451280
2181 -102451280 -81610722 -56536588 -29732998 2611898 30372700 31271291 -2861094
$$ packed form
2231a56229707L9969080M9561032J9261270j8138858l0217089L434435N8988947
2224c3370890P3141707K0965651l8524611m0728320r104615j1201359m5786732
2217h4609169m8046645j04031M2459795M4988142L8660952M7081208M0819034
2210H1249286M073635j8809662M070136K6883220m225342n6692015n7335147q742004
2202b9527893J4636314j7530561n0615935l4396995P578168K5717142J5496323
2195f8643437O750810J2498276K2040479K6797181K4707269J0888104j2902877
2188B2135805k9197865k5408253j4517434j5901898k4180826j8463506L082697
2181a02451280K0840558K5074134K6803590L2344896K7760802Q98591l4132385
$$ plain form
2174 -2861094 -51847571 -85590825 -92679502 -85433066 -77402248 -62533100 -24577325 32802120
2166 32802120 77663771 81754673 52347904 18798361 -2908138 -11548379 2194397
2159 2194397 43287965 76469554 50197213 -23725646 -61897135 -17081575 49532565
2152 49532565 55946658 21053441 26839852 80721208 102446096 52778676 -11020476
2145 -11020476 -32153089 -25925101 -18152545 8885515 56734566 70702304 27261900
2138 27261900 -2425849 43852194 106347886 85785235 -2744247 -60348910 -61523685
2131 -61523685 -69221450 -101962533 -104649607 -67530276 -58862067 -101535669 -121643632 -71841339
2123 -71841339 -12934913 -10848999 -34992954 -28831343 -8526608 -14343100 -26522669 -12314994
$$ packed form
2174b861094m8986477l3743254p088677P246436Q030818J4869148L7955775N7379445
2166C2802120M4861651M090902k9406769l3549543k1706499q640241J3742776
2159B194397M1093568L3181589k6272341p3922859l8171489M4815560O6614140
2152D9532565O414093l4893217N786411N3881356K1724888m9667420o3799152
2145a1020476k1132613O227988P772556K7038060M7849051J3967738m3440404
2138B7261900k9687749M6278043O2495692k0562651q8529482n7604663j174775
2131f1523685p697765l2741083k687074L7119331Q668209m2673602k0107963M9802293
2123g1841339N8906426K085914k4143955O161611K0304735n816492j2179569J4207675
$$ plain form
2115 -12314994 -5144706 -50064659 -109607409 -110530780 -55155075 -3665006 27210916 62313815
2107 62313815 88787790 71698131 35941947 37330578 55702971 16015272 -75694198
2100 -75694198 -120340948 -76441013 -24903382 -40608880 -87988153 -100774637 -88293212
2093 -88293212 -93278915 -104517958 -87908841 -63580255 -75991995 -110517412 -110454049 -67879664
2085 -67879664 -34948843 -43336654 -66419193 -72228904 -69943668 -83641576 -108074174 -114079353
2077 -114079353 -88505728 -51656420 -31862053 -31881887 -34014883 -37651725 -64777237 -110998027
2069 -110998027 -125166182 -79833032 -33480351 -57732498 -116400412 -100652965 4776551
2062 4776551 82611476 49022124 -28591598 -41687966 8246900 49471996 68188004
$$ packed form
2115a2314994P170288m4919953n9542750r23371N5375705N1490069L0875922L5102899
2107F2313815K6473975j7089659l5756184J388631J8372393l9687699r1709470
2100g5694198m4646750M3899935N1537631j5705498m7379273j2786484J2481425
2093h8293212m985703j1239043J6609117K4328586j2411740l4525417O3363M2574385
2085f7879664L2930821q387811k3082539n809711K285236j3697908k4432598o005179
2077a14079353K5573625L6849308J9794367j9834k132996l636842k7125512m6220790
2069a10998027j4168155M5333150M6352681k4252147n8667914J5747447J05429516
2062D776551P7834925l3589352p7613722j3096368M9934866M1225096J8716008
$$ plain form
2055 68188004 98562048 125093063 101762749 53183689 53322813 100977221 112357627
2048 112357627 50498687 -28170183 -73819229 -96916197 -95494415 -30277697 74971001
2041 74971001 103320874 -4634801 -139827386 -154836915 -56674957 24508088 26404370
2034 26404370 8875966 20831548 18367693 -47764481 -138045987 -169288494 -114794908
2027 -114794908 -20443245 53297017 76209790 56669967 30664052 29185467 43338873
2020 43338873 39723344 17063110 16037069 55788110 95339343 89217387 54438674 42788444
2012 42788444 62428195 69498171 33717203 -26740082 -78826130 -107944327 -111428490
2005 -111428490 -93077519 -75876388 -88252366 -121557791 -129869918 -89712425 -31333617
$$ packed form
2055F8188004L0374044K6531015k3330314m8579060J39124M7654408J1380406
2048A12357627o1858940p8668870m5649046k3096968J421782O5216718J05248698
2041G4971001K8349873j07955675j35192585j5009529R8161958Q1183045J896282
2034B6404370j7528404J1955582k463855o6132174r0281506l1242507N4493586
2027a14794908R4351663P3740262K2912773j9539823k6005915j478585J4153406
2020D3338873l615529k2660234j026041L9751041L9551233o121956l4778713j1650230
2012D2788444J9639751P069976l5780968o0457285n2086048k9118197l484163
2005a11428490J8350971J7201131j2375978l3305425q312127M0157493N8378808
$$ plain form
1998 -31333617 9073559 35069302 59175577 61685890 25145740 -15949260 -15622712 6903536
1990 6903536 -6465446 -50262607 -49781059 20863228 83055279 60377916 -12490804 -46178534
1982 -46178534 -26006389 -16875249 -51962638 -85050376 -66536899 -14143785 19095693
1975 19095693 16613161 11836658 43034763 110237508 171577821 178562765 121830867 40601074
1967 40601074 -18867169 -43491033 -42158821 -15633374 34100383 76867941 73212681
1960 73212681 24338936 -22217468 -21066743 33225138 109630129 160171572 147894592
1953 147894592 85730378 37383275 45466679 71387843 49853153 -10169415 -37852756
1946 -37852756 -10564079 19241029 19803420 25112162 52270675 53777459 8612261 -11011673
$$ packed form
1998c1333617M0407176K5995743K4106275K510313l6540150m1095000L26548K2526248
1990F903536j3368982m3797161M81548P0644287O2192051k2677363p2868720l3687730
1982d6178534K0172145R131140l5087389l3087738J8513477N2393114L3239478
1975A9095693k482532m776503L1198105O7202745O1340313O984944n6731898q1229793
1967D0601074n9468243k4623864J332212K6525447M9733757M2767558l655260
1960G3212681m8873745m6556404J150725N4291881P6404991N0541443j2276980
1953A47894592o2164214m8347103Q083404K5921164k1534690o0022568k7683341
1946c7852756K7288677K9805108N62391N308742K7158513J506784m5165198j9623934
$$ plain form
1938 -11011673 56408649 143771053 135414915 35647331 -41173679 -39329293 -18982014
1931 -18982014 -32782310 -47172640 -27725877 -15667899 -55842821 -109909526 -111024218
1924 -111024218 -64926402 -28390464 -13285551 19272130 80237925 133332093 156588605
1917 156588605 164988111 161665284 122860583 54867108 16694893 48149967 107834518
1910 107834518 124218064 89057242 57160203 61211219 72476684 55692345 23244529
1903 23244529 9448593 16498083 18816311 11015901 17479070 49255214 80013218 81362500
1895 81362500 64043872 62999731 89549648 119508009 128432315 118170941 99973300
1888 99973300 67868065 7405285 -72936095 -138748212 -167042209 -173076761 -183087531
$$ packed form
1938a1011673O7420322Q7362404q356138r9767584p6821010J844386K0347279
1931a8982014j3800296j4390330J9446763J2057978m0174922n4066705j114692
1924a11024218M6097816L6535938J5104913L2557681O0965795N3094168K3256512
1917A56588605Q399506l322827l8804701o7993475l8172215L1455074N9684551
1910A07834518J6383546l5160822l1897039M051016J1265465j6784339l2447816
1903B3244529j3795936P049490K318228p800410O463169L1776144L0758004J349282
1895H1362500j7318628j044141K6549917K9958361Q924306j0261374j8197641
1888I9973300l2105235o0462780q0341380o5812117k8293997o034552j0010770
$$ plain form
1881 -183087531 -187541400 -148479209 -61352384 19817254 46047915 42710642 75972741
1874 75972741 155248766 215190759 207078427 162665754 137628049 129193900 94319831
1867 94319831 28620217 -21422935 -20976640 19172250 72032326 120275438 147504480
1860 147504480 139160217 104375515 71647224 55956669 54146075 71838928 118798550
1853 118798550 170918112 177445948 123885632 52761754 3105079 -33388586 -71795380
1846 -71795380 -91423430 -74029288 -52659129 -72991706 -122997477 -149465907 -136531443
1839 -136531443 -120144158 -123616544 -124882786 -100439705 -64773843 -46231636 -46613310 -42381361
1831 -42381361 -15356138 24241418 37939142 -10081510 -105030314 -176526260 -170521475
$$ packed form
1881a83087531m453869L9062191Q7126825Q1169638K6230661l337273L3262099
1874G5972741P9276025N9941993q112332m4412673k5037705q434149l4874069
1867I4319831o5699614n0043152M46295M0148890N2860076M8243112K7229042
1860A47504480q344263l4784702l2728291j5690555j810594J7692853M6959622
1853A18798550N2119562O527836n3560316p1123878m9656675l6493665l8406794
1846g1795380j9628050J7394142K1370159k0332577n0005771k6468430J2934464
1839a36531443J6387285l472386j266242K4443081L5665862J8542207l81674M231949
1831d2381361K7025223L9597556J3697724m8020652r4948804p1495946O004785
$$ plain form
1824 -170521475 -118331620 -97474462 -125743540 -138824450 -85341846 -848267 39365045
1817 39365045 10991705 -43870228 -71656848 -53260813 -10021530 16724288 3831311
1810 3831311 -25606773 -29188100 -3316642 16286737 17956387 30587143 54306662 30929554
1802 30929554 -66477428 -160709040 -157462054 -79780957 -37843749 -72136131 -109266264
1795 -109266264 -86448915 -36732486 -13878676 -6026911 18539259 35011887 2377725
1788 2377725 -50817925 -53178193 5797249 61632922 67171896 43321250 27443755 22767033
1780 22767033 20169586 27660608 49902241 69319613 75733106 89287374 123232914 144390129
1772 144390129 108115003 26042101 -36106752 -33309202 13323361 55453945 78057984
$$ packed form
1824a70521475N2189855K0857158k8269078j3080910N3482604Q4493579M0213312
1817C9365045k8373340n4861933k7786620J8396035M3239283K6745818j2892977
1810C831311k9438084l581327K5871458J9603379J669650J2630756K3719519k3377108
1802C0929554r7406982r4231612L246986P7681097M1937208l4292382l7130133
1795a09266264K2817349M9716429K2853810P851765K4566170J6472628l2634162
1788B377725n3195650k360268N8975442N5835673N538974k3850646j5877495m676722
1780B2767033k597447P491022K2241633J9417372O413493J3554268L3945540K1157215
1772A44390129l6275126q2072902o2148853K797550M6632563M2130584K2604039
$$ plain form
1765 78057984 101220790 132824556 144629974 105695236 29180958 -31106564 -37583494
1758 -37583494 -12062880 -7515417 -39933956 -69291204 -56575031 -17725341 2003812
1751 2003812 -6061074 -7040787 16456172 32485775 11277343 -17493475 3400138 75218525
1743 75218525 131794358 126089443 94169389 99172830 129215483 98791863 -35466946
1736 -35466946 -198783686 -271065514 -218535002 -117264817 -51307550 -28706116 -11190923
1729 -11190923 12790785 21004571 5397407 -12341632 -14271221 -5848170 2493261 7477153
1721 7477153 1116627 -24436808 -48102118 -26968546 44020773 106157359 105173009 67342601
1713 67342601 64619027 110311373 140106419 109542526 60254560 54013599 76985914
$$ packed form
1765G8057984K3162806L1603766J1805418l8934738p6514278o0287522o476930
1758c7583494K5520614M547463l2418539k9357248J2716173L8849690J9729153
1751B003812q064886r79713K3496959J6029603k1208432k8770818K0893613P1818387
1743G5218525N6575833n704915l1920054N003441L0042653l0423620j34258809
1736c5466946j63316740p2281828N2530512J01270185O5957267K2601434J7515193
1729a1190923K3981708Q213786j5607164j7739039j929589Q423051Q341431M983892
1721G477153o360526k5553435k3665310K1133572P0989319O2136586r84350l7830408
1713F7342601k723574M5692346K9795046l0563893m9287966o240961K2972315
$$ plain form
1706 76985914 61467787 -7980076 -62955192 -39806039 37728462 89969807 75628521
1699 75628521 29213486 11114468 41687515 88611565 108038833 89931056 61138666
1692 61138666 47854772 49166191 59319928 98539469 183832322 264310799 234424314
1685 234424314 54210323 -168117267 -268790117 -205531554 -92544067 -47003837 -58266142
1678 -58266142 -49261571 -15863000 -27659135 -100808555 -153887136 -122149663 -52814340
1671 -52814340 -32336603 -58230345 -50836448 19136185 84469878 79356478 27532262
1664 27532262 -147252 23490437 72527276 120942181 159450991 173400012 150676651
1657 150676651 111917591 91951522 85993252 55947961 3312688 -9512570 57379509
$$ packed form
1706G6985914j5518127o9447863n4975116K3149153P7534501N2241345j4341286
1699G5628521m6415035j8099018L0573047M6924050J9427268j8107777k8792390
1692F1138666j3283894J311419J0153737L9219541Q5292853Q0478477k9886485
1685B34424314j80213991k22327590j00672850O3258563J12987487M5540230j1262305
1678e8266142R004571L3398571j1796135p3149420n3078581L1737473O9335323
1671e2814340K0477737k5893742P393897O9972633O5333693n113400n1824216
1664B7532262k7679514K3637689M9036839M8414905L8508810J3949021k2723361
1657A50676651l8759060j9966069n958270l0045291n2635273j2825258O6892079
$$ plain form
1650 57379509 151335099 184878911 144783132 94234075 71149536 40627181 -31117220
1643 -31117220 -103845610 -108286154 -41410380 30399939 60928118 73520600 108037444
1636 108037444 155634166 175788529 157078610 126211902 101114460 67756551 12476624
1629 12476624 -46915594 -77814135 -66819065 -24477899 31097005 80073489 100764186
1622 100764186 84417719 50526082 32092341 41165192 56793844 48222155 4039729
1615 4039729 -59058576 -108265852 -118022860 -90554848 -51686474 -20731819 6789820
1608 6789820 35932103 46232545 14266379 -41969143 -71623643 -52279326 -17567445
1601 -17567445 -11285298 -36740988 -67897447 -89475104 -103168028 -109014382 -106680138 -108678565
$$ packed form
1650E7379509R3955590L3543812m0095779n0549057k3084539l0522355p1744401
1643c1117220p2728390m440544O6875774P1810319L0528179J2592482L4516844
1636A08037444M7596722K0154363j8709919l0866708k5097442l3357909n5279927
1629A2476624n9392218l0898541J0995070M2341166N5574904M8976484K0690697
1622A00764186j6346467l3891637j8433741R072851J5628652q571689m4182426
1615D039729o3098305m9207276r757008K7468012L8868374L0954655K7521639
1608F789820K9142283J0300442l1966166n6235522k9654500J9344317L4711881
1601a7567445O282147k5455690l1156459k1577657j3692924n846354K334244j998427
$$ plain form
1593 -108678565 -128002335 -152645030 -151810891 -111130845 -50327123 -5874503 -3559390
1586 -3559390 -40404959 -80979393 -80571013 -30588085 23728143 29634003 -11867631 -49333976
1578 -49333976 -41392133 7851188 70091477 119455135 132342277 94080113 27103085
1571 27103085 -10146404 19359656 82444940 106798085 59867833 -18810834 -63386861
1564 -63386861 -46747991 215838 22880432 -5732665 -60188961 -87758394 -62470112
1557 -62470112 -11312681 18771643 12765722 -6674605 -20796266 -39077360 -70742957
1550 -70742957 -91721284 -68017633 -11348549 17729952 -20078499 -87815443 -113012239
1543 -113012239 -75515679 -24062568 -2157533 7889995 46123533 106956481 143757155
$$ packed form
1593a08678565j9323770k4642695Q34139M0680046O0803722M4452620K315113
1586c559390l6845569m0574434M08380M9982928N4316228N905860m1501634l7466345
1578d9333976P941843M9243321O2240289M9363658J2887142l8262164o6977028
1571B7103085l7249489K9506060O3085284K4353145m6930252p8678667m4576027
1564f3386861J6638870M6963829K2664594k8613097n4456296k7569433K5288282
1557f2470112N1157431L0084324o005921j9440327j4121661j8281094l1665597
1550g0742957k0978327K3703651N6669084K9078501l7808451o7736944k5196796
1543a13012239L7496560N1453111K1905035J0047528L8233538O0832948L6800674
$$ plain form
1536 143757155 131376064 91275268 54195163 27910756 9833369 4856226 14497486
1529 14497486 25376561 25081799 19410473 20337195 24912479 19168511 -2266155 -32280647
1521 -32280647 -63062632 -89172370 -99619310 -81267915 -38389023 -310767 4837006
1514 4837006 -13995643 -15209558 24303488 73876589 84154992 51247685 18858959
1507 18858959 14243235 15319975 -3155646 -24207722 -18744306 3863487 10444082 -7680233
1499 -7680233 -36146034 -70839094 -109006607 -120956166 -80170556 -17955549 3293304
1492 3293304 -24192121 -44707190 -23972817 10010688 25437397 30569824 35243040 23001964
1484 23001964 -4728541 -6465285 36593962 78635787 73208194 40257882 25129287
$$ packed form
1536A43757155j2381091m0100796l7080105k6284407j8077387m977143R641260
1529A4497486J0879075k94762n671326R26722M575284n743968k1434666l0014492
1521c2280647l0781985k6109738j0446940J8351395M2878892L8078256N147773
1514D837006j8832649j213915L9513046M9573101J0278403l2907307l2388726
1507A8858959m615724J076740j8475621k1052076N463416K2607793O580595j8124315
1499g680233k8465801l4693060l8167513j1949559M0785610O2215007K1248853
1492C293304k7485425k0515069K0734373L3983505J5426709N132427M673216j2241076
1484B3001964k7730505j736744M3059247M2041825n427593l2950312j5128595
$$ plain form
1477 25129287 29921026 35229080 51225028 87771110 106410704 68910952 10809742
1470 10809742 -1311046 32069352 58835407 72683143 112074996 163825992 158775863
1463 158775863 85608457 26409384 41189705 86159763 90821099 55886335 23529752
1456 23529752 858298 -28765409 -53805572 -52976674 -45072747 -67390879 -114019144 -139620701
1448 -139620701 -120982728 -80247557 -49217047 -37519195 -33234082 -14491328 33953084
1441 33953084 99683371 147436184 157286631 142897588 120405631 83029738 25966350
1434 25966350 -27396475 -50194658 -46592820 -40306189 -45652913 -66475944 -98642858 -113447549
1426 -113447549 -69933281 26927854 109964464 124153860 86470166 37275743 -25643328
$$ packed form
1477B5129287M791739N308054J5995948L6546082J8639594l7499752n8101210
1470A0809742j2120788L3380398K6766055J3847736L9391853N1750996n050129
1463A58775863p3167406n9199073J4780321M4970058M661336l4934764l2356583
1456B3529752k2671454k9623707k5040163Q28898P903927k2318132m6628265k5601557
1448a39620701J8637973M0735171L1030510J1697852M285113J8742754M8444412
1441C3953084O5730287M7752813R850447j4389043k2491957l7375893n7063388
1434B5966350n3362825k2798183L601838O286631n346724k0823031l2166914j4804691
1426a13447549M3514268R6861135Q3036610J4189396l7683694m9194423o2919071
$$ plain form
1419 -25643328 -109720013 -163557244 -128981652 -41799769 1338555 -22128243 -40435126
1412 -40435126 -13581458 10108596 -1614535 7209622 82976878 161188191 148168487
1405 148168487 64205890 14476129 31519590 38147341 -18606558 -78536123 -55473730
1398 -55473730 40686776 120056822 123454924 72323099 20190873 -7560336 -24446860
1391 -24446860 -57936328 -116984893 -172795212 -179398924 -127948384 -67849494 -50648724
1384 -50648724 -64163732 -55883064 -18161736 -5220808 -48496305 -97775970 -84624301
1377 -84624301 -18490354 26447437 11247128 -26462704 -33697761 -842723 53518292
1370 53518292 113873126 157347253 146016504 67638166 -31922313 -90503673 -95631307
$$ packed form
1419b5643328q4076685n3837231L4575592Q7181883M3138324k3466798j8306883
1412d0435126K6853668K3690054j1723131Q824157P5767256P8211313j3019704
1405A48168487q3962597m9729761J7043461O627751n6753899n9929565K3062393
1398e5473730R6160506P9370046L398102n1131825n2132226k7751209j6886524
1391b4446860l3489468n9048565n5810319o603712N1450540O0098890J7200770
1384e0648724j3515008Q280668L7721328J2940928m3275497m9279665J3151669
1377h4624301O6133947M4937791j5200309l7709832p235057L2855038N4361015
1370E3518292O0354834M3474127j1330749p8378338r9560479n8581360n127634
$$ plain form
1363 -95631307 -81298440 -70314771 -56186783 -41244000 -51892734 -96724961 -136191916
1356 -136191916 -121924370 -58787604 -4971767 -5361859 -38038127 -38598401 24483780 112043132
1348 112043132 160211040 152228239 123250276 97583930 54585449 -25477598 -108922723
1341 -108922723 -134726588 -84524723 656645 69254303 99372797 93729586 65109559
1334 65109559 35114020 24281534 31682071 38361391 36331318 37581817 48729221 55990649
1326 55990649 46536020 29179336 20807968 24356264 33596437 49261483 73656230 93447753
1318 93447753 84442132 37516453 -29151064 -87103751 -119757663 -123675124 -97516615
1311 -97516615 -45163544 8797810 26203654 -4485043 -45393055 -49996511 -22532942
$$ packed form
1363i5631307J4332867J0983669J4127988J4942783j0648734m4832227l9466955
1356a36191916J4267546O3136766N3815837l90092l2676268n60274O3082181Q7559352
1348A12043132M8167908p982801k8977963k5666346m2998481q0063047q3445125
1341a08922723k5803865N0201865Q5181368O8597658L0118494n643211k8620027
1334F5109559k9995539j0832486P400537O679320k030073J250499J1147404P261428
1326E5990649r454629j7356684q371368L548296R240173J5665046K4394747J9791523
1318I3447753r005621m6925679o6667517n7952687l2653912l917461K6158509
1311i7516615N2353071N3961354J7405844l0688697m0908012m603456K7463569
$$ plain form
1304 -22532942 -7830880 -20462683 -23247686 5936394 27243980 -2999310 -56940831
1297 -56940831 -68607463 -29552736 2590991 -6804554 -22612872 3425592 72151608
1290 72151608 151692823 213616137 231032262 178325859 67674650 -38668164 -87115651
1283 -87115651 -87633574 -80307253 -66804577 -16690453 64555399 120135303 110442732 66253420
1275 66253420 49363901 74338870 93551907 60779843 -8245097 -51752982 -34520494
1268 -34520494 10801206 24667448 -6560268 -36344069 -16100851 50696516 118516986
1261 118516986 146849636 126662828 75644628 25219229 5717408 26417988 66768255
1254 66768255 93825511 87122456 43559714 -30675512 -117071037 -177402122 -171718808
$$ packed form
1304b2532942J4702062j2631803k785003K9184080K1307586l0243290n3941521
1297e6940831j1666632L9054727L2143727r395545j5808318K6038464O8726016
1290G2151608P9541215O1923314J7416125n2706403j10651209j06342814m8447487
1283h7115651n17923P326321J3502676N0114124Q1245852N5579904r692571m4189312
1275F6253420j6889519K4974969J9213037l2772064o9024940m3507885J7232488
1268c4520494M5321700J3866242l1227716k9783801K0243218O6797367O7820470
1261A18516986K8332650k0186808n1018200n0425399j9501821K0700580M0350267
1254F6768255K7057256o703055m3562742p4235226q6395525o0331085N683314
$$ plain form
1247 -171718808 -98736607 -10785356 28746147 7582569 -27448144 -31903926 -17964003
1240 -17964003 -26433054 -54777335 -50779823 9745081 75539831 81952331 36656662 3653892
1232 3653892 14151576 38345179 46571867 52277565 77078953 109016102 120353964 105003688
1224 105003688 78016858 55294690 50249377 72612934 111941937 135983203 122730929
1217 122730929 84389738 47694369 23632652 9881532 8638358 22111765 35408459
1210 35408459 21234514 -33151754 -106824973 -155716478 -149465614 -102769954 -59318060
1203 -59318060 -37597174 -15370492 13350444 1807344 -79262282 -159455583 -132528897
1196 -132528897 -8695717 75779650 34353073 -55667657 -69159589 -5506873 29324966
$$ packed form
1247a71718808P2982201Q7951251L9531503k1163578l5030713m455782J3939923
1240a7964003q469051k8344281L997512O0524904O5794750O412500m5295669l3002770
1232C653892J0497684K4193603Q226688N705698K4801388L1937149J1337862j5350276
1224A05003688k6986830k2722168n045313K2363557L9329003K4041266j3252274
1217A22730929l8341191l6695369k4061717j3751120j243174J3473407J3296694
1210C5408459j4173945n4386268p3673219m8891505O250864M6695660M3451894
1203e9318060K1720886K2226682K8720936j1543100q1069626q0193301K6926686
1196a32528897J23833180Q4475367m1426577r0020730j3491932O3652716L4831839
$$ plain form
1189 29324966 -18205932 -87549410 -100507202 -54338539 -1894129 16764989 786985
1182 786985 -29439837 -58241963 -86074623 -114524188 -122561597 -80986490 -1335802 58428258
1174 58428258 58130821 18641526 -19618589 -46292956 -60883505 -46694627 -12191186
1167 -12191186 -18864365 -102903869 -193295630 -181538775 -68257736 29852553 27848531
1160 27848531 -36206785 -74649582 -56460491 -11069344 29656397 57022542 73395489
1153 73395489 77666044 56865827 -4661193 -91037780 -144959658 -125848688 -66818749
1146 -66818749 -33701541 -37477104 -34841953 -7885091 14988797 20932855 34737189 64235782
1138 64235782 79980305 70305656 64253260 74268860 65358774 13044562 -48665982 -69718806
$$ packed form
1189B9324966m7530898o9343478j2957792M6168663N2444410J8659118j5978004
1182G86985l0226822k8802126k7832660k8449565q037409M1575107P9650688N9764060
1174E8428258k97437l9489295l8260115k6674367j4590549J4188878L4503441
1167a2191186o673179q4039504r0391761J1756855J13281039R8110289k004022
1160B7848531o4055316l8442797J8189091M5391147M0725741K7366145J6372947
1153G3395489M270555k0800217o1527020q6376587n3921878J9110970N9029939
1146f6818749L3117208l775563K635151K6956862K2873888N944058J3804334K9498593
1138F4235782J5744523r674649o052396J0015600q910086n2314212o1710544k1052824
$$ plain form
1130 -69718806 -43283111 2551359 42041812 59267793 48332849 25568501 16042873
1123 16042873 19959108 23737691 40886798 91108385 138855121 121548793 54330816
1116 54330816 29544767 78718796 113811795 58447936 -34344442 -64736978 -29118405
1109 -29118405 -2335860 -16848841 -39232026 -44941796 -44201603 -43046422 -36130582 -29939504
1101 -29939504 -29476549 -19426334 3577145 11128957 -2764580 8566074 65381492 101222435
1093 101222435 55107129 -19477821 -25852677 28005789 50261813 13737621 -19941984
1086 -19941984 -17807818 -10199496 -1372785 46237142 116785182 134764856 87455810 53944269
1078 53944269 70385081 66380344 -7423571 -82874481 -78970519 -23626863 9150534
$$ packed form
1130f9718806K6435695M5834470L9490453J7225981j0934944k2764348r525628
1123A6042873L916235L778583J7149107N0221587M7746736j7306328o7217977
1116E4330816k4786049M9174029L5092999n5363859r2792378l0392536L5618573
1109b9118405K6782545j4512981k2383185n709770P40193J155181O915840O191078
1101b9939504M62955J0050215K3003479P551812j3893537J1330654N6815418L5840943
1093A01222435m6115306p4584950o374856N3858466K2256024l6524192l3679605
1086a9941984K134166P608322Q826711M7609927P0548040J7979674m7309046l3511541
1078E3944269J6440812m004737p3803915p5450910L903962N5343656L2777397
$$ plain form
1071 9150534 14809853 23561309 9633189 -63863075 -145806286 -144578661 -61260762 14003053
1063 14003053 33268223 33940076 47888207 50890437 23211315 -8036547 -14686703 -3631354
1055 -3631354 15044110 47631104 82648441 85184033 53480246 37658729 66439192
1048 66439192 90288120 40891124 -71367466 -160263683 -159450244 -84258131 1325323
1041 1325323 50741311 60018994 49898049 42144263 48067928 64353245 74978135 65413021
1033 65413021 41032285 24060819 23632932 19273296 -7051844 -29708610 -2285697 69436091
1025 69436091 111149995 63595530 -38944963 -106201513 -96967300 -52909764 -30554124
1018 -30554124 -36301221 -41618347 -34453415 -31021217 -45145233 -65315187 -66485491 -38826809
$$ packed form
1071I150534N659319Q751456j3928120p3496264q1943211J227625Q3317899P5263815
1063A4003053J9265170O71853J3948131L002230k7679122l1247862o650156J1055349
1055c631354J8675464L2586994L5017337K535592l1703787j5821517K8780463
1048F6439192K3848928m9396996j12258590q8896217Q13439P5192113Q5583454
1041A325323M9415988R277683j0120945p753786N923665J6285317J0624890r565114
1033F5413021k4380736j6971466m27887m359636k6325140k2656766K7422913P1721788
1025F9436091M1713904m7554465j02540493o7256550R234213M4057536K2355640
1018c0554124n747097n317126P164932L432198j4124016k0169954j170304K7658682
$$ plain form
1010 -38826809 -1165267 15494844 -1828126 -35595076 -53744226 -34388896 19536442
1003 19536442 76466592 88874765 32186501 -58381471 -109095470 -82814199 -19534507
996 -19534507 14457273 3548890 -12738764 -1084497 27555511 41211771 25275933
989 25275933 -8142201 -34400983 -35497178 -15275707 2918723 1085026 -13513491 -20158425
981 -20158425 -9794007 10252086 27535829 30305811 14084996 -4911695 1265406 32339467
973 32339467 48592435 27280031 10467496 53396893 132542155 157569784 87990927
966 87990927 -9654309 -48485716 -26739049 -8750254 -27943710 -57539295 -71428994
959 -71428994 -85216490 -119251265 -153554253 -148578658 -99349962 -43279120 -13422740
$$ packed form
1010c8826809L7661542J6660111j7322970l3766950j8149150J9355330N3925338
1003A9536442N6930150J2408173n6688264r0567972n0713999K6281271O3279692
996a9534507L3991780j0908383j6287654J1654267K8640008J3656260j5935838
989B5275933l3418134k6258782j096195K0221471J8194430j833697j4598517o644934
981b0158425J0364418K0046093J7283743K769982j6220815j8996691O177101L1074061
973C2339467J6252968k1312404j6812535M2929397P9145262K5027629o9578857
966H7990927r7645236l8831407K1746667J7988795j9193456k9595585j3889699
959g1428994j3787496l4034775l4302988M975595M9228696N6070842K9856380
$$ plain form
952 -13422740 -4886054 3471750 11859538 4529791 -15225270 -21866913 -7837173 -4486721
944 -4486721 -43441933 -109175178 -151705294 -143734002 -107823589 -86324505 -97926841 -126309248
936 -126309248 -143235939 -140583280 -138614962 -153926325 -162531692 -121170968 -36045744 23351628
928 23351628 8495308 -39049619 -45201314 -7513008 14067126 -228925 -4747165 24213771
920 24213771 45863022 31435285 20235529 49594512 79661441 53002558 -2692920
913 -2692920 -4838575 59868617 113069291 99400157 61614136 70210649 122611802 153920275
905 153920275 125809473 64718547 15750284 -9011846 -26535912 -47994998 -67352190
898 -67352190 -80583767 -95001042 -107243691 -89090453 -23115053 52503910 73259931
$$ packed form
952a3422740Q536686Q357804Q387788p329747j9755061o641643J4029740L350452
944d486721l8955212o5733245m2530116P971292L5910413K1499084j1602336k8382407
936a26309248j6926691K652659J968318j5311363q605367M1360724Q5125224N9397372
928B3351628j4856320m7544927o151695L7688306K1580134j4296051m518240K8960936
920B4213771K1649251j4427737j1199756K9358983L0066929k6658883n5695478
913b692920k145655O4707192N3200674j3669134l7786021Q596513N2401153L1308473
905A53920275k8110802o1090926m8968263k4762130j7524066k1459086j9357192
898f7352190j3231577j4417275j2242649J8153238O5975400P5618963K0756021
$$ plain form
891 73259931 35645666 15855485 69890694 147150890 150076800 62605664 -33576578
884 -33576578 -68117972 -52172566 -26492238 7226613 68517327 145329023 199071697
877 199071697 209620930 186071112 141422620 83272679 27292345 -3773464 -2300699
870 -2300699 13701347 19825446 14610543 25653031 77573530 150372468 185957053 152949305
862 152949305 89504257 54152966 47547881 24011127 -24240822 -49011877 -26722518
855 -26722518 -1617827 -15669438 -43796524 -44254178 -32163923 -43844666 -56347970 -13174004
847 -13174004 75753622 127796470 93305287 11855471 -53342475 -84431951 -88478041
840 -88478041 -58990901 1886855 55027297 59595096 22055655 -17784430 -33788799
$$ packed form
891G3259931l7614265j9790181N4035209P7260196K925910q7471136r6182242
884c3576578l4541394J5945406K5680328L3718851O1290714P6811696N3742674
877A99071697J0549233k3549818m4648492n8149941n5980334l1065809J472765
870b300699J6002046O124099n214903J1042488N1920499P2798938L5584585l3007748
862A52949305o3445048l5351291o605085k3536754m8251949k4771055K2289359
855b6722518K5104691j4051611k8127086m57654J2090255j1680743j2503304M3173966
847a3174004Q8927626N2042848l4491183q1449816o5197946l1089476m046090
840h8478041K9487140O0877756N3140442M567799l7539441l9840085j6004369
$$ plain form
833 -33788799 -22906015 11862376 57628866 85098572 76031938 47753758 24635842
826 24635842 -400101 -42530274 -74913091 -46740792 42588557 127329984 150197904
819 150197904 122025026 87456696 62422123 37473060 20908018 34076658 64539032
812 64539032 66002379 22255993 -19721405 -6960104 49366401 92416307 96354446 86289995
804 86289995 81527565 63342821 20373329 -10832171 12030488 73470363 117163623
797 117163623 117964645 100088482 86614826 71245953 48812886 36408070 44306414 52437519
789 52437519 38097967 9966550 -4955599 3611002 23190656 38685305 46031659 51391032
781 51391032 62283899 72611942 58497475 4543399 -66967991 -113708753 -121219672
$$ packed form
833c3788799J0882784L4768391M5766490K7469706r066634k8278180k3117916
826B4635842k5035943m2130173l2382817K8172299Q9329349Q4741427K2867920
819A50197904k8172878l4568330k5034573k4949063j6565042J3168640L0462374
812F4539032J463347m3746386m1977398J2761301N6326505M3049906L938139j0064451
804H6289995m762430j8184744m2969492l1205500K2862659O1439875M3693260
797A17163623Q01022j7876163j3473656j5368873k2433067j2404816P898344Q131105
789E2437519j4339552k8131417j4922149Q566601J9579654J5494649P346354N359373
781E1391032J0892867J0328043j4114467n3954076p1511390m6740762p510919
$$ plain form
774 -121219672 -110631631 -98841791 -81585500 -62285895 -63676172 -94580339 -131334866
767 -131334866 -146214254 -131798355 -92892031 -47068152 -36708171 -94468177 -183109158
760 -183109158 -219217381 -176518489 -112285944 -69008769 -18462593 55666909 95125225
753 95125225 55756201 -3310531 -1404803 42294724 58348743 53450375 82279482 123959022
745 123959022 106335610 46262950 42273537 111834894 155562363 117732766 68407262
738 68407262 73110282 84848263 37032648 -39676576 -70788926 -45085416 2822888
731 2822888 61783543 126276313 157023364 128532416 79535971 57329814 48960724 21351581
723 21351581 -12105621 -21113266 -13163787 -4129768 20243028 57049685 53887103 -7881511
$$ packed form
774a21219672J0588041J1789840J7256291J9299605j390277l0904167l6754527
767a31334866j4879388J4415899L8906324M5823879J0359981n7760006q8640981
760a83109158l6108223M2698892O4232545M3277175N0546176P4129502L9458316
753I5125225l9369024n9066732J905728M3699527J6054019m898368K8829107M1679540
745A23959022j7623412o0072660l989413O9561357M3727469l7829597m9325504
738F8407262M703020J1737981m7815615p6709224l1112350K5703510M7908304
731B822888N8960655O4492770L0747051k8490948m8996445k2206157q369090k7609143
723B1351581l3457202r007645P949479R034019K4372796L6806657l162582o1768614
$$ plain form
715 -7881511 -51125671 -6175953 70381349 72645110 5822211 -29678416 6374955 54283771
707 54283771 62218432 39468878 2099143 -46802996 -80075579 -72186030 -61224831 -100889758
699 -100889758 -154836131 -135108130 -49603915 -5502966 -46177860 -91545194 -75798275
692 -75798275 -40317519 -37690523 -37925860 2968206 56394398 71741594 54599202 33722198
684 33722198 4029817 -39906649 -64838332 -50504590 -34344342 -52409271 -82201596
677 -82201596 -93582692 -103710881 -125998627 -120045458 -59302763 1201871 285219 -26067309
669 -26067309 2923429 84906450 140071010 130270635 96151152 79267591 75664211 71106071
661 71106071 65084214 52233575 23900675 -8316382 -23177287 -15645973 15770726 81264581
$$ packed form
715g881511m3244160M4949718P6557302K263761o6822899l5500627L6053371M7908816
707E4283771P934661k2749554l7369735m8902139l3272583P889549J0961199l9664927
699a00889758n3946373J9728001Q5504215M4100949m0674894m5367334J5746919
692g5798275L5480756K626996k35337M0894066N3426192J5347196j7142392k0877004
684C3722198k9692381m3936466k4931683J4333742J6160248j8064929k9792325
677h2201596j1381096j0128189k2287746N953169O0742695O0504634r16652k6352528
669b6067309K8990738Q1983021N5164560r800375l4119483j6883561l603380m558140
661G1106071o021857j2850639k8332900l2217057j4860905P531314L1416699O5493855
$$ plain form
653 81264581 159675879 180390072 103786166 -4742949 -45217892 -9572667 28736016
646 28736016 34263452 38556027 51539295 30982433 -34812112 -85896738 -71007358 -19407703
638 -19407703 3679026 -21943881 -64543818 -87205008 -77041446 -45979760 -17644868
631 -17644868 -2867440 10086981 27071466 27637596 1659181 -16209511 7267037 41796104
623 41796104 31925970 -14773333 -39275554 -25257287 -13830584 -20309958 -8435142 35176332
615 35176332 69745995 70112008 65644729 78985223 83560486 55523613 14567610 -20600376
607 -20600376 -64128287 -114440543 -128595674 -88637101 -43236620 -35712195 -37167790 -2342888
599 -2342888 51891168 80491559 84165039 87797220 75994864 16665722 -67894423 -114671374
$$ packed form
653H1264581P8411298K0714193p6603906j08529115m0474943L5645225L8308683
646B8736016N527436M292575J2983268k0556862o5794545n1084626J4889380N1599655
638a9407703K3086729k5622907m2599937k2661190J0163562L1061686K8334892
631a7644868J4777428J2954421J6984485N66130k5978415j7868692K3476548L4529067
623D1796104r870134m6699303k4502221J4018267J1426703o479374J1874816M3611474
615C5176332L4569663L66013m467279J3340494M575263k8036873m0956003l5167986
607b0600376m3527911n0312256j4155131L9958573M5400481P524425j455595L4824902
599b342888N4234056K8600391L673480L632181j1802356n9329142q4560145m6776951
$$ plain form
591 -114671374 -97646562 -44032745 14409351 59612084 73098484 54734001 43166660
584 43166660 68790313 101208968 94433837 64980487 63086430 82034453 70076194 28562791
576 28562791 16521482 44648878 47384799 -7798627 -58567357 -41543471 15001873
569 15001873 47325917 53205018 69536921 91690504 85636041 60864099 62391871 93073167
561 93073167 104891768 74794188 35202064 14110223 -6638525 -48319252 -88624022
554 -88624022 -89816770 -50977995 -4205193 26027887 35128454 22592731 -8929410 -41408726
546 -41408726 -50311688 -30051081 718691 19943336 20599379 11258798 5625642 6838588
538 6838588 -3316603 -48910215 -124244118 -187991891 -208470127 -199433861 -188791063 -168844486
$$ packed form
591a14671374J7024812N3613817N8442096M5202733J3486400j8364483j1567341
584D3166660K5623653L2418655o775131k9453350j894057J8948023j1958259m1513403
576B8562791j2041309K8127396K735921n5183426n0768730J7023886N6545344
569A5001873L2324044N879101J6331903K2153583o054463k4771942J527772L0681296
561I3073167J1818601l0097580l9592124k1091841k0748748m1680727m0304770
554h8624022j192748L8838775M6772802L0233080R100567j2535723l1522141l2479316
546d1408726q902962K0260607L0769772J9224645O56043r340581n633156J212946
538F838588j0155191m5593612p5333903o3747773k0478236R036266J0642798J9946577
$$ plain form
530 -168844486 -112979778 -33314515 21841605 32849579 29135816 34310108 35300347 24841392
522 24841392 28074708 56410815 78002703 71851723 69022798 92800480 99903571 44875596
514 44875596 -29287956 -41558789 2964982 22916298 -6334198 -18274237 26512525
507 26512525 73787882 68115024 38848495 40268543 63875118 70586639 66982662 85967882
499 85967882 118118448 121000462 83903177 37778629 11738496 14243303 39921300 62566731
491 62566731 45274962 -6676163 -30819505 12662968 74564334 79989214 32212901
484 32212901 -5652886 -14109992 -34036034 -81927245 -115538772 -99864562 -54869252
477 -54869252 -18174799 -1678958 -2672135 -21930611 -52352166 -75784339 -82453910 -72793106
$$ packed form
530a68844486N5864708P9665263N5156120J1007974l713763N174292R90239j0458955
522B4841392L233316K8336107K1591888o150980k828925K3777682P103091n5027975
514D4875596p4163552j2270833M4523771J9951316k9250496j1940039M4786762
507B6512525M7275357n672858k9266529J420048K3606575O711521l603977J8985220
499H5967882L2150566K882014l7097285m6124548k6040133K504807K5677997K2645431
491F2566731j7291769n1951125k4143342M3482473O1901366N424880m7776313
484C2212901l7865787q457106j9926042m7891211l3611527J5674210M4995310
477e4869252L6694453J6495841r93177j9258476l0421555k3432173o669571R660804
$$ plain form
469 -72793106 -42134389 6942109 42716304 34487400 3824566 1266649 27374807 25740347
461 25740347 -31583250 -99773300 -125308700 -112092107 -95110638 -84022787 -66531764
454 -66531764 -42590693 -22869881 -8951041 330612 -2212035 -15201174 -15117076 18004148
446 18004148 69145250 98990531 81935205 27470983 -26768536 -40685035 -4737332
439 -4737332 49369355 83595936 95292586 105979254 118531482 117122599 105064879 103092082
431 103092082 106413428 86273732 45637586 29112231 56485074 86755483 76075163
424 76075163 37637755 13425400 14345892 20170386 17556949 7957577 -7248813 -24828071
416 -24828071 -34480555 -31775753 -23405825 -12983255 -3640391 -16537607 -69877158 -131333037
$$ packed form
469g2793106L0658717M9076498L5774195q228904l0662834k557917K6108158j634460
461B5740347n7323597o8190050k5535400J3216593J6981469J1087851J7491023
454f6531764K3941071J9720812J3918840R281653k542647j2989139Q4098L3121224
446A8004148N1141102K9845281j7055326n4464222n4239519j3916499L5947703
439d737332N4106687L4226581J1696650J0686668J2552228j408883j2057720j972797
431A03092082L321346k0139696m0636146j6525355K7372843L0270409j0680320
424G6075163l8437408k4212355R20492N824494k613437r599372j5206390j7579258
416b4828071r652484K704802Q369928J0422570R342864j2897216n3339551o1455879
$$ plain form
408 -131333037 -137974946 -82335486 -28978614 -19553278 -17488121 14130559 40169990 18444459
400 18444459 -14850856 -263698 41041081 42402468 8387083 5732129 42570661 50982728
392 50982728 6859974 -22649694 10410476 53471128 37253417 -15023359 -23882566
385 -23882566 34716561 110792752 153080654 149209185 106202712 42041454 -3396250
378 -3396250 4895910 47286818 62593515 28725908 -482564 32582167 101281025 120171808
370 120171808 59097561 -11804940 -15110596 32031191 53530224 30197136 17333123
363 17333123 42732069 56347174 16213866 -33646617 -27131771 20578180 38013217
356 38013217 6129291 -22968134 -12068080 16168805 26946095 14365486 -16137078
$$ packed form
408a31333037o641909N5639460N3356872R425336K065157L1618680K6039431k1725531
400A8444459l3295315J4587158M1304779J361387l4015385k654954L6838532Q412067
392E0982728m4122754k9509668L3060170M3060652j6217711n2276776q859207
385b3882566N8599127P6076191M2287902l871469m3006473o4161258m5437704
378c396250Q292160M2390908J5306697l3867607k9208472L3064731O8698858J8890783
370A20171808o1074247p0902501l305656M7141787K1499033k3333088j2864013
363A7333123K5398946J3615105m0133308m9860483O514846M7709951J7435037
356C8013217l1883926k9097425J0900054K8236885J0777290j2580609l0502564
$$ plain form
349 -16137078 -60690726 -99683425 -108655062 -98668118 -106381460 -132282185 -130661664 -78262950
341 -78262950 -13869323 12174092 -3654835 -28791551 -35147903 -14449399 18042071
334 18042071 24506715 -18210502 -73950008 -78930362 -28396856 13991314 8286214 -12654232
326 -12654232 -10131358 1661990 2446418 16930193 66327689 112505913 109923083 80007083
318 80007083 72524288 80909083 63545442 30033813 31801179 70109260 86292301 54556997
310 54556997 18452439 14462574 18622074 -1241418 -29679501 -35078079 -18573903 3376667
302 3376667 33378890 73472778 96674961 77874565 38086515 20204042 28406074 27784566
294 27784566 3074063 -19355490 -19688377 -23003554 -62925922 -121794013 -138837688 -83657004
$$ packed form
349a6137078m4553648l8992699q971637R986944p713342k5900725J620521N2398714
341g8262950O4393627K6043415j5828927k5136716o356352K0698504L2491470
334A8042071O464644m2717217n5739506m980354N0533506M2388170n705100k0940446
326a2654232K522874J1793348P84428J4483775M9397496M6178224k582830k9916000
318H0007083p482795Q384795j7363641l3511629J767366L8308081J6183041l1735304
310E4556997l6104558l989865M159500j9863492k8438083n398578J6504176K1950570
302C376667L0002223M0093888K3202183j8800396l9788050j7882473Q202032o21508
294B7784566k4710503k2429553l32887l315177l9922368n8868091j7043675N5180684
$$ plain form
286 -83657004 2094739 52694580 52383813 37512334 32892253 20722605 -16562093 -55254460
278 -55254460 -59761792 -34429140 -15241397 -18569425 -28612233 -33624688 -43505624 -63740139
270 -63740139 -76991577 -64439832 -30939938 1932681 18751389 19884046 16450153 19958454
262 19958454 30959104 37051279 26874778 2351732 -27952964 -57316789 -72717977
$$ packed form
286h3657004Q5751743N0599841l10767j4871479m620081j2169648l7284698l8692367
278e5254460m507332K5332652J9187743l328028j0042808n012455r880936k0234515
270f3740139j3251438J2551745L3499894L2872619J6818708J132657l433893L508301
262A9958454J1000650O092175j0176501k4523046l0304696k9363825j5401188
$$ [...]
##END NTUPLES=NMR SPECTRUM
##END=
