##TITLE=31Pdec_LR-716-V2
 H2O, 24 sc
 6.7.2020
##JCAMPDX= 6.0         $$ Bruker NMR JCAMP-DX V2.0
##DATA TYPE= NMR SPECTRUM
##DATA CLASS= NTUPLES
##ORIGIN= UXNMR, Bruker Analytische Messtechnik GmbH
##OWNER= root
$$ XWIN-NMR		Version 3.5
$$ Mon Jul  6 10:34:20 2020 Russian Standard Time (UT+4h)  she@DPX200
##.OBSERVE FREQUENCY= 81.013821
##.OBSERVE NUCLEUS= ^31P
##.ACQUISITION MODE= SIMULTANEOUS
##.ACQUISITION SCHEME= undefined
##.AVERAGES= 24
##.DIGITISER RES= 17
##SPECTROMETER/DATA SYSTEM= spect
##.PULSE SEQUENCE= zgpg30
##.SOLVENT NAME= CDCl3
##.SHIFT REFERENCE= (INTERNAL, CDCl3, 0, 182.463)
##AUDIT TRAIL= $$ (NUMBER, WHEN, WHO, WHERE, WHAT)
$$ ##TITLE= Audit trail, XWIN-NMR		Version 3.5
$$ ##JCAMPDX= 5.01
$$ ##ORIGIN= Bruker BioSpin GmbH
$$ ##OWNER= she
$$ F:/spectra/data/she/nmr/P31/1/pdata/1/auditp.txt
$$ ##AUDIT TRAIL=  $$ (NUMBER, WHEN, WHO, WHERE, WHAT)
(   1,<2020-07-06 10:33:00.28 +0400>,<she>,<DPX200>,
      <created by zg, POWCHK disabled, PULCHK disabled
       configuration hash MD5:
       00 E9 B6 7A A2 85 ED C7 34 08 36 98 17 FE 4E 26
       data hash MD5: 32K
       3B 9E 06 6B 0E 45 B2 4A DB 5A 05 5E 63 9B 5B E2>)
(   2,<2020-07-06 10:33:19.93 +0400>,<she>,<DPX200>,
      <Start of raw data processing
       efp BC_mod = 2 LB = 1 FT_mod = 6 PKNL = 1 PHC0 = -1592.816 PHC1 = -181.5979 SI = 64K 
       data hash MD5: 64K
       CB 05 31 49 B5 37 A8 39 24 43 C9 70 E9 19 D1 5D>)
(   3,<2020-07-06 10:33:38.09 +0400>,<she>,<DPX200>,
      <pk PHC0 = -90.02653 PHC1 = 237.5999 
       data hash MD5: 64K
       8B DF 8C 0C 74 EE B0 2D 84 B5 CD 17 61 EC 5E 8E>)
(   4,<2020-07-06 10:33:58.42 +0400>,<she>,<DPX200>,
      <abs ABSG = 5 
       data hash MD5: 64K
       DC 0A 4E 29 8E 81 5F 45 F2 30 ED 8C 0C AF 6D 8A>)
$$ ##END=
$$ 
$$ hash MD5
$$ 4C 89 64 E6 30 58 1E 9E EA 6A 23 18 86 55 4D 6A
##$RELAX= 
##$RELAX= 
##$RELAX= 
##$RELAX= 
##$RELAX= 
##$RELAX= 
##$RELAX= 
##$RELAX= 
$$ Bruker specific parameters
$$ --------------------------
##$DU= <F:/spectra>
##$EXPNO= 1
##$NAME= <P31>
##$PROCNO= 1
##$TYPE= <nmr>
##$USER= <she>
##$AMP= (0..31)
100 100 100 100 100 100 100 100 100 100 100 100 100 100 100 100 100 100 
100 100 100 100 100 100 100 100 100 100 100 100 100 100 
##$AQSEQ= 0
##$AQ_mod= 1
##$AUNM= <au_zg>
##$AUTOPOS= <>
##$BF1= 81.014009
##$BF2= 200.13
##$BF3= 200.13
##$BF4= 200.13
##$BF5= 200.13
##$BF6= 200.13
##$BF7= 200.13
##$BF8= 200.13
##$BYTORDA= 1
##$CFDGTYP= 0
##$CFRGTYP= 5
##$CHEMSTR= <none>
##$CNST= (0..31)
1 1 145 1 1 1 1 1 1 1 1 1 1 1 1 1 1 1 1 1 1 1 1 1 1 1 1 1 1 1 1 1 
##$CPDPRG= <waltz16>
##$CPDPRG1= <>
##$CPDPRG2= <waltz16>
##$CPDPRG3= <>
##$CPDPRG4= <mlev>
##$CPDPRG5= <mlev>
##$CPDPRG6= <mlev>
##$CPDPRG7= <mlev>
##$CPDPRG8= <mlev>
##$CPDPRGB= <>
##$CPDPRGT= <>
##$D= (0..31)
0 1 0 0 0 0 0 0 0 0 0 0.03 2e-05 3e-06 0 0 0 0 0 0 0 0 0 0 0 0 0 0 0 0 
0 0 
##$DATE= 1594017179
##$DBL= (0..7)
120 120 120 11 120 120 24 19 
##$DBP= (0..7)
150 150 150 150 150 150 150 150 
##$DBP07= 0
##$DBPNAM0= <>
##$DBPNAM1= <>
##$DBPNAM2= <>
$$ [...]
##$SUBNAM3= <"">
##$SUBNAM4= <"">
##$SUBNAM5= <"">
##$SUBNAM6= <"">
##$SUBNAM7= <"">
##$SUBNAM8= <"">
##$SUBNAM9= <"">
##$SW= 369.568048894756
##$SWIBOX= (0..15)
0 1 3 0 0 0 0 0 0 0 0 0 0 0 0 0 
##$SW_h= 29940.119760479
##$TD= 32768
##$TD0= 1
##$TE= 0
##$TE2= 300
##$TE3= 300
##$TEG= 300
##$TL= (0..7)
0 120 53 12 22 120 120 120 
##$TP= (0..7)
150 150 150 150 150 150 150 150 
##$TP07= 0
##$TPNAME0= <>
##$TPNAME1= <>
##$TPNAME2= <>
##$TPNAME3= <>
##$TPNAME4= <>
##$TPNAME5= <>
##$TPNAME6= <>
##$TPNAME7= <>
##$TPOAL= (0..7)
0.5 0.5 0.5 0.5 0.5 0.5 0.5 0.5 
##$TPOFFS= (0..7)
0 0 0 0 0 0 0 0 
##$TUNHIN= 0
##$TUNHOUT= 0
##$TUNXOUT= 0
##$USERA1= <user>
##$USERA2= <user>
##$USERA3= <user>
##$USERA4= <user>
##$USERA5= <user>
##$V9= 5
##$VALIST= <valist>
##$VCLIST= <CCCCCCCCCCCCCCC>
##$VD= 0
##$VDLIST= <DDDDDDDDDDDDDDD>
##$VPLIST= <PPPPPPPPPPPPPPP>
##$VTLIST= <TTTTTTTTTTTTTTT>
##$WBST= 1024
##$WBSW= 4
##$XGAIN= (0..3)
0 0 0 0 
##$XL= 0
##$YL= 0
##$YMAX_a= 167221
##$YMIN_a= -168299
##$ZGOPTNS= <>
##$ZL1= 120
##$ZL2= 120
##$ZL3= 120
##$ZL4= 120
##$ABSF1= 182.463
##$ABSF2= -187.1042
##$ABSG= 5
##$ABSL= 3
##$ALPHA= 0
##$AQORDER= 0
##$ASSFAC= 0
##$ASSFACI= 0
##$ASSFACX= 0
##$ASSWID= 0
##$AUNMP= <proc_1d>
##$AZFE= 0.1
##$AZFW= 0.5
##$BCFW= 0
##$BC_mod= 2
##$BYTORDP= 0
##$COROFFS= 0
##$CY= -3
##$DATMOD= 1
##$DC= 0
##$DFILT= <>
##$DTYPP= 0
##$F1P= 0
##$F2P= 0
##$FCOR= 1
##$FTSIZE= 65536
##$FT_mod= 6
##$GAMMA= 0
##$GB= 0
##$INTBC= 1
##$INTSCL= 5.30512e-09
##$ISEN= 30
##$LB= 1
##$LEV0= 0
##$LPBIN= 0
##$MAXI= 10000
##$MC2= 0
##$MEAN= 0
##$ME_mod= 0
##$MI= 50
##$NCOEF= 0
##$NC_proc= -1
##$NLEV= 6
##$NOISF1= 182.463
##$NOISF2= 159.3651
##$NSP= 0
##$NTH_PI= 0
##$NZP= 0
##$OFFSET= 182.463
##$PC= 4
##$PHC0= -1682.843
##$PHC1= 56.002
##$PH_mod= 1
##$PKNL= yes
##$PPARMOD= 0
##$PSCAL= 0
##$PSIGN= 0
##$REVERSE= no
##$SF= 81.0140089999434
##$SI= 65536
##$SIGF1= 159.3651
##$SIGF2= -187.1042
##$SINO= 113.3802
##$SIOLD= 16384
##$SREGLST= <1H.CDCl3>
##$SSB= 0
##$STSI= 65536
##$STSR= 0
##$SW_p= 29940.119760479
##$SYMM= 0
##$S_DEV= 0
##$TDeff= 32768
##$TDoff= 0
##$TI= <>
##$TILT= no
##$TM1= 0
##$TM2= 0
##$TOPLEV= 0
##$USERP1= <user>
##$USERP2= <user>
##$USERP3= <user>
##$USERP4= <user>
##$USERP5= <user>
##$WDW= 1
##$XDIM= 65536
##$YMAX_p= 338736184
##$YMIN_p= -2485639
$$ End of Bruker specific parameters
$$ ---------------------------------
##NTUPLES= NMR SPECTRUM
##VAR_NAME=  FREQUENCY,     SPECTRUM/REAL,   SPECTRUM/IMAG
##SYMBOL=    X,             R,               I
##VAR_TYPE=  INDEPENDENT,   DEPENDENT,       DEPENDENT
##VAR_FORM=  AFFN,          ASDF,            ASDF
##VAR_DIM=   65536,         65536,           65536
##UNITS=     HZ,            ARBITRARY UNITS, ARBITRARY UNITS
##FACTOR=    0.456856943014862, 1,           1
##FIRST=     14782.0589164792, 0,            0
##LAST=      -15158.0608439998, 0,           0
##MIN=       -15158.0608439998, -2485639,    0
##MAX=       14782.0589164792, 338736184,    0
$$ Real data points
##PAGE= N=1
##DATA TABLE= (X++(R..R)), XYDATA
$$ [...]
$$ plain form
42532 -123550 -86430 -99231 -148198 -176022 -147428 -88470 -60658 -97383 -168716 -213238 -200596
42521 -200596 -153271 -111225 -92801 -93411 -103632 -117119 -131632 -150066 -170706 -174958 -144330 -97161
42509 -97161 -84330 -129352 -190092 -202541 -152609 -85205 -51237 -63809 -97479 -112434 -88270 -50464
42497 -50464 -50503 -101624 -153033 -153932 -121752 -108970 -120731 -117255 -91369 -82520 -102746 -110197 -83450
42484 -83450 -64892 -87786 -109504 -75109 -13926 -5693 -62902 -112868 -102748 -63812 -51991 -73231
42472 -73231 -98328 -117640 -144468 -178396 -195031 -172517 -116154 -58512 -36010 -53932 -73715 -51776
42460 -51776 5832 46707 34612 -13767 -61678 -93793 -108126 -94348 -49835 -2698 10859 -12742
42448 -12742 -48669 -81799 -115790 -146614 -154042 -128837 -92371 -78087 -96643 -121690 -111741 -54704
$$ packed form
42532a23550L7120j2801m8967k7824K8594N8958K7812l6725p1333m4522J2642
42521b00596M7325M2046J8424o10j0221j3487j4513j8434k0640m252L0628M7169
42509i7161J2831m5022o0740j2449M9932O7404L3968j2572l3670j4955K4164L7806
42497e0464l9n1121n1409q99L2180J2782j1761L476K5886Q849k0226p451K6747
42484h3450J8558k2894k1718L4395O1183Q233n7209m9966J0120L8936J1821k1240
42472g3231k5097j9312k6828l3928j6635K2514N6363N7642K2502j7922j9783K1939
42460e1776N7608M0875j2095m8379m7911l2115j4333J3778M4513M7137J3557k3601
42448a2742l5927l3130l3991l0824p428K5205L6466J4284j8556k5047R949N7037
$$ plain form
42436 -54704 8883 23917 -13504 -53555 -66980 -85686 -140376 -196307 -202957 -180990 -192191 -231425
42424 -231425 -224899 -149114 -76126 -68577 -98256 -114253 -129119 -175915 -228282 -233208 -191386 -138571
42412 -138571 -76016 8199 71411 51793 -34213 -106087 -129692 -138657 -148653 -138700 -127442 -170893
42400 -170893 -255494 -289879 -246697 -216423 -259909 -303473 -264361 -194286 -191246 -234448 -228884 -172233
42388 -172233 -148665 -175042 -183126 -157732 -164951 -219925 -248666 -222932 -219128 -284298 -345745 -327248
42376 -327248 -268665 -249188 -266243 -278349 -303331 -373896 -442358 -435473 -378377 -361591 -396683 -405516
42364 -405516 -355472 -307210 -309134 -333272 -344961 -354351 -360364 -320837 -231684 -170839 -198309 -260333
42352 -260333 -263140 -208750 -180943 -210685 -236354 -210384 -173100 -182303 -220602 -226663 -194509 -183701
$$ packed form
42436e4704O3587J5034l7421m0051j3425j8706n4690n5931o650K1967j1201l9234
42424b31425O526P5785P2988P549k9679j5997j4866m6796n2367m926M1822N2815
42412a38571O2555Q4215O3212j9618q6006p1874k3605q965r996R953J1258m3451
42400a70893q4601l4385M3182L0274m3486m3564L9112P0075L040m3202N564N6651
42388a72233K3568k6377q084K5394p219n4974k8741K5734L804o5170o1447J8497
42376c27248N8583J9477j7055j2106k4982p0565o8462O885N7096J6786l5092q833
42364d05516N0044M8262j924k4138j1689r390o013L9527Q9153O0845k7470o2024
42352b60333k807N4390K7807k9742k5669K5970L7284r203l8299o061L2154J0808
$$ plain form
42340 -183701 -226376 -272641 -254070 -171232 -84155 -31013 5136 48805 90498 110120 114392 125977
42328 125977 148486 162710 151323 115533 75430 59282 77016 101124 99633 92846 135142 219921
42316 219921 254895 179941 67202 37196 100587 158550 148876 106530 71236 27496 -25748
42305 -25748 -29203 48444 134392 137759 77357 50950 94936 146401 145044 107298 80769 75217
42293 75217 68059 50026 38564 55586 103096 153816 167000 127731 69076 39504 51372 79386
42281 79386 103478 125405 141377 130741 88727 47658 41819 60476 57181 6572 -62879 -98476
42269 -98476 -77995 -28466 5883 5634 -15555 -34728 -41756 -41878 -46763 -61964 -75952 -68554 -42219
42256 -42219 -32896 -65254 -105124 -92546 -26013 26586 17265 -21527 -32893 -15168 -5923 -13393
$$ packed form
42340a83701m2675m6265J8571Q2838Q7077N3142L6149M3669M1693J9622M272J1585
42328A25977K2509J4224j1387l5790m0103j6148J7734K4108j491o787M2296Q4779
42316B19921L4974p4954j12739l0006O3391N7963r674m2346l5294m3740n3244
42305b5748l455P7647Q5948L367o0402k6407M3986N1465j357l7746k6529n552
42293G5217p158j8033j1462J7022M7510N0720J3184l9269n8655k9572J1868K8014
42281G9386K4092K1927J5972j0636m2014m1069n839J8657l295n0609o9451l5597
42269i8476K0481M9529L4349k49k1189j9173p028j22m885j5201j3988P398K6335
42256d2219R323l2358l9870J2578O6533N2599r321l8792j1366J7725R245p470
$$ plain form
42244 -13393 -11628 8089 25850 29333 22228 1 -41785 -74803 -58180 -2134 29097 -3265
42232 -3265 -62155 -84284 -53868 -4965 27991 36645 28302 14527 10596 30703 75258 122492
42220 122492 137515 102178 40700 -150 -5985 -8252 -27194 -33689 -2696 26445 -1636 -66501
42208 -66501 -92773 -60046 -23513 -16581 -7452 22550 33500 3327 -19771 -194 10286 -46670
42196 -46670 -127973 -146028 -103085 -78478 -95191 -94113 -49926 -19983 -44809 -78205 -66012 -35429
42184 -35429 -47055 -95133 -115004 -74741 -10535 26450 22158 -3413 -24145 -26088 -13036 306
42172 306 3887 -1964 -15376 -34871 -49840 -44957 -20367 7132 27305 42508 46359 22026 -25299
42159 -25299 -59790 -59405 -47962 -58485 -82382 -85401 -63302 -46703 -49930 -49467 -26704 -4214 -14546
$$ packed form
42244a3393J765J9717J7761L483p105k2227m1786l3018J6623N6046L1231l2362
42232c265n8890k2129L0416M8903L2956Q654q343j3775l931K0107M4555M7234
42220A22492J5023l5337o1478m0850n835k267j8942o495L0993K9141k8081o4865
42208f6501k6272L2727L6533O932R129L0002J0950l0173k3098J9577J0480n6956
42196d6670q1303j8055M2943K4607j6713J078M4187K9943k4826l3396J2193L0583
42184c5429j1626m8078j9871M0263O4206L6985m292k5571k0732j943J3052J3342
42172C06L581n851j3412j9495j4969M883K4590K7499K0173J5203L851k4333m7325
42159b5299l4491L85J1443j0523k3897l019K2099J6599l227M63K2763K2490j0332
$$ plain form
42146 -14546 -47820 -61324 -42050 -28176 -49918 -74006 -42529 41757 112534 130613 131645 158228
42134 158228 190128 186691 161278 151883 141616 83907 2369 -18090 39704 84051 42987 -33760
42122 -33760 -55490 -17388 18468 28351 41129 67631 82818 73411 50379 18396 -21976 -50732
42110 -50732 -52122 -50412 -74322 -98716 -75109 -9963 45588 77007 113549 155818 166368 142069
42098 142069 125743 128320 109389 58936 24977 24576 1378 -77426 -149691 -148138 -104578 -89959
42086 -89959 -95206 -56820 23710 73058 55076 11279 -12531 -12052 12563 71944 143320 169888
42074 169888 135828 95732 95339 102209 56593 -33788 -94672 -77006 -14031 22241 3225 -31489
42062 -31489 -28657 13370 48054 44550 22507 13019 13786 8344 5204 20546 36480 19175 -24115
$$ packed form
42146a4546l3274j3504J9274J3874k1742k4088L1477Q4286P0777J8079J032K6583
42134A58228L1900l437k5413r395j0267n7709q1538k0459N7794M4347m1064p6747
42122c3760k1730L8102L5856R883J2778K6502J5187r407k3032l1983m0372k8756
42110e0732j390J710k3910k4394K3607O5146N5551L1419L6542M2269J0550k4299
42098A42069j6326K577j8931n0453l3959m01k3198p8804p2265J553M3560J4619
42086h9959n247L8386Q0530M9348j7982m3797k3810M79K4615N9381P1376K6568
42074A69888l4060m0096l93O870m5616r0381o0884J7666O2975L6272j9016l4714
42062c1489K832M2027L4684l504k2043r488P67n442l140J5342J5934j7305m3290
$$ plain form
42049 -24115 -46284 -23191 18623 41822 34478 3347 -36066 -58606 -52168 -45434 -77528 -135913
42037 -135913 -165029 -144497 -114020 -106921 -107069 -94416 -85630 -97767 -114272 -122858 -145773 -189697
42025 -189697 -205031 -149213 -62278 -21046 -36330 -55138 -53505 -60980 -88080 -94389 -54007 -5128
42013 -5128 -3253 -54616 -120352 -162725 -166740 -137868 -100000 -81453 -87018 -94860 -88534 -74802 -61986
42000 -61986 -43020 -14167 9476 14586 9459 5361 -7081 -41386 -84414 -104926 -92467 -70592
41988 -70592 -67931 -86484 -102249 -92104 -57579 -22223 -5072 -1071 5937 16815 17485 3151 -15398
41975 -15398 -30774 -44010 -46371 -20656 26993 59988 54698 31608 22399 24981 17186 -1971 -17483
41962 -17483 -33493 -66364 -106694 -126173 -123055 -120345 -113701 -69479 6116 45578 5828 -62085
$$ packed form
42049b4115k2169K3093M1814K3199p344l1131l9413k2540O438O734l2094n8385
42037a35913k9116K0532L0477P099j48J2653Q786j2137j6505q586k2915m3924
42025a89697j5334N5818Q6935M1232j5284j8808J633p475k7100o309M0382M8879
42013e128J875n1363o5736m2373m015K8872L7868J8547n565p842O326J3732J2816
42000f1986J8966K8853K3643N110n127m098j2442l4305m3028k0512J2459K1875
41988g0592K661j8553j5765J0145L4525L5356J7151M001P008J0878O70j4334j8549
41975a5398j5376j3236k361K5715M7649L2995n290k3090r209K582p795j9157j5512
41962a7483j6010l2871m0330j9479L118K710O644M4222P5595L9462l9750o7913
$$ plain form
41950 -62085 -76044 -30708 7701 -1539 -35509 -61386 -74103 -75091 -64443 -65531 -107939 -169559
41938 -169559 -185520 -136921 -79741 -57416 -41515 -2391 19866 -18557 -73358 -68975 -22483 -20854
41926 -20854 -79569 -117123 -86666 -42493 -39314 -49692 -38181 -44858 -116813 -204154 -212235 -139892
41914 -139892 -84872 -108948 -167097 -186629 -157588 -115686 -79264 -41968 -8329 -2098 -36563 -90670
41902 -90670 -121536 -104673 -62363 -41258 -56616 -76983 -77173 -81299 -123237 -182254 -199285 -154961
41890 -154961 -92396 -55963 -43499 -33173 -25400 -33861 -53706 -63145 -50656 -24745 1611 26248
41878 26248 55035 84661 91544 50325 -28133 -90927 -93415 -48117 -5624 5146 -4091 -14278
41866 -14278 -22369 -29444 -31202 -26733 -17058 7616 57040 112968 135031 103003 36060 -33603 -86302
$$ packed form
41950f2085j3959M5336L8409r240l3970k5877j2717r88J0648j088m2408o1620
41938a69559j5961M8599N7180K2325J5901L9124K2257l8423n4801M383M6492J629
41926b0854n8715l7554L0457M4173L179j0378J1511o677p1955q7341q081P2343
41914a39892N5020k4076n8149j9532K9041M1902L6422L7296L3639O231l4465n4107
41902i0670l0866J6863M2310K1105j5358k0367j90m126m1938n9017j7031M4324
41890a54961O2565L6433J2464J0326P773q461j9845r439J2489K5911K6356K4637
41878B6248K8787K9626O883m1219p8458o2794k488M5298M2493J0770r237j0187
41866a4278q091p075j758M469R675K4674M9424N5928K2063l2028o6943o9663n2699
$$ plain form
41853 -86302 -111354 -103376 -72298 -38063 -8589 17789 26711 -4640 -63404 -97594 -80238 -51223
41841 -51223 -64892 -112436 -130875 -86296 -17110 14493 -7391 -46171 -65569 -69071 -82810 -114899
41829 -114899 -147877 -165518 -166020 -147165 -104195 -53377 -31474 -52741 -89300 -113196 -128827 -138661
41817 -138661 -115601 -53266 -7276 -25335 -63559 -46925 3904 -4122 -84109 -139301 -113641 -74896
41805 -74896 -93882 -127282 -97841 -28771 -11734 -75430 -162007 -211272 -203973 -145810 -72613 -47997
41793 -47997 -89520 -118954 -56886 52332 90435 31323 -30139 -24465 4196 -14432 -75937 -131144
41781 -131144 -160086 -169354 -156584 -122484 -90877 -79424 -71125 -45264 -17504 -19965 -53804 -84888
41769 -84888 -79012 -28305 45627 103347 113552 77371 22505 -22459 -38244 -17412 15259 2171
$$ packed form
41853h6302k5052P978L1078L4235K9474K6378Q922l1351n8764l4190J7356K9015
41841e1223j3669m7544j8439M4579O9186L1603k1884l8780j9398l502j3739l2089
41829a14899l2978j7641n02J8855M2970N0818K1903k1267l6559k3896j5631r834
41817a38661K3060O2335M5990j8059l8224J6634N0829q026p9987n5192K5660L8745
41805g4896j8986l3400K9441O9070J7037o3696q6577m9265P299N8163P3197K4616
41793d7997m1523k9434O2068J09218L8103n9112o1462N674K8661j8628o1505n5207
41781a31144k8942r268J2770L4100L1607J1453Q299K5861K7760k461l3839l1084
41769h4888N876N0707P3932N7720J0205l6181n4866m4964j5785K0832L2671j3088
$$ plain form
41757 2171 -82487 -173982 -177064 -92053 -23845 -43959 -100756 -105849 -61981 -49043 -106428 -184484
41745 -184484 -212854 -178808 -128530 -109716 -120645 -115871 -68467 -17019 -22978 -84064 -132869 -133316
41733 -133316 -128456 -161835 -199122 -178676 -108867 -56281 -49478 -51042 -27571 2755 7349 -13375
41721 -13375 -35816 -47021 -50092 -47720 -33921 -624 49020 93447 107436 89486 62705 42297
41709 42297 20261 -7620 -24983 -24933 -30294 -53729 -61992 -21259 37452 47179 -2536 -50033 -46922
41696 -46922 -14296 3726 1831 561 991 -14297 -49547 -92896 -136881 -178610 -204880 -200131 -171200
41683 -171200 -146411 -142981 -145389 -124010 -71555 -14287 14186 5487 -21432 -45858 -61557 -67404
41671 -67404 -59268 -42712 -40051 -66662 -106475 -127893 -119711 -94595 -62302 -21943 17875 34097
$$ packed form
41757B171q4658r1495l082Q5011O8208k0114n6797n093M3868J2938n7385p8056
41745a84484k8370L4046N0278J8814j0929M774M7404N1448n959o1086m8805m47
41733a33316M860l3379l7287K0446O9809N2586O803j564K3471L0326M594k0724
41721a3375k2441j1205l071K372J3799L3297M9644M4427J3989j7950k6781k0408
41709D2297k2036k7881j7363N0n361k3435q263M0733N8711R727m9715m7497L111
41696d6922L2626J8022j895j270M30j5288l5250m3349m3985m1729k6270M749K8931
41683a71200K4789L430k408K1379N2455N7268K8473q699k6919k4426j5699n847
41671f7404Q136J6556K661k6611l9813k1418Q182K5116L2293M0359L9818J6222
$$ plain form
41659 34097 13838 -30787 -79700 -123314 -157459 -174172 -168592 -147332 -122309 -101704 -90366 -91491
41647 -91491 -104327 -126280 -156184 -185951 -192947 -158714 -97637 -47981 -28448 -23783 -22870 -45867
41635 -45867 -109810 -183416 -208086 -165131 -97888 -59828 -59077 -65579 -59223 -51702 -60010 -74251 -66414
41622 -66414 -30079 4434 5752 -18821 -38358 -46830 -67559 -103771 -119866 -95646 -68661 -83192
41610 -83192 -116637 -108261 -58365 -40545 -96193 -170433 -189916 -160778 -139251 -136791 -117204 -75510
41598 -75510 -53365 -68616 -88936 -93245 -104209 -133343 -147137 -126827 -114963 -151105 -196250 -181241
41586 -181241 -111173 -60832 -71807 -110638 -132140 -131140 -120992 -109447 -112135 -146677 -193656 -202867
41574 -202867 -161827 -123768 -141292 -199738 -241637 -234711 -193860 -157118 -159212 -206862 -261551 -268988
$$ packed form
41659C4097k0259m4625m8913m3614l4145j6713N580K1260K5023K0605J1338j125
41647i1491j2836k1953k9904k9767o996L4233O1077M9656J9533M665R13k2997
41635d5867o3943p3606k4670M2955O7243L8060P51o502O356P521q308j4241P837
41622f6414L6335L4513J318k4573j9537q472k0729l6212j6095K4220K6985j4531
41610h3192l3445Q376M9896J7820n5648p4240j9483K9138K1527K460J9587M1694
41598g5510K2145j5251k0320m309j0964k9134j3794K0310J1864l6142m5145J5009
41586a81241P0068N0341j0975l8831k1502J000J0148J1545k688l4542m6979r211
41574b02867M1040L8059j7524n8446m1899O926M0851L6742k094m7650n4689p437
$$ plain form
41562 -268988 -222424 -171265 -150764 -136905 -96668 -48655 -36765 -68773 -118867 -169439 -209907
41551 -209907 -212948 -159852 -84169 -47428 -69078 -113004 -142133 -153861 -161304 -170286 -178030 -171951
41539 -171951 -135091 -77453 -49102 -86148 -152321 -176386 -144992 -112296 -113890 -122893 -108222 -85416
41527 -85416 -77126 -64132 -19845 30364 31403 -25012 -84846 -98627 -74893 -55897 -62801 -83671
41515 -83671 -103548 -121689 -135297 -127986 -91975 -50015 -32591 -38026 -40540 -36044 -46453 -72294
41503 -72294 -81623 -66494 -69819 -121922 -185024 -204619 -189040 -187073 -204216 -196764 -144521 -79070
41491 -79070 -39485 -44201 -102972 -206730 -304767 -343686 -335416 -338369 -368647 -385779 -372178 -360720
41479 -360720 -364864 -350484 -310848 -303670 -364045 -434393 -439683 -393755 -371176 -399747 -439127 -450761
$$ packed form
41562b68988M6564N1159K0501J3859M0237M8013J1890l2008n0094n0572m0468
41551b09907l041N3096P5683L6741k1650m3926k9129j1728p443q982p744O079
41539a71951L6860N7638K8351l7046o6173k4065L1394L2696j594r003J4671K2806
41527h5416Q290J2994M4287N0209J039n6415n9834j3781K3734J8996o904k0870
41515h3671j9877j8141j3608P311L6011M1960J7424n435k514M496j0409k5841
41503g2294r329J5129l325n2103o3102j9595J5579J967j7143P452N2243O5451
41491g9070L9585m716n8771j03758r8037l8919Q270k953l0278j7132J3601J1458
41479c60720m144J4380L9636P178o0375p0348n290M5928K2579k8571l9380j1634
$$ plain form
41467 -450761 -435260 -406495 -375400 -360475 -377342 -412610 -431469 -412170 -361109 -304978 -278376
41456 -278376 -297296 -330386 -323493 -269075 -216111 -189595 -146295 -48810 61846 122072 138278
41445 138278 160723 191200 188338 154133 142705 177569 223961 255478 290740 346287 403337 442465
41433 442465 470917 498826 525740 563196 630920 717625 786234 831476 888857 970440 1039102
41422 1039102 1070151 1090717 1125750 1150583 1140090 1126309 1153365 1198095 1192029 1116169 1023276
41411 1023276 960215 911573 837815 738986 655424 615646 602925 577511 525579 476910 466925
41400 466925 487964 495612 464308 415390 381855 367824 358556 349938 345177 336718 317056 298748
41388 298748 297369 299264 275390 230655 210464 243375 298285 320519 300977 285497 311751 356229
$$ packed form
41467d50761J5501K8765L1095J4925j6867l5268j8859J9299N1061N6131K6602
41456b78376j8920l3090O893N4418N2964K6516M3300R7485J10656O0226J6206
41445A38278K2445L0477k862l4205j1428L4864M6392L1517L5262N5547N7050L9128
41433D42465K8452K7909K6914L7456O7724Q6705O8609M5242N7381Q1583O8662
41422A039102L1049K0566L5033K4833j0493j3781K7056M4730o066p5860r2893
41411A023276o3061m8642p3758r8829q3562l9778j2721k5414n1932m8669r985
41400D66925K1039P648l1304m8918l3535j4031r268q618m761q459j9662j8308
41388B98748j379J895k3874m4735k0191L2911N4910K2234j9542j5480K6254M4478
$$ plain form
41376 356229 360109 302230 228223 199793 226548 261236 257885 219919 188954 198884 246652 298072
41364 298072 315100 285406 234256 202778 206563 219349 205930 167859 144635 166687 217646 251488
41352 251488 241104 199692 157674 134050 134826 161380 202010 223221 192640 116607 40920 6862
41340 6862 13808 27407 16796 -16285 -37436 -13135 45526 84182 69839 40138 55662 113169
41328 113169 151009 140077 115161 104229 88120 59100 56234 95021 119127 84309 40982 57837
41316 57837 104209 99807 56153 63002 134234 176208 135932 79669 77622 100055 90928 69597
41304 69597 82912 112339 111711 100835 137908 216118 264888 250685 209462 176665 148427 123055
41292 123055 121466 142844 146870 109627 63989 54281 73112 73612 35694 -4388 6543 80317
$$ packed form
41376C56229L880n7879p4007k8430K6755L4688l351l7966l0965R930M7768N1420
41364B98072J7028k9694n1150l1478L785J2786j3419l8071k3224K2052N0959L3842
41352B51488j0384m1412m2018k3624P76K6554M0630K1211l0581p6033p5687l4058
41340F862O946J3599j0611l3081k1151K4301N8661L8656j4343k9701J5524N7507
41328A13169L7840j0932k4916j0932j6109k9020k866L8787K4106l4818m3327J6855
41316E7837M6372m402m3654O849P1232M1974m0276n6263k047K2433r127k1331
41304F9597J3315K9427o28j0876L7073P8210M8770j4203m1223l2797k8238k5372
41292A23055j589K1378M026l7243m5638r708J8831N00l7918m0082J0931P3774
$$ plain form
41280 80317 171402 216757 192538 132370 90230 88917 106691 109801 93228 86753 115889 158860
41268 158860 161989 110625 60086 65753 104179 110849 83348 83231 129802 163921 145686 119157
41256 119157 133218 159168 148803 125115 142535 191256 217936 219924 240375 279578 289737 260251
41244 260251 234698 233934 231630 218916 224043 248549 252108 227408 224774 268768 310869 303557 265606
41231 265606 233796 206912 184925 205422 277952 329325 287393 188953 132181 142635 159462
41220 159462 142670 117828 111188 112225 115970 139523 174444 178073 138975 103643 110350 139240
41208 139240 156198 162744 166953 145502 81530 13250 -4022 29210 63554 69999 62033 57024
41196 57024 59007 79402 131209 193597 220533 199490 170128 169659 189430 202417 202669 193626 166271
$$ packed form
41280H0317R1085M5355k4219o0168m2140j313J7774L110j6573o475K9136M2971
41268A58860L129n1364n0539N667L8426O670k7501j17M6571L4119j8235k6529
41256A19157J4061K5950j0365k3688J7420M8721K6680J988K0451L9203J0159k9486
41244B60251k5553p64k304j2714N127K4506L559k4700k634M3994M2101p312l7951
41231B65606l1810k6884k1987K0497P2530N1373m1932r8440n6772J0454J6827
41220A59462j6792k4842o640J037L745K3553L4921L629l9098l5332O707K8890
41208A39240J6958O546M209k1451o3972o8280j7272L3232L4344O445p966n009
41196E7024J983K0395N1807O2388K6936k1043k9362m69J9771J2987K52r043k7355
$$ plain form
41183 166271 122557 100947 139120 216208 267112 258118 220604 203421 216345 231455 222002 186636
41171 186636 145273 120982 121237 133036 139233 136464 131382 128052 131072 150575 184501 203839 180679
41158 180679 128118 85222 62760 35873 -3599 -23815 200 47708 85539 115409 157026
41147 157026 199896 207271 168661 122984 120746 173241 243185 282820 281564 271570 278511 278885 231499
41134 231499 146631 87132 91020 128730 154304 162427 168564 166797 143912 111430 86668 59777
41122 59777 15158 -29494 -41641 -21038 4162 19302 31473 45240 57598 67968 71572 58168
41110 58168 35838 29641 35940 18475 -18313 -5379 86668 171916 155377 73998 39707 72505
41098 72505 98608 99515 136074 208992 225933 155868 99030 133385 192087 178243 118291 105217
$$ packed form
41183A66271m3714k1610L8173P7088N0904q994l7514j7183J2924J5110r453l5366
41171A86636m1363k4291K55J1799O197k769n082l330L020J9503L3926J9338k3160
41158A80679n2561m2896k2462k6887l9472k0216K4015M7508L7831K9870M1617
41147A57026M2870P375l8610m5677k238N2495O9944L9635j256r994O941L74m7386
41134B31499q4868n9499L888L7710K5574Q123O137j767k2885l2482k4762k6891
41122E9777m4619m4652j2147K0603K5200J5140J2171J3767J2358J0370L604j3404
41110E8168k2330o197O299j7465l6788J2934R2047Q5248j6539q1379l4291L2798
41098G2505K6103R07L6559P2918J6941p0065n6838L4355N8702j3844n9952j3074
$$ plain form
41086 105217 150137 187283 185187 163794 132804 95301 85242 123268 160464 140955 92687 77428
41074 77428 79858 37112 -40486 -75196 -44255 -4412 7860 10893 8761 -16854 -33168 25378
41062 25378 139218 203548 183792 170235 222612 261203 196924 89270 69591 152358 225589
41051 225589 210659 140731 82118 56764 55122 64337 65394 44011 14240 -1615 -13745 -45813
41039 -45813 -78164 -57623 26072 114324 145946 119237 75322 46925 37401 29752 5925 -27415
41027 -27415 -32169 18952 92809 118535 69334 -4003 -31652 7692 87278 169779 223686 228091
41015 228091 191573 155761 154693 174462 171637 126762 62309 12992 -1930 20617 71924 130046
41003 130046 169625 181686 176168 164911 156119 165930 211689 279026 314748 277985 192879 127020
$$ packed form
41086A05217M4920L7146k096k1393l0990l7503j0059L8026L7196j9509m8268j5259
41074G7428K430m2746p7598l4710L0941L9843J2272L033k132k5615j6314N8546
41062B5378J13840O4330j9756j3557N2377L8591o4279j07654j9679Q2767P3231
41051B25589j4930o9928n8613k5354j642R215J057k1383k9771j5855j2130l2068
41039d5813l2351K0541Q3695Q8252L1622k6709m3915k8397r524p649k3827l3340
41027b7415m754N1121P3857K5726m9201p3337k7649L9344P9586Q2501N3907M405
41015B28091l6518l5812j068J9769k825m4875o4453m9317j4922K2547N1307N8122
41003A30046L9579J2061n518j1257q792R811M5759O7337L5722l6763q5106o5859
$$ plain form
40991 127020 116625 134038 132651 99803 51261 -8352 -97974 -238329 -434886 -683921 -983857
40980 -983857 -1330855 -1695640 -2003290 -2156931 -2114081 -1941024 -1757399 -1614768 -1465095 -1266857
40970 -1266857 -1073004 -965383 -937229 -907841 -842054 -784369 -766906 -753054 -699411 -614699 -520620
40959 -520620 -405892 -266643 -152463 -117334 -147481 -186359 -211628 -237443 -256738 -239958 -192457
40948 -192457 -161130 -171968 -201068 -218721 -225368 -230072 -226710 -209517 -188007 -172533 -165336 -172903
40936 -172903 -201856 -234994 -240854 -219385 -207692 -222822 -229201 -189531 -125473 -96758 -130185 -193434
40924 -193434 -232120 -213999 -145347 -63287 -7711 12507 19657 27758 21814 -9336 -43073 -53830
40912 -53830 -57889 -92719 -156415 -201343 -192065 -142411 -90033 -59622 -57392 -75197 -88015 -70288
$$ packed form
40991A27020j0395J7413j387l2848m8542n9613q9622j40355j96557k49035k99936
40980i83857l46998l64785l07650j53641M2850J73057J83625J42631J49673J98238
40970a266857J93853J07621K8154K9388O5787N7685J7463J3852N3643Q4712R4079
40959e20620J14728J39249J14180L5129l0147l8878k5269k5815j9295J6780M7501
40948a92457L1327j0838k9100j7653o647m704L362J7193K1510J5474P197p567
40936a72903k8953l3138n860K1469J1693j5130o379L9670O4058K8715l3427o3249
40924a93434l8686J8121O8652Q2060N5576K0218P150Q101n944l1150l3737j0757
40912e3830m059l4830o3696m4928R278M9654N2378L0411K230j7805j2818J7727
$$ plain form
40900 -70288 -29539 -5030 -18860 -47345 -57526 -51656 -50931 -51569 -31208 4846 19679 -3134 -34288
40887 -34288 -44812 -51811 -87470 -136523 -144350 -93001 -32792 -17204 -34290 -34997 -12045 -7721 -42820
40874 -42820 -81769 -87279 -74750 -82906 -114067 -137096 -135459 -118553 -93297 -58562 -25062 -7444
40862 -7444 3653 28313 55872 55773 34549 35040 62524 62765 6737 -50096 -41915 10992 39879
40849 39879 36392 52070 94971 103727 44370 -33437 -71327 -78774 -91710 -100397 -73929 -28339
40837 -28339 -11140 -27407 -33736 -6789 27652 40342 31899 9474 -30776 -78538 -99468 -76568
40825 -76568 -38924 -22586 -19386 5582 53439 80778 57415 11990 1617 41683 81730 59052
40813 59052 -28406 -113677 -130840 -85574 -43903 -53396 -92070 -102947 -66301 -21510 -17599 -55342
$$ packed form
40900g0288M0749K4509j3830k8485j0181N870P25o38K0361L6054J4833k2813l1154
40887c4288j0524o999l5659m9053p827N1349O0209J5588j7086p07K2952M324l5099
40874d2820l8949n510J2529q156l1161k3029J637J6906K5256L4735L3500J7618
40862g444J1097K4660K7559r9k1224M91K7484K41n6028n6833Q181N2907K8887
40849C9879l487J5678M2901Q756n9357p7807l7890p447j2936q687K6468M5590
40837b8339J7199j6267o329K6947L4441J2690q443k2425m0250m7762k0930K2900
40825g6568L7644J6338L200K4968M7857K7339k3363m5425j0373M0066M0047k2678
40813E9052q7458q5271j7163M5266M1671r493l8674j0877L6646M4791L911l7743
$$ plain form
40801 -55342 -87939 -75985 -29426 13229 37170 61304 94271 109104 83010 40265 20749 16281
40789 16281 -18845 -89388 -137038 -119160 -71302 -56696 -81014 -98573 -85959 -63175 -46653 -28569
40777 -28569 -10229 -11825 -31454 -33872 -6607 6009 -39166 -113995 -147692 -117395 -71694 -62268
40765 -62268 -87075 -112103 -120420 -120629 -123403 -128014 -126341 -111431 -87543 -73096 -81691 -99115 -96782
40752 -96782 -72388 -55162 -60730 -66002 -47941 -22936 -18481 -24166 -8311 24841 35833 11736
40740 11736 -11282 557 37797 73403 96585 100652 70141 11001 -31508 -20780 22365 54542
40728 54542 77059 124070 191267 228929 216642 197100 211686 241327 243091 215277 187794 167851
40716 167851 138761 106460 103242 135324 161583 144219 99043 75728 101601 162314 226747 270150
$$ packed form
40801e5342l2597J1954M6559M2655K3941K4134L2967J4833k6094m2745j9516m468
40789A6281l5126p0543m7650J7878M7858J4606k4318j7559J2614K2784J6522J8084
40777b8569J8340j596j9629k418K7265J2616m5175p4829l3697L0297M5701R426
40765f2268k4807k5028q317k09k774m611J673J4910K3888J4447q595j7424K333
40752i6782K4394J7226n568n272J8061K5005M455n685J5855L3152J0992k4097
40740A1736k3018J1839L7240L5606K3182M067l0511n9140m2509J0728M3145L2177
40728E4542K2517M7011O7197L7662j2287j9542J4586K9641J764k7814k7483j9943
40716A67851k9090l2301l218L2082K6259j7364m5176k3315K5873O0713O4433M3403
$$ plain form
40704 270150 276873 242096 178460 110678 58354 29438 28327 56753 102707 142718 165128 180984
40692 180984 201540 216913 213660 203571 210295 228944 227439 196694 172088 187114 229605 269550
40680 269550 309075 365704 414396 395996 300946 204392 182817 218050 225312 170119 111985 117483
40668 117483 169284 196364 172271 136734 119481 92358 24777 -48100 -56306 16893 117508
40657 117508 188872 218339 213521 178160 131953 114272 135538 153041 129079 88313 77047 84944
40645 84944 58019 -12982 -66838 -49013 20602 74987 72048 26817 -9417 5944 64889 108284
40633 108284 87731 28009 -416 25482 51682 26635 -23998 -32909 16828 67621 54855 -20447
40621 -20447 -91287 -92127 -25048 46312 71601 65309 66634 71663 46404 -2898 -25086 2196 44433
$$ packed form
40704B70150O723l4777o3636o7782n2324k8916j111K8426M5954M0011K2410J5856
40692A80984K0556J5373l253j0089O724J8649j505l0745k4606J5026M2491L9945
40680B69550L9525N6629M8692j8400r5050r6554k1575L5233P262n5193n8134N498
40668A17483N1801K7080k4093l5537j7253k7123o7581p2877q206P3199J00615
40657A17508P1364K9467m818l5361m6207j7681K1266J7503k3962m0766j1266P897
40645H4944k6925p1001n3856J7825O9615N4385k939m5231l6234J5361N8945M3395
40633A08284k0553n9722k8425K5898K6200k5047n0633q911M9737N0793j2766p5302
40621b0447p0840q40O7079P1360K5289o292J325N029k5259m9302k2188K7282M2237
$$ plain form
40608 44433 72281 99962 134046 135470 76819 -397 -33349 -14866 21365 62417 108966 130146
40596 130146 90788 19605 -10284 23250 67579 78949 78785 102285 132490 121874 60569 -7312
40584 -7312 -32460 -9605 23738 33701 29296 41452 62728 40667 -44854 -128971 -130029 -52918
40572 -52918 23539 51158 48871 37795 7093 -35227 -39830 15953 82643 104526 95413 100833
40560 100833 113649 87719 28043 5005 59253 137879 160285 123924 104711 154656 236796
40549 236796 281055 279054 288624 350917 443203 525851 598505 682520 776538 864684 948093 1029788
40537 1029788 1085439 1094465 1089392 1122704 1185756 1216039 1195309 1183489 1228696 1292889 1306649 1265876
40525 1265876 1232952 1257305 1326829 1391100 1412342 1399058 1398911 1449231 1534047 1606900 1649006 1673325
$$ packed form
40608D4433K7848K7681L4084J424n8651p7216l2952J8483L6231M1052M6549K1180
40596A30146l9358p1183k9889L3534M4329J1370j64K3500L0205j0616o1305o7881
40584g312k5148K2855L3343R963m405J2156K1276k2061q5521q4117j058P7111
40572e2918P6457K7619k287j1076l0702m2320m603N5783O6690K1883r113N420
40560A00833J2816k5930n9676k3038N4248P8626K2406l6361j9213M9945Q2140
40549B36796M4259k001R570O2293R2286Q2648P2654Q4015R4018Q8146Q3409Q1695
40537A029788N5651R026n073L3312O3052L0283k0730j1820M5207O4193J3760m0773
40525A265876l2924K4353O9524O4271K1242j3284j47N0320Q4816P2853M2106K4319
$$ plain form
40513 1673325 1677516 1641509 1579363 1539463 1531837 1507052 1435686 1355616 1301353 1237882 1117201
40502 1117201 960152 825114 726769 643377 577427 546786 533053 498582 443243 390210 332221
40491 332221 252928 186050 181266 215117 211481 159139 132912 175723 231549 231744 187047 149515
40479 149515 131776 113414 93788 90329 102733 115682 123891 128447 123468 107075 88747 70940
40467 70940 46379 26866 42702 92635 127851 114032 79957 74265 102385 139758 179052 222588
40455 222588 248726 230953 180800 133428 99072 64300 31200 16730 20501 32232 64067 130513
40443 130513 197121 199732 129296 55837 47837 100216 159927 189981 185728 158051 129049 123175
40431 123175 136920 137046 113466 108427 156101 213438 202859 123233 64990 94535 168103 195807
$$ packed form
40513A673325M191l6007o2146l9900p626k4785p1366q0070n4263o3471j20681
40502A117201j57049j35038r8345q3392o5950l0641j3733l4471n5339n3033n7989
40491C32221p9293o6878m784L3851l636n2342k6227M2811N5826J95m4697l7532
40479A49515j7739j8362j9626l459J2404J2949Q209M556m979j6393j8328j7807
40467G0940k4561j9513J5836M9933L5216j3819l4075n692K8120L7373L9294M3536
40455B22588K6138j7773n0153m7372l4356l4772l3100j4470L771J1731L1835O6446
40443A30513O6608K611p0436p3459q000N2379N9711L0054m253k7677k9002n874
40431A23175J3745J26k3580n039M7674N7337j0579p9626n8243K9545P3568K7704
$$ plain form
40419 195807 159729 121174 123379 139282 126846 92741 72967 76058 78180 64451 46637 40468
40407 40468 46730 57847 69275 82800 106059 142422 172641 161844 103404 40030 14788 17742
40395 17742 18564 35539 112316 222070 265906 202057 116303 108508 155127 155462 87333 32731
40383 32731 46394 80477 70656 32773 25384 56725 81688 72525 45358 20769 -2708 -29380
40371 -29380 -49287 -53279 -50736 -60828 -88994 -114947 -105611 -47702 28542 68225 44098 -15727
40359 -15727 -59177 -60814 -33146 -581 19718 16803 -11459 -46526 -53355 -10093 65211 122081
40347 122081 116178 46165 -43833 -100145 -101888 -70250 -40330 -29736 -33049 -36817 -34490 -31494 -39727
40334 -39727 -64961 -99929 -132996 -158971 -174163 -169146 -142319 -114617 -108068 -110214 -86243 -31035
$$ packed form
40419A95807l6078l8555K205J5903j2436l4105j9774L091K122j3729j7814o169
40407D0468O262J1117J1428J3525K3259L6363L0219j0797n8440o3374k5242K954
40395A7742Q22J6975P6777J09754M3836o3849q5754p795M6619L35o8129n4602
40383C2731J3663L4083r821l7883p389L1341K4963r163k7167k4589k3477k6672
40371b9380j9907l992K543j0092k8166k5953R336N7909P6244L9683k4127n9825
40359a5727m3450j637K7668L2565K0299k915k8262l5067o829M3262P5304N6870
40347A22081n903p0013q9998n6312j743L1638K9920J0594l313l768K327K996q233
40334c9727k5234l4968l3067k5975j5192N017K6827K7702O549k146K3971N5208
$$ plain form
40322 -31035 20757 47188 68304 103181 131035 125613 99996 80192 58736 20273 -4227 35748
40310 35748 129603 202585 202873 150095 90277 47800 34233 57101 96685 113779 104104 108031
40298 108031 143799 172281 157255 119969 98410 91154 82186 83376 104045 113275 88451 69922
40286 69922 101160 138902 102318 4928 -47357 -4170 63171 74728 49417 51276 83549 96013
40274 96013 67938 29956 16003 32894 68505 99653 100381 66811 26138 5714 8086 28695
40262 28695 72126 129291 165096 158488 134800 128643 132989 117169 80897 56508 65420 101027
40250 101027 146108 178904 171044 111200 29267 -27692 -40374 -18291 31522 107002 188502 244966
40238 244966 263976 253385 218251 162160 106222 76010 68081 56264 32800 16646 18036 22687
$$ packed form
40322c1035N1792K6431K1116L4877K7854n422k5617j9804k1456l8463k4500L9975
40310C5748R3855P2982K88n2778n9818m2477j3567K2868L9584J7094r675L927
40298A08031L5768K8482j5026l7286k1559p256q968J190K0669R230k4824j8529
40286F9922L1238L7742l6584r7390n2285M3187O7341J1557k5311J859L2273J2464
40274I6013k8075l7982j3953J6891L5611L1148P28l3570m0673k0424K372K0609
40262B8695M3431N7165L5805o608k3688o157M346j5820l6272k4389Q912L5607
40250A01027M5081L2796p860n9844q1933n6959j2682K2083M9813P5480Q1500N6464
40238B44966J9010j0591l5134n6091n5938l0212p929j1817k3464j6154J390M651
$$ plain form
40226 22687 19732 21418 41547 68990 75436 46133 -244 -23815 -4046 32555 44133 33465
40214 33465 41506 68886 53641 -33509 -117110 -102474 -6372 67407 70304 52873 66248 96810
40202 96810 116636 127579 125379 83131 7974 -39924 -25979 7141 6863 -13315 -8416 26298
40190 26298 64431 96153 119291 110618 55169 -14352 -50166 -45359 -22996 6562 40117 61348
40178 61348 69529 100082 166588 210669 170640 79893 29666 45657 74655 91506 135929 219903
40166 219903 274492 235948 136497 64748 67433 124518 190502 224714 206668 158745 137609 171675
40154 171675 219377 215977 150385 71105 26065 20562 29392 30169 24270 33034 68037 105080 106032
40141 106032 70132 36502 25866 14629 -11383 -16549 30429 91893 105397 78510 78607 125145
$$ packed form
40226B2687k955J686K0129K7443O446k9303m6377k3571J9769L6601J1578j0668
40214C3465Q041K7380j5245q7150q3601J4636R6102P3779K897j7431J3375L0562
40202I6810J9826J0943k200m2248p5157m7898J3945L3120k78k0178M899L4714
40190B6298L8133L1722K3138q673n5449o9521l5814M807K2363K9558L3555K1231
40178F1348Q181L0553O6506M4081m0029r0747n0227J5991K8998J6851M4423Q3974
40166B19903N4589l8544r9451p1749K685N7085O5984L4212j8046m7923k1136L4066
40154A71675M7702l400o5592p9280m5040n503Q830P77n899Q764L5003L7043R52
40141A06032l5900l3630j0636j1237k6012n166M6978O1464J3504k6887R7M6538
$$ plain form
40129 125145 155572 122617 68670 59485 84544 80281 33650 2596 29549 86350 124125 136765
40117 136765 146266 155405 152016 144501 153162 166228 140907 63365 -16548 -32779 23973 99717
40105 99717 141562 149913 158169 176139 178559 153541 133572 150044 173066 141574 58821 7232
40093 7232 38608 94526 85634 17512 -27365 -15971 5052 10796 44516 126317 190181 173708
40081 173708 119383 116529 173968 221105 218083 193840 179198 172241 179224 223605 291252 321722
40069 321722 283748 215954 165499 130130 93629 74501 92330 117320 107323 78170 82117 120965
40057 120965 137753 107863 85703 127630 204475 235455 194633 138141 121519 132136 126329 101557
40045 101557 92490 107771 115849 101996 97689 127503 159639 149579 115718 123152 189035 249318
$$ packed form
40129A25145L0427l2955n3947r185K5059m263m6631l1054K6953N6801L7775J2640
40117A36765R501R139l389p515Q661J3066k5321p7542p9913j6231N6752P5744
40105I9717M1845Q351Q256J7970K420k5018j9969J6472K3022l1492q2753n1589
40093G232L1376N5918q892o8122m4877J1394K1023N744L3720Q1801O3864j6473
40081A73708n4325k854N7439M7137l022k4243j4642o957O983M4381O7647L0470
40069C21722l7974o7794n0455l5369l6501j9128J7829K4990r997k9153L947L8848
40057A20965J6788k9890k2160M1927P6845L0980m0822n6492j6622J0617n807k4772
40045A01557r067J5281Q078j3853m307K9814L2136j0060l3861P434O5883O0283
$$ plain form
40033 249318 240330 179814 136471 139349 153317 140122 109436 96664 112325 133908 139864 131255
40021 131255 117236 96752 66588 36952 23189 26316 37857 60965 105198 156893 179072 153535
40009 153535 103318 58871 23318 -7622 -12567 34682 118252 187149 212545 212434 213976 215662
39997 215662 198923 161302 124602 115194 141418 186568 223363 237525 232850 212800 172444 117968
39985 117968 76918 71066 90492 110733 122058 124591 113428 94410 97217 139745 190634 201110
39973 201110 165668 117613 75925 38768 22117 52741 115036 152277 136361 97516 72020
39962 72020 60763 54590 58936 73311 85583 106099 163426 240684 265958 209373 149157 184359
39950 184359 302166 387431 359960 255933 168430 145498 161238 164540 138774 113477 117842
$$ packed form
40033B49318q988o0516m3343K878J3968j3195l0686j2772J5661K1583N956q609
40021A31255j4019k0484l0164k9636j3763L127J1541K3108M4233N1695K2179k5537
40009A53535n0217m4447l5553l0940m945M7249Q3570O8897K5396j11J542J686
39997B15662j6739l7621l6700r408K6224M5150L6795J4162m675k0050m0356n4476
39985A17968m1050n852J9426K0241J1325K533j1163j9018K807M2528N0889J0476
39973B01110l5442m8055m1688l7157j6651L0624O2295L7241j5916l8845k5496
39962G2020j1257o173M346J4375J2272K0516N7327P7258K5274n6585o0216L5202
39950A84359J17807Q5265k7471j04027q7503k2932J5740L302k5766k5297M365
$$ plain form
39939 117842 132320 110746 53399 22103 61561 138380 189791 204465 213688 223278 205991 159305
39927 159305 122997 126833 155044 177105 186746 194282 200839 199678 193443 193285 201192 204510 195463 192179
39913 192179 224141 285009 316028 265096 157986 76262 60816 77804 91952 121407 183575
39902 183575 232386 208929 134890 96303 134615 202341 233670 217889 190183 181616 193946 205563
39890 205563 194376 165846 152297 168585 184025 166271 136753 141961 179095 200410 194488 208503
39878 208503 269287 331219 337646 298960 268577 262856 249083 208699 173329 185055 242029 299198
39866 299198 317232 300361 282678 281992 279231 250566 206420 177846 169277 153472 122097 113398
39854 113398 165435 255609 314055 298015 234052 183337 181970 221529 269586 292000 266651 200883
$$ packed form
39939A17842J4478k1574n7347l1296L9458P6819N1411J4674R223R590j7287m6686
39927A59305l6308L836K8211K2061R641P536O557j161o235j58P907L318r047l284
39913A92179L1962O0868L1019n0932j07110q1724j5446J6988J4148K9455O2168
39902A83575M8811k3457p4039l8587L8312O7726L1329j5781k7706q567J2330J1617
39890B05563j1187k8530j3549J6288J5440j7754k9518N208L7134K1315n922J4015
39878B08503O0784O1932O427l8686l0383n721j3773m0384l5370J1726N6974N7169
39866B99198J8034j6871j7683o86k761k8665m4146k8574q569j5805l1375q699
39854A13398N2037R0174N8446j6040o3963n0715j367L9559M8057K2414k5349o5768
$$ plain form
39842 200883 137173 117813 135839 144835 129751 136926 205459 297515 341763 327801 301833 277185
39830 277185 220400 140826 117345 189914 282996 296686 234697 180939 178523 197190 203495 196872
39818 196872 179232 148599 127559 146426 191815 217275 207937 188935 170213 137805 107046 124407
39806 124407 193995 254408 257947 229255 214702 213865 198380 168200 150119 157932 184396 218467
39794 218467 247204 256659 251443 255154 271266 265921 216000 154201 132871 153239 164174 131020
39782 131020 76918 48269 59919 86695 97889 87155 70653 67236 85946 123507 160017 162478
39770 162478 116845 61795 61567 127783 195581 202153 161658 130207 126107 130697 143682 177822
39758 177822 209884 202303 175134 189720 248802 281201 250495 211978 222603 254281 248601 210298
$$ packed form
39842B00883o3710j9360J8026Q996j5084P175O8533R2056M4248j3962k5968k4648
39830B77185n6785p9574k3481P2569R3082J3690o1989n3758k416J8667O305o623
39818A96872j7640l0633k1040J8867M5389K5460r338j9002j8722l2408l0759J7361
39806A24407O9588O0413L539k8692j4553q37j5485l0180j8081P813K6464L4071
39794B18467K8737R455n216L711J6112n345m9921o1799k1330K0368J0935l3154
39782A31020n4102k8649J1650K6776J1194j0734j6502l417J8710L7561L6510K461
39770A62478m5633n5050k28O6216O7798O572m0495l1451m100M590J2985L4140
39758A77822L2062p581k7169J4586N9082L2399l0706l8517J0625L1678n680l8303
$$ plain form
39746 210298 186422 184244 171097 139662 117007 112876 106754 89360 78415 86521 103085 115277
39734 115277 123548 128372 119076 86785 42243 12671 15610 35613 39584 24555 29426 74173 111105
39721 111105 83675 21317 13283 81550 146527 143385 107547 104961 136360 163550 182025 204958
39709 204958 209762 166763 102048 71973 86548 110227 125717 142865 154232 140223 118545 132526
39697 132526 180294 204471 169306 110035 86525 114495 158682 176531 157633 128554 119899 126727
39685 126727 117133 85791 67706 79302 83881 51137 14027 17383 42384 43941 38557 79854
39673 79854 155158 188390 158186 134913 170949 224284 235044 219852 232803 270652 279580 243128
39661 243128 208685 219500 257229 268834 234609 193788 200359 259833 323689 351910 358865 374698
$$ packed form
39746B10298k3876k178j3147l1435k2655m131o122j7394j0945Q106J6564J2192
39734A15277Q271M824r296l2291m4542k9572K939K0003L971j5029M871M4747L6932
39721A11105k7430o2358q034O8267O4977l142l5838k586L1399K7190J8475K2933
39709B04958M804m2999o4715l0075J4575K3679J5490J7148J1367j4009k1678J3981
39697A32526M7768K4177l5165n9271k3510K7970M4187J7849j8898k9079q655O828
39685A26727r594l1342j8085J1596M579l2744l7110L356K5001J557n384M1297
39673G9854P5304L3232l0204k3273L6036N3335J0760j5192J2951L7849Q928l6452
39661B43128l4443J0815L7729J1605l4225m0821O571N9474O3856K8221O955J5833
$$ plain form
39649 374698 384932 353958 301242 297156 365239 438304 444768 401355 379585 406483 445978 468248
39637 468248 487925 523472 558458 569284 570911 605658 689872 796151 893696 982305 1069167
39626 1069167 1133056 1146072 1126944 1133763 1191140 1257685 1284342 1272301 1246527 1205094 1136413
39615 1136413 1065845 1037220 1052483 1069991 1063246 1046985 1044229 1059404 1086005 1113404 1127697 1131311
39603 1131311 1151701 1198045 1224683 1185739 1118245 1110409 1177772 1232477 1201691 1120719 1068184
39592 1068184 1054210 1027033 966044 911405 900814 918754 920603 883202 819526 755246 701059
39581 701059 648270 589650 538326 516777 529607 558653 582427 586706 561071 507316 452320 427506
39569 427506 427580 413291 368057 329293 340897 386460 396290 326694 216661 151291 170302 227991
$$ packed form
39649C74698J0234l0974n2716m086O8083P3065O464m3413k1770K6898L9495K2270
39637D68248J9677L5547L4986J0826J627L4747Q4214J06279R7545Q8609Q6862
39626A069167O3889J3016j9128O819N7377O6545K6657j2041k5774m1433o8681
39615A136413p0568k8625J5263J7508o745j6261k756J5175K6601K7399J4293L614
39603A131311K0390M6344K6638l8944o7494p836O7363N4705l0786q0972n2535
39592A068184j3974k7177o0989n4639j0591J7940J849l7401o3676o4280n4187
39581G01059n2789n8620n1324k1549J2830K9046K3774M279k5635n3755n4996k4814
39569D27506P4j4289m5234l8764J1604M5563R830o9596j10033o5370J9011N7689
$$ plain form
39557 227991 254043 238189 227894 249543 273676 270759 257974 260349 261470 233984 193614 178819
39545 178819 194799 219876 248226 278260 276335 211255 120701 84302 122591 172736 173798 129932
39533 129932 79954 50502 53102 87171 130851 158619 171450 180942 176637 152893 149798 203172
39521 203172 263953 246425 162381 121411 174030 238871 225114 150311 87938 68378 88251
39510 88251 153184 244481 294361 262205 196106 159193 139022 96102 57515 79620 144378 177414
39498 177414 159388 141021 148010 146152 112859 77191 67585 72958 78889 98026 138508 176360
39486 176360 186134 176689 174463 186346 197462 197044 190874 187925 184156 168566 146907 144990 172938
39473 172938 200492 197287 187810 223102 296021 334900 296741 217935 152329 112946 104419 151539
$$ packed form
39557B27991K6052j5854j0295K1649K4133k917j2785K375J121k7486m0370j4795
39545A78819J5980K5077K8350L0034j925o5080r0554l6399L8289N0145J062m3866
39533A29932m9978k9452K600L4069M3680K7768J2831R492m305k3744l095N3374
39521B03172O0781j7528q4044m0970N2619O4841j3757p4803o2373j9560J9873
39510H8251O4933R1297M9880l2156o6099l6913k0171m2920l8587K2105O4758L3036
39498A77414j8026j8367O989j858l3293l5668r606N373N931J9137M0482L7852
39486A76360R774r445k226J1883J1116m18o170k949l769j5590k1659j917K7948
39473A72938K7554l205r477L5292P2919L8879l8159p8806o5606l9383q527M7120
$$ plain form
39461 151539 243356 300274 264275 190639 183090 256743 329140 336271 295740 256801 244278 258715
39449 258715 287291 307246 311301 327294 380671 446710 475948 456385 412669 358298 294604 245406
39437 245406 239560 260911 265850 251331 254811 283844 302313 300859 324681 400130 475433 473155
39425 473155 380742 259785 179457 164279 196708 245185 284407 301567 296931 285424 291313 325432
39413 325432 366598 384449 384301 404221 457931 509579 522530 504946 485746 473879 466567 469082
39401 469082 477062 467042 436666 426050 462009 506610 502218 447416 388955 358587 357802 384094
39389 384094 427281 454501 441136 404994 375387 349146 315759 299087 323985 362530 367731 346170
39377 346170 343455 369013 389681 390229 386640 383254 367965 348548 345969 351793 335528 293498 252949
$$ packed form
39461A51539R1817N6918l5999p3636p549P3653P2397P131m0531l8939j2523J4437
39449B58715K8576J9955M055J5993N3377O6039K9238j9563m3716n4371o3694m9198
39437B45406n846K1351M939j4519L480K9033J8469j454K3822P5449P5303k278
39425D73155r2413j20957q0328j5178L2429M8477L9222J7160m636j1507N889L4119
39413C25432M1166J7851j48J9920N3710N1648J2951j7584j9200j1867p312K515
39401D69082P980j0020l0376j0616L5959M4601m392n4802n8461l0368p85K6292
39389C84094M3187K7220j3365l6142k9607k6241l3387j6672K4898L8545N201k1561
39377C46170k715K5558K0668N48l589l386j5289j9417k579N824j6265m2030m0549
$$ plain form
39364 252949 233427 237037 260822 283780 268891 222662 218472 301064 400118 411589 340416 282107
39352 282107 281508 300720 319191 363997 426189 444657 406729 381622 413378 452923 441515 398072
39340 398072 372257 362335 336320 301017 293889 317949 329383 298402 261218 292406 414669 547351
39328 547351 581195 511379 445730 456709 489998 470066 426916 435846 485859 508398 500882 514577
39316 514577 542818 533789 503078 516758 561707 552190 480056 441036 485261 553033 590872 621281
39304 621281 657903 659903 621202 605535 637455 648759 588259 500663 444995 418784 412985 452195
39292 452195 521811 543184 488637 442717 481688 565562 616599 632461 649756 661474 645934
39281 645934 624153 621175 619423 607577 621058 676916 725270 724823 712203 737749 786134 820182
$$ packed form
39364B52949j9522L610K3785K2958j4889m6229m190Q2592R9054J1471p1173n8309
39352B82107n99J9212J8471M4806O2192J8468l7928k5107L1756L9545j1408m3443
39340C98072k5815r922k6015l5303p128K4060J1434l0981l7184L1188J22263J32682
39328E47351L3844o9816o5649J0979L3289j9932m3150Q930N0013K2539p516J3695
39316E14577K8241r029l0711J3680M4949r517p2134l9020M4225O7772L7839L0409
39304F21281L6622K000l8701j5667L1920J1304o0500q7596n5668k6211n799L9210
39292D52195O9616K1373n4547m5920L8971Q3874N1037J5862J7295J1718j5540
39281F45934k1781k978j752j1846J3481N5858M8354m47j2620K5546M8385L4048
$$ plain form
39269 820182 852537 913162 987879 1042454 1071631 1087321 1101944 1150136 1269115 1431029 1562645
39258 1562645 1660989 1813296 2066487 2350793 2562675 2644535 2565530 2332348 2054209 1880295
39248 1880295 1822857 1755907 1630793 1550122 1563270 1551558 1426395 1293517 1281743 1332015 1309337
39237 1309337 1225590 1193705 1235143 1284721 1328310 1391865 1440358 1423476 1386707 1415796 1500969
39226 1500969 1560385 1563760 1542084 1519922 1521617 1587207 1700474 1768823 1753835 1740334 1796051
39215 1796051 1864213 1888780 1931146 2047744 2165855 2208859 2233789 2311261 2385641 2400815 2444917
39204 2444917 2604969 2789493 2871350 2903681 3012538 3173297 3282452 3361770 3500488 3676481
39194 3676481 3819879 3971736 4199636 4445792 4636719 4840578 5135116 5440015 5672352
$$ packed form
39269H20182L2355O0625P4717N4575K9177J5690J4623M8192J18979J61914J31616
39258A562645R8344J52307K53191K84306K11882Q1860p9005k33182k78139j73914
39248A880295n7438o6950j25114q0671J3148j1712j25163j32878j1774N0272k2678
39237A309337q3747l1885M1438M9578M3589O3555M8493j6882l6769K9089Q5173
39226A500969N9416L375k1676k2162J695O5590J13267O8349j4988j3501N5717
39215A796051O8162K4567M2366J16598J18111M3004K4930P7472P4380J5174M4102
39204B444917J60052J84524Q1857L2331J08857J60759J09155P9318J38718J75993
39194C676481J43398J51857K27900K46156J90927K03859K94538L04899K32337
$$ plain form
39185 5672352 5932285 6325333 6748570 7081521 7433114 7955530 8581171 9202847 9925281
39176 9925281 10853983 11847427 12798384 13931780 15473409 17286133 19235630 21621186 24779265
39167 24779265 28597473 32985721 38483129 45768723 55007435 66496279 81525717 101707171
39159 101707171 128126006 162321300 206499856 259050514 308986889 338736184 336505309
39152 336505309 306006918 262475953 219893346 183534811 152867541 127104933 106298640
39145 106298640 89777381 76255877 65102382 56218693 49101172 43016402 37765226
39138 37765226 33468770 29883019 26594048 23617957 21190468 19182373 17267119 15464933
39130 15464933 14011758 12855045 11743760 10674058 9815612 9119752 8399598 7691636 7165900
$$ packed form
39185E672352K59933L93048M23237L32951L51593N22416O25641O21676P22434
39176I925281R28702R93444R50957J133396J541629J812724J949497K385556L158079
39167B4779265L818208M388248N497408P285594R238712J1488844J5029438K0181454
39159A01707171K6418835L4195294M4178556N2550658M9936375K9749295k230875
39152C36505309l0498391m3530965m2582607l6358535l0667270k5762608k0806293
39145A06298640j6521259j3521504j1153495q883689p117521o084770n251176
39138C7765226m296456l585751l288971k976091k427489k008095j915254j802186
39130A5464933j453175j156713j111285j069702q58446o95860p20154p07962n25736
$$ plain form
39121 7165900 6769625 6305286 5779378 5351814 5019609 4659879 4310697 4103755 3976976
39112 3976976 3747224 3426154 3189501 3067302 2925538 2729242 2574730 2475221 2345691 2190836
39102 2190836 2094121 2032571 1908400 1752358 1692395 1724246 1708800 1602487 1506086 1472736 1439665
39091 1439665 1370410 1310083 1276579 1230471 1168722 1130753 1108207 1057976 995720 970015 963572
39080 963572 927186 882190 876699 875662 816227 738478 732077 779155 779379 711510 645444 612485
39068 612485 586617 577043 616932 674386 692533 702758 781571 913088 1016266 1096843 1248995
39057 1248995 1504896 1790165 2025126 2170465 2186728 2056688 1844321 1638430 1449283 1242620
39047 1242620 1039475 885702 764620 645640 571027 576234 578929 487227 370725 366986 452454
$$ packed form
39121G165900l96275m64339n25908m27564l32205l59730l49182k06942j26779
39112C976976k29752l21070k36653j22199j41764j96296j54512r9509j29530j54855
39102B190836r6715o1550j24171j56042n9963L1851j5446j06313r6401l3350l3071
39091A439665o9255o0327l3504m6108o1749l7969k2546n0231o2256k5705o443
39080I63572l6386m4996n491j037n9435p7749o401M7078K24o7869o6066l2959
39068F12485k5868r574L9889N7454J8147J0225P8813J31517J03178Q0577J52152
39057A248995K55901K85269K34961J45339J6263j30040k12367k05891j89147k06663
39047A242620k03145j53773j21082j18980p4613N207K695r1702j16502l739Q5468
$$ plain form
39036 452454 475587 399410 334348 331310 323657 293072 311674 379640 392934 325701 282763 310191
39024 310191 313755 241581 193071 248281 323906 310300 241887 216691 233467 223031 179804 158058
39012 158058 176317 208236 239060 268792 286358 283781 265908 224217 149795 88218 111831 209774
39000 209774 278947 258433 199023 164288 145274 120346 115648 142463 145945 85951 11380 -12864
38988 -12864 -2272 -9681 -29409 -12633 50279 122617 177452 213572 230775 226181 204456 172211
38976 172211 138918 128754 160281 210250 235450 230836 221516 204360 158725 111181 114432 155866
38964 155866 167922 141163 137748 171679 174596 119229 77491 99237 124844 88709 29865 19858
38952 19858 45268 45394 18641 11079 32762 56194 73283 94798 113827 115838 103689 81500
$$ packed form
39036D52454K3133p6177o5062l038p653l0585J8602O7966J3294o7233m2938K7428
39024C10191L564p2174m8510N5210P5625j3606o8413k5196J6776j0436m3227k1746
39012A58058J8259L1919L0824K9732J7566k577j7873m1691p4422o1577K3613R7943
39000B09774O9173k0514n9410l4735j9014k4928m698K6815L482n9994p4571k4244
38988a2864J0592p409j9728J6776O2912P2338N4835L6120J7203m594k1725l2245
38976A72211l3293j0164L1527M9969K5200m614r320j7156m5635m7544L251M1434
38964A55866J2056k6759l415L3931K917n5367m1738K1746K5607l6135n8844j0007
38952A9858K5410J26k6753p562K1683K3432J7089K1515J9029K011j2149k2189
$$ plain form
38940 81500 46375 20145 41577 100218 136373 137569 163193 229401 251310 169164 60868 42982
38928 42982 110766 163884 154267 122957 113399 127592 157607 195620 219664 218323 215205 228720
38916 228720 232754 198088 143359 105954 96871 119210 183200 261452 286357 244266 213491 250385
38904 250385 302474 304525 291013 323129 366764 350537 299274 295423 336772 346392 307462 277713
38892 277713 278552 277583 277313 312145 353455 327007 237649 170829 153749 125139 69304 63282 139487
38879 139487 207600 185321 123654 121808 177486 204213 163679 107826 100321 147761 207431 233463
38867 233463 215913 185135 173393 181844 202940 248924 314527 337642 264693 144569 83330
38856 83330 107410 150455 174769 208542 246979 227113 145522 96227 127192 156008 108788 52733
$$ packed form
38940H1500l5125k6230K1432N8641L6155J196K5624O6208K1909q2146j08296j7886
38928D2982O7784N3118r617l1310r558J4193L0015L8013K4044j341l118J3515
38916B28720M034l4666n4729l7405r083K2339O3990P8252K4905m2091l0775L6894
38904B50385N2089K051j3512L2116M3635j6227n1263l851M1349R620l8930k9749
38892B77713Q39r69k70L4832M1310k6448q9358o6820j7080k8610n5835o022P6205
38879A39487O8113k2279o1667j846N5678K6727m0534n5853p505M7440N9670K6032
38867B33463j7550l0778j1742Q451K1096M5984O5603K3115p2949j20124o1239
38856H3330K4080M3045K4314L3773L8437j9866q1591m9295L0965K8816m7220n6055
$$ plain form
38844 52733 87395 175577 201672 152335 114514 117725 107679 78918 104654 199833 267153 238626
38832 238626 183507 204304 288412 339132 314676 262754 236262 240063 256484 268649 255402 207924
38820 207924 156598 142369 157547 156532 132860 137371 196837 259713 262379 217303 188032 195951
38808 195951 204327 188483 166720 152626 128820 90670 72888 102424 158082 207441 253560 310491
38796 310491 359155 368540 344120 315991 291245 256773 220137 206909 218933 231675 234326 239350
38784 239350 249222 244608 212128 161161 111407 82516 88238 116156 123568 83914 27626 3313
38772 3313 10293 11517 3563 20514 65623 95397 89000 84246 117906 167780 182375 143221 78463
38759 78463 36113 53012 123038 190341 206406 195434 220221 281067 307910 269620 223914 222101
$$ packed form
38844E2733L4662Q8182K6095m9337l7821L211j0046k8761K5736R5179O7320k8527
38832B38626n5119K0797Q4108N0720k4456n1922k6492L801J6421J2165j3247m7478
38820B07924n1326j4229J5178j015k3672M511N9466O2876K666m5076k9271P919
38808A95951Q376j5844k1763j4094k3806l8150j7782K9536N5658M9359M6119N6931
38796C10491M8664R385k4420k8129k4746l4472l6636j3228J2024J2742K651N024
38784B39350R872m614l2480n0967m9754k8891N722K7918P412l9654n6288k4313
38772C313O980J224p954J6951M5109K9774o397m754L3660M9874J4595l9154o4758
38759G8463m2350J6899P0026O7303J6065j0972K4787O0846K6843l8290m5706j813
$$ plain form
38747 222101 229910 199821 166504 194497 263994 291030 253344 221354 254398 327513 378746 380548
38735 380548 345970 306194 302133 360975 456396 519355 511061 464595 437943 450730 488657 545513
38723 545513 627040 722806 807302 873541 942092 1027660 1114104 1176179 1215165 1255374 1307262
38712 1307262 1351525 1365819 1352426 1328625 1303897 1284560 1289177 1331001 1385798 1407664 1386840
38701 1386840 1363700 1368300 1373241 1335460 1267315 1230142 1258523 1321101 1362903 1362401 1336321 1308057
38689 1308057 1288688 1280783 1285314 1302561 1329524 1353995 1351166 1297579 1199759 1103673 1058247 1061923
38677 1061923 1057406 992953 881990 783662 726850 680990 614267 551529 541609 580003 604021
38666 604021 571268 509817 474052 475970 483018 468603 440244 422587 432190 468784 515785 546862
$$ packed form
38747B22101P809l0089l3317K7993O9497K7036l7686l1990L3044P3115N1233J802
38735C80548l4578l9776m061N8842R5421O2959q294m6466k6652J2787L7927N6856
38723E45513Q1527R5766Q4496O6239O8551Q5568Q6444O2075L8986M0209N1888
38712A307262M4263J4294j3393k3801k4728j9337M617M1824N4797K1866k0824
38701A386840k3140M600M941l7781o8145l7173K8381O2578M1802n02k6080k8264
38689A308057j9369p905M531J7247K6963K4471k829n3587r7820r6086m5426L676
38677A061923m517o4453j10963r8328n6812m5860o6723o2738r920L8394K4018
38666F04021l2753o1451l5765J918P048j4415k8359j7657R603L6594M7001L1077
$$ plain form
38654 546862 544751 520387 506558 525087 561624 579689 561945 529837 513304 507693 480015 420441
38642 420441 363008 340275 340773 337418 338946 373990 429160 447060 400256 333593 310253 337030
38630 337030 366469 360911 332186 318985 338053 362622 350931 298144 250400 254678 303841 350858
38618 350858 369422 373268 378430 379932 373815 372285 383674 400511 417423 436886 448590 430688
38606 430688 383352 333720 296497 261556 233683 243728 293583 329378 308589 263663 253684 275226
38594 275226 273195 230874 194632 201083 225946 226235 201408 186103 196698 208328 186950 135150
38582 135150 98495 118584 180681 223520 208756 163566 140727 153897 173004 169789 142742 103809
38570 103809 64795 35948 19593 6847 -5482 -1776 32264 84479 129349 157523 172306 167226
$$ packed form
38654E46862k111k4364j3829J8529L6537J8065j7744l2108j6533n611k7678n9574
38642D20441n7433k2733M98l355J528L5044N5170J7900m6804o6663k3340K6777
38630C37030K9439n558k8725j3201J9068K4569j1691n2787m7744M278M9163M7017
38618C50858J8564L846N162J502o117j530J1389J6837J6912J9463J1704j7902
38606D30688m7336m9632l7223l4941k7873J0045M9855L5795k0789m4926r979K1542
38594B75226k031m2321l6242O451K4863K89k4827j5305J0595J1630k1378n1800
38582A35150l6655K0089O2097M2839j4764m5190k2839J3170J9107l215k7047l8933
38570A03809l9014k8847j6355j2746j2329L706L4040N2215M4870K8174J4783n080
$$ plain form
38558 167226 134418 91880 74140 90741 114370 114687 88155 53715 34831 45209 76268 99987
38546 99987 98624 85725 80616 73391 43824 8387 10100 53220 84388 59605 3138 -26839
38534 -26839 -13581 7690 8574 5035 25075 59982 70457 39215 -2742 -13436 9316 32872
38522 32872 39688 46730 68217 83985 64554 14091 -31661 -44758 -29129 -12113 -22425 -66449
38510 -66449 -115259 -127100 -94407 -54260 -40340 -44923 -46445 -50612 -74724 -109447 -130141 -134193
38498 -134193 -133327 -120955 -86429 -53465 -58650 -90528 -96472 -60226 -28217 -40491 -74618 -82331
38486 -82331 -50044 2082 53629 89396 94268 71507 51938 61038 87574 101536 88432 50818
38474 50818 -3460 -54503 -73970 -61105 -54746 -79808 -103202 -82926 -45083 -59015 -133113 -189020
$$ packed form
38558A67226l2808m2538j7740J6601K3629L17k6532l4440j8884J0378L1059K3719
38546I9987j363j2899n109p225k9567l5437J713M3120L1168k4783n6467k9977
38534b6839J3258K1271Q84l539K0040L4907J0475l1242m1957j0694K2752K3556
38522C2872O816P042K1487J5768j9431n0463m5752j3097J5629J7016j0312m4024
38510f6449m8810j1841L2693M0147J3920m583j522m167k4112l4723k0694m052
38498a34193Q66J2372L4526L2964n185l1878n944L6246L2009j2274l4127p713
38486h2331L2287N2126N1547L5767M872k2761j9569R100K6536J3962j3104l7614
38474E0818n4278n1043j9467J2865O359k5062k3394K0276L7843j3932p4098n5907
$$ plain form
38462 -189020 -161599 -81888 -29030 -31800 -55267 -61347 -37391 24299 123897 221639 252530 198299
38450 198299 116338 73279 74311 83948 89810 105052 121706 110152 70386 42969 54596 85023
38438 85023 103834 109908 114687 113580 98788 79475 64703 45091 17357 9558 50718 124083
38426 124083 178949 185341 155895 121831 110788 139773 201833 260872 282481 268734 245536 226281
38414 226281 212252 215130 242274 265331 248442 216633 251313 391957 577450 724119 843466
38403 843466 1033447 1340506 1664736 1834773 1771152 1549591 1302525 1094249 914520 754979
38393 754979 631433 536380 434779 328667 270858 281054 298033 260053 190545 151147 145777
38382 145777 133666 111062 110101 128892 131767 115780 110441 110601 79168 25841 12665 60514 114749
$$ packed form
38462a89020K7421P9711N2858k770k3467o080K3956O1690R9598R7742L0891n4231
38450A98299q1961m3059J032R637N862J5242J6654j1554l9766k7417J1627L0427
38438H5023J8811O074M779j107j4792j9313j4772j9612k7734p799M1160P3365
38426A24083N4866O392k9446l4064j1043K8985O2060N9039K1609j3747k3198j9255
38414B26281j4029K878K7144K3057j6889l1809L4680J40644J85493J46669J19347
38403H43466J89981L07059L24230J70037o3621k21561k47066k08276j79729j59541
38393G54979j23546r5053j01601j06112n7809J0196J6979l7980o9508l9398n370
38382A45777j2111k2604r61J8791K875j5987n339J60l1433n3327j3176M7849N4235
$$ plain form
38369 114749 129746 126105 132629 131579 102466 68450 53386 35619 -9137 -56224 -71486 -71377
38357 -71377 -93562 -129007 -131910 -86065 -21308 28378 50457 46305 28169 18133 27057 40488
38345 40488 40760 31646 28693 40671 68745 100786 100025 35626 -59211 -100029 -49366 33156 68057
38332 68057 46502 9618 -22838 -54426 -70187 -47159 2364 40065 49473 45071 44118 54924
38320 54924 77912 94831 77326 28897 -8357 -11927 -8135 -15589 -6274 34235 57477 23424
38308 23424 -21535 -10912 29968 21550 -38944 -72805 -44959 -7043 -2033 -6466 6239 14893
38296 14893 -3486 -32508 -52359 -68707 -79342 -60930 -18558 -2094 -38267 -83824 -80700 -28713
38284 -28713 25785 48099 36576 8221 -15464 -24325 -30343 -43423 -40602 4785 65430 79984
$$ packed form
38369A14749J4997l641O524j050k9113l4016j5064j7767m4756m7087j5262J09
38357g1377k2185l5445k903M5845O4757M9686K2079m152j8136j0036Q924J3431
38345D0488K72r114k953J1978K8074L2041p61o4399r4837m0818N0663Q2522L4901
38332F8057k1555l6884l2456l1588j5761K3028M9523L7701R408m402r53J0806
38320E4924K2988J6919j7505m8429l7254l570L792p454R315M0509K3242l4053
38308B3424m4959J0623M0880q418o0494l3861K7846L7916N010m433J2705Q654
38296A4893j8379k9022j9851j6348j0635J8412M2372J6464l6173m5557L124N1987
38284b8713N4498K2314j1523k8355k3685q861o018j3080K821M5387O0645J4554
$$ plain form
38272 79984 38209 -4940 -13058 -10261 -19627 -20731 -2717 -2677 -45046 -88477 -81524 -34239 10865
38259 10865 42027 64675 61393 20509 -23712 -34309 -30615 -49300 -71978 -55040 -14081 -9188
38247 -9188 -51290 -91437 -106290 -124312 -151851 -142762 -74733 1348 31329 33814 58721 101739
38235 101739 114991 89575 72083 90886 112022 93517 53058 44473 76393 94498 57552 -2450
38223 -2450 -26659 -15075 -22391 -70230 -110528 -94113 -36932 9635 24222 19973 9244 163
38211 163 9972 44032 73926 72245 56530 59923 70688 48511 -4097 -40334 -45469 -58372 -95417
38198 -95417 -106520 -47140 43482 84767 57537 18477 16418 36537 38427 17510 5438 21842
38186 21842 47674 50631 25358 -2266 -8623 2305 11547 10264 1467 -12209 -27283 -35173 -36978
$$ packed form
38272G9984m1775m3149q118K797r366j104J8014M0m2369m3431O953M7285M5104
38259A0865L1162K2648l282m0884m4221j0597L694j8685k2678J6938M0959M893
38247i188m2102m0147j4853j8022k7539R089O8029P6081K9981K485K4907M3018
38235A01739J3252k5416j7492J8803K1136j8505m0459q585L1920J8105l6946o0002
38223b450k4209J1584p316m7839m0298J6415N7181M6567J4587m249j0729r081
38211A63R809L4060K9894j681j5715L393J0765k2177n2608l6237n135j2903l7045
38198i5417j1103N9380R0622M1285k7230l9060k059K0119J890k0917j2072J6404
38186B1842K5832K957k5273k7624o357J0928R242j283q797j3676j5074p890j805
$$ plain form
38173 -36978 -53801 -100345 -154913 -180812 -172896 -155362 -139357 -118553 -104362 -119283 -145882 -132701
38161 -132701 -73205 -28807 -39058 -57743 -27329 25757 34678 871 -17563 -14449 -48082 -132901
38149 -132901 -200021 -200866 -180833 -199228 -231253 -212645 -145014 -87879 -62687 -31559 27954 86154
38137 86154 111760 110865 97733 68481 27676 7152 27965 64063 71860 44785 16109 14717
38125 14717 36623 55986 49423 12116 -38174 -73994 -82535 -74815 -66308 -55724 -32267 600
38113 600 21458 15973 -930 885 25701 36525 275 -54649 -58213 8190 72772 63922 14098
38100 14098 18709 97873 162746 138868 65825 33799 60713 82960 50599 -15398 -60521 -57501
38088 -57501 -23705 1964 -5289 -33975 -50168 -34996 1203 39112 62412 50729 -3326 -60104
$$ packed form
38173c6978j6823m6544n4568k5899P916J7534J6005K0804J4191j4921k6599J3181
38161a32701N9496M4398j0251j8685L0414N3086Q921l3807j8434L114l3633q4819
38149a32901o7120q45K0033j8395l2025J8608O7631N7135K5192L1128N9513N8200
38137H6154K5606q95j3132k9252m0805k0524K0813L6098P797k7075k8676j392
38125A4717K1906J9363o563l7307n0290l5820q541P720Q507J0584K3457L2867
38113F00K0858n485j6903J815K4816J0824l6250n4924l564O6403O4582q850m9824
38100A4098M611P9164O4873k3878p3043l2026K6914K2247l2361o5997m5123L020
38088e7501L3796K5669p253k8686j6193J5172L6199L7909K3300j1683n4055n6778
$$ plain form
38076 -60104 -58580 761 40772 8533 -49370 -56030 -11733 22886 24868 27833 53527 82170
38064 82170 91036 77079 45391 16888 35025 115315 199272 212723 161275 112111 93270 77502
38052 77502 56307 49357 37688 -23284 -104435 -107733 -9230 85004 76073 -7038 -77650 -110847
38040 -110847 -125653 -110618 -49573 16801 32608 6976 -10687 -10932 -18123 -28496 -19033 -1662
38028 -1662 -8135 -33421 -47421 -46537 -41590 -17305 36931 78477 60085 9390 -9928 -229 -15564
38015 -15564 -55709 -62669 -28106 -13975 -44508 -63475 -34671 -6813 -29553 -68860 -62188 -11632
38003 -11632 31230 40427 30810 25345 43029 91811 143951 151171 113408 92746 123201 150320
37991 150320 109909 29429 -10110 9754 31303 14994 -14796 -25463 -24819 -36800 -66867 -108560
$$ packed form
38076f0104J524N9341M0011l2239n7903o660M4297L4619J982K965K5694K8643
38064H2170Q866j3957l1688k8503J8137Q0290Q3957J3451n1448m9164j8841j5768
38052G7502k1195o950j1669o0972q1151l298R8503R4234q931q3111p0612l3197
38040a10847j4806J5035O1045O6374J5807k5632j7663k45p191j0373R463J7371
38028a662o473k5286j4000Q84M947K4285N4236M1546j8392n0695j9318R699j5335
38015a5564m0145o960L4563J4131l0533j8967K8804K7858k2740l9307O672N0556
38003a1632M2862R197r617n465J7684M8782N2140P220l7763k0662L0455K7119
37991A50320m0411q0480l9539J9864K1549j6309k9790j0667O44j1981l0067m1693
$$ plain form
37979 -108560 -154439 -185551 -177528 -135472 -101918 -110256 -143340 -156731 -135812 -110993 -113420 -130067
37967 -130067 -117356 -59555 2799 17819 -13379 -40993 -35976 -26725 -52906 -108300 -154114 -172783
37955 -172783 -179582 -186140 -179807 -144451 -85106 -27340 -1129 -21941 -73911 -113543 -105969 -61206
37943 -61206 -23047 -18941 -31444 -23927 14247 55948 66632 39597 -1754 -32951 -50781 -62377
37931 -62377 -62748 -39115 4101 41900 54975 45451 22524 -10147 -43729 -58320 -43569 -15385
37919 -15385 1519 662 -6335 -7235 3598 23846 36741 18510 -31897 -81330 -98156 -89415 -82438
37906 -82438 -78932 -53236 5126 71506 112618 114909 86048 47755 26598 28266 19990 -32171
37894 -32171 -102718 -120018 -59302 14322 29317 2452 754 28380 17700 -58107 -128968 -120680
$$ packed form
37979a08560m5879l1112Q023M2056L3554q338l3084j3391K0919K4819k427j6647
37967a30067J2711N7801O2354J5020l1198k7614N017R251k6181n5394m5814j8669
37955a72783o799o558O333L5356N9345N7766K6211k0812n1970l9632P574M4763
37943f1206L8159M106j2503P517L8174M1701J0684k7035m1351l1197j7830j1596
37931f2377l71K3633M3216L7799J3075r524k2927l2671l3582j4591J4751K8184
37919a5385J6904q57o997r00J0833K0248J2895j8231n0407m9433j6826Q741O977
37906h2438L506K5696N8362O6380M1112K291k8861l8293k1157J668q276n2161
37894c2171p0547j7300O0716P3624J4995k6865j698K7626j0680p5807p0861Q288
$$ plain form
37882 -120680 -55642 -12314 -17082 -34021 -44306 -68932 -106429 -111568 -65077 -17283 -23349 -65523
37870 -65523 -79869 -41824 13692 48423 60524 67077 75412 79647 69995 41468 1720 -32091
37858 -32091 -49559 -51307 -34198 7534 56984 77365 59185 36910 33729 23400 -13778 -31308
37846 -31308 25466 118381 146763 86561 29142 53263 118699 131656 72340 3471 -25700 -29538
37834 -29538 -40339 -55022 -44368 3623 66213 110364 126642 131007 133647 123254 94358 70579
37822 70579 75599 97007 112214 136306 199609 283293 329877 325110 317219 340685 375492 405068
37810 405068 457052 548024 638744 693629 743065 830012 926864 970529 965147 985686 1076768 1200088
37798 1200088 1291304 1327161 1325715 1315646 1319335 1341876 1367059 1380269 1393106 1424059 1460404 1468524
$$ packed form
37882a20680O5038M3328m768j6939j0285k4626l7497n139M6491M7794o066m2174
37870f5523j4346L8045N5516L4731J2101O553Q335M235r652k8527l9748l3811
37858c2091j7468j748J7109M1732M9450K0381j8180k2275l181j0329l7178j7530
37846c1308N6774R2915K8382o0202n7419K4121O5436J2957n9316o8869k9171l838
37834b9538j0801j4683J0654M7991O2590M4151J6278M365K640j0393k8896k3779
37822G0579N020K1408J5207K4092O3303Q3684M6584m767p891K3466L4807K9576
37810D05068N1984R0972R0720N4885M9436Q6947R6852M3665n382K0539R1082J23320
37798A200088R1216L5857j446j0069L689K2541K5183J3210J2837L0953L6345Q120
$$ plain form
37786 1468524 1443525 1420921 1432874 1474641 1519023 1543747 1539929 1512436 1477950 1448510 1414435
37775 1414435 1357552 1282360 1218078 1184411 1166109 1127885 1051395 955463 877232 829227 782837
37764 782837 707982 617511 543241 476401 379277 263210 196851 206863 225904 187231 122718
37753 122718 103797 123159 114092 69351 54739 97340 139024 126542 84232 64450 76721 100458
37741 100458 125052 140360 122157 67198 20396 30202 87671 135543 128665 68246 -9040 -56517
37729 -56517 -45526 10147 63125 79902 73859 80476 107605 124123 98383 40234 -2352 4950
37717 4950 38112 40247 -3141 -42134 -34649 -9834 -22670 -69050 -95323 -81471 -60808 -55583
37705 -55583 -47084 -22581 -2441 -8 3000 17623 21576 -1812 -29402 -29104 -1884 26640 34926
$$ packed form
37786A468524k4999k2604J1953M1767M4382K4724l818k7493l4486k9440l4075
37775A414435n6883p5192o4282l3667j8302l8224p6490r5932p8231m8005m6390
37764G82837p4855r0471p4270o6840r7124j16067o6359J0012J9041l8673o4513
37753A22718j8921J9362r067m4741j4612M2601M1684j2482m2310j9782J2271K3737
37741A00458K4594J5308j8203n4959m6802R806N7469M7872o878o0419p7286m7477
37729e6517J0991N5673N2978J6777o043O617K7129J6518k5740n8149m2586P302
37717D950L3162K135m3388l8993P485K4815j2836m6380k6273J3852K0663N225
37705e5583Q499K4503K0140K433L008J4623L953k3388k7590K98K7220K8524Q286
$$ plain form
37692 34926 12942 -32318 -66400 -53120 -5233 21959 1944 -32358 -44310 -40424 -41154 -46638
37680 -46638 -58488 -93805 -143213 -154293 -98465 -22222 11400 4761 4855 25952 41774 37765 22872
37667 22872 -1104 -37805 -69548 -71321 -47523 -22073 -360 25960 47138 44351 22016 -2226
37655 -2226 -27443 -53566 -52431 -873 67793 96340 84327 83907 112145 122705 79988 12228
37643 12228 -31658 -38255 -20760 9530 38290 45410 31692 23795 33574 39674 29795 31840 75234
37630 75234 143987 197433 221084 229656 233068 226590 206624 174182 131433 94451 95727 146692
37618 146692 205851 215114 168796 118929 106797 115688 103171 56606 -2945 -55591 -95725 -115125
37606 -115125 -99815 -53820 -8871 5418 -5188 -8760 13924 51738 81883 92021 83015 65251
$$ packed form
37692C4926k1984m5260l4082J3280M7887K7192k0015l4302j1952L886p30n484
37680d6638j1850l5317m9408j1080N5828P6243L3622o639R4K1097J5822m009j4893
37667B2872k3976l6701l1743j773K3798K5450K1713K6320K1178k787k2335k4242
37655b226k5217k6123J135N1558O8666K8547j2013m20K8238J0560m2717o7760
37643A2228m3886o597J7495L0290K8760P120j3718p897R779O100r879K045M3394
37630G5234O8753N3446K3651Q572L412o478j9966l2442m2749l6982J276N0965
37618A46692N9159R263m6318m9867j2132Q891j2517m6565n9551n2646m0134j9400
37606a15125J5310M5995M4949J4289j0606l572K2684L7814L0145J0138r006j7764
$$ plain form
37594 65251 57368 74018 106164 125911 119972 105037 98593 90127 60800 20709 1234 12129
37582 12129 30827 39257 47682 68730 86872 76377 43190 24348 38161 54595 34620 -10375
37570 -10375 -26012 12378 62291 69631 39144 16500 12736 -10647 -75744 -146707 -172244 -143028
37558 -143028 -92690 -67443 -104755 -205950 -308957 -325550 -238665 -133968 -100971 -131174 -152370
37547 -152370 -132740 -98118 -67424 -33876 -6832 -13061 -48644 -79794 -97724 -120794 -135647 -99976
37535 -99976 -27006 -2385 -72616 -168217 -192620 -148842 -115394 -122629 -126315 -101660 -90305 -128303
37523 -128303 -182253 -195881 -165448 -128143 -98258 -60531 -19388 -6815 -28552 -42099 -15411
37512 -15411 20104 11763 -32819 -48326 -121 67095 84998 38271 -32852 -82258 -87748 -52311
$$ packed form
37594F5251p883J6650L2146J9747n939j4935o444q466k9327m0091j9475J0895
37582A2129J8698Q430Q425K1048J8142j0495l3187j8842J3813J6434j9975m4995
37570a0375j5637L8390M9913P340l0487k2644l764k3383o5097p0963k5537K9216
37558a43028N0338K5247l7312j01195j03007j6593Q6885J04697L2997l0203k1196
37547a52370J9630L4622L0694L3548K7044o229l5583l1150j7930k3070j4853L5671
37535i9976P2970K4621p0231r5601k4403M3778L3448p235l686K4655J1355l7998
37523a28303n3950j3628L0433L7305K9885L7727M1143J2573k1737j3547K6688
37512a5411L5515q341m4582j5507M8205O7216J7903m6727p1123m9406n490L5437
$$ plain form
37500 -52311 -4068 16749 -2946 -29041 -19612 24157 65751 80195 70270 46971 19628 -1701
37488 -1701 -16882 -39238 -67095 -69549 -31428 6159 -8246 -62289 -98685 -101190 -107698 -134791
37476 -134791 -147842 -124571 -96464 -100011 -128821 -160454 -191077 -215849 -214571 -189946 -184228 -220861
37464 -220861 -260898 -256879 -222621 -206631 -217729 -222426 -203181 -175874 -155046 -138741 -124284 -108601
37452 -108601 -81221 -48467 -52235 -123928 -224747 -275834 -253155 -212372 -208348 -227628 -220750 -172353
37440 -172353 -113669 -81669 -88130 -121131 -158531 -179996 -176947 -156161 -134940 -132096 -156174 -195516
37428 -195516 -224987 -230369 -222044 -218874 -226039 -235900 -241157 -237818 -224571 -207608 -193857 -172060 -121065
37415 -121065 -51969 -17385 -50496 -112127 -132254 -94950 -47880 -32144 -39382 -42510 -35644 -32906
$$ packed form
37500e2311M8243K0817j9695k6095R429M3769M1594J4444r925k3299k7343k1329
37488a701j5181k2356k7857k454L8121L7587j4405n4043l6396k505o508k7093
37476a34791j3051K3271K8107l547k8810l1633l0623k4772J278K4625N718l6633
37464b20861m0037M019L4258J5990j1098m697J9245K7307K0828J6305J4457J5683
37452a08601K7380L2754l768p1693j00819n1087K2679M0783M024j9280O878M8397
37440a72353N8684L2000o461l3001l7400k1465L049K0786K1221K844k4078l9342
37428a95516k9471n382Q325L170p165r861n257L339J3247J6963J3751K1797N0995
37415a21065O9096L4584l3111o1631k0127L7304M7070J5736p238l128O866K738
$$ plain form
37403 -32906 -51591 -102544 -173652 -220444 -202839 -139686 -97653 -113387 -153710 -167279 -147831 -125408
37391 -125408 -118557 -121642 -125770 -128216 -127826 -127907 -136369 -150318 -152227 -136804 -130200 -163360 -231346 -293889
37377 -293889 -312941 -281745 -227298 -193862 -208561 -247327 -250614 -194339 -130505 -128352 -184065 -224230
37365 -224230 -200967 -148051 -128879 -158309 -198260 -211466 -195721 -175352 -180365 -228287 -306126 -370251
37353 -370251 -380828 -340722 -291308 -270046 -282705 -316726 -366405 -434505 -514789 -584616 -621956
37342 -621956 -630833 -644637 -695917 -783163 -877882 -967076 -1075686 -1241140 -1479713 -1781538 -2109326
37331 -2109326 -2380620 -2485639 -2375066 -2124636 -1864410 -1642002 -1406441 -1131626 -882533
37322 -882533 -718961 -598745 -446028 -276024 -171651 -152292 -148935 -115647 -85462 -89319 -91670
$$ packed form
37403c2906j8685n0953p1108m6792J7605O3153M2033j5734m0323j3569J9448K2423
37391a25408O851l085m128k446L90q1q462j3949j909J5423O604l3160o7986o2543
37377b93889j9052L1196N4447L3436j4699l8766l287N6275O3834K153n5713m0165
37365b24230K3263N2916J9172k9430l9951j3206J5745K0369n013m7922p7839o4125
37353c70251j0577M0106M9414K1262j2659l4021m9679o8100q0284o9827l7340
37342f21956q877j3804n1280q7246r4719q9194j08610j65454k38573l01825l27788
37331b109326k71294j05019J10573K50430K60226K22408K35561K74815K49093
37322h82533J63572J20216J52717J70004J04373J9359L357L3288L0185l857k351
$$ plain form
37311 -91670 -52514 350 15511 260 6557 54901 116777 157431 156766 105634 25797 -19797
37299 -19797 13870 88226 122271 99836 84329 117393 160033 163182 145347 151554 169091 145134
37287 145134 78988 35641 53171 88108 84555 59322 72044 128229 163493 129672 53776 -6093
37275 -6093 -28441 -26569 -7849 29324 71036 94522 97782 98414 105876 115082 120294 114165 84816
37262 84816 40457 21946 54237 97069 89661 39470 13769 39104 67966 62111 48156 58078
37250 58078 69764 51755 23163 18901 29741 28961 30448 64619 115303 135939 118309 93978
37238 93978 75098 45887 11497 3587 28954 55582 59863 51704 45189 38987 34223 39941 52393
37225 52393 57569 60244 81114 117654 135265 106884 41826 -26326 -60557 -35664 37720 105969
$$ packed form
37311i1670L9156N2864J5161j5251O297M8344O1876M0654o65n1132p9837m5594
37299a9797L3667P4356L4045k2435j5507L3064M2640L149j7835O207J7537k3957
37287A45134o6146m3347J7530L4937l553k5233J2722N6185L5264l3821p5896n9869
37275f093k2348J872J8720L7173M1712K3486L260O32P462R206N212o129k9349
37262H4816m4359j8511L2291M2832p408n0191k5701K5335K8862n855j3955R922
37250E8078J1686j8009k8592m262J0840p80J487L4171N0684K0636j7630k4331
37238I3978j8880k9211l4390p910K5367K6628M281q159o515o202m764N718J2452
37225E2393N176K675K0870L6540J7611k8381o5058o8152l4231K4893P3384O8249
$$ plain form
37213 105969 117939 77047 24857 -14442 -39294 -37182 3116 49643 52228 15346 -6554 5023
37201 5023 8757 -18102 -38777 -24394 -4648 -9222 -8890 32423 84742 89689 49002 19558 30349
37188 30349 55593 69084 78699 97599 116916 121920 113876 104186 98924 94891 83958 61831 37446
37175 37446 27606 37431 56681 80515 116492 159634 180040 156010 107247 73737 68670 72631
37163 72631 70107 69081 78582 84023 61548 16206 -10738 10599 51020 52539 14900 12022 89971
37150 89971 185370 200109 133984 73229 54617 25521 -41249 -80140 -32646 53006 90159 76992
37138 76992 80345 123720 162255 159642 128221 92818 65957 60431 80954 100736 87007 51184
37126 51184 35031 48073 60830 61540 72640 99779 109651 81245 44973 44047 79007 114380 125734
$$ packed form
37213A05969J1970m0892n2190l9299k4852K112M0298M6527K585l6882k1900J1577
37201E023L734k6859k0675J4383J9746m574L32M1313N2319M947m0687k9444J0791
37188C0349K5244J3491R615J8900J9317N004q044r690n262m033j0933k2127k4385
37175C7446r840R825J9250K3834L5977M3142K0406k4030m8763l3510n067L961
37163G2631k524j026R501N441k2475m5342k6944K1337M0421J519l7639k878P7949
37150H9971R5399J4739o6125o0755j8612k9096o6770l8891M7494Q5652L7153j3167
37138G6992L353M3375L8535k613l1421l5403k6861n526K0523J9782j3729l5823
37126E1184j6153J3042J2757P10J1100K7139R872k8406l6272r26L4960L5373J1354
$$ plain form
37113 125734 118970 110239 103563 89825 63168 37189 38687 77782 130431 161839 162544 150694 145279
37100 145279 149979 157698 158115 145270 126515 115111 106861 81559 40996 23969 59922 124197
37088 124197 166465 171872 167007 175213 194713 215238 229002 227553 210553 194580 194936 206141 216681
37075 216681 227919 238752 233444 212479 210027 241633 258465 206691 119774 90778 148606 219008
37063 219008 224417 172296 121279 102198 102165 97682 76847 47844 41365 83400 153088 192472 173505
37050 173505 132719 123718 155535 193334 202446 176843 137040 110678 107119 110712 109598 119732
37038 119732 155853 190274 179631 132767 109538 140064 182791 181672 135697 92021 90429 127610
37026 127610 159703 137589 61840 -376 16258 93175 150864 148924 115915 80699 34491 -24421
$$ packed form
37113A25734o764q731o676j3738k6657k5979J498L9095N2649L1408P05j1850n415
37100A45279M700P719M17j2845j8755j1404q250k5302m0563j7027L5953O4275
37088A24197M2268N407m865Q206J9500K0525J3764j449j7000j5973L56J1205J0540
37075B16681J1238J0833n308k0965k452L1606J6832n1774q6917k8996N7828P0402
37063B19008N409n2121n1017j9081l3m483k0835k9003o479M2035O9688L9384j8967
37050A73505m0786r001L1817L7799R112k5603l9803k6362l559L593j114J0134
37038A19732L6121L4421j0643m6864k3229L0526M2727j119m5975m3676j592L7181
37026A27610L2093k2114p5749o2216J6634P6917N7689j940l3009l5216m6208n8912
$$ plain form
37014 -24421 -68304 -86180 -96502 -90638 -29126 71171 118216 68678 6309 26629 98450 123518
37002 123518 91115 75679 101734 114618 89620 71651 80277 62652 -13417 -86766 -78631 1994
36990 1994 80018 112207 116126 118740 120763 111564 89966 64804 47788 45840 55038 66569 78395
36977 78395 90802 94738 83764 74715 89558 114498 110063 73680 58125 104134 181347 224913
36965 224913 210884 164459 110169 53402 8556 4880 48331 102438 125690 115209 100313 104264
36953 104264 126522 154359 175215 179063 163338 139889 128300 138161 162623 188897 206624 206121
36941 206121 182298 147403 128057 138856 167377 195017 220867 249702 268426 259042 231507 217168
36929 217168 225564 232879 222115 210235 219933 245389 267259 287695 325946 382996 431526 444876
$$ packed form
37014b4421m3883j7876j0322N864O1512J00297M7045m9538o2369K0320P1821K5068
37002A23518l2403j5436K6055J2884k4998j7969Q626j7625p6069p3349Q135Q0625
36990A994P8024L2189L919K614K023r199k1598k5162j7016j948R198J1531J1826
36977G8395J2407L936j0974r049J4843K4940m435l6383j5555M6009P7213M3566
36965B24913j4029m6425n4290n6767m4846l676M3451N4107K3252j0481j4896L951
36953A04264K2258K7837K0856L848j5725k3449j1589R861K4462K6274J7727n03
36941B06121k3823l4895j9346J0799K8521K7640K5850K8835J8724r384k7535j4339
36929B17168Q396P315j0764j1880R698K5456K1870K0436L8251N7050M8530J3350
$$ plain form
36917 444876 424233 393884 376637 376348 381638 385089 394851 421120 454476 470646 460532 445204
36905 445204 455724 503891 573386 632857 661996 676393 720118 815587 927355 1000928 1032876
36894 1032876 1067257 1118892 1144031 1108525 1045342 1008478 997324 969364 913881 868875 863461
36883 863461 880266 886369 875281 861628 848838 821835 774122 730105 724559 754871 771189 733184
36871 733184 662797 610766 580824 530585 449442 381993 352499 318010 236384 140498 94244
36860 94244 99072 95339 45599 -28579 -89348 -125103 -150648 -191737 -264828 -351936 -409159 -419963
36848 -419963 -416599 -424155 -417630 -373482 -327617 -326415 -347889 -337048 -301025 -296033 -327858 -344476
36836 -344476 -332740 -339922 -378239 -389294 -342291 -296173 -312567 -364221 -386504 -373745 -363943 -363030
$$ packed form
36917D44876k0643l0349j7247k89N290L451R762K6269L3356J6170j0114j5328
36905D45204J0520M8167O9495N9471K9139J4397M3725R5469J11768P3573L1948
36894A032876L4381N1635K5139l5506o3183l6864j1154k7960n5483m5006n414
36883H63461J6805O103j1088j3653j2790k7003m7713m4017n546L0312J6318l8005
36871G33184p0387n2031k9942n0239q1143o7449k9494l4489q1626r5886m6254
36860I4244M828l733m9740p4178o0769l5755k5545m1089p3091q7108n7223j0804
36848d19963L364p556O525M4148M5865J202k1474J0841L6023M992l1825j6618
36836c44476J1736p182l8317j1055M7003M6118j6394n1654k2283J2759R802R13
$$ plain form
36824 -363030 -348683 -329140 -336324 -366486 -379746 -358792 -324779 -294012 -259458 -220901 -197612 -200214
36812 -200214 -215889 -229692 -239124 -242964 -238017 -233489 -247303 -277678 -294547 -271582 -218371 -172822
36800 -172822 -166763 -201087 -245440 -257806 -214361 -131373 -57105 -34677 -68905 -129546 -184029 -220163
36788 -220163 -237015 -229403 -198389 -169548 -174423 -207345 -225372 -205094 -176504 -180676 -215201 -246899
36776 -246899 -259120 -255672 -235181 -199340 -175108 -187010 -212793 -209956 -184182 -182623 -213380 -224581
36764 -224581 -183082 -126536 -108141 -127483 -148229 -154306 -155176 -156364 -154570 -148770 -137156 -118849 -109515
36751 -109515 -128506 -156482 -140336 -64640 13234 27021 -27923 -112912 -196798 -251656 -237348
36740 -237348 -147226 -47725 -13630 -33217 -34671 -2657 -3005 -74191 -153742 -152131 -65150 28097
$$ packed form
36824c63030J4347J9543p184l0162j3260K0954L4013L0767L4554L8557K3289k602
36812b00214j5675j3803r432l840M947M528j3814l0375j6869K2965N3211M5549
36800a72822O059l4324m4353j2366M3445Q2988P4268K2428l4228o0641n4483l6134
36788b20163j6852P612L1014K8841m875l2922j8027K0278K8590m172l4525l1698
36776b46899j2221L448K0491L5841K4232j1902k5783K837K5774J559l0757j1201
36764b24581M1499N6546J8395j9342k0746o077q70j188J794N800J1614J8307R334
36751a09515j8991k7976J6146P5696P7874J3787n4944q4989q3886n4858J4308
36740b37348R0122R9501L4095j9587j454L2014l48p1186p9551J611Q6981R3247
$$ plain form
36728 28097 62584 46799 28768 32636 39315 16608 -43060 -114190 -161754 -169202 -144985 -109768
36716 -109768 -82998 -76678 -91743 -115960 -128173 -111437 -70151 -34709 -36719 -71072 -95150 -79616
36704 -79616 -46688 -37876 -57629 -77484 -84564 -88334 -85069 -62067 -42306 -74079 -156564 -221463
36692 -221463 -216572 -168809 -134636 -125844 -120331 -112318 -109551 -105318 -94120 -95706 -126678 -168004 -196023
36679 -196023 -221487 -256995 -272147 -234528 -178041 -169393 -208384 -221188 -165055 -87834 -60472 -90364
36667 -90364 -130451 -147758 -151143 -159289 -166565 -150620 -108700 -72848 -74698 -101230 -110615 -93823 -87401
36654 -87401 -113786 -146670 -157403 -158559 -172936 -195438 -216878 -245243 -266683 -233251 -140379 -67239
36642 -67239 -73206 -100727 -65968 -5662 -23877 -109697 -135404 -56342 12363 -27165 -110571 -124334
$$ packed form
36728B8097L4487j5785j8031L868O679k2707n9668p1130m7564p448K4217L5217
36716a09768K6770O320j5065k4217j2213J6736M1286L5442k010l4353k4078J5534
36704g9616L2928Q812j9753j9855p080l770L265K3002J9761l1773q2485o4899
36692b21463M891M7763L4173Q792N513Q013K767M233J1198j586l0972m1326k8019
36679a96023k5464l5508j5152L7619N6487Q648l8991j2804N6133P7221K7362k9892
36667i0364m0087j7307l385q146p276J5945M1920L5852j850k6532r385J6792O422
36654h7401k6385l2884j0733j156j4377k2502k1440k8365k1440L3432R2872P3140
36642f7239n967k7521L4759O0306j8215q5820k5707P9062O8705l9528q3406j3763
$$ plain form
36630 -124334 -79710 -72463 -118726 -139069 -95135 -45809 -48187 -77082 -81015 -67663 -82153 -122170
36618 -122170 -131969 -94019 -78517 -154842 -274693 -309339 -216713 -104209 -82259 -115460 -89356
36607 -89356 15919 105630 107504 41808 -43788 -121571 -155128 -112085 -32912 -7742 -52577 -84484
36595 -84484 -53928 -18840 -37943 -72338 -61536 -28874 -31963 -59784 -61644 -42735 -50646 -88935
36583 -88935 -115889 -113853 -97650 -71266 -35356 -17983 -36460 -48496 -6978 54150 60040 8707
36571 8707 -32807 -43301 -73820 -142114 -181381 -134004 -37445 27675 33682 8932 -22319 -58296
36559 -58296 -93189 -111137 -107950 -97188 -91384 -87723 -74258 -45537 -9231 23774 50444 67111
36547 67111 57046 10350 -42346 -48519 -346 47260 43368 -4765 -63199 -117769 -157773 -153208
$$ packed form
36630a24334M4624P247m6263k0343M3934M9326k378k8895l933J3352j4490m0017
36618a22170r799L7950J5502p6325j19851l4646R2626J12504K1950l3201K6104
36607h9356J05275Q9711J874o5696q5596p7783l3557M3043P9173K5170m4835l1907
36595h4484L0556L5088j9103l4395J0802L2662l089k7821j860J8909p911l8289
36583h8935k6954K036J6203K6384L5910J7373j8477j2036M1518O1128N890n1333
36571H707m1514j0494l0519o8294l9267M7377R6559O5120O007k4750l1251l5977
36559e8296l4893j7948L187J0762N804L661J3465K8721L6306L3005K6670J6667
36547F7111j0065m6696n2696o173M8173M7606l892m8133n8434n4570m0004M565
$$ plain form
36535 -153208 -93985 -23576 12115 24423 45440 61480 38721 -8485 -37020 -46019 -63607 -75723
36523 -75723 -41952 17808 29250 -26997 -79846 -67614 -15990 12851 -141 -33480 -66944 -89593
36511 -89593 -94945 -90972 -91295 -86369 -53767 -3285 25802 20392 5317 -9435 -46278 -108288 -155611
36498 -155611 -155954 -120807 -75458 -35633 -28946 -85949 -180387 -227512 -181074 -95464 -56677 -85522
36486 -85522 -140568 -178408 -173472 -115089 -30030 19134 969 -41654 -52602 -40080 -50237 -87997
36474 -87997 -116126 -120951 -127935 -152443 -178824 -193133 -198900 -192190 -155700 -95418 -59168 -92773
36462 -92773 -179436 -240526 -210885 -112919 -39094 -50437 -111402 -145893 -134178 -114787 -106774 -86130
36450 -86130 -42330 -2935 13003 17445 14118 -13631 -58898 -87358 -95661 -116537 -145650 -132959
$$ packed form
36535a53208N9223P0409L5691J2308K1017J6040k2759m7206k8535q999j7588j2116
36523g5723L3771N9760J1442n6247n2849J2232N1624K8841j2992l3339l3464k2649
36511h9593n352L973l23M926L2602N0482K9087n410j5075j4752l6843o2010m7323
36498a55611l43L5147M5349L9825O687n7003r4438m7125M6438Q5610L8787k8845
36486h5522n5046l7840M936N8383Q5059M9164j8165m2623j0948J2522j0157l7760
36474h7997k8129m825o984k4508k6381j4309n767O710L6490O0282L6250l3605
36462i2773q6663o1090K9641R7966P3825j1343o0965l4491J1715J9391Q013K0644
36450h6130M3800L9395J5938M442l327k7749m5267k8460q303k0876k9113J2691
$$ plain form
36438 -132959 -79679 -66181 -129914 -189552 -161647 -88513 -66435 -99477 -118921 -110345 -120129 -153118
36426 -153118 -160448 -126703 -84979 -46624 3762 44399 29140 -30383 -71954 -76753 -80626 -90892
36414 -90892 -77299 -53197 -72192 -122944 -121482 -43902 20932 -3343 -80105 -131573 -138005 -115579
36402 -115579 -66970 -10848 4199 -26045 -33955 14852 53123 15577 -53052 -73465 -58133 -69798
36390 -69798 -99241 -89415 -56685 -78733 -161052 -215536 -191187 -142584 -140736 -182979 -219853 -217357
36378 -217357 -169488 -96744 -49197 -63621 -104402 -98359 -41368 -11669 -55724 -123350 -151641 -153956
36366 -153956 -174439 -201508 -190167 -144064 -111400 -106737 -94475 -57191 -31485 -54408 -106354 -134131
36354 -134131 -116313 -82005 -66978 -70311 -63717 -34755 -5835 -7395 -43298 -89138 -115340 -105820
$$ packed form
36438a32959N3280J3498o3733n9638K7905P3134K2078l3042j9444Q576r784l2989
36426a53118p330L3745M1724L8355N0386M0637j5259n9523m1571m799l873j0266
36414i0892J3593K4102j8995n0752J462P7580O4834k4275p6762n1468o432K2426
36402a15579M8609N6122J5047l0244p910M8807L8271l7546o8629k0413J5332j1665
36390f9798k9443R826L2730k2048q2319n4484K4349M8603J848m2243l6874K496
36378b17357M7869P2744M7547j4424m0781O043N6991K9699m4055o7626k8291k315
36366a53956k0483k7069J1341M6103L2664M663J2262L7284K5706k2923n1946k7777
36354a34131J7818L4308J5027l333O594K8962K8920j560l5903m5840k6202R520
$$ plain form
36342 -105820 -67739 -33835 -38917 -77188 -99869 -77734 -46886 -59374 -104933 -127026 -109515 -92898
36330 -92898 -96723 -84186 -30407 25825 39446 28720 39249 66950 71853 54048 55934 83325
36318 83325 80328 10517 -74812 -90032 -25048 36270 18536 -50218 -74862 -18880 44919 32112
36306 32112 -38043 -73837 -44437 -17602 -49292 -100230 -103799 -65012 -34508 -21514 -1087 13174
36294 13174 -20572 -89842 -127302 -106507 -72550 -55737 -21732 53354 117533 109987 56057 34591
36282 34591 68666 104495 94276 51604 18515 13942 24830 25215 -1337 -43366 -69627 -69439 -70042
36269 -70042 -91629 -105205 -72115 -12893 9342 -24908 -66454 -68077 -38869 -12695 -2530 -9877
36257 -9877 -44053 -98958 -134166 -114151 -55881 -10728 -6607 -29007 -50083 -54881 -44873 -34448
$$ packed form
36342a05820L8081L3904n082l8271k2681K2135L0848j2488m5559k2093J7511J6617
36330i2898l825J2537N3779N6232J3621j0726J0529K7701M903j7805J886K7391
36318H3325k997o9811q5329j5220O4984O1318j7734o8754k4644N5982O3799j2807
36306C2112p0155l5794K9400K6835l1690n0938l569L8787L0504J2994K0427J4261
36294A3174l3746o9270l7460K0795L3957J6813L4005P5086O4179p546n3930k1466
36282C4591L4075L5829j0219m2672l3089m573J0888L85k6552m2029k6261J88o03
36269g0042k1587j3576L3090N9222K2235l4250m1546j623K9208K6174J0165p347
36257i877l4176n4905l5208K0015N8270M5153M121k2400k1076m798J0008J0425
$$ plain form
36245 -34448 -39675 -56981 -61102 -37152 -3692 9727 -5221 -39366 -82444 -116200 -113619 -74159
36233 -74159 -40165 -42930 -50141 -11170 57759 88359 60512 28235 30098 33487 606 -42599
36221 -42599 -50497 -31994 -27772 -40007 -40977 -35548 -55013 -90828 -93088 -46555 2911 15902 6941
36208 6941 509 -15549 -56170 -93318 -89521 -58567 -48257 -69548 -83583 -60286 -12537 35606
36196 35606 79677 116878 126091 92770 40578 12430 20489 32527 11966 -40209 -90586 -114448
36184 -114448 -120687 -130129 -137551 -114590 -57845 -13339 -28108 -85800 -121108 -100514 -55408 -23070
36172 -23070 7097 57130 100735 89408 29644 -17555 -23362 -28528 -69617 -111412 -96931 -40473
36160 -40473 -18620 -69294 -144457 -176066 -153574 -114694 -85990 -62940 -39053 -26146 -39054 -73093
$$ packed form
36245c4448n227j7306m121K3950L3460J3419j4948l4145m3078l3756K581L9460
36233g4159L3994k765p211L8971O8929L0600k7847l2277J863L389l2881m3205
36221d2599p898J8503M222j2235r70N429j9465l5815k260M6533M9466J2991q961
36208F941o432j6058m0621l7148L797L0954J0310k1291j4035K3297M7749M8143
36196C5606M4071L7201R213l3321n2192k8148Q059J2038k0561n2175n0377k3862
36184a14448o239r442p422K2961N6745M4506j4769n7692l5308K0594M5106L2338
36172b3070L0167N0033M3605j1327n9764m7199n807n166m1089m1795J4481N6458
36160d0473K1853n0674p5163l1609K2492L8880K8704K3050K3887J2907j2908l4039
$$ plain form
36148 -73093 -103509 -105221 -73989 -29944 2026 14565 15546 8827 -7135 -21697 -15836 5690 7914
36135 7914 -29883 -81842 -111622 -123114 -140989 -152081 -112564 -21107 60042 80509 62718 56437
36123 56437 61932 40702 -12959 -58964 -72322 -75055 -93059 -114606 -113869 -92788 -74694 -69586 -69164
36110 -69164 -69309 -74327 -78798 -66110 -33493 -5069 -7501 -36932 -60906 -54366 -24621 4925 26558
36097 26558 49299 71547 74937 55416 39100 45682 51461 19219 -40374 -71664 -45213 4584
36085 4584 26987 14138 -4445 -3803 20831 61983 100905 113481 94920 67356 48131 28400
36073 28400 852 -15837 -8894 -5245 -35357 -78514 -86466 -52435 -11114 24912 75444 132757
36061 132757 147973 101802 43964 32427 68499 117877 157194 167052 118658 14841 -81321
$$ packed form
36148g3093l0416j712L1232M4045L1970J2539R81o719j5962j4562N861K1526K224
36135G914l7797n1959k9780j1492j7875j1092L9517R1457Q1149K0467j7791o281
36123E6437N495k1230n3661m6005j3358k733j8004k1547P37K1081J8094N108M22
36110f9164j45n018m471J2688L2617K8424k432k9431k3974O540K9745K9546K1633
36097B6558K2741K2248L390j9521j6316O582N779l2242n9593l1290K6451M9797
36085D584K2403j2849j8583O42K4634M1152L8922J2576j8561k7564j9225j9731
36073B8400k7548j6689O943L649l0112m3157p952L4031M1321L6026N0532N7313
36061A32757J5216m6171n7838j1537L6072M9378L9317R858m8394j03817r6162
$$ plain form
36050 -81321 -107920 -79592 -57122 -55929 -35544 23658 85585 110280 97960 67014 24714 -22013
36038 -22013 -55215 -62940 -46429 -1685 77129 162426 194500 146119 66570 34904 80424 168320
36026 168320 247305 285151 269069 205228 123554 59872 23585 -4142 -36487 -61044 -61366 -43431
36014 -43431 -26402 -15447 -772 18319 27646 23256 24410 46056 72047 78130 72291 81523 98864
36001 98864 81932 19447 -37091 -36623 5050 37343 50583 76077 122485 158775 160987 135585
35989 135585 94190 44940 12039 20329 51357 58155 34819 24102 40570 42311 9579 -5678
35977 -5678 41393 106663 116536 78166 60701 81249 82647 31363 -27286 -34485 8453 56172
35965 56172 74143 56307 16358 -19616 -33539 -39385 -64609 -104888 -130779 -145219 -189795 -272772
$$ packed form
36050h1321k6599K8328K2470J193K0385N9202O1927K4695j2320l0946m2300m6727
36038b2013l3202p725J6511M4744P8814Q5297L2074m8381p9549l1666M5520Q7896
36026A68320P8985L7846j6082o3841q1674o3682l6287k7727l2345k4557l22J7935
36014d3431J7029J0955J4675J9091R327m390J154K1646K5991O083n839R232J7341
36001I8864j6932o2485n6538M68M1673L2293J3240K5494M6408L6290K212k5402
35989A35585m1395m9250l2901Q290L1028O798k3336j0717J6468J741l2732j5257
35977e678M7071O5270R873l8370j7465K0548J398n1284n8649p199M2938M7719
35965E6172J7971j7836l9949l5974j3923n846k5224m0279k5891j4440m4576q2977
$$ plain form
35953 -272772 -334302 -319328 -254199 -211770 -223062 -263469 -307796 -351658 -383473 -381474 -348232 -315151
35941 -315151 -302536 -300694 -296430 -290589 -281140 -257581 -225897 -212804 -227235 -240526 -226416 -201527
35929 -201527 -201773 -234265 -279495 -327119 -374887 -398739 -366525 -291411 -232929 -222958 -222718 -183663
35917 -183663 -124350 -103569 -129453 -145652 -115652 -74690 -73700 -106819 -128525 -120626 -104473 -96469
35905 -96469 -89155 -78342 -76215 -87436 -97439 -97692 -103511 -131604 -171485 -191847 -170194 -112487 -52165
35892 -52165 -29047 -52935 -86035 -81575 -44562 -28733 -62094 -105398 -107712 -76174 -56946 -66929
35880 -66929 -85298 -100647 -118073 -120262 -76201 -6359 11912 -60738 -162541 -203695 -175619 -141611
35868 -141611 -137725 -137194 -111466 -73653 -46759 -30260 -18268 -18729 -34211 -49487 -54875 -56330 -50128
$$ packed form
35953b72772o1530J4974O5129M2429j1292m0407m4327m3862l1815J999L3242L3081
35941c15151J2615J842M264N841R449K3559L1684J3093j4431j3291J4110K4889
35929b01527k46l2492m5230m7624m7768k3852L2214P5114N8482R971K40L9055
35917a83663N9313K0781k5884j6199L0000M0962R90l3119k1706P899J6153Q004
35905i6469P314J0813K127j1221j0003k53n819k8093l9881k0362K1653N7707O0322
35892e2165K3118k3888l3100M460L7013J5829l3361m3304k314L1538J9228r983
35880f6929j8369j5349j7426k189M4061O9842J8271p2650j01803m1154K8076L4008
35868a41611L886N31K5728L7813K6894J6499J1992m61j5482j5276n388j455O202
$$ plain form
35855 -50128 -22972 4058 -23257 -109610 -170637 -132159 -41193 -11466 -71034 -137965 -151666 -147441
35843 -147441 -169795 -186974 -150479 -87961 -65819 -84777 -82750 -36411 4214 -5260 -41135 -49829
35831 -49829 -13052 45847 92910 101908 66203 14239 -4757 27330 70844 72109 24660 -31396
35819 -31396 -63640 -78373 -95132 -110669 -102401 -60035 783 56796 95322 107943 82599 22535
35807 22535 -35951 -56296 -57153 -99333 -196546 -273980 -255566 -170502 -121386 -150479 -192678 -176260
35795 -176260 -119073 -90447 -113573 -149491 -160888 -149660 -134806 -129084 -141705 -173746 -201760 -192034
35783 -192034 -145494 -106918 -109862 -128533 -111604 -58814 -31719 -74733 -150368 -180364 -140838 -84365
35771 -84365 -64572 -73128 -71128 -54890 -55489 -83074 -108083 -103973 -81843 -70935 -82353 -103042 -113387
$$ packed form
35855e0128K7156K7030k7315q6353o1027L8478R0966K9727n9568o6931j3701M225
35843a47441k2354j7179L6495O2518K2142j8958K027M6339M0625r474l5875q694
35831d9829L6777N8899M7063Q998l5705n1964j8996L2087M3514J265m7449n6056
35819c1396l2244j4733j6759j5537Q268M2366O0818N6013L8526J2621k5344o0064
35807B2535n8486k0345q57m2180r7213p7434J8414Q5064M9116k9093m2199J6418
35795a76260N7187K8626k3126l5918j1397J1228J4854N722j2621l2041k8014R726
35783a92034M6540L8576k944j8671J6929N2790K7095m3014p5635k9996L9526N6473
35771h4365J9793q556K000J6238n99k7585k5009M110K2130J0908j1418k0689j0345
$$ plain form
35758 -113387 -101995 -72352 -41901 -29199 -39805 -67485 -101063 -120663 -102293 -49916 -13542
35747 -13542 -43324 -124574 -189081 -195415 -166067 -138095 -114652 -83475 -48678 -18138 13159 40107
$$ packed form
35758a13387J1392K9643L0451J2702j0606k7680l3578j9600J8370N2377L6374
35747a3542k9782q1250o4507o334K9348K7972K3443L1177L4797L0540L1297K6948
$$ [...]
##END NTUPLES=NMR SPECTRUM
##END=
