##TITLE=31Pdec_LR-716-C2-2
 H2O, 24 sc
 30.6.2020
##JCAMPDX= 6.0         $$ Bruker NMR JCAMP-DX V2.0
##DATA TYPE= NMR SPECTRUM
##DATA CLASS= NTUPLES
##ORIGIN= UXNMR, Bruker Analytische Messtechnik GmbH
##OWNER= root
$$ XWIN-NMR		Version 3.5
$$ Tue Jun 30 10:52:44 2020 Russian Standard Time (UT+4h)  she@DPX200
##.OBSERVE FREQUENCY= 81.013821
##.OBSERVE NUCLEUS= ^31P
##.ACQUISITION MODE= SIMULTANEOUS
##.ACQUISITION SCHEME= undefined
##.AVERAGES= 24
##.DIGITISER RES= 17
##SPECTROMETER/DATA SYSTEM= spect
##.PULSE SEQUENCE= zgpg30
##.SOLVENT NAME= CDCl3
##.SHIFT REFERENCE= (INTERNAL, CDCl3, 0, 182.463)
##AUDIT TRAIL= $$ (NUMBER, WHEN, WHO, WHERE, WHAT)
$$ ##TITLE= Audit trail, XWIN-NMR		Version 3.5
$$ ##JCAMPDX= 5.01
$$ ##ORIGIN= Bruker BioSpin GmbH
$$ ##OWNER= she
$$ F:/spectra/data/she/nmr/P31/1/pdata/1/auditp.txt
$$ ##AUDIT TRAIL=  $$ (NUMBER, WHEN, WHO, WHERE, WHAT)
(   1,<2020-06-30 10:51:13.46 +0400>,<she>,<DPX200>,
      <created by zg, POWCHK disabled, PULCHK disabled
       configuration hash MD5:
       00 E9 B6 7A A2 85 ED C7 34 08 36 98 17 FE 4E 26
       data hash MD5: 32K
       7D B6 01 D6 F9 91 90 40 AD A8 00 C8 89 A3 7C E7>)
(   2,<2020-06-30 10:51:30.92 +0400>,<she>,<DPX200>,
      <Start of raw data processing
       efp BC_mod = 2 LB = 1 FT_mod = 6 PKNL = 1 PHC0 = -1878.4 PHC1 = 548.002 SI = 64K 
       data hash MD5: 64K
       D7 A8 AD 2E 69 89 D9 6C 6C 7B C9 47 3A 70 FF E8>)
(   3,<2020-06-30 10:52:12.50 +0400>,<she>,<DPX200>,
      <pk PHC0 = 231.956 PHC1 = -586.3999 
       data hash MD5: 64K
       E8 B2 37 95 22 D7 3C 64 2D BE 4A 91 55 B5 39 C9>)
$$ ##END=
$$ 
$$ hash MD5
$$ F7 06 CA 85 07 04 9C 3C 1F 79 96 0A 00 AF B0 13
##$RELAX= 
##$RELAX= 
##$RELAX= 
##$RELAX= 
##$RELAX= 
##$RELAX= 
##$RELAX= 
##$RELAX= 
$$ Bruker specific parameters
$$ --------------------------
##$DU= <F:/spectra>
##$EXPNO= 1
##$NAME= <P31>
##$PROCNO= 1
##$TYPE= <nmr>
##$USER= <she>
##$AMP= (0..31)
100 100 100 100 100 100 100 100 100 100 100 100 100 100 100 100 100 100 
100 100 100 100 100 100 100 100 100 100 100 100 100 100 
##$AQSEQ= 0
##$AQ_mod= 1
##$AUNM= <au_zg>
##$AUTOPOS= <>
##$BF1= 81.014009
##$BF2= 200.13
##$BF3= 200.13
##$BF4= 200.13
##$BF5= 200.13
##$BF6= 200.13
##$BF7= 200.13
##$BF8= 200.13
##$BYTORDA= 1
##$CFDGTYP= 0
##$CFRGTYP= 5
##$CHEMSTR= <none>
##$CNST= (0..31)
1 1 145 1 1 1 1 1 1 1 1 1 1 1 1 1 1 1 1 1 1 1 1 1 1 1 1 1 1 1 1 1 
##$CPDPRG= <waltz16>
##$CPDPRG1= <>
##$CPDPRG2= <waltz16>
##$CPDPRG3= <>
##$CPDPRG4= <mlev>
##$CPDPRG5= <mlev>
##$CPDPRG6= <mlev>
##$CPDPRG7= <mlev>
##$CPDPRG8= <mlev>
##$CPDPRGB= <>
##$CPDPRGT= <>
##$D= (0..31)
0 1 0 0 0 0 0 0 0 0 0 0.03 2e-05 3e-06 0 0 0 0 0 0 0 0 0 0 0 0 0 0 0 0 
0 0 
##$DATE= 1593499872
##$DBL= (0..7)
120 120 120 11 120 120 24 19 
##$DBP= (0..7)
150 150 150 150 150 150 150 150 
##$DBP07= 0
##$DBPNAM0= <>
##$DBPNAM1= <>
##$DBPNAM2= <>
##$DBPNAM3= <>
##$DBPNAM4= <>
##$DBPNAM5= <>
##$DBPNAM6= <>
##$DBPNAM7= <>
##$DBPOAL= (0..7)
0.5 0.5 0.5 0.5 0.5 0.5 0.5 0.5 
##$DBPOFFS= (0..7)
$$ [...]
##$SUBNAM2= <"">
##$SUBNAM3= <"">
##$SUBNAM4= <"">
##$SUBNAM5= <"">
##$SUBNAM6= <"">
##$SUBNAM7= <"">
##$SUBNAM8= <"">
##$SUBNAM9= <"">
##$SW= 369.568048894756
##$SWIBOX= (0..15)
0 1 3 0 0 0 0 0 0 0 0 0 0 0 0 0 
##$SW_h= 29940.119760479
##$TD= 32768
##$TD0= 1
##$TE= 0
##$TE2= 300
##$TE3= 300
##$TEG= 300
##$TL= (0..7)
0 120 53 12 22 120 120 120 
##$TP= (0..7)
150 150 150 150 150 150 150 150 
##$TP07= 0
##$TPNAME0= <>
##$TPNAME1= <>
##$TPNAME2= <>
##$TPNAME3= <>
##$TPNAME4= <>
##$TPNAME5= <>
##$TPNAME6= <>
##$TPNAME7= <>
##$TPOAL= (0..7)
0.5 0.5 0.5 0.5 0.5 0.5 0.5 0.5 
##$TPOFFS= (0..7)
0 0 0 0 0 0 0 0 
##$TUNHIN= 0
##$TUNHOUT= 0
##$TUNXOUT= 0
##$USERA1= <user>
##$USERA2= <user>
##$USERA3= <user>
##$USERA4= <user>
##$USERA5= <user>
##$V9= 5
##$VALIST= <valist>
##$VCLIST= <CCCCCCCCCCCCCCC>
##$VD= 0
##$VDLIST= <DDDDDDDDDDDDDDD>
##$VPLIST= <PPPPPPPPPPPPPPP>
##$VTLIST= <TTTTTTTTTTTTTTT>
##$WBST= 1024
##$WBSW= 4
##$XGAIN= (0..3)
0 0 0 0 
##$XL= 0
##$YL= 0
##$YMAX_a= 45634
##$YMIN_a= -48758
##$ZGOPTNS= <>
##$ZL1= 120
##$ZL2= 120
##$ZL3= 120
##$ZL4= 120
##$ABSF1= 0
##$ABSF2= 0
##$ABSG= 0
##$ABSL= 0
##$ALPHA= 0
##$AQORDER= 0
##$ASSFAC= 0
##$ASSFACI= 0
##$ASSFACX= 0
##$ASSWID= 0
##$AUNMP= <proc_1d>
##$AZFE= 0.1
##$AZFW= 0.5
##$BCFW= 0
##$BC_mod= 2
##$BYTORDP= 0
##$COROFFS= 0
##$CY= -3
##$DATMOD= 1
##$DC= 0
##$DFILT= <>
##$DTYPP= 0
##$F1P= 0
##$F2P= 0
##$FCOR= 1
##$FTSIZE= 65536
##$FT_mod= 6
##$GAMMA= 0
##$GB= 0
##$INTBC= 1
##$INTSCL= 5.30512e-09
##$ISEN= 30
##$LB= 1
##$LEV0= 0
##$LPBIN= 0
##$MAXI= 10000
##$MC2= 0
##$MEAN= 0
##$ME_mod= 0
##$MI= 50
##$NCOEF= 0
##$NC_proc= -3
##$NLEV= 6
##$NOISF1= 182.463
##$NOISF2= 159.3651
##$NSP= 0
##$NTH_PI= 0
##$NZP= 0
##$OFFSET= 182.463
##$PC= 4
##$PHC0= -1646.444
##$PHC1= -38.39789
##$PH_mod= 1
##$PKNL= yes
##$PPARMOD= 0
##$PSCAL= 0
##$PSIGN= 0
##$REVERSE= no
##$SF= 81.0140089999434
##$SI= 65536
##$SIGF1= 159.3651
##$SIGF2= -187.1042
##$SINO= 113.3802
##$SIOLD= 16384
##$SREGLST= <1H.CDCl3>
##$SSB= 0
##$STSI= 65536
##$STSR= 0
##$SW_p= 29940.119760479
##$SYMM= 0
##$S_DEV= 0
##$TDeff= 32768
##$TDoff= 0
##$TI= <>
##$TILT= no
##$TM1= 0
##$TM2= 0
##$TOPLEV= 0
##$USERP1= <user>
##$USERP2= <user>
##$USERP3= <user>
##$USERP4= <user>
##$USERP5= <user>
##$WDW= 1
##$XDIM= 65536
##$YMAX_p= 364150300
##$YMIN_p= -6054421
$$ End of Bruker specific parameters
$$ ---------------------------------
##NTUPLES= NMR SPECTRUM
##VAR_NAME=  FREQUENCY,     SPECTRUM/REAL,   SPECTRUM/IMAG
##SYMBOL=    X,             R,               I
##VAR_TYPE=  INDEPENDENT,   DEPENDENT,       DEPENDENT
##VAR_FORM=  AFFN,          ASDF,            ASDF
##VAR_DIM=   65536,         65536,           65536
##UNITS=     HZ,            ARBITRARY UNITS, ARBITRARY UNITS
##FACTOR=    0.456856943014862, 1,           1
##FIRST=     14782.0589164792, 0,            0
##LAST=      -15158.0608439998, 0,           0
##MIN=       -15158.0608439998, -6054421,    0
##MAX=       14782.0589164792, 364150300,    0
$$ Real data points
##PAGE= N=1
##DATA TABLE= (X++(R..R)), XYDATA
$$ [...]
42035A86627j67310k08798n3789J59512K50440J43390p0445k01406j56069n9386
42025a77234q5199j81858j28776J09101K86141K29139Q4644N8153Q6405j4060
42015B66456j97740k41316r3798N8010P0543q024p7843r9367n6640K8818M9893
42004c01008n5703j45415l6051J85264K45838J00618o40P2211J22226k9463k36261
41993g8384k54435r1341O8304J29414R5049l8581j95661j76832P1789K73613J56719
41982d0346j28149j99999P055J85046J24439m7331j34900j11845k0226J21102
41972b45154K18472J35602p4224j67157m2614J11517J10318J3405m3544n9297
41962d2676o1296J8488J79287K31828N5045j60016j51571K2505P5876p3392k02084
$$ plain form
42035 186627 19317 -189481 -243270 -83758 166682 310072 239627 38221 -117848 -177234
42025 -177234 -262433 -444291 -573067 -463966 -177825 51314 135958 194111 280516 266456
42015 266456 68716 -172600 -266398 -208388 -137845 -145869 -223712 -323079 -379719 -350901 -301008
42004 -301008 -356711 -502126 -538177 -352913 -107075 -6457 -7097 65114 187340 157877 -78384
41993 -78384 -332819 -424160 -355856 -226442 -131393 -169974 -365635 -542467 -470678 -197065 -40346
41982 -40346 -168495 -368494 -361439 -176393 -51954 -99285 -234185 -346030 -366256 -245154
41972 -245154 -26682 108920 34696 -132461 -175075 -63558 46760 60165 16621 -42676
41962 -42676 -103972 -85484 93803 325631 380676 220660 69089 91594 167470 94078 -108006
41951a08006j25792O2271J52953P9678m6759q4803j2492M2965l5818j51439p0965
41940b98207K16960L98349K45904l7455j20350l6911o7100k21066k27348l7893
41930a85117O3325l8874p6871J16005K70818J19901j30348j21504P6102J06176
41920A99613p1670j48223j4398P4743k8125j07038K0902J61929M7015k31511l51838
41909d48601k13427o821J06443J47279J57973J03373j2688r2914q1466l9016j9980
41898c99845J9066J10793J71396J10131j0172l6843O1407J50045J12490p980r0098
41887A90390r3190p4725q2241r0793n4529J6464N5341J7434m8504l6831Q0416
41876a20768J84229J36814k7692j28349q1115j5739p1293j66913j12618Q8773
$$ plain form
41951 -108006 -233798 -171527 -18574 61104 14345 -70458 -82950 -39985 -75803 -227242 -298207
41940 -298207 -81247 317102 563006 525551 405201 368290 301190 80124 -147224 -185117
41930 -185117 -121792 -160666 -237537 -121532 149286 269187 138839 17335 93437 199613
41920 199613 127943 -20280 -34678 40065 11940 -95098 -74196 87733 134748 -96763 -448601
41909 -448601 -662028 -668849 -562406 -415127 -257154 -153781 -166469 -259383 -340849 -379865 -399845
41898 -399845 -380779 -269986 -98590 11541 1369 -35474 25933 175978 288468 280488 190390
41887 190390 97200 22475 -59766 -150559 -205088 -188624 -133283 -115849 -164353 -201184 -120768
41876 -120768 63461 200275 172583 44234 -36881 -52620 -123913 -290826 -403444 -314671
41866c14671K09914J01416j07062j81880o9677P9031J12214J5958j20011j98095
41856d72863j71733o0423P2172J60348J62416P6314l1913m9569N3817J38493M6158
41845g6783j55692k20309n6355J37864J63367Q5411O7161Q4096Q237j18995j35628
41834b17626m1660Q969m469N3595J71328J38116r0262k33454p6340J88980K29453
41823A26630K6424j64503j93341j17447p932R7496R9181n6130j96786j11188R6580
41812d01016J13286r6775k16496p1026J16132J16508M5843R2369J56695N5907
41802h8573j05021r1936M9575P4311m1219q7862j2045J6763m6434l2910J04356
41791b60995J73178Q0422O024Q3476J59959O3709j03408j45257p0489j2018M092
$$ plain form
41866 -314671 -104757 -3341 -110403 -292283 -361960 -282929 -170715 -154757 -274768 -472863
41856 -472863 -644596 -705019 -632847 -472499 -310083 -233769 -265682 -315251 -261434 -122941 -76783
41845 -76783 -232475 -452784 -509139 -371275 -207908 -122497 -55336 28760 36997 -81998 -217626
41834 -217626 -259286 -250317 -254786 -201191 -29863 108253 17991 -215463 -291803 -102823 126630
41823 126630 153054 -11449 -204790 -322237 -330169 -232673 -133492 -189622 -386408 -497596 -401016
41812 -401016 -287730 -384505 -601001 -672027 -555895 -439387 -393544 -301175 -144480 -88573
41802 -88573 -193594 -285530 -235955 -161644 -202863 -290725 -302770 -286007 -332441 -365351 -260995
41791 -260995 -87817 -7395 -1371 82105 242064 305773 202365 57108 -13381 -25399 -21307
41780b1307J7502j203n9824n8616K3550K0403j34261j94413M4603L39367K89671
41769B65472n4383k50107j11450P4976M3303r3428j11454j7261M5711K8819k4040
41758b03842o1991l0550O5555Q6913n8451j74978m268L00773K91799r3653l71148
41747b53841k20205M8759K9560j49629j20234R7156K07310J83362K23086K79009
41737C24333J09639k27801l81386k33593l2396M8879R9378J57914J03443l2697
41727f4287j7868J69512K23721j4939k87885l16320j75757n7767N6114K24209
41717b61267K96345J30938j11899j68018l3107R7484J17218K9064j60780l45779
41707d09801k91115M1936L17520K53847M7947L5698J13393n7809l80623l88406
$$ plain form
41780 -21307 -3805 -5008 -64832 -123448 -99898 -79495 -213756 -408169 -363566 -24199 265472
41769 265472 211089 -39018 -150468 -75492 -32189 -125617 -237071 -254332 -208621 -179802 -203842
41758 -203842 -265833 -296383 -230828 -143915 -202366 -377344 -381612 -80839 210960 117307 -253841
41747 -253841 -474046 -425287 -395727 -545356 -665590 -568434 -361124 -177762 45324 324333
41737 324333 433972 206171 -175215 -408808 -441204 -392325 -292947 -135033 -31590 -64287
41727 -64287 -82155 87357 311078 296139 8254 -308066 -483823 -541590 -485476 -261267
41717 -261267 35078 166016 54117 -113901 -147008 -49524 67694 96758 -64022 -409801
41707 -409801 -700916 -658980 -341460 -87613 -39666 -3968 109425 51616 -329007 -717413
41697g17413k0292K12052J7564k08500k8716L27800L30831k3522k26563l0191
41687c66950K29627J66908j27187k70968j17428J08369J45270R970p6607n22J16388
41676a83130J25150P2792R1554J37747M1301j78510k75514j39436K4755K4518
41666b58773k3270O7533J95141J30359p7034j62092p4146k4714q8005q1083O4317
41655c31767J27893k6084j73102o4849J62557J91730K881j38091j04587l6903
41645c90322m6806o0477j1768L1800K0253J5667M8389M2641k2380l4991N6804
41634c51190J24407N9348l9409k8783M6444N8803L7137R5110J78058J08417j12240
41623A76102k60034j95250k6900R2360J55640J92744J44578r800j27763p0377
$$ plain form
41697 -717413 -737705 -525653 -508089 -716589 -745305 -417505 -86674 -110196 -336759 -366950
41687 -366950 -137323 29585 -97602 -368570 -485998 -377629 -232359 -222389 -298996 -299518 -183130
41676 -183130 -57980 14812 106366 244113 285414 106904 -168610 -308046 -283291 -258773
41666 -258773 -282043 -214510 -19369 110990 33956 -128136 -202282 -226996 -315001 -396084 -331767
41655 -331767 -203874 -229958 -403060 -467909 -305352 -113622 -110741 -248832 -353419 -390322
41645 -390322 -437128 -497605 -509373 -477573 -457320 -441653 -393264 -350623 -373003 -407994 -351190
41634 -351190 -226783 -167435 -206844 -235627 -189183 -130380 -93243 1867 179925 288342 176102
41623 176102 -83932 -279182 -306082 -213722 -58082 134662 279240 269440 141677 71300
41613G1300Q1169J34401O0399j690P403j2440j19657k03380j42977J123N9657
41602f4692j8175j00127m8513R3414J44172J5825j50507j44429L6651J68818R0690
41591B3127r8069k05046k03213j86443j49941o387J93648K60752J37123r818m2515
41580b86782l0709o2787n2203R2197K33387J67565m1963j24708K113J21173N0961
41569F8244j09180j72599j35383j09662j02213k3312J29739K38249K12644Q9637
41559H6164k2055m1068K2412O4017j0625j45268j72519m7635O2123K1575n0457
41548b33336L5895K16748K42066N0514j43199j74622j30522j35781j36537l8148
41538d46922R2184J30906J04647J18719J46896P2446q5560j62044q6523R852j4445
$$ plain form
41613 71300 152469 286870 347269 345579 352982 340542 220885 17505 -125472 -124349 -64692
41602 -64692 -82867 -182994 -231507 -138093 6079 21904 -128603 -273032 -236381 -67563 23127
41591 23127 -74942 -279988 -483201 -669644 -819585 -825972 -632324 -371572 -234449 -244267 -286782
41580 -286782 -317491 -380278 -432481 -340284 -106897 60668 18705 -106003 -103890 17283 68244
41569 68244 -40936 -213535 -348918 -458580 -560793 -584105 -454366 -216117 -3473 86164
41559 86164 64109 23041 45453 109470 98845 -46423 -218942 -266577 -204454 -182879 -233336
41548 -233336 -197441 19307 261373 311887 168688 -5934 -136456 -272237 -408774 -446922
41538 -446922 -354738 -223832 -119185 -466 146430 218876 133316 -28728 -115251 -105399 -119844
41527a19844j12143j12818N3480K53109K76454O5377k01047k86272j55420J6127
41517c22997R2885J14178J31657P0969j10167k52346j74083M1559J36895L8690
41507b32760o2171p812J22677J55737L8849j31035j98356o2686J95088L25698
41497A43229J84331m8452r2428K7582L8423j24401k06869o1970J06625Q2779l2812
41486A6037l2312O6853J19046J11035J00967M1992j01539j88145r0837N1490K1951
41475A16538j26459j71007r1976o4738j23855j28405n5663l5584o7756R69J56858
41464e91078J72224j5667j52822m4878J49871J76899M3436n9315m2281L8697J04194
41453b20720P9424p2197k26319j66548Q9772K22111M8178j58384n2690K31954
$$ plain form
41527 -119844 -231987 -344805 -291325 -38216 238238 303615 102568 -183704 -339124 -322997
41517 -322997 -230112 -115934 15723 86692 -23475 -275821 -449904 -408345 -271450 -232760
41507 -232760 -294931 -302743 -180066 -24329 14520 -116515 -314871 -377557 -182469 143229
41497 143229 327560 279108 186680 214262 252685 128284 -78585 -140555 -33930 48849 16037
41486 16037 -16275 50578 169624 280659 381626 423618 322079 133934 43097 94587 116538
41475 116538 -9921 -180928 -272904 -337642 -461497 -589902 -645565 -681149 -748905 -747936 -591078
41464 -591078 -418854 -434521 -587343 -632221 -482350 -305451 -262015 -321330 -363611 -324914 -220720
41453 -220720 -141296 -213493 -439812 -606360 -516588 -294477 -246299 -404683 -457373 -225419
41443b25419K54331p0160l32553k17995Q5490K11315J02987j7369r362O7054J16735
41432c4946J07407K5225j16489k17460j60755L2250K05863K45885J68930L1840
41422B87750j29211k26839j32105J22492K59529O2548k77688l41771l6481K60177
41412a51599K16622j5708q1551M7504J07034J0395m3395M9486J19277K8147j06430
41401A79782j40205j35001j86732k03825o5411J30359J91167J16985N4216K5869
41391c2796p3814k30225k66736j00137J18102J82538O1612r7796j29182M946J72570
41380c90918J93703M8303q7061p2933N596q082r0885j01669l2037R7j2164N1487
41368d96563J86507K10401M8654j13196q9183M3000Q2614o86p3565p0643n7429
$$ plain form
41443 -225419 28912 -41248 -373801 -591796 -506306 -294991 -192004 -209373 -218735 -151681 -34946
41432 -34946 72461 97686 -18803 -236263 -397018 -364768 -158905 86980 255910 287750
41422 287750 158539 -68300 -200405 -77913 181616 244164 -33524 -375295 -411776 -151599
41412 -151599 65023 49315 -32236 15268 122302 132697 89302 138788 258065 286212 179782
41401 179782 39577 -95424 -282156 -485981 -551392 -421033 -229866 -112881 -58665 -32796
41391 -32796 -106610 -336835 -603571 -703708 -585606 -403068 -341456 -439252 -568434 -563488 -390918
41380 -390918 -197215 -148912 -235973 -308906 -303310 -311392 -402277 -503946 -535983 -535886 -548050 -496563
41368 -496563 -310056 -99655 -51001 -164197 -253380 -210380 -127766 -128452 -202017 -272660 -330089
41357c30089q3282j12408j09698q1366j3674J22177K70436K98163J69415L4103
41347A63777M6124J35239Q4775j48009l21989k14107O4761K03008J00051l3517
41337H0113j9160L4794n9692k52844l22454j88188J2191J38714J83281J82538
41327b10707J41420P7486L1523L606l5394o6192n3769m7260j20141k10297j72024
41316f61749j4363P9827L4136K248J01314J87941P6142j29895j36184J23668L63661
41305B6746K96281j9688k67577k42989m7706P6767L4345n9182p1551k8716l6966
41294c40236r1627p4958N4320J78394J71484N6551l9546l5119M0152Q4898J2620
41283A6933j52421k63081k01216l8563M5735N682l6672j0312Q733k3322j4143
$$ plain form
41357 -330089 -413371 -525779 -635477 -716843 -730517 -608340 -337904 -39741 129674 163777
41347 163777 209901 345140 429915 281906 -40083 -254190 -189429 13579 113630 80113
41337 80113 60953 95747 36055 -216789 -539243 -727431 -715240 -576526 -393245 -210707
41327 -210707 -69287 8199 39722 43328 7934 -58258 -112027 -159287 -279428 -489725 -661749
41316 -661749 -676112 -596285 -562149 -559901 -458587 -270646 -194504 -324399 -460583 -336915 26746
41305 26746 323027 303339 35762 -207227 -254933 -178166 -143821 -203003 -274554 -303270 -340236
41294 -340236 -431863 -506821 -452501 -274107 -102623 -46072 -85618 -120737 -80585 4313 16933
41283 16933 -135488 -398569 -599785 -638348 -592613 -586931 -623603 -633915 -625182 -648504 -662647
41272f62647Q0199J25868K0924r6681m2256J04455R9492q6342k10694j14294O1013
41261g20963R3479j7807q4203P930J62001J98486P2047o8545o0785N4639Q4880
41250b78841l0706j21649n4928M6785J7009n1087N0656K59203K77236K2119k31275
41239i5478k46613j19180l7274J8743J39286K31106J52433k594j6287R5068R1408
41228B10618j04611k72011k18590l5718R2048J55274K33117K68064J38111q9518
41218C76784j85498p1863O3193L6758q6854j35372r2314o5541n7690M3670K35602
41207F0875L38370K39828O2032k0932j8769m4873q4572j6660J51234K40096J37137
41196A043766n5124j74480j99728k09851k20569j73875o7714Q658l318m2701j5053
$$ plain form
41272 -662647 -582448 -456580 -435656 -532337 -574593 -470138 -370646 -456988 -667682 -781976 -720963
41261 -720963 -627484 -645291 -729494 -721564 -559563 -361077 -289030 -357575 -418360 -363721 -278841
41250 -278841 -309547 -431196 -486124 -439339 -422330 -473417 -422761 -163558 113678 135797 -95478
41239 -95478 -342091 -461271 -498545 -479802 -340516 -109410 43023 40429 24142 119210 210618
41228 210618 106007 -166004 -384594 -420312 -328264 -172990 60127 328191 466302 376784
41218 376784 191286 119423 182616 219374 132520 -2852 -95166 -160707 -218397 -174727 60875
41207 60875 399245 639073 701105 680173 661404 616531 531959 515299 666533 906629 1043766
41196 1043766 988642 814162 614434 404583 184014 10139 -57575 -48917 -52235 -94936 -109989
41185a09989O4188Q2263R04n5936L8727K06359K31765N8200j17677j18206k4306
41174B56292j5206p6527n4255N4769Q5807q243p4364k9328R00o6915q1289R1375
41162H3016K68891J58500j92264m03136k53315N2056J97335J54726J18185J61041
41152C45035J56483K2896j27793j53101p8738l7266o4933o7073J8332J17917J19071
41141B50830P930j26998j85724j23365K4887J54385J77729J25225R0913O3587
41131D59399o3433k56649k87434o0117J64579J02041j19354j48415K5977O6852
41121a16554j21596k00063M1959L00383K16579p0410j77649o9756r515n2281n836
41110b64739J43589J71742K7555o0274K2392J02726N6823N764L3886J5069r8663
$$ plain form
41185 -109989 -45801 36462 37366 -18570 20157 226516 458281 516481 398804 280598 256292
41174 256292 241086 164559 110304 165073 250880 242637 168273 138945 139845 72930 -8359 83016
41162 83016 351907 510407 318143 -84993 -338308 -286252 -88917 65809 183994 345035
41152 345035 501518 524414 396621 243520 164782 127516 62583 -4490 13842 131759 250830
41141 250830 258760 131762 -53962 -177327 -152440 1945 179674 304899 395812 459399
41131 459399 395966 139317 -148117 -208234 -43655 58386 -60968 -209383 -183406 -116554
41121 -116554 -238150 -438213 -396254 -95871 120708 50298 -127351 -197107 -206622 -258903 -264739
41110 -264739 -121150 50592 78147 17873 40265 142991 199814 205578 239464 254533 155870
41099A55870j10177O6936J57819o8998l65061l23925j37J76610N5294o0984N2881
41088b63872K00728J16900j11559j93866m6816J49591K22467J55033P336j53351
41078H2591k34475j52612O1425K44857K39946N2223j41440j63029k3076Q8805
41068E5215L4048r6452j06018L1561J27789L7206j42728k01309q2524O3200Q0331
41057a99681j2290o9445j2982O8386L7732r4254j61713o3875Q2917R9849j470
41046c26826m9914J2126M3312n2647j41747m1332J95713L20658J97705m1812j72438
41035e7202j18979N725N3768j0660j03596j29160p1132K8259J38496K31690K31931
41024A99140Q2218j16727j60309r306J12228J3463j65935j35478J11439K58708
$$ plain form
41099 155870 45693 112629 270448 201450 -163611 -487536 -487673 -311063 -255769 -316753 -263872
41088 -263872 -63144 53756 -57803 -251669 -298485 -148894 73573 228606 235942 82591
41078 82591 -151884 -304496 -243071 1786 241732 293955 152515 -10514 -33590 55215
41068 55215 89263 -7189 -113207 -81646 46143 83349 -59379 -260688 -343212 -280012 -199681
41057 -199681 -211971 -281416 -294398 -226012 -188280 -282534 -444247 -508122 -425205 -325356 -326826
41046 -326826 -376740 -364614 -321302 -373949 -515696 -557028 -361315 -40657 157048 115236 -57202
41035 -57202 -176181 -170456 -116688 -127348 -230944 -360104 -431236 -402977 -264481 -32791 199140
41024 199140 281358 164631 4322 -4984 107244 120707 -45228 -180706 -69267 189441
41014A89441J06679j51962k14660p5277K3793l2907r9206k2044J26643J54625
41004E125O258j72189k04440o4151J18381J93088J24124R746j7477P6822J82286
40993B57573J44320o3555k79055l05962j33831N1997J00938O4874P5707J29561
40983D2567J09945j008p4044k7515N1361M8850o005n615O3630J12575Q9163L7287
40971D41191Q098k1210j05667k28401k71671j33100J11295K25422Q1065j38326
40961c1304j41090P3320K00870P0895j10177q9338M9249N0038r0921j35328L132
40950a50654J34729R8224k7354q1395k3057Q6479J60730J09278p2131k13711j44876
40939a23738K7972K8812j62141k43991n4799J75991K05357J45752K09043K99494
$$ plain form
41014 189441 296120 144158 -70502 -145779 -121986 -154893 -254099 -276143 -149500 5125
41004 5125 11383 -160806 -365246 -429397 -311016 -117928 6196 15942 -1535 75287 257573
40993 257573 401893 338338 59283 -246679 -380510 -328513 -227575 -162701 -86994 42567
40983 42567 152512 151504 77460 49945 101306 150156 144151 138536 202166 314741 403904 441191
40971 441191 449289 428079 322412 94011 -177660 -310760 -199465 25957 107022 -31304
40961 -31304 -172394 -99074 101796 172691 62514 -26824 22425 72463 -18458 -153786 -150654
40950 -150654 -15925 82299 54945 -26450 -49507 36972 197702 306980 234849 21138 -123738
40939 -123738 -95766 -66954 -229095 -473086 -527885 -351894 -146537 -785 208258 507752
40929E07752J79839q7230k02515r2321J0360l6538r5985l1436P2810Q1731J7804
40918C24271j5044Q022L7671L1231k0707q0667p6704p778N757j05256k00093j12593
40906b11890O2045Q3044n9218j29477k1021J18504J74108J99889J97651N4873
40896D68508j76455k35938n5455Q4771J946q3119N1046K04361Q6588j54382j48662
40885D3209Q5215J78703J5903j26187p0766K1441J63m3365k5351l4216q7182r636
40873e2069K45311M02570K21602j34812l20456k59825j53936j27687j07704k6032
40863c13038N7964P1483L3076P683L1323R2238J37880J10283J4967o4675n4653
40852A24531K9853J09379J15050L7528n5462o3349K6209Q9563K4479q8529j05718
$$ plain form
40929 507752 687591 600361 397846 305525 315885 279347 183362 151926 224736 306467 324271
40918 324271 309227 317249 354920 386151 365444 284777 208073 200295 206052 100796 -99297 -211890
40906 -211890 -149845 -66801 -126019 -255496 -276517 -158013 16095 215984 413635 468508
40896 468508 292053 56115 660 85431 87377 4258 55304 259665 346253 191871 43209
40885 43209 128424 307127 323030 196843 126077 147518 147681 104316 78965 44749 -42433 -52069
40873 -52069 193242 595812 817414 682602 362146 102321 -51615 -179302 -287006 -313038
40863 -313038 -255074 -183591 -150515 -142832 -111509 -19271 118609 228892 243859 179184 124531
40852 124531 154384 263763 378813 416341 360879 297530 323739 413302 437781 349252 243534
40841B43534n3324o4172j06495q702K10388K91580J19002q8388j19079p2663j20956
40830B30725j73982m9213J64397J99463R689j80540k08367j30568n0214J1770
40820a76840N2841O3997Q2668J31343J19634m1515k51402l11875j94737m9592
40810e75478M1746J36393K52411L06377K59357J65385N3370q5326j86917j64107
40800B03211p3110n1849q7161m6314N2188M3333o5121m8626J56557K97545J82110
40789E62763l0363j09568j06564j84212k72539j81721L5691J24698J5288q0246
40779b26773M425J60969J75242n296k36965l37723k46668p2416J5681k8956r5861
40768h94341r5513q5530j50245k45417k62906j77145k8864J57054L26714L57391
$$ plain form
40841 243534 190210 126038 19543 10841 221229 512809 631811 543423 424344 351681 230725
40830 230725 56743 7530 171927 371390 381079 200539 -7828 -138396 -188610 -176840
40820 -176840 -123999 -60002 22666 154009 273643 232128 -19274 -331149 -525886 -575478
40810 -575478 -533732 -397339 -144928 161449 420806 586191 639561 554235 367318 203211
40800 203211 130101 78252 -8909 -55223 -3035 40298 -24823 -73449 83108 380653 562763
40789 562763 532400 422832 316268 132056 -140483 -322204 -286513 -161815 -146527 -226773
40779 -226773 -222348 -61379 113863 108567 -128398 -466121 -712789 -785205 -769524 -798480 -894341
40768 -894341 -989854 -1075384 -1225629 -1471046 -1733952 -1911097 -1939961 -1782907 -1456193 -1098802
40758a098802K03062J6087j9804P1014J18898N5936m3665j12414j19604r356K07907
40747g30741L44555K23636l6559j43469m5058J2666j06275k10723r6073J34564
40737f53477K34446J55428M9463J8314K8740L3156L2871K8480M824l3764o7384
40726a68903q1485n1711M5463J68719K15282J35176q355j27795j95984k05463
40716b75056j29061J2221J12462R0131j0056q1392p2900N20R5882J36405N0378
40705g0466j09907j70523n2213R1001O6903p9783j27661Q784J72912J92256Q2693
40694C996k6514p2598q5576q6182l8780Q6079K37825L02070K10158L1953p9879
40683D82552o4461k8445r6044k22228k41242j01036M4355K6988j11190j66623
$$ plain form
40758 -1098802 -895740 -879653 -899457 -828443 -709545 -653609 -697274 -809688 -929292 -938648 -730741
40747 -730741 -386186 -162550 -199109 -342578 -387636 -374970 -481245 -691968 -788041 -653477
40737 -653477 -419031 -263603 -214140 -195826 -167086 -133930 -101059 -72579 -67755 -101519 -168903
40726 -168903 -250388 -302099 -256636 -87917 127365 262541 254186 126391 -69593 -275056
40716 -275056 -404117 -391896 -279434 -189303 -199359 -280751 -353651 -353131 -257249 -120844 -70466
40705 -70466 -180373 -350896 -403109 -312108 -245205 -324988 -452649 -443865 -270953 -78697 3996
40694 3996 -22518 -95116 -180692 -266874 -305654 -219575 18250 320320 530478 562431 482552
40683 482552 418091 389646 293602 71374 -169868 -270904 -226549 -199561 -310751 -477374
40673d77374l8763J31237J33507m0364j80626j26227L2528Q3196l0224j53019
40663f66129j30042K7068J94956K69123K13305O8640m4842j9183R9014J35479
40653A47389J0369j50733j91640j18025k5386P1694K03839K95200K06423n5116
40643C94014k86592k95612r4727J26816J81378M0113j41088j68198j9959J29082
40633a34773J40226Q5563J02090J59057J17997k9038j55753k14328k57776k42741
40623d29476m1142K73048L83155J41343j62296j59486R0395K05732L6795j65292
40613A72776j70078q6934j21586k20444j74709K2938J56691J12659J8462N759
40603b84466J6558m1293r1642j3375J16054J03006m5580r8824L9538J49383J7070
$$ plain form
40673 -477374 -516137 -384900 -251393 -291757 -472383 -598610 -566082 -482886 -513110 -666129
40663 -666129 -796171 -769103 -574147 -305024 -91719 -23079 -67921 -87104 11910 147389
40653 147389 157758 7025 -184615 -302640 -328026 -256332 -52493 242707 449130 394014
40643 394014 107422 -188190 -282917 -156101 25277 65390 -75698 -243896 -263855 -134773
40633 -134773 5453 91016 193106 352163 470160 441122 285369 71041 -186735 -429476
40623 -429476 -470618 -197570 185585 326928 164632 5146 95541 301273 338068 172776
40613 172776 2698 -84236 -205822 -426266 -600975 -578037 -421346 -308687 -290225 -284466
40603 -284466 -267908 -309201 -400843 -414218 -298164 -195158 -240738 -339562 -300024 -150641 -133571
40592a33571k13194k23531J1970J82684Q3919j13828j36014K1089J32215O6867
40582c21394p9151j48246r7334j110M6320K1915p69O2706J72968J83065M6406
40571a14624p6087k5938J07904J15342K812n648J50875K14295j7886l36974l68261
40560c54190q9213J44345R2853q3780j17000j219P1096J6847n7988l0722J11022
40549b97949K80737L42785K04620n0941j95251j22810j0737p1163k26471k24131
40539c71311l1245J16490P9415n846J0689O1757K3191o4360q4294l2485K4093
40528b73906P6499J29488J21185K1743o6013l3537P2723J29204R6824R70j46667
40517A28513k81418k57946m9054J34225J02340l1283l2087Q4569J08440M500m2777
$$ plain form
40592 -133571 -346765 -570296 -558326 -375642 -291723 -405551 -541565 -520476 -388261 -321394
40582 -321394 -400545 -548791 -646125 -647235 -600915 -579000 -579769 -517063 -344095 -161030 -114624
40571 -114624 -190711 -216649 -108745 6597 9409 3761 154636 368931 351045 14071 -354190
40560 -354190 -443403 -299058 -206205 -289985 -406985 -408204 -337108 -320261 -378249 -408971 -297949
40549 -297949 -17212 325573 530193 479252 284001 161191 150454 79291 -147180 -371311
40539 -371311 -402556 -286066 -206651 -212497 -201808 -140051 -116860 -181220 -265514 -297999 -273906
40528 -273906 -197407 -67919 53266 75009 8996 -24541 48182 177386 274210 275180 128513
40517 128513 -152905 -410851 -459905 -325680 -223340 -254623 -286710 -202141 -93701 -89201 -131978
40506a31978M3541J21029Q5340R908k6324m3870m3824J6226Q0231K9490r7396
40495D2373j35410q2235j07465k13904j77715N6649K17181J18990l5067L920J29690
40484a82993R1720q3317j72733j24570n5576J7753J60622K94288K63628J06087
40474C14909J0613K2617J2317p5253j51628j61209j32525o7269L7340Q7494P261
40463i5333r2025o7148k982o1308j33504K7269L32148L90472J07360j23057j764
40452B80128K27344J69125j40883l47892l04147j74491r4282p508J47032K99821
40442E4247L43054K38505K8431j74571k42720j64906p2254n0028r170J40831K85249
40431C76668K34483R996j71559j86293j16140o9256m6249k5454m0973r9673j15894
$$ plain form
40506 -131978 -88437 32592 117932 127840 101516 57646 13822 30048 110279 139769 42373
40495 42373 -93037 -175272 -282737 -496641 -674356 -617707 -400526 -281536 -316603 -312683 -182993
40484 -182993 -91273 -174590 -347323 -471893 -527469 -509716 -349094 -54806 208822 314909
40474 314909 325522 348139 360456 285203 133575 -27634 -160159 -227428 -190088 -102594 -95333
40463 -95333 -187358 -254506 -257488 -318796 -452300 -425031 -92883 297589 404949 281892 280128
40452 280128 507472 676597 535714 187822 -116325 -290816 -385098 -392606 -245574 54247
40442 54247 397301 635806 664237 489666 246946 82040 9786 -40242 -49412 91419 376668
40431 376668 611151 621147 449588 263295 147155 77899 31650 6196 -34777 -134450 -250344
40420b50344j4098J51632K48176K11617R6678j1604q8623j50570j73234r4978
40410g5348O6700J63806P1949j28150k29795j61975n2570j1424N768N7787R1309
40399b01943N7598K6314N4898N6987n1611j72660j57701m2786L0211O3357J62680
40388a74656K75643K05114p1027l04214k88037j04211L9825P8953Q2819Q6590
40378a73201N5772k7005j29025j96962j77530n3124J10643K03097J78387Q0424
40368a28524l4314j19437j01715N1629K16656K10102M4458o8327l0296K118r7951
40357e5601j85589p0538J48403K05651O4188m5135J6504J09119M7206j40463k65307
40346a71562j91872N6645L16575L73806J39722k10083l63889k02089P2680J84254
$$ plain form
40420 -250344 -264442 -112810 135366 346983 443661 432057 343434 192864 19630 -75348
40410 -75348 -8648 155158 227107 98957 -130838 -292813 -345383 -356807 -351039 -293252 -201943
40399 -201943 -144345 -118031 -63133 -6146 -57757 -230417 -388118 -430904 -400693 -337336 -174656
40388 -174656 100987 306101 235074 -69140 -357177 -461388 -421563 -342610 -259791 -173201
40378 -173201 -117429 -144434 -273459 -470421 -647951 -701075 -590432 -387335 -208948 -128524
40368 -128524 -162838 -282275 -383990 -332361 -115705 94397 138855 70528 40232 42350 -55601
40357 -55601 -241190 -311728 -163325 42326 106514 61379 77883 187002 234208 93745 -171562
40346 -171562 -363434 -306789 9786 383592 523314 313231 -50658 -252747 -180067 4187
40336D187Q7574l8475l7225P2112J62588J47745M9670m5970p9640n3484J3431
40325B82513J16765K21892K45358J55146M7085K6131M3202k9790j74171k18379
40315G15752q7087Q3175J37082Q6593L1796Q970L888J9005L6754J296p7384q9223
40303H70617J5640J22296J05875K685p6309j05943j02404k4927J26014K05625
40293A139169R8264p5657j15676m6870n7852j68895k02997j03084l4560j02898
40283C28944j86269j52993o4367l9686o0255k8934P3069J78353K02388Q1525j48174
40272A83601k93580j85312N1835J05762q1447k05436n0693J85010K03235L9157
40262d7868n3421m467M2208J6675m894J8329M2391M8867L8874l8303j86364k53745
$$ plain form
40336 4187 91761 53286 16061 88173 250761 398506 448176 402206 322566 269082 282513
40325 282513 399278 621170 866528 1021674 1068759 1094890 1138092 1108302 934131 715752
40315 715752 628665 711840 848922 935515 967311 976281 980169 999174 1035928 1037224 959840 870617
40303 870617 886257 1008553 1114428 1117113 1040804 934861 832457 807530 933544 1139169
40293 1139169 1237433 1161776 1046100 999230 941378 772483 569486 466402 431842 328944
40283 328944 142675 -10318 -74685 -114371 -174626 -203560 -130491 47862 250250 331775 183601
40272 183601 -109979 -295291 -243456 -137694 -219141 -424577 -475270 -290260 -87025 -47868
40262 -47868 -101289 -105756 -63548 -46873 -51767 -33438 8953 57820 96694 58391 -127973 -381718
40250c81718j10436J18166J89036P3307m6562p2388o6194m9148M1636J67968J75831
40239C9498K3779j42171j88904j27432k1998Q4089J36097J05203O3219Q4824J04202
40228A60406K5703p8532q0968m4843j06887j66740o321K83123L43186Q1934j81129
40217B28932k07620j24755p3956M7971K68661L15023J8016l35596l84421j95597
40207d43342n5660J9351J79016L16091J89736r5893j66325M9596K08040Q8774
40197B89384j01191r6614L6532N9622p5342j92273j34807N6649J73493M1582k44744
40186a87709l57940j28355J90120K33252K3857r5458J2895J26006O8182l4137
40176a49287k5890J7658j8948n5990K1758J24293Q9459l8563o7825M8314J56289
$$ plain form
40250 -381718 -492154 -373988 -184952 -111645 -158207 -230595 -296789 -345937 -304301 -136333 39498
40239 39498 63277 -78894 -267798 -395230 -417228 -333139 -197042 -91839 -28620 56204 160406
40228 160406 186109 107577 26609 -18234 -125121 -291861 -298182 -15059 328127 410061 228932
40217 228932 21312 -103443 -177399 -129428 139233 454256 472272 136676 -247745 -443342
40207 -443342 -499002 -479651 -300635 15456 205192 109299 -57026 -7430 200610 289384
40197 289384 188193 91579 128111 187733 112391 -79882 -214689 -158040 15453 57035 -187709
40186 -187709 -545649 -674004 -483884 -250632 -226775 -322233 -309338 -183332 -115150 -149287
40176 -149287 -175177 -157519 -176467 -232457 -210699 -86406 3053 -35510 -103335 -55021 101268
40165A01268J36106M1203k2298m4249q5138j60453k05623j53910k5420Q3943J08531
40154b26040P8452N3956L2543k5293j02949j26301n4389P2112J64954J46090J2428
40143B5563j20364j00569P4081K19415J84895L8305n3496m4896n996J8354J5321
40132B50613n1454j60869j73984j4507J62285J56900J2907p5882p2479q1708r0443
40121a38621K87J02652J0073k18324k53654J1673K55261J74321r1544j87812k5557
40110c61245J69919J90399N3206p3448m7438J07710K04868J05865p9177j35079
40100A35580o0159m4644j28430j29779K2518J44356R7035p386l9623o2517j42729
40089b15778j65548k8208J53819K14497J61733Q1995j4240j01284p2971O7550
$$ plain form
40165 101268 237374 278577 256279 212030 126892 -33561 -239184 -393094 -418514 -334571 -226040
40154 -226040 -147588 -93632 -61089 -86382 -189331 -315632 -370021 -297909 -132955 13135 25563
40143 25563 -94801 -195370 -121289 98126 283021 321326 267830 222934 216938 235292 250613
40132 250613 199159 38290 -135694 -150201 12084 168984 181891 106009 33530 -48178 -138621
40121 -138621 -138334 -35682 -25609 -243933 -497587 -485914 -230653 -56332 -147876 -335688 -361245
40110 -361245 -191326 -927 52279 -21169 -68607 39103 243971 349836 270659 135580
40100 135580 75421 30777 -97653 -227432 -204914 -60558 36477 29091 -10532 -73049 -215778
40089 -215778 -381326 -409534 -255715 -41218 120515 202510 188270 86986 14015 81565
40079H1565J33578L4745o2753k4883K4495l1313n2104Q9344K16881J28231m0859
40068D96927n5052L565q0608k12522j32834Q8585J30442l9229j17472J1602J09131
40057B02535K1501p2958M097J40035J25478o0889k68557l24218j34776J90757
40047a76995L41237J32855j97808k71463q2567N8342M5587O4595J48211P5572
40037A37566j73038k73030o2582J66074J19290o2614q5158M4631J21864J00628
40027C3631P3495M6793j5814m8243K863L3658m9494j35884p6538O5995J21210
40016E1672O4507n594m5049n6267o872Q4679R3679k0652r2680O668J32599P8342
40004B85032q5158j15328K1437J13436L8044p6161n7439Q2989J75975P7341j69973
$$ plain form
40079 81565 215143 249888 187135 162252 186747 155434 103330 192674 409555 537786 496927
40068 496927 441875 445440 364832 152310 19476 108061 238503 199274 81802 93404 202535
40057 202535 224036 151078 155175 295210 420688 359799 91242 -232976 -367752 -176995
40047 -176995 164242 297097 99289 -172174 -254741 -196399 -150812 -86217 61994 137566
40037 137566 -35472 -308502 -371084 -205010 -85720 -148334 -233492 -188861 -66997 33631
40027 33631 107126 153919 138105 89862 92725 126383 76889 -58995 -135533 -69538 51672
40016 51672 116179 110585 65536 9269 2397 87076 180755 160103 67423 74091 206690 285032
40004 285032 199874 84546 105983 219419 257463 181302 123863 206852 382827 460168 290195
39993B90195l29225k01450R9471K34052O8938j47027j55389m6357n5699j67740
39983d10231j67414M628J89991K60206K20345J04377m4017j24073q4639k8355
39973g9182m5356k9712J32735K83130J63297j61153l33118j92656K5070N8378
39963a78567m0023n3134P0827J79047J32888k9008j36256q2377K5988j3373j99342
39952c23330k82659j18293J02285J42499Q0750J35993K65716K40282M8390r0049
39942B01584r4435r0779j05518k1055J23546J21936l0909q6435L6656J07200r024
39931A52767j27497j05537q9250j74855j52000J16898L44025J99593j56456k94053
39921b86365j20965R1605J82533K18867J94643P381k34331k43908Q311K01210
$$ plain form
39993 290195 -39030 -240480 -141009 93043 161981 14954 -140435 -186792 -242491 -410231
39983 -410231 -577645 -573017 -383026 -122820 97525 201902 157885 33812 -50827 -79182
39973 -79182 -124538 -154250 -21515 261615 424912 263759 -69359 -262015 -236945 -178567
39963 -178567 -218590 -271724 -200897 -21850 111038 82030 -54226 -136603 -110615 -123988 -323330
39952 -323330 -605989 -724282 -621997 -479498 -398748 -262755 2961 243243 291633 201584
39942 201584 107149 16370 -89148 -110203 13343 135279 104370 17935 54591 161791 152767
39931 152767 25270 -80267 -169517 -344372 -496372 -379474 -35449 164144 7688 -286365
39921 -286365 -407330 -315725 -133192 85675 280318 287699 53368 -190540 -182229 18981
39911A8981J22954m7594o3844K7081L2209o0098j05709n2498J6187L1391j829
39900h2769n5797r2056o3043J8381O0531J5637l9892k5165J5335O54l3004K371
39888b78817O3485J1902j50743k34777j19319O6538J27038P2492O4758J38375
39878b39068J55207O0875J341P9286J49036K8917j76902j89680K5071J79612O9516
39867A43211j49856k17764j26283m5544j2642Q1648K33667K77043J36345m0163
39857B79662p9706M389Q4029J02552R4222P9491M0473k0081p3529j14137j51297
39846B46068j53503o5081R4384J95984J21249q6989k37438j82047J9766J59508
39836A11901J05424o0164j50106r4950r551k6494j13645j20727J541J20403J15132
$$ plain form
39911 18981 141935 94341 30497 57578 89787 29689 -76020 -128518 -112331 -80940 -82769
39900 -82769 -138566 -230622 -293665 -275284 -214753 -199116 -239008 -264173 -248838 -248184 -281188 -278817
39888 -278817 -215332 -203430 -354173 -588950 -708269 -641731 -514693 -442201 -377443 -239068
39878 -239068 -83861 -22986 -21645 57641 206677 235594 58692 -130988 -105917 73695 143211
39867 143211 -6645 -224409 -350692 -396236 -408878 -327230 -93563 183480 319825 279662
39857 279662 199956 204345 288374 390926 485148 564639 605112 585031 511502 397365 246068
39846 246068 92565 27484 121868 317852 439101 352112 114674 -67373 -47607 111901
39836 111901 217325 157161 7055 -87895 -97446 -123940 -237585 -358312 -356771 -236368 -121236
39825a21236O7434J31091K51390K02143n0107k23124j05885J04288P8320j43786
39815A90528k16282k3375J63115J25624m596l6469k5248q1032j05444J7745J44134
39804A48700P1496j00079j14062J7936N9627k2002k3107P9466M7672j68417k55192
39793b57962j3920K79525K57822j3274j83313j35882n0638l1484J2805J16117
39783b0204J58218P5694m4186j36416k30498k86680j59665J59398M21937L86589
39773C24187J13257j26778j65298n5943N9982R0613K0601j01232j93725k10823
39763b45159j69658r5168J0243J08698J16362K1413n6979k0235N7768M5026k5850
39752b53539N164J64527K74018J94894J6645q4056p8068p0934j12214j33339o9133
$$ plain form
39825 -121236 -53802 77289 328679 530822 480715 257591 151706 255994 334314 190528
39815 190528 -25754 -49129 113986 239610 235014 198545 173297 92265 -13179 4566 148700
39804 148700 220196 120117 6055 23991 83618 61616 38509 117975 165647 -2770 -257962
39793 -257962 -271882 7643 265465 252191 68878 -67004 -117642 -149126 -136321 -20204
39783 -20204 138014 213708 169522 33106 -197392 -484072 -643737 -484339 -62402 324187
39773 324187 437444 310666 145368 89425 149407 240020 260621 159389 -34336 -245159
39763 -245159 -414817 -509985 -499742 -391044 -274682 -253269 -310248 -330483 -272715 -227689 -253539
39752 -253539 -248375 -83848 190170 385064 401709 317653 239585 168651 56437 -76902 -146035
39741a46035M9107J41294J64131J30393P6695K6480k5265q2994j05587l6724Q7680
39730B79175J19725l5244k59830l25056j62502M7367R5871j2656r7060l3486J14998
39719b68698J96148J41103J9062n6587n1779l1812o0687j04853p1944N3718J58619
39708g7710J20142l4531j31754l6250J80084K86879J36262j58345l23811k15237
39698b54271M1323K14453K16603J31381M7569k7277r0768r6271k8970M5325O4177
39687B63274M3599J5620m6324j61752k47761j87776P335J87184K24601J31012
39677B29012J724r0233j25787j21220j07014q9479k6181J08273K28663J98205
39667B05963K1788j11532o0259P1918Q4012l2346j02906n9505l9600j38259k27523
$$ plain form
39741 -146035 -96928 44366 208497 338890 415585 442065 416800 333806 228219 191495 279175
39730 279175 398900 363656 103826 -221230 -383732 -336365 -240494 -253150 -350210 -383696 -268698
39719 -268698 -72550 68553 87615 31028 -20751 -52563 -113250 -218103 -290047 -236329 -77710
39708 -77710 42432 7901 -123853 -160103 19981 306860 443122 284777 -39034 -254271
39698 -254271 -212948 1505 218108 349489 397058 369781 279013 182742 153772 199097 263274
39687 263274 306873 322493 276169 114417 -133344 -321120 -313785 -126601 98000 229012
39677 229012 230736 140503 14716 -106504 -213518 -302997 -329178 -220905 7758 205963
39667 205963 227751 116219 55960 127878 211890 179544 76638 17133 -22467 -160726 -388249
39656c88249j45382N6548K02233K42019K49490K25645R7118r6075j97592j52570
39646I3185o4025N757J12962K47860K62576R8510p9272j15928q9356j38945k08735
39635A24589j60411m2707k6388j19302j58028o8436N3345J12701R9412J8292r1179
39624b58112j01178M3028J52413K5266j82527j17912K15595M04662K30772j9261
39614C92746l9010L0168r1038k99207k65169J7048J98848P5195j76001k74675
39604d31095j36773J25824L20137K84345M6720j48854j29688m2884j21438k78797
39594e12503k07315J34777M28501M36187K62783R3612n1313j69664j51555K624
39584B66134N9249j22415l12545k13304Q7202K40590J45620L4251N4855P0906
$$ plain form
39656 -388249 -533631 -477083 -274850 -32831 216659 442304 539422 443347 245755 93185
39646 93185 29160 34917 147879 395739 658315 756825 677553 561625 472269 333324 124589
39635 124589 -35822 -78529 -104917 -224219 -382247 -450683 -397338 -284637 -185225 -166933 -258112
39624 -258112 -359290 -316262 -163849 -138583 -321110 -439022 -223427 181235 412007 392746
39614 392746 353736 383904 292866 -6341 -271510 -254462 -55614 19581 -156420 -431095
39604 -431095 -567868 -442044 -121907 162438 209158 60304 -69384 -112268 -233706 -512503
39594 -512503 -719818 -585041 -156540 279647 542430 636042 584729 415065 263510 266134
39584 266134 325383 202968 -109577 -322881 -235679 4911 150531 184782 239637 310543
39574C10543m0128j53851j23647l6370m4011q1174J7032J86050J72860p8183l10706
39563a81585l06465j52895m2112J6910J09502J81728J25592K0389L8564J32789
39553e7583Q1886j19928k01197m2993J06558K8935r8958N969K56070L15686J15713
39542C90158p0688o6510j1523p1287j69782j43735n678Q1336J4221j49122k53582
39531d56192j81650K6588J95408K14816J71277J80441J68379n921k55175l17866
39521b59895j34100N3380M7907n3263o5808J1650P6982J24861K00261K50676J91597
39510D44248O6642k183M558k883o2569j05889p3119N484O9417J03211J12054O2432
39498F21403q7489k80620l45491j72528J05969K22851R5471q0762j14655m9268
$$ plain form
39574 310543 270415 116564 -7083 -43453 -87464 -168638 -151606 34444 207304 129121 -181585
39563 -181585 -488050 -640945 -683057 -666147 -556645 -374917 -249325 -228936 -190372 -57583
39553 -57583 24303 -95625 -296822 -339815 -233257 -204322 -303280 -297311 -41241 274445 390158
39542 390158 319470 252960 241437 170150 368 -143367 -149045 -67709 -53488 -202610 -456192
39531 -456192 -637842 -611254 -415846 -201030 -29753 150688 319067 313146 57971 -259895
39521 -259895 -393995 -340615 -292708 -345971 -411779 -400129 -323147 -198286 1975 252651 444248
39510 444248 510890 508707 513265 510382 447813 341924 268805 274289 343706 446917 558971 621403
39498 621403 533914 253294 -92197 -264725 -158756 64095 159566 78804 -35851 -85119
39488h5119p963K2677Q6797R1823k4514q8552P0630K73684K07815n8784j47896
39477C40598K8335J34140k4517j93787j16879O0145P0929n9632j43552j48050
39467e2270j39098r3170Q288O6179M3235P2061J98035K32525P1492p8695l8693
39456B89889K8900o9518j78576o7750J31570J45026L3211M5895J45375J04590
39446F08612k8723j3529J10617Q6353p0865j17252q9987k54381n14149m36795
39436g20099Q843L04884J87440M6526K14814L82928J64096j85614j54188J83463
39426D33093K73567n9069l69538k54254J35131L55036J97464j54789l59651k39756
39416d2766N9265K38497J90365P4259K7033p494p1753n4314P5217J22092j7992
$$ plain form
39488 -85119 -93082 -70405 16392 108215 83701 -4851 65779 339463 547278 488494 340598
39477 340598 368933 503073 478556 284769 167890 228035 298964 239332 95780 -52270
39467 -52270 -191368 -284538 -276250 -210071 -166836 -94775 103260 335785 407277 328582 289889
39456 289889 318789 249271 70695 2945 134515 279541 312752 358647 504022 608612
39446 608612 579889 566360 676977 763330 692465 575213 485226 230845 -283304 -720099
39436 -720099 -711256 -406372 -218932 -172406 42408 425336 589432 403818 249630 433093
39426 433093 706660 647591 278053 23799 158930 513966 711430 556641 196990 -42766
39416 -42766 16499 254996 445361 519620 546653 539159 467406 413092 488309 610401 592409
39405E92409j14003N6334L09072L19372J25198M586k8896j89435m20829l87502
39395B66306l6309K48904K06805N1902P0684J84647J71323O7010N2249J01349
39385A384870M4812j05009j64635q8660l0505q0486j43011j17644m2052M724J8912
39374F81316K8019K1285j2095l6152j3879L7305P0888O1847J1514o4125j32099
39363F53824j59608j48578j24710q8390j9349O1421Q9682M2490k8004p4989j10995
39352I2794j40788j14665k0581M8532K1727j6910M4668J32218P1457j18141k14040
39341b13729j15875K6005Q4619J35211K28397K19098L2606j06287J2270K00108
39331E02423J30011j29508k10934m0978O6789m0816j26631j7851R3395K1729p1337
$$ plain form
39405 592409 478406 534740 843812 1163184 1288382 1292968 1264072 1074637 653808 266306
39395 266306 229997 478901 685706 737608 808292 992939 1164262 1231272 1283521 1384870
39385 1384870 1429682 1324673 1160038 1071378 1040873 960387 817376 699732 657680 662404 681316
39374 681316 709335 730620 718525 682373 668494 705799 776687 838534 850048 785923 653824
39363 653824 494216 345638 220928 132538 113189 174610 264292 306782 278778 203789 92794
39352 92794 -47994 -162659 -183240 -134708 -112981 -129891 -85223 46995 118452 311 -213729
39341 -213729 -329604 -303599 -218980 -83769 144628 363726 396332 290045 302315 502423
39331 502423 632434 502926 291992 251014 317803 276987 150356 132505 225900 247629 176292
39320A76292J6361J48563Q4316j07508j76035q6083O136N7514J27339J55396M3287
39309D45578j06423j16271m8320j03622k44321k29081l2400R3044L4755q479J07971
39298b07569K16184J17433r0070j65161p1273J4654l1143j49073k01057j14170
39288f81245N8754J82217J78153J23373J36177J85171J32282l1655j42809r6278
39278D4140J7294O4986L4728j7187o0074o4129j098O1056r975j97483k79124j00516
39266e07382J90636L11143J80389k5883j15563n8872N6024J41345J59440J10931
39256D42208J1158j11087j90041j42237L1335J90464J87565M4299q8663j27273
39246B47728r8610j3640J44389K83859K33781j2672k29001k27019q0138J9528
$$ plain form
39320 176292 192653 341216 425532 318024 141989 55906 62042 119556 246895 402291 445578
39309 445578 339155 222884 174564 70942 -173379 -402460 -434860 -341816 -307061 -315540 -207569
39298 -207569 8615 126048 35978 -129183 -200456 -185802 -216945 -366018 -567075 -681245
39288 -681245 -622491 -440274 -262121 -138748 -2571 182600 314882 283227 140418 44140
39278 44140 61434 126420 161148 143961 83887 19758 18660 79716 69741 -127742 -406866 -507382
39266 -507382 -316746 -5603 174786 148903 33340 -25532 30492 171837 331277 442208
39256 442208 453366 342279 152238 10001 41336 231800 419365 463664 375001 247728
39246 247728 149118 135478 279867 563726 797507 784835 555834 328815 248677 268205
39236B68205J4522j7486k4892k3893k8830l1689k2324J2832O7107Q5700M4746
39225C43998L4877J21779J51004p6856m09351m18984p766L67057K96674k2289
39215C80143j35410l270N7667m0204o9265M0683P1193o5835j50001l2040J15338
39204A68999R2036l1106p6100j8628O5890J37564J40413l825k17751k67430q1998
39193i1936J05329Q6054l4421m1762P1264J76132K23885J95163J4665k58811l35435
39182A10127n9731K76572K87121L2306j19438o5038j9928m9977J9981J85029J72809
39171G69833q7618k86612k05734l3765l403k6143O0352J58174J08477J736M77
39160D55774M2136M271j5497J08488K21227J04630j23979j77017o1296k0710r2119
$$ plain form
39236 268205 282727 265241 240349 216456 187626 155937 133613 146445 213552 299252 343998
39225 343998 378875 500654 651658 574802 165451 -253533 -261299 105758 402432 380143
39215 380143 244733 241463 299130 258926 189661 230344 301537 235702 85701 53661 168999
39204 168999 261035 229929 153829 135201 201091 338655 479068 475243 257492 -9938 -91936
39193 -91936 13393 99447 65026 23264 94528 270660 494545 689708 704373 445562 110127
39182 110127 50396 326968 614089 646395 526957 461919 441991 392014 411995 597024 769833
39171 769833 682215 395603 189869 156104 152701 126558 186910 345084 453561 455297 455774
39160 455774 497910 502181 486684 595172 816399 921029 797050 620033 558737 538027 445908
39149D45908r9011m4890j08779k43832j96270K1002R3050n5418j04159J12087
39139a80312L03301K03833j2266o8412j9864m8894r6333j9867R2899Q0755K504
39128B37344p135L760l5561J677J95694L14225J34295j46067j88350m8705k9773
39117D31404j32758j08824K6777K0041r9119k4231K40462L03143K9043k14127
39107D71811j48177K2315M6438L1285J10978J04864j20610k75615o2906K68822
39097D49205K48049q9287k65560j09021L6114q2112k31463j03388K01852L50941
39087D05330K51354R5997K3882k0927q6760q3014M7699J63152Q6092j13805j80601
39076E88399m2243O3073o3238k67976k63286m1995J46541J77976J66495J96662
$$ plain form
39149 445908 346897 302007 193228 -50604 -246874 -225872 -132822 -188240 -292399 -180312
39139 -180312 122989 326822 314556 246144 226280 177386 81053 61186 154085 234840 237344
39128 237344 230209 233969 198408 200085 395779 710004 844299 698232 509882 461177 431404
39117 431404 298646 189822 216599 236640 137521 113290 353752 656895 685938 471811
39107 471811 323634 345949 392387 423672 534650 639514 518904 243289 180383 449205
39097 449205 697254 607967 342407 233386 269500 187388 -44075 -147463 54389 405330
39087 405330 656684 752681 776563 755636 668876 585862 633561 796713 882805 769000 588399
39076 588399 546156 609229 545991 278015 14729 -27266 119275 297251 463746 660408
39066F60408J84793O9154o0941j03165n6419M6354J65322J97709P8566n0191J1655
39055A143245J84797J78131n5167k19353j34875R497K4454L9386K19330M13186
39045A802631L67759J27932m1697k2876Q6979J62838J17302j00563l80357m49910
39035A670038j96877J26040K06473O0995o9244p5053j9423N5506J34531J33668
39025B026654P062j28556j52101j20226j25947j09592lR7058O0905k6751l3760
39014A494743k644r831L4336J98184L07124J89823J180M160J53721J96337P2702
39003B639835p2142j68230k20467j57852J6635P6087r9907k16596K4727L72674
38993B194764L46461k416j61917M3560K54227K14904J04821J16324J65815J78030
$$ plain form
39066 660408 845201 914355 853414 750249 693830 740184 905506 1103215 1181781 1131590 1143245
39055 1143245 1328042 1506173 1451006 1231653 1096778 1106275 1130729 1170115 1389445 1802631
39045 1802631 2170390 2298322 2256625 2233749 2320728 2483566 2600868 2500305 2119948 1670038
39035 1670038 1473161 1599201 1805674 1866669 1797425 1722372 1702949 1758455 1892986 2026654
39025 2026654 2033716 1905160 1753059 1632833 1506886 1397294 1397291 1494349 1555254 1528503 1494743
39014 1494743 1492099 1482268 1516604 1714788 2021912 2211735 2212915 2217075 2370796 2567133 2639835
39003 2639835 2567693 2399463 2178996 2021144 2037779 2113866 2013959 1797363 1822090 2194764
38993 2194764 2541225 2538809 2376892 2420452 2674679 2889583 2994404 3110728 3276543 3454573
38983C454573K55203M01071M30182L00729K13357K50159K33645P4846l9027O0127
38973E634865K91965M94282N97677N90168N24259N48613P15308Q41208Q06271
38964A1044616Q15699J045102J269554J275215J355836J840604K413317K590479
38956B3650422K624094L135098M077320M969963N948726P550509R654343J1844773
38948G3455248J4650694J9028769K4861245L1685197M0252634M9997708N4303827
38941C08235322M2889142J3025836k3489595m8846742n4850026m7534869l7347048
38934A52082020k9114226k2385380j6759053j3036833j0923982q995397o842285
38927D4024864n280145m574856m036194l305972k743176k502104k266995j927200
$$ plain form
38983 3454573 3709776 4110847 4541029 4841758 5055115 5305274 5538919 5613765 5574738 5634865
38973 5634865 5926830 6421112 7018789 7608957 8133216 8681829 9397137 10238345 11044616
38964 11044616 11860315 12905417 14174971 15450186 16806022 18646626 21059943 23650422
38956 23650422 26274516 29409614 33486934 38456897 44405623 51956132 61610475 73455248
38948 73455248 88105942 107134711 131995956 163681153 203933787 253931495 308235322
38941 308235322 351124464 364150300 340660705 291813963 236963937 189429068 152082020
38934 152082020 122967794 100582414 83823361 70786528 59862546 50867149 44024864
38927 44024864 38744719 34169863 30133669 26827697 24084521 21582417 19315422 17388222
38919A7388222j673121j457866j102073q26679r58728j229866j090990o19298
38911H429601l90204n24654n94692m50221m01678n20887m67951j61785J1406j43919
38901D785016l23205k84053k11237k79835l13259j58487j5512q9430k21648j72267
38891B716083l4660o8634k74916m07552l31088j50608k0191K0276K1583L6210
38881A506503O0906L8222o5018j80463j90137o5757Q5158J20557m040j86073k57603
38870H62255j62390l5327k1775n6062K4582J70505J58122k7553j26342k1308P2549
38859H37256K620m9772O5370J34526n5475k77657j86516J03175J87189R620j06829
38848F63507j8412Q7918J11046J80008L08987K98044J00561m7429p212M4352p5725
$$ plain form
38919 17388222 15715101 14257235 13155162 12328483 11369755 10139889 9048899 8429601
38911 8429601 8039397 7514743 6920051 6469830 6068152 5547265 5079314 4917529 4928935 4785016
38901 4785016 4461811 4177758 3966521 3686686 3373427 3214940 3199428 3109998 2888350 2716083
38891 2716083 2681423 2612789 2337873 1930321 1599233 1448625 1428434 1448710 1470293 1506503
38881 1506503 1567409 1605631 1540613 1360150 1170013 1104256 1189414 1309971 1305931 1119858 862255
38870 862255 699865 664538 642763 586701 611283 781788 939910 912357 786015 764707 837256
38859 837256 839876 790104 855474 990000 934525 656868 470352 573527 760716 770336 663507
38848 663507 645095 733013 844059 1024067 1333054 1631098 1731659 1684230 1677018 1721370 1645645
38837A645645k78011l74710l24034j85628k4333N6065j8487j22658m5852J64527
38827D92524K17826J6115j85058j62544j8686M4431M611o9664j59256j99248p3437
38816i2386J43467J78501l1669j76806k7382J98850J86284R131m4102M3181N1064
38805D38133o4665j39761j24607j15769r6710K9756J58065O8197j64244j93855
38795b05460N7891K31558O9878j77666j39482J27549K71458J75833L9420m082
38785D46897k9940p6407m7407N7233O0152j15366k77458k27886m4651O0139M8711
38774a45983M6451J02294J44827J37161J04609L3695r0786j70954r6749M8654
38764A13219P5166k1641o6299j8756l5452j51914j72701l672J62181J58458R9112
$$ plain form
38837 1645645 1367634 992924 668890 483262 458929 514994 496507 373849 327997 492524
38827 492524 710350 726465 541407 378863 360177 404608 409219 339555 180299 -18949 -92386
38816 -92386 51081 229582 197913 21107 -6275 192575 378859 387990 343888 387069 438133
38805 438133 373468 233707 109100 -6669 -103379 -73623 84442 152639 -11605 -205460
38795 -205460 -147569 83989 153867 -23799 -163281 -35732 235726 411559 450979 446897
38785 446897 416957 340550 293143 350376 410528 295162 17704 -210182 -254833 -194694 -145983
38774 -145983 -99532 2762 147589 284750 389359 423054 332268 161314 64565 113219
38764 113219 188385 166744 100445 81689 46237 -105677 -278378 -282050 -119869 38589 137701
38753A37701J14594Q0076j26799l11629k25542J7967J21491O7722N0036N5051
38743a9332p4383k21724j03489J82203J92919j51879l69816j38065K10430K20574
38733b72562r969o8874J07317K17813J17861k6966p4145p4997q9961p6013l458
38722b53954P8037J13655P9575k2333j14158p2494P5195J05629q7597k64248j38600
38711e01293J85686L38369J96563P939j0041O7615P9471J9904l1295n1691m2991
38700B58236J2291P3225M5699m9953m8159J16390K53462J53291r9664k14562p9944
38689D20312R3512N9595j51538k94117k16902j1619J37654J52539P0242n5225
38679B04453j72994k05669j14885L345j174j27294j97724q9902J00903J99810
$$ plain form
38753 137701 252295 332371 205572 -106057 -331599 -313632 -192141 -124419 -74383 -19332
38743 -19332 -93715 -315439 -418928 -236725 -43806 -195685 -565501 -703566 -493136 -272562
38733 -272562 -282531 -351405 -244088 -26275 91586 64620 -9525 -84522 -174483 -250496 -253954
38722 -253954 -175917 -62262 17313 -5020 -119178 -191672 -116477 -10848 -98445 -362693 -501293
38711 -501293 -315607 22762 219325 227264 217223 284838 364309 384213 352918 301227 258236
38700 258236 270527 343752 389451 339498 291339 407729 661191 814482 714818 500256 420312
38689 420312 513824 573419 421881 127764 -89138 -100757 36897 189436 259678 204453
38679 204453 31459 -174210 -289095 -285750 -286924 -414218 -611942 -701844 -600941 -401131
38669d01131J74095J26443J23688J37474J34984J27872J14342N0973p0396j56990
38659C61354r4178Q8571J89521N6793j79179k27088k8293J37761N7107r5548n4877
38648B11944P9010J3393j94593j85020P9878J89129m9866k54650p4396K26003
38638D0832J92356r2172j83052j1647O0754j09546k32544r6940J11491J48959
38628a71509N0065k7652l6683J8314J40670K24812J07327j43884k24057j8860
38618h1457J90784J29691p2507j03703O3889J73198O9615j33130k53729k34582
38608b51931j24359K086Q4916J16751J44710J92355K04618J16858m5002j73009
38598B67993j76598o8544L2342J6140o3370k0506J90750L34640J83608j27084
$$ plain form
38669 -401131 -227036 -100593 23095 160569 295553 423425 537767 588740 518344 361354
38659 361354 267176 355747 545268 602061 422882 195794 167501 305262 362369 266821 211944
38648 211944 290954 304347 109754 -75266 4612 193741 143875 -110775 -185171 40832
38638 40832 233188 141016 -42036 -53683 7071 -102475 -335019 -431959 -320468 -171509
38628 -171509 -121444 -149096 -185779 -167465 -26795 198017 305344 161460 -62597 -81457
38618 -81457 109327 239018 166511 62808 126697 299895 369510 236380 -17349 -251931
38608 -251931 -376290 -374204 -289288 -172537 -27827 164528 369146 486004 441002 267993
38598 267993 91395 22851 55193 71333 7963 -12543 178207 512847 696455 569371
38588E69371k55025j24678J6248K5007M4646J66829K23801R7103l1202K9775J45893
38577I07768P7976j18923j92446r4241j9128q6748k14321k86726k59703j16821
38567d03313R9474K39958J95577O0372r59J2224j019k4451K7389J02765P9025
38556C87042j817M902P2494L5656j05672j69067r7438k9816k8785L89O6577M7121
38544A81586l8536o553J30243J01961j47842k67851l1819K47284J79200q5711
38534B61962j20796P0991J02200j01700j61160J04909L47456K26996p5092j66614
38524D89152j2854J06905N7626k5051k908J01749J91922J83616M0350j50948j98481
38513G81078l3383J51378J34579l4349j30785p7871J0172N3032P2720P0000L5242
$$ plain form
38588 569371 314346 189668 205916 230923 275569 442398 666199 763302 732100 761875 907768
38577 907768 985744 866821 674375 580134 561006 474258 259937 -26789 -286492 -403313
38567 -403313 -303839 -63881 131696 192068 191109 203333 202314 177863 205252 308017 387042
38556 387042 385225 390127 462621 498277 392605 223538 126100 96284 67499 67888 134465 181586
38544 181586 143050 136497 266740 368701 220859 -46992 -78811 168473 347673 261962
38534 261962 141166 212157 314357 212657 51497 156406 503862 730858 655766 489152
38524 489152 476298 583203 640829 615778 612870 714619 906541 1090157 1130507 979559 781078
38513 781078 747695 899073 1033652 999303 868518 790647 800819 853851 926571 996571 1031813
38502A031813N5933J95950K91716J24936j96604l22543j75191o1465j55937k12185
38492E76423M47K83150L22080J70544Q4215O4708o3716k46509k55607r9665l694
38481H32376M883J13520L06453L18889R4207q5907n9439j7530j11401j71711m5526
38470A178814R6765N4956o8373j04365j31828k46032k57451N967K86810K09607
38460A024870j11734k19792k2682J01284m7748j91957p7984J16024J07891n3458
38450F24714j37837j03974p0295o7044m4059j9128k6654r467P2155J19378M6605
38439C84394m3894j7326N1195j0186j69833k17239q0820P2064Q0415k4973j18729
38428i4932j28232m6626P9746J42768O8928m4745j9212J41402K19465R3324p5893
$$ plain form
38502 1031813 1087746 1283696 1575412 1700348 1503744 1181201 1006010 944545 788608 576423
38492 576423 576870 860020 1182100 1352644 1436859 1501567 1437851 1191342 935735 836070 832376
38481 832376 837259 950779 1257232 1576121 1670328 1584421 1524982 1507452 1396051 1224340 1178814
38470 1178814 1275579 1330535 1262162 1157797 1025969 779937 522486 528453 815263 1024870
38460 1024870 913136 693344 670662 771946 724198 532241 454257 570281 678172 624714
38450 624714 486877 382903 312608 245564 201505 182377 155723 146256 218411 337789 384394
38439 384394 340500 323174 374369 364183 194350 -22889 -103709 -31645 48770 23797 -94932
38428 -94932 -223164 -269790 -190044 -47276 21652 -23093 -42305 99097 318562 411886 335993
38417C35993r3012k6571p0284j93562j69792M1249J82975P2769j21762j44734
38407a86731l5992k3823j13187n9118K09892M04025K56735q3716k44510j12979
38397A0596P1888Q1861l9188j09622n7023L8625O5620q106j02688j00572J989
38386a46620N6406l7976j47820o9093J45110K17430N2050j00700n425K11653K53425
38375D28440O3533j54025k48417k37906j43983N6620K72355K98368Q1368j60952
38365B55401j94444l9184J08511J25761L1230j05560j98465j53593K3190J66879
38355A9726J30356p794m5260N8372J53475J53412J30027J15727J4436j81425k74475
38344B66577j34853N7061N1598q9089r5427P4558J76474P7315n5750n0846K5430
$$ plain form
38417 335993 242981 216410 146126 -47436 -217228 -175979 6996 79765 -41997 -186731
38407 -186731 -222723 -246546 -359733 -418851 -208959 195066 451801 368085 123575 10596
38397 10596 82484 164345 125157 15535 -41488 -2863 62757 54651 -48037 -148609 -146620
38386 -146620 -90214 -128190 -276010 -345103 -199993 17437 69487 -31213 -36638 175015 428440
38375 428440 491973 337948 89531 -148375 -292358 -235738 36617 334985 416353 255401
38365 255401 60957 21773 130284 256045 287275 181715 -16750 -170343 -147153 19726
38355 19726 150082 142288 97028 155400 308875 462287 592314 708041 722477 541052 266577
38344 266577 131724 188785 240383 151294 55867 130425 306899 384214 328464 277618 303048
38333C03048N0767N7747R2472M9724j40136k99629k12769M1287J91081J52336
38323B85928P5501M7486p478j09963j44066o2996J6910P951k7068k1031j1994
38312D9180k0630K6788J43865J87977M8694j62590k33846j00688J18047K70011
38302C26808K78786J73296P8928J11055K23981K53845J58809R2451J64376K70575
38292B132910K77089K39632K97749M64709O73104R15916J180668J378307J546364
38283I106448J961184K701469L156763K415932L38686k039671l406651l334471
38275A0899689k417274j487784r67888q47351r23344r53081p79418m54695j84174
38266A884680r7753j37059j81223j89060j75002j34942o9537k6549m6177r1531
$$ plain form
38333 303048 353815 411562 504034 553758 413622 113993 -98776 -57489 133592 285928
38323 285928 361429 408915 401437 291474 147408 84412 101322 109273 82205 61174 49180
38312 49180 28550 55338 199203 387180 435874 273284 39438 -61250 56797 326808
38302 326808 605594 778890 857818 968873 1192854 1446699 1605508 1697959 1862335 2132910
38292 2132910 2409999 2649631 2947380 3412089 4085193 5001109 6181777 7560084 9106448
38283 9106448 11067632 13769101 16925864 19341796 19680482 17640811 14234160 10899689
38275 10899689 8482415 6994631 6026743 5179392 4256048 3302967 2523549 2068854 1884680
38266 1884680 1786927 1649868 1468645 1279585 1104583 969641 900104 873555 827378 735847
38256G35847r2826m0302J9552N7008O5328J1766j33660l06874l70889k73507j20887
38245d49444m0413k7477L323O7602J07573J12217J32198J67513J42622K6499j04306
38234A37907j59301j23424k9150Q1670J41719R8373J4028K9400J68612K77992
38224F37826K24817N2676j31788k92140l76713k64495K0084J83393J0373k56190
38214a92157j95022J58979L18106N9112k33890j49079J52642K27323R404j85958
38204c0540j95132j46938j03288L9128K19189J68882j30569k86489l7982L10763
38194a92976L12914L3630r1596M9206J09717j17144l58953k92124j6941J28572
38184d35695M2311q9544j03994j3930R0337J21528K8094j11418j00594J13737
$$ plain form
38256 735847 643021 602719 622271 679279 744607 756373 622713 315839 -55050 -328557 -449444
38245 -449444 -489857 -517334 -514011 -446409 -338836 -226619 -94421 73092 215714 242213 137907
38234 137907 -21394 -144818 -173968 -92298 49421 147794 161822 191222 359834 637826
38224 637826 862643 915319 783531 491391 114678 -149817 -129733 53660 64033 -192157
38214 -192157 -387179 -228200 89906 149018 -84872 -233951 -81309 146014 155418 -30540
38204 -30540 -225672 -372610 -475898 -436770 -217581 -48699 -179268 -465757 -503739 -192976
38194 -192976 119938 153568 61972 111178 220895 103751 -255202 -547326 -564267 -435695
38184 -435695 -393384 -482928 -586922 -600852 -510515 -388987 -360893 -472311 -572905 -459168
38174d59168K82036J51652j45845k47190o8275J06841P7734j2260K7057J30258
38164a57160J38979O9610K4592j7718j22018k05034j25381Q6958K55768K72442
38154B21038J49753p1628l11909m03953k40346M0596J77062R8563k0294k3075
38144c84193N3049Q6859L4370n4373r4385l0406R0136J35858N9492j5976J2266
38133a07303M1096o3229j85653r7904J49782K45234P2655j13654q6625K7313r825
38122a28113j73600k50598j60039n457J15877J83543J89197J45683J12949R9617
38112A29059J3017j68838k71869j41559Q7255J34115l8179j76408r6612R1709
38102d38310J76892J10176K35n0165k3460K8245K3107p2406j76964j68825m6321
$$ plain form
38174 -459168 -177132 -25480 -171325 -418515 -486790 -379949 -302215 -314475 -287418 -157160
38164 -157160 -18181 51429 76021 58303 -63715 -268749 -394130 -307172 -51404 221038
38154 221038 370791 299163 -12746 -416699 -657045 -616449 -439387 -340824 -361118 -384193
38144 -384193 -331144 -244285 -209915 -264288 -358673 -389079 -298943 -163085 -103593 -119569 -107303
38133 -107303 -66207 -129436 -315089 -412993 -263211 -17977 54678 -58976 -145601 -118288 -128113
38122 -128113 -301713 -552311 -712350 -717807 -601930 -418387 -229190 -83507 29442 129059
38112 129059 142076 -26762 -298631 -440190 -352935 -218820 -256999 -433407 -530019 -438310
38102 -438310 -261418 -151242 -151007 -201172 -224632 -196387 -173280 -245686 -422650 -591475 -637796
38091f37796O3653Q3229P8855J30197J92953J73806Q2452J3771K168j3871p0358
38080I9059r8985j8776J28771J96888J00442p2694j59320j20837q7680j70825
38070b03957k77643j97612J15626M23040M32147J33034j76395k33237j04868n3346
38060a43211j49273j80295K202K14105J83086l8420j34698Q519J48618P5759p4169
38049h7777o1984P5408J07914k4028j57241j81041j47634r9755P946J62481K39390
38038a66321J75829O6916J4843j210k6422j5202P9811J81812J63951J4965j50350
38027C38622k21842j77037o4389M0743Q4197P5064N8167L4469l5559j32808j66796
38016a67169j06018l4722j6989M184Q3935J42825Q0963m3196r1837n9015m2733
$$ plain form
38091 -637796 -574143 -490914 -412059 -281862 -88909 84897 167349 181120 183288 169417 99059
38080 99059 74 -18702 110069 306957 407399 334705 175385 54548 -33132 -203957
38070 -203957 -481600 -679212 -563586 -140546 291601 424635 248240 15003 -89865 -143211
38060 -143211 -292484 -472779 -470577 -256472 -73386 -111806 -246504 -237985 -89367 -13608 -87777
38049 -87777 -149761 -74353 33561 9533 -147708 -328749 -476383 -576138 -568192 -405711 -166321
38038 -166321 9508 76424 91267 90057 63635 48433 128244 310056 474007 488972 338622
38027 338622 116780 -60257 -124646 -83903 294 75358 133525 167994 132435 -373 -167169
38016 -167169 -273187 -307909 -324898 -320714 -236779 -93954 -12991 -56187 -148024 -207039 -249772
38005b49772l7322N0710J69519J31128o4763j42883N0566K56519J43842j86316
37995A21228l23095j32916Q1245O1891n5787l1782Q3534P4025o5720j32429m3546
37984c63352O3640P4594N1432R3477J79334K07680J15781o4816k05352j56783
37974d365P2075K50562J78456k5188o4186J00685J78727j6749k80143l09779j24326
37963d4231J2626j3995o0549J0750J32077J40854n193j76576k15446j14691k5814
37952c60188n0572q5309J0451J46959J12380n3363o4807J42158K49197M7466j98507
37941a04135j59676L3520L8668j12129j03994P8442J30631m869k9013J51939K17299
37930A36683j3927k35354j40687Q8887J17136p305j5596Q2126O1006p2395r1792
$$ plain form
38005 -249772 -287094 -236384 -66865 64263 -500 -143383 -92817 163702 307544 121228
37995 121228 -201867 -334783 -253538 -191647 -247434 -279216 -195682 -121657 -187377 -319806 -363352
37984 -363352 -299712 -225118 -173686 -80209 99125 306805 422586 357770 152418 -4365
37974 -4365 67710 318272 496728 471540 407354 508039 686766 670017 389874 80095 -44231
37963 -44231 -31605 -45600 -106149 -95399 36678 177532 172339 -4237 -219683 -334374 -360188
37952 -360188 -410760 -496069 -485618 -338659 -226279 -279642 -344449 -202291 46906 94372 -104135
37941 -104135 -263811 -230291 -191623 -303752 -407746 -329304 -198673 -203542 -232555 -80616 136683
37930 136683 122756 -112598 -253285 -164398 -47262 -54567 -70163 11963 72969 574 -91218
37919i1218K8986P1683l1244q4457K4923J54435J64657J04171M4345m3537j42949
37908A99795j38388k6831J7470p5036j19900J9495J68090J00267q1439j00653
37898c7130L9231O0445j20919k40824j11654P2820N8482n0468K8111K62058L13925
37887B74077O3188j81829j24906J02229J63174n840j73858j82515r7403j7811
37877a81494M0452N5702j534m4697N5816K24426K16583j0573j82463r7324P8767
37866A53661R5705P308K1883J01179J7016k30423l57698k12547J4844R1014L5746
37855b62312m481l553k3450n4459m0615L425K3867K3029K2834m219o2186n8869
37843d40989O1006J64204P6885j31354k01045n9847N6314k7658j29983K695K46040
$$ plain form
37919 -91218 -62232 9451 -21793 -106250 -81327 73108 237765 341936 386281 342744 199795
37908 199795 61407 34576 52046 -22990 -142890 -123395 44695 144962 63523 -37130
37898 -37130 2101 62546 -58373 -299197 -410851 -338031 -279549 -330017 -301906 -39848 274077
37887 274077 337265 155436 30530 132759 295933 290093 116235 -66280 -163683 -181494
37877 -181494 -141042 -85340 -86874 -131571 -75755 148671 365254 354681 172218 74894 153661
37866 153661 249366 256674 278557 379736 396752 166329 -191369 -403916 -389072 -298058 -262312
37855 -262312 -266793 -270346 -293796 -348255 -388870 -385445 -361578 -338549 -315715 -319934 -382120 -440989
37843 -440989 -379983 -215779 -138894 -270248 -471293 -531140 -474826 -502484 -632467 -629772 -383732
37832c83732K34400o4100k39931l8306K36109J63685j58064k70000l9357J88641
37822c70655J50742O483j3661K4297l6341j15542m3008J21287J71577O8034n9723
37811i6510j37221j58403o2297J63302L19461J97824q1672j95225p5258K4982
37801a01017m1137j06282n736J54794J92176J05105r500j30051k47703k74517
37791d63868j70820n1396k2793j9017O4191J74690J92364J27320P8438N9859J7408
37780a3624l1719k1717K9863M6597K8504L6885N7129L585j26526k12841j59374
37769c63238j2930R3768P8321k0928q8881n5133K8605P0662Q0859J32513J80120
37758A23738P1514j84330l28803j81304P7735J44689J8577m3211M8242R9145q283
$$ plain form
37832 -383732 -149332 -213432 -453363 -491669 -255560 -91875 -249939 -519939 -559296 -370655
37822 -370655 -219913 -213430 -227091 -202794 -239135 -354677 -397685 -276398 -104821 -36787 -96510
37811 -96510 -233731 -392134 -454431 -291129 28332 226156 144484 -50741 -125999 -101017
37801 -101017 -142154 -248436 -254172 -99378 92798 197903 188403 58352 -189351 -463868
37791 -463868 -634688 -686084 -708877 -727894 -663703 -489013 -296649 -169329 -90891 -31032 -13624
37780 -13624 -45343 -67060 -37197 9400 37904 74789 131918 135503 8977 -203864 -363238
37769 -363238 -376168 -282400 -204079 -225007 -313888 -369021 -340416 -269754 -188895 -56382 123738
37758 123738 195252 10922 -317881 -499185 -421450 -276761 -258184 -301395 -253153 -154008 -162291
37747a62291j01063j312J63360J35507p8009j93949m1860J94420K01499p3159
37737D3143l46048l16357l518K79669K78125N6961j16664r2517M1024J29060J35105
37726H7983J11300O7736l1766j56050j85137n8268J06010J23729j9679j40256
37716i4398j02647j192k792q9359r9648R201J10000J23211J10441J03043J6311
37705H2171j69111k94710k18037n968J73434K38932J82308J4646j49342j16091
37695b61768J14250K59768J32830o7674q2330k7779j68916l84322k88496J18259
37685f56178L65360J90059r8779j24501L7279R3725R291m7663l7123l4946j4992
37674c18468R0851J97495J62855K0749p4792p3800k7323N4340J57313J68084K5172
$$ plain form
37747 -162291 -263354 -264666 -101306 34201 -43808 -237757 -279617 -85197 116302 43143
37737 43143 -302905 -619262 -622780 -343111 -64986 -8025 -124689 -217206 -176182 -47122 87983
37726 87983 199283 267019 235253 79203 -105934 -164202 -58192 65537 45858 -94398
37716 -94398 -197045 -198237 -201029 -290388 -390036 -380835 -270835 -147624 -37183 65860 82171
37705 82171 -86940 -381650 -599687 -605655 -432221 -193289 -10981 3665 -145677 -261768
37695 -261768 -147518 112250 245080 177406 95076 67297 -101619 -485941 -774437 -656178
37685 -656178 -290818 -100759 -199538 -324039 -286760 -193035 -183744 -231407 -268530 -303476 -318468
37674 -318468 -227617 -30122 132733 153482 78690 4890 -22433 31907 189220 357304 382476
37663C82476j10544n4207R6033Q4377j02708k05374p3487J39101K07394Q5163
37653D48224j14703k36269j60692P6385K44890J60222m6112q5006O6494J31213
37643D84646l7538k35388k20945m0356R9475J16517O6464n267q4069j39423j57717
37632a53601j53871j04903J8314J22294N8897j16879j54245J9983J45375J3009
37622c05627j90513j55859P9255K06557J18393J9465O4421J39285P7558q9603
37612c6668j92564j26393O1931K16585J89201j2630k00370k05030p2217L2267
37602c45888N6086P0445R5055P8649M2375P2557J53048J65173Q7454M1657R2230
37591F08841J43168R5957j2718q9002q8541l451J40672K37375J78744K6464l2633
$$ plain form
37663 382476 271932 217725 313758 398135 295427 90053 16566 155667 363061 448224
37653 448224 333521 97252 -63440 12945 257835 418057 371945 286939 353433 484646
37643 484646 447108 211720 -9225 -49581 49894 166411 232875 227608 143539 4116 -153601
37632 -153601 -307472 -412375 -394061 -271767 -212870 -329749 -483994 -464011 -318636 -305627
37622 -305627 -496140 -651999 -572744 -366187 -247794 -228329 -163908 -24623 52935 -36668
37612 -36668 -229232 -355625 -293694 -77109 112092 99462 -100908 -305938 -378155 -345888
37602 -345888 -289802 -219357 -124302 -45653 -3278 69279 222327 387500 474954 516611 608841
37591 608841 752009 847966 835248 746246 657705 654254 794926 1032301 1211045 1237509 1204876
37580A204876N0334J17955N9770l5767o8102q3251j23265r3925N4544J69912J10412
37569A363493j8763n0038m9642j76145l33675k69585m558J47317N0266n7394L3733
37558F35009J77382J47498J9312Q971P2158k8716k88252l95359j85536R5164J29043
37547C86674n2517j77991j44029q7306r2725p3445J3089M9005l1924r3164q575
37536c12908J12928R7750n340k1829L5939j614j36624j70525l9566O8140K3536
37525c50113m5623O766J15330J55357J36537R5821j2393j55401j58005J582N2059
37514a58083j55023l07306n7148L78429M65047J33847j31129l0519J60797R0688
37504C89600j54821k57521j26639O8022J45606L4155k02366l45623k09107P2180
$$ plain form
37580 1204876 1255210 1373165 1432935 1397168 1329066 1245815 1122550 1028625 1083169 1253081 1363493
37569 1363493 1344730 1294692 1245050 1068905 735230 465645 461087 608404 658670 601276 635009
37558 635009 812391 959889 979201 988172 1060330 1031614 743362 348003 162467 257631 386674
37547 386674 334157 156166 12137 -75169 -167894 -241339 -228250 -179245 -211169 -304333 -312908
37536 -312908 -199980 -102230 -107570 -129399 -93460 -95074 -231698 -402223 -441789 -373649 -350113
37525 -350113 -395736 -388970 -273640 -118283 18254 114075 101682 -53719 -211724 -210142 -158083
37514 -158083 -313106 -620412 -677560 -299131 165916 299763 168634 138115 298912 389600
37504 389600 234779 -22742 -149381 -81359 64247 98402 -103964 -449587 -658694 -586514
37494e86514J55962j9793j36355k560J56189J16989L8299J26876K17453N8002
37484A24548k00471k11548L496J16546M2198O260P8570N7031j19644k26633j34889
37473d64536p180J8038L5633J17586J30023j2969j50640j18024J0843Q9845J16377
37462b35004J16240K1957j41703j59551N3480K26020J03484j15469n3433K33015
37452D9036L04765J8565k35905j17387J75152K26691k866j95389j70799p7411
37442b5548q5088j36970r7601K2506J16260J51183J58533J09318n1147k43240
37432h1794k70282o2894J90302K49747J07608l7127n7019k9152o7110j35761j19164
37421c12646r461Q3409J04987J26557J90932J87833N580k33595k56720o444K35526
$$ plain form
37494 -586514 -430552 -450345 -586700 -589260 -433071 -316082 -277783 -150907 66546 124548
37484 124548 -75923 -287471 -283975 -167429 -125231 -118971 -40401 16630 -103014 -329647 -464536
37473 -464536 -471716 -453678 -418045 -300459 -170436 -183405 -334045 -452069 -441226 -351381 -235004
37462 -235004 -118764 -96807 -238510 -398061 -344581 -118561 -15077 -130546 -183979 49036
37452 49036 353801 372366 136461 19074 194226 420917 418051 222662 51863 -25548
37442 -25548 -110636 -247606 -345207 -322701 -206441 -55258 103275 212593 161446 -81794
37432 -81794 -352076 -414970 -224668 25079 132687 95560 38541 9389 -57721 -193482 -312646
37421 -312646 -322107 -238698 -133711 -7154 183778 371611 377191 143596 -113124 -119568 115958
37410A15958K09398K4559l5153N1190N3126r0955j61523l9157Q4782K9960q7235
37399A54950r1579n8909j38519k33449j44116P3273J77788J12707L3727J4916
37389i9211k967o306O6309J13129j8700k11997j88272M0522J70572J06221P9262
37378D8562J60817P8633k55209m38845j46924L08603L89430R5928j04763m014
37368A32218J27981M9687j14503j49939p2292k2881k8998j0559O8701J50501J44240
37357B74156J7587j41180j78714m7168J24926J86690J24121Q553j16302k12491
37347D0178k18511j43697q9761q2269r329J60345K58095J68402L5571K3118L2764
37336A74906r1535k27449j43502Q8544J73181M5863p1775p1269q5981j69847j66253
$$ plain form
37410 115958 325356 349915 314762 365952 419078 328123 166600 127443 212225 242185 154950
37399 154950 63371 4462 -134057 -367506 -511622 -438349 -260561 -147854 -114127 -99211
37389 -99211 -102178 -108484 -42175 70954 52254 -159743 -348015 -307493 -136921 -30700 48562
37378 48562 209379 288012 32803 -406042 -552966 -244363 145067 240995 136232 132218
37368 132218 260199 309886 195383 45444 -26848 -49729 -78727 -89286 -20585 129916 274156
37357 274156 291743 150563 -28151 -75319 49607 236297 360418 368971 252669 40178
37347 40178 -178333 -322030 -411791 -494060 -503389 -343044 -84949 83453 119024 142142 174906
37336 174906 83371 -144078 -287580 -199036 -25855 20008 -51767 -123036 -209017 -378864 -545117
37325e45117j2469R9472K1999j01960o2607R9428J67201N4457r8088j13533L574
37314d87643O1677p4031k46106j58822J68632L26745Q2953k12009j06447K49615
37304c95436L13575k3928l07562k38404l4205N5752J17233K32201K06731n8946
37294a32989k75779j74378O1411R7077l8984p4260M5234J30482P8871l8777j34623
37283d56715j44027k0080J48357J72073O4937Q1729K68551K76818q5574m22538
37273a16469k73182J65285L04683J4435k81296k91600j58483n5346M7829J32653
37263e11491O4585r6122q5477J20146J95812k4932k50399j50954J72083L61120
37253b05629K65063K9428j41764j49679k6467Q3756N2981o3606r9062l5094k6574
$$ plain form
37325 -545117 -557586 -458114 -436115 -538075 -600682 -501254 -334053 -279596 -377684 -491217 -487643
37314 -487643 -425966 -499997 -746103 -904925 -736293 -409548 -326595 -538604 -645051 -395436
37304 -395436 -81861 -105789 -413351 -651755 -685960 -630208 -512975 -280774 -74043 -132989
37294 -132989 -408768 -583146 -521735 -424658 -463642 -537902 -492668 -362186 -283315 -322092 -456715
37283 -456715 -600742 -620822 -472465 -300392 -235455 -153726 114825 391643 306069 -116469
37273 -116469 -389651 -224366 80317 94752 -186544 -478144 -636627 -691973 -644144 -511491
37263 -511491 -446906 -543028 -628505 -508359 -312547 -337479 -587878 -738832 -566749 -205629
37253 -205629 59434 88862 -52902 -202581 -229048 -145292 -92311 -155917 -254979 -290073 -316647
37242c16647j27403j83928p8298R7526J96103J86287R9943l3492j31994j00865
37232c92768J1321N6516K6343N8760J66674J85295N9565n3390o4830r3741k00874
37221b41129k27416o4333J30783J63821P0452p175l1491j1151P3992J43326K9913
37210B9592k12473k62716N429K72624K33186M2388r7M3032n7633k03229j23707
37199b33604Q7306P7969j48494k11539k473J21074n3772k25034p0453K34183L03392
37188a21445J10080n9952p9474q6642j63087j87184o2696J00162J31505L1625
37178c87108m3334N84P6151N4717l0469k5727R1404J40879M751j65806j53512
37167d37470P498R5587L2748l7332O652J16279J86304J69240O4951p8548j61113
$$ plain form
37242 -316647 -444050 -627978 -706276 -608750 -412647 -226360 -126417 -159909 -291903 -392768
37232 -392768 -381447 -324931 -298588 -239828 -73154 112141 171706 118316 53486 -40255 -241129
37221 -241129 -468545 -532878 -402095 -238274 -167822 -174997 -206488 -217639 -143647 -321 29592
37210 29592 -182881 -445597 -440168 -167544 65642 108030 107933 150965 93332 -109897 -233604
37199 -233604 -146298 -68329 -216823 -428362 -430835 -309761 -363533 -588567 -659020 -424837 -121445
37188 -121445 -11365 -71317 -150791 -237433 -400520 -587704 -650400 -550238 -418733 -387108
37178 -387108 -430442 -429858 -353707 -298990 -329459 -355186 -263782 -122903 -118152 -283958 -437470
37167 -437470 -429972 -334385 -301637 -338969 -332317 -216038 -29734 139506 204457 125909 -35204
37156c5204j43966j23343j58670j17023J13249L46717L09883P3953l7595L4028
37146B62029J9372j67706k49081p2034R2604j2889k12975k09834n8760p569n8264
37135f75107l4043M8986K1274j00989j34363n1617o30k4052l3612m4730j51822
37124a180705k65107j73648P0515J24300j65003m90968m66427j02336K58024L71078
37114b020277K98408K32337K54894K92633K52090J54061R8717J07681R4344L4818
37104b00294M2591J66058K42616J22917p0045j18478n9341r9343k28936k19626
37094d21881k5898J15158O8263k027N5891J35932J08857O0469Q8988P0601j26506
37083A27847l42391l04861l3064J81706J71207N3400k421J5511L0798J7772N815
$$ plain form
37156 -35204 -179170 -302513 -461183 -578206 -464957 -118240 191643 265596 228001 262029
37146 262029 281401 113695 -135386 -207420 -114816 -127705 -340680 -550514 -609274 -616843 -675107
37135 -675107 -709150 -660164 -638890 -739879 -874242 -925859 -926489 -950541 -984153 -1028883 -1180705
37124 -1180705 -1445812 -1619460 -1548945 -1424645 -1589648 -2080616 -2547043 -2649379 -2391355 -2020277
37114 -2020277 -1721869 -1489532 -1234638 -942005 -689915 -535854 -437137 -329456 -235112 -200294
37104 -200294 -157703 8355 250971 373888 303843 185365 126024 26681 -202255 -421881
37094 -421881 -447779 -332621 -264358 -266385 -210494 -74562 34295 94764 183752 254353 127847
37083 127847 -214544 -519405 -552469 -370763 -199556 -146156 -148577 -133066 -102268 -84496 -78681
37072g8681J3999K4773N235m3446o2941j3253L8145k459q2867n2769Q3671J32787
37060c7806P202j20107p8177N1507R6195N1990J5932j882k1458J2399R0435M8476
37048A14706j60934k72156o6156K19692J92207q2613j70526M2637J93813O1354
37038G2024r1381R923K01232J81896o878j08155p1021n1864j03429j25803p3529
37027a66985j272N9490J04380Q7395k270n5646J3030R8365L6820j34773k10944
37016a72410r5505Q2227J34165J2448j49662j54393M9494K47536J67374j45097
37006b3823l22923j54428J25477J88338P0335L2381J04346Q0060q0456j59550
36996a40243l7052J24955J39878L9373l1985r866P7881J65797J63789L1089j30435
$$ plain form
37072 -78681 -64682 -39909 -34674 -78120 -141061 -154314 -116169 -118628 -201495 -254264 -170593 -37806
37060 -37806 -30604 -150711 -228888 -177381 -81186 -29196 -13264 -15146 -36604 -24205 66230 114706
37048 114706 -46228 -318384 -384540 -164848 27359 -55254 -225780 -183143 10670 72024
37038 72024 -19357 -9434 191798 373694 366816 258661 187640 135776 32347 -93456 -166985
37027 -166985 -168257 -108767 -4387 83008 80738 25092 38122 136487 173307 38534 -172410
37016 -172410 -267915 -185688 -51523 -39075 -188737 -343130 -293636 -46100 121274 -23823
37006 -23823 -346746 -501174 -375697 -187359 -117024 -84643 19703 99763 19307 -140243
36996 -140243 -177295 -52340 87538 126911 94926 85060 162941 328738 492527 523616 393181
36985C93181j71068r2030k4868k1498j8919l173k1086k1343J00996K63208K30877
36974F14277k3855k29191j94369o1228k6916l4560N3759J54937Q6722j12093k24431
36963C052j66096m5192M9751J17118J19801L471j45586j49078J1288J47240J21904
36952F7673J4286l5722j7167K04m23M268J636k2569j8948N8727J42431J06833
36940C01229m9096j71217j49212o6242o4435j20318q7153M9177J23540O0401J5615
36929a57711J14465K04715Q4297j31024j42299O0822J67703L6269r8555m1334
36919I7348L9585o5966k08595j06778J71192K82547J18490o9720p2946J8552L1942
36908B35651l8036j02488j35944j45599r8329J4313J10509J03708J2201p1996
$$ plain form
36985 393181 222113 130083 105215 83717 64798 61625 40539 19196 120192 383400 614277
36974 614277 590422 361231 166862 105634 78718 44158 97917 252854 339576 227483 3052
36963 3052 -163044 -208236 -158485 -41367 78434 81905 -63681 -212759 -201471 -54231 67673
36952 67673 81959 46237 29070 29274 28851 33119 34755 12186 -6762 51965 194396 301229
36940 301229 252133 80916 -68296 -134538 -198973 -319291 -406444 -357267 -233727 -173326 -157711
36929 -157711 -43246 161469 245766 114742 -27557 33265 200968 237237 138682 97348
36919 97348 136933 70967 -137628 -244406 -73214 209333 327823 258103 185157 203709 235651
36908 235651 197615 95127 -40817 -186416 -284745 -270432 -159923 -56215 -44014 -116010
36898a16010r1902o7588n2399o7810p7816l9351K5844O2644R0839J84306L03600
36887A54357K80548O4419j45891j53526l2770J9034j1214k186L0327l4379j47760
36876B0959j16669O9379J83781R9586m3207q6975o2679n0161k9883J0892J532
36865c445n9103l6672J18799K35209J45341o8695j97164j68521o9308Q542K8295
36854f6722M711K7592J78016L41624K62560r4004m00515l60456r7293N3578J4897
36843a36012j9637L2056K7596j08970k28445j78800k2339O6479K2665o0972m9630
36832f56009J00858K81863L09141J22724j12478j84427q9547j4898p3447j64120
36822d80340j25534M9889K06352K03411P2753j9640K0905Q8294K1563j48913k25004
$$ plain form
36898 -116010 -207912 -275500 -327899 -395709 -473525 -512876 -487032 -424388 -333549 -149243 154357
36887 154357 434905 499324 353433 199907 167137 186171 174957 172771 203098 168719 20959
36876 20959 -95710 -26331 157450 257036 213829 126854 64175 14014 -15869 -4977 -3445
36865 -3445 -62548 -99220 19579 254788 400129 331434 134270 -34251 -103559 -95017 -66722
36854 -66722 -62011 -34419 143597 485221 747781 653777 253262 -107194 -204487 -150909 -136012
36843 -136012 -155649 -123593 -95997 -204967 -433412 -612212 -634551 -568072 -545407 -606379 -656009
36832 -656009 -555151 -273288 35853 158577 46099 -138328 -227875 -242773 -316220 -480340
36822 -480340 -605874 -555985 -349633 -146222 -73469 -93109 -72204 16090 37653 -111260 -336264
36811c36264j19647L8291J23745J72050K28989K17953R1194l6620n7884l9605
36801B82202o8567p8091q448J6954j03277k10449j06401J09958J98323J51009
36791A83213J08568K4484k09676l86686j82953K53251L90970J00380j32901K1692
36781A70342K27244O2297k86325l43277q3046J13713Q8322L5693N9971K0048j39047
36770g4065k50575k12253j31738r0091j078J75101K80548J72554m4488j44355
36760c20440o3196N9903Q9911M0880M639O661o842m6121k5855R1418J65457L5899
36748C2314k02147k60961m8576J90866K19254J01172K3343L696k9363k8218O8664
36737G0044J39428M1256j06736o6946J31085K16213Q2491r0893j49606j38395
$$ plain form
36811 -336264 -455911 -417620 -293875 -121825 107164 325117 416311 379691 321807 282202
36801 282202 213635 135544 127096 144050 40773 -169676 -276077 -166119 32204 183213
36791 183213 291781 316265 106589 -280097 -463050 -209799 181171 281551 148650 170342
36781 170342 397586 459883 173558 -169719 -252765 -139052 -50730 -15037 44934 64982 -74065
36770 -74065 -324640 -536893 -668631 -758722 -759800 -584699 -304151 -131597 -176085 -320440
36760 -320440 -383636 -323733 -233822 -192942 -188303 -181642 -188484 -234605 -260460 -169042 -3585 32314
36748 32314 -169833 -430794 -479370 -288504 -69250 31922 55265 58961 29598 1380 70044
36737 70044 209472 250728 143992 77046 208131 424344 506835 415942 266336 127941
36727A27941j15664m3837N2943N0939n2333q8176N032N9855l5343j29508n1467
36716b19618J08816J48450N4994k6847l9053l4931k1114M5668J28057J27966L5370
36705C07758o0153r9407r4198n3880K4424R5879R4222K9064j6905K038M6150N9594
36693C34586M1004L3813P0290J27104J37677P5662J6008M9165J30936J11880m5681
36682A082444j82006j47721j2802L4369n6560j51233j21299J0728J18588R9166
36672F73674m5696k03369k34244j05834O3736J24684L9048j11617k15205j92600
36662b07423l1755J75963K68209J51920q9771k69179k68413j27635J4341M9189
36652c34554n637l2750L8364J33034J38573P3913M4163M5487l0032j69065j95073
$$ plain form
36727 127941 12277 -31560 21383 72322 19989 -68187 -63155 -3300 -38643 -168151 -219618
36716 -219618 -110802 37648 92642 65795 26742 -8189 -29303 16365 144422 272388 307758
36705 307758 247605 148198 54000 120 24544 120423 214645 243709 226804 228842 274992 334586
36693 334586 375590 409403 479693 606797 744474 820136 836144 885309 1016245 1128125 1082444
36682 1082444 900438 752717 739915 774284 717724 566491 445192 455920 574508 673674
36672 673674 627978 424609 190365 84531 148267 272951 311999 200382 -14823 -207423
36662 -207423 -239178 -63215 204994 356914 267143 -2036 -270449 -398084 -383743 -334554
36652 -334554 -340191 -372941 -334577 -201543 -62970 10943 55106 100593 70561 -98504 -293577
36641b93577m0707R9609K6415j75058k54516j26611O3887J53747J08920j190p0704
36630e09785l3683N2150N9804j2891j8774Q7866J33136l700j58979j21440L6730
36619d89566R7835N5601O7746J29103Q8362l4584n1502N0838O3500q6526k06744
36608c15937j59155n6084k5443j4281M6364R1338O9796N6196Q8615P8925J227
36597a38439k4259L8367L3479j11196k10412j06488O1183P7591k4240p7341o5936
36586e47691o6604m1107O5843J36088M2422q9876n4097P9588O8297p8319r1685
36575e77141J05435K45569J19984j11263j63966j4452J18426Q0791n9992j32050
36565c88659m9228J14822K18301K06422J38898O3673l6904j30891j07454L2338
$$ plain form
36641 -293577 -334284 -234675 -208260 -383318 -637834 -764445 -700558 -546811 -437891 -439081 -509785
36630 -509785 -543468 -491318 -431514 -444405 -463179 -375313 -242177 -245877 -404856 -526296 -489566
36619 -489566 -391731 -336130 -268384 -139281 -50919 -85503 -137005 -86167 -22667 -109193 -315937
36608 -315937 -475092 -531176 -556619 -570900 -524536 -433198 -363402 -307206 -218591 -139666 -138439
36597 -138439 -162698 -124331 -90852 -202048 -412460 -518948 -457765 -380174 -404414 -481755 -547691
36586 -547691 -614295 -655402 -589559 -453471 -411049 -500925 -555022 -475434 -407137 -485456 -577141
36575 -577141 -471706 -226137 -106153 -217416 -381382 -395834 -277408 -196617 -256609 -388659
36565 -388659 -437887 -323065 -104764 101658 240556 304229 267325 136434 28980 61318
36555F1318R9259j5728j36198o3904P9461L1410j71351k23026o550K50832L03624
36544B09147J33606j40809l61364l38295l2743K56566J86018j23591k05229O0353
36534c56341K52811O8674k19922k22436j1333Q5541K2339O87O0959O5541L533
36523b49947m656M1383L8507L567K9867O5793j6652j69114k20713j50620p6133
36512g08718j3806R7612J76568Q1459r4388j02858N8159J21705q080r5953K6077
36501d62223J81940J43653l0815j43065j50838j21019m1220J08786K06452J20701
36491a87648o1087j26235k4094J01204J41154J27221J01424K9559j11370k54435
36481b64307k99579k02888J790K20229L31429K61489N7113j32067j67555l7741
$$ plain form
36555 61318 160577 144849 8651 -55253 24208 55618 -115733 -338759 -345309 -94477 209147
36544 209147 342753 201944 -159420 -497715 -530458 -273892 -87874 -211465 -416694 -356341
36534 -356341 -103530 -34856 -254778 -477214 -488547 -403006 -380667 -379980 -319021 -253480 -249947
36523 -249947 -254603 -213220 -174713 -171146 -141279 -75486 -92138 -261252 -481965 -632585 -708718
36512 -708718 -722524 -624912 -448344 -366885 -461273 -564131 -505972 -384267 -392347 -488300 -462223
36501 -462223 -280283 -136630 -167445 -310510 -461348 -582367 -623587 -514801 -308349 -187648
36491 -187648 -248735 -374970 -399064 -297860 -156706 -29485 71939 101498 -9872 -264307
36481 -264307 -563886 -766774 -764984 -544755 -213326 48163 105276 -26791 -194346 -232087
36471b32087J21089J36346k2487j84568j61894N321Q0990n3248k24065j96262
36461g30865P170J50045J17265M7065Q6358J56138Q5207r2908j44029L4254K30569
36450e3731J84213n5538j93605r2390O8182Q4129M279j2687J8703m3843k00670
36439b92958k75665j62885L6791J54314J20856j5729j41317j36072J2339J52868
36429e47458J32431N179m2509L0520P0836j6164j20502r6393N1111K08008K68679
36418e6262J74552l3230j64050m1529K21488K86447K1813l02316l74464k21145
36408d88696o6330J7633R8881J47163O5436p7411q5399P1720J97788J43831j4257
36397A0359j17736j12281m2138L3587O3081J8750o1387r7881n4378L7750J23720
$$ plain form
36471 -232087 -110998 25348 2861 -181707 -343601 -338280 -257290 -310538 -534603 -730865
36461 -730865 -723695 -573650 -456385 -409320 -322962 -166824 -81617 -174525 -318554 -284300 -53731
36450 -53731 130482 74944 -118661 -211051 -142869 -58740 -54461 -67148 -48445 -92288 -292958
36439 -292958 -568623 -731508 -694717 -540403 -419547 -435276 -576593 -712665 -700326 -547458
36429 -547458 -415027 -409848 -452357 -421837 -351001 -367165 -487667 -584060 -532949 -324941 -56262
36418 -56262 118290 85060 -78990 -120519 100969 387416 409229 106913 -267551 -488696
36408 -488696 -555026 -537393 -438512 -291349 -225913 -303324 -388723 -317003 -119215 24616 10359
36397 10359 -107377 -219658 -261796 -228209 -165128 -146378 -207765 -305646 -360024 -322274 -198554
36386a98554J48845P8035m0856q2902k819O9968N952j11090r6334M3097J10544
36375g6114K9469m2491K0556J09887O9424m7485o8291K4553P9130K4553k2120
36364A01071M5402J37120R0327p4208j55073n4813O4327P303j59069j92376k9730
36353b19719J20845Q2120p0058j68480j78159j39680l8103J14142J85071R2789
36343b19232l0047k6473K8551k0912r8574j1189J66158J40773j21804k90475j51077
36332f34301R0191J49468N8262O946R656k5021m2816O6952K15455K02933K6806
36321A24531j25085j67876j82284j84109p0520J44011K55999J49981k0625o1992
36311a37969j4775m2222j37011j31116J8773J40141R4902k2231l7578M5197P6531
$$ plain form
36386 -198554 -49709 28326 -12530 -95432 -98251 -28283 -22331 -133421 -229755 -186658 -76114
36375 -76114 -46645 -89136 -68580 41307 110731 63246 -5045 19508 98638 123191 101071
36364 101071 146473 283593 373920 299712 144639 89826 154153 161456 2387 -189989 -219719
36353 -219719 -98874 -16754 -86812 -255292 -433451 -573131 -611234 -497092 -312021 -219232
36343 -219232 -249279 -275752 -247201 -268113 -366687 -377876 -211718 -70945 -192749 -483224 -634301
36332 -634301 -544110 -394642 -336380 -329434 -319778 -344799 -387615 -320663 -105208 97725 124531
36321 124531 -554 -168430 -350714 -534823 -605343 -461332 -205333 -55352 -75977 -137969
36311 -137969 -152744 -194966 -331977 -463093 -444320 -304179 -209277 -231508 -269086 -223889 -147358
36300a47358P924m0452K0439J14596J30864P8113K1790m4043j47260k26616k03062
36289d35065j25749j07467j27426m7855J49421K85521K07629r780j51873q8979
36279d51623J20424K91790K63255N0096j44791j47534k2873L1473l1774p9896
36269a21453m6246k2483o4988r2636n2340j4847j2863M6020J85666K42083R0336
36258A36249j35895k13412j26465m1896n3108q4784j7109J77325L73439L52121
36248C66465M5125k64712k04406J61095L39670R5213k01506j59417K7693l8142
36238A67078k41842j53013J82464K45387j11808l97165k50127K7429J6395j59152
36228f74354j09089J71793L51611L03761K08576J78643J33262M8107K7564P6807
$$ plain form
36300 -147358 -139434 -179886 -159447 -44851 86013 164126 185916 141873 -5387 -232003 -435065
36289 -435065 -560814 -668281 -795707 -843562 -694141 -408620 -200991 -210771 -362644 -451623
36279 -451623 -331199 -39409 223846 273942 129151 -18383 -41256 -9783 -41557 -121453
36269 -121453 -167699 -190182 -255170 -347806 -400146 -414993 -427856 -381836 -196170 45913 136249
36258 136249 354 -213058 -339523 -381419 -434527 -519311 -536420 -359095 14344 366465
36248 366465 411590 146878 -57528 103567 443237 538450 336944 177527 205220 167078
36238 167078 -74764 -227777 -45313 200074 88266 -308899 -559026 -531597 -515202 -674354
36228 -674354 -783443 -611650 -260039 43722 252298 430941 564203 612310 639874 716681
36218G16681N0493q8989j63278l8474J51789J74000P794j36338j02568J2061J758
36207E84929j58980k75922k08050o3840k5896p6245n8327M1456P7799J0940l0905
36196a83041L975Q712m1129k391J50508J94896O571j77544r1207J37294J81913
36185A88557K1883p3396j4525r071j64163k80018j68133N2861J36264L4324r4067
36174c69484j05019J3582J76796K66519K12178O5983m8393q7341j17187j70913
36164a63279j71494n4745J06444J71226R1122l9018p0932N8425K43603K86575
36154D57927J15307j03929j60084p1551m1236j45559k26541j42221K4132R9575
36144a94180N6710L755J0347M9001P1097N4447j361o2303o6666J959P4015P2599
$$ plain form
36218 716681 767174 678185 514907 476433 628222 802222 810016 673678 571110 583171 584929
36207 584929 425949 150027 -58023 -121863 -147759 -224004 -282331 -240875 -163076 -152136 -183041
36196 -183041 -179066 -170354 -211483 -213874 -63366 131530 138101 -39443 -130650 6644 188557
36185 188557 210440 137044 122519 113448 -50715 -330733 -498866 -446005 -309741 -275417 -369484
36174 -369484 -474503 -460921 -284125 -17606 194572 260555 212162 124821 7634 -163279
36164 -163279 -334773 -389518 -283074 -111848 -20726 -59744 -130676 -72251 171352 457927
36154 457927 573234 469305 309221 237670 196434 50875 -175666 -317887 -293755 -194180
36144 -194180 -137470 -133715 -123368 -74367 -3270 51177 49816 -12487 -79153 -77194 -3179 69420
36132F9420O045n7890p8765o3770l1285L865K7220L3406K1410k0467q4990j08062
36120b83863l2754P9931R7931R823l4683N7311J64382J14258o9186k02294j79815
36109b78959n4762Q9820K11435K47415J29428q3090j95381r1842J03783J65195
36099B43042K6186j66868k44593j78923n1655O5753J53015J98467J77085Q3321
36089C04830m3984j47495j92154j75609j16562m6188L228J9767J9851K8029N4815
36078b91472R2455J14227Q0674k0847j37400j89330j55675p6225K8890J60295
36068c94408K44962J63055n8007j99116j21652K3272J8147q5635p3057N4554Q0578
36057c47307l0333m0282J46392K64966R1448j71524j79428L7216J40853K419j53405
$$ plain form
36132 69420 75465 17575 -61190 -124960 -156245 -152380 -125160 -91754 -70344 -90811 -175801 -283863
36120 -283863 -316617 -236686 -138755 -128932 -163615 -106304 58078 172336 103150 -99144 -278959
36109 -278959 -333721 -243901 -32466 214949 344377 261287 65906 -25936 77847 243042
36099 243042 269228 102360 -142233 -321156 -372811 -307058 -154043 44424 221509 304830
36089 304830 260846 113351 -78803 -254412 -370974 -417162 -413934 -394167 -374316 -346287 -291472
36078 -291472 -199017 -84790 -4116 -24963 -162363 -351693 -507368 -583593 -554703 -394408
36068 -394408 -149446 13609 -44398 -243514 -365166 -341894 -323747 -409382 -482439 -427885 -347307
36057 -347307 -377640 -417922 -271530 -6564 84884 -86640 -266068 -228852 -87999 -85580 -238985
36046b38985j33779l8082m5221j42138j82023q9377R0509K66584L56876L22752
36036A67116J89960R303j81323l06827k43709J5748K49394K30040L9537l8055
36026A31184O2705J05950n2756k35702k32329j06291m0528m6315k4254J4306m297
36015d28327l7962l056M5479J1654l1022M5347J44166M6791j96899k63854k8221
36004f95904K27383K17338M1133l2797J3846o7r5294j04796J0357Q1246K3290
35993c14265j8986P1499J69629J06473m6909p9427L9400J26738O9944l2893o0703
35982C0500m2724n3704n7407J6931J11915R7044l1460j32295j11486k0838N9878
35971a33646J21805J51565P1314j36363l10294k50407K4973K66737K69498Q3681
$$ plain form
36046 -238985 -372764 -410846 -456067 -598205 -780228 -869605 -779096 -512512 -155636 167116
36036 167116 357076 366379 185056 -121771 -365480 -349732 -100338 129702 169239 131184
36026 131184 193889 299839 247083 11381 -220948 -327239 -367767 -414082 -438336 -424030 -428327
36015 -428327 -466289 -469345 -423866 -412212 -443234 -397887 -253721 -206930 -403829 -667683 -695904
36004 -695904 -468521 -251183 -210050 -242847 -229001 -229068 -324362 -429158 -418801 -337555 -314265
35993 -314265 -333251 -261752 -92123 14350 -32559 -111986 -72586 54152 124096 91203 30500
35982 30500 -12224 -65928 -123335 -106404 5511 102555 71095 -61200 -172686 -193524 -133646
35971 -133646 -11841 139724 211038 74675 -235619 -486026 -461053 -194316 75182 158863
35961A58863q3509j14366o4853l2407j9279L5223J22682J36942J4095j43514j64840
35950a54963l7934N2996k3258j41366p9442J52550K91389J65090p6700j77608
35940b9246j20711j02165j88148j90319L3141L02610L13004N1280j68984j20506
35930b20044O2641J19614K7627l0566K1128P4896O6062P2080J22168R2635q2394
35919C25847k35005j67207M4050J26506j4015j69223j24387N6927J42069N2974
35909C8536l7303N1103K44633K84602N9810k21566k78204j16593k342p0862j48236
35898a96422m4988J44070J96315R6790J4146L878m2586j51136j81578n5804R6974
35887a20341J13430K761r7060q8957J0555J01983Q3167l1839q6030K7715J77069
$$ plain form
35961 158863 75354 -39012 -103865 -136272 -155551 -120328 2354 139296 153391 9877 -154963
35950 -154963 -192897 -139901 -163159 -304525 -383967 -231417 59972 225062 148362 -29246
35940 -29246 -149957 -252122 -440270 -630589 -597448 -294838 18166 69446 -99538 -220044
35930 -220044 -157403 -37789 -10162 -40728 -19600 55296 121358 193438 315606 408241 325847
35919 325847 90842 -76365 -32315 94191 80176 -89047 -213434 -156507 -14438 38536
35909 38536 1233 52336 296969 581571 641381 419815 141611 25018 22676 -48186 -196422
35898 -196422 -241410 -97340 98975 195765 209911 213789 171203 20067 -161511 -217315 -120341
35887 -120341 -6911 -4150 -101210 -190167 -179612 -77629 5538 -26301 -112331 -84616 92453
35876I2453J46181l4349j15809j9161M0111q6738k26810j62847J9374P4428l1939
35865c05106j12676n6204O0606J27615J12572L6553m1105m7177J335j0537j00333
35854c34457r9537R6552L13807L24538J78909Q3744M2093j06006l17844l34490
$$ plain form
35876 92453 238634 204285 88476 69315 109426 22688 -204122 -366969 -347595 -273167 -305106
35865 -305106 -417782 -473986 -413380 -285765 -173193 -136640 -177745 -224922 -223587 -234124 -334457
35854 -334457 -433994 -337442 -23635 300903 479812 563556 605649 499643 181799 -152691
$$ [...]
##END NTUPLES=NMR SPECTRUM
##END=
