##TITLE=31Pdec_LR-715-RM2
 Ac2O, 124 sc
 6.7.2020
##JCAMPDX= 6.0         $$ Bruker NMR JCAMP-DX V2.0
##DATA TYPE= NMR SPECTRUM
##DATA CLASS= NTUPLES
##ORIGIN= UXNMR, Bruker Analytische Messtechnik GmbH
##OWNER= root
$$ XWIN-NMR		Version 3.5
$$ Mon Jul  6 12:20:33 2020 Russian Standard Time (UT+4h)  she@DPX200
##.OBSERVE FREQUENCY= 81.013821
##.OBSERVE NUCLEUS= ^31P
##.ACQUISITION MODE= SIMULTANEOUS
##.ACQUISITION SCHEME= undefined
##.AVERAGES= 124
##.DIGITISER RES= 17
##SPECTROMETER/DATA SYSTEM= spect
##.PULSE SEQUENCE= zgpg30
##.SOLVENT NAME= CDCl3
##.SHIFT REFERENCE= (INTERNAL, CDCl3, 0, 182.463)
##AUDIT TRAIL= $$ (NUMBER, WHEN, WHO, WHERE, WHAT)
$$ ##TITLE= Audit trail, XWIN-NMR		Version 3.5
$$ ##JCAMPDX= 5.01
$$ ##ORIGIN= Bruker BioSpin GmbH
$$ ##OWNER= she
$$ F:/spectra/data/she/nmr/P31/1/pdata/1/auditp.txt
$$ ##AUDIT TRAIL=  $$ (NUMBER, WHEN, WHO, WHERE, WHAT)
(   1,<2020-07-06 12:19:30.35 +0400>,<she>,<DPX200>,
      <continue with go, POWCHK disabled, PULCHK disabled
       configuration hash MD5:
       00 E9 B6 7A A2 85 ED C7 34 08 36 98 17 FE 4E 26
       data hash MD5: 32K
       AC 33 3A 86 C7 09 F9 7C 3B 41 3E 4A 5B D7 C7 83>)
(   2,<2020-07-06 12:19:40.59 +0400>,<she>,<DPX200>,
      <Start of raw data processing
       efp BC_mod = 2 LB = 1 FT_mod = 6 PKNL = 1 PHC0 = -1682.843 PHC1 = 56.00197 SI = 64K 
       data hash MD5: 64K
       4B D6 05 D8 09 B7 CA 7C EC AC 5F 43 E6 9F EC 7B>)
(   3,<2020-07-06 12:20:02.73 +0400>,<she>,<DPX200>,
      <pk PHC0 = 10.51279 PHC1 = -4 
       data hash MD5: 64K
       82 34 D6 D6 0F 2A 9E 9E CE D4 D5 C8 15 68 87 E7>)
(   4,<2020-07-06 12:20:10.29 +0400>,<she>,<DPX200>,
      <abs ABSG = 5 
       data hash MD5: 64K
       42 34 96 82 07 7C 3A A3 75 2E 3A 49 23 7C 0C 64>)
$$ ##END=
$$ 
$$ hash MD5
$$ F0 68 68 B9 5B E2 DD 9D A3 F8 82 5F 80 C6 5E 8D
##$RELAX= 
##$RELAX= 
##$RELAX= 
##$RELAX= 
##$RELAX= 
##$RELAX= 
##$RELAX= 
##$RELAX= 
$$ Bruker specific parameters
$$ --------------------------
##$DU= <F:/spectra>
##$EXPNO= 1
##$NAME= <P31>
##$PROCNO= 1
##$TYPE= <nmr>
##$USER= <she>
##$AMP= (0..31)
100 100 100 100 100 100 100 100 100 100 100 100 100 100 100 100 100 100 
100 100 100 100 100 100 100 100 100 100 100 100 100 100 
##$AQSEQ= 0
##$AQ_mod= 1
##$AUNM= <au_zg>
##$AUTOPOS= <>
##$BF1= 81.014009
##$BF2= 200.13
##$BF3= 200.13
##$BF4= 200.13
##$BF5= 200.13
##$BF6= 200.13
##$BF7= 200.13
##$BF8= 200.13
##$BYTORDA= 1
##$CFDGTYP= 0
##$CFRGTYP= 5
##$CHEMSTR= <none>
##$CNST= (0..31)
1 1 145 1 1 1 1 1 1 1 1 1 1 1 1 1 1 1 1 1 1 1 1 1 1 1 1 1 1 1 1 1 
##$CPDPRG= <waltz16>
##$CPDPRG1= <>
##$CPDPRG2= <waltz16>
##$CPDPRG3= <>
##$CPDPRG4= <mlev>
##$CPDPRG5= <mlev>
##$CPDPRG6= <mlev>
##$CPDPRG7= <mlev>
##$CPDPRG8= <mlev>
##$CPDPRGB= <>
##$CPDPRGT= <>
##$D= (0..31)
0 1 0 0 0 0 0 0 0 0 0 0.03 2e-05 3e-06 0 0 0 0 0 0 0 0 0 0 0 0 0 0 0 0 
0 0 
##$DATE= 1594023383
##$DBL= (0..7)
120 120 120 11 120 120 24 19 
##$DBP= (0..7)
150 150 150 150 150 150 150 150 
##$DBP07= 0
##$DBPNAM0= <>
##$DBPNAM1= <>
##$DBPNAM2= <>
$$ [...]
##$SUBNAM3= <"">
##$SUBNAM4= <"">
##$SUBNAM5= <"">
##$SUBNAM6= <"">
##$SUBNAM7= <"">
##$SUBNAM8= <"">
##$SUBNAM9= <"">
##$SW= 369.568048894756
##$SWIBOX= (0..15)
0 1 3 0 0 0 0 0 0 0 0 0 0 0 0 0 
##$SW_h= 29940.119760479
##$TD= 32768
##$TD0= 1
##$TE= 0
##$TE2= 300
##$TE3= 300
##$TEG= 300
##$TL= (0..7)
0 120 53 12 22 120 120 120 
##$TP= (0..7)
150 150 150 150 150 150 150 150 
##$TP07= 0
##$TPNAME0= <>
##$TPNAME1= <>
##$TPNAME2= <>
##$TPNAME3= <>
##$TPNAME4= <>
##$TPNAME5= <>
##$TPNAME6= <>
##$TPNAME7= <>
##$TPOAL= (0..7)
0.5 0.5 0.5 0.5 0.5 0.5 0.5 0.5 
##$TPOFFS= (0..7)
0 0 0 0 0 0 0 0 
##$TUNHIN= 0
##$TUNHOUT= 0
##$TUNXOUT= 0
##$USERA1= <user>
##$USERA2= <user>
##$USERA3= <user>
##$USERA4= <user>
##$USERA5= <user>
##$V9= 5
##$VALIST= <valist>
##$VCLIST= <CCCCCCCCCCCCCCC>
##$VD= 0
##$VDLIST= <DDDDDDDDDDDDDDD>
##$VPLIST= <PPPPPPPPPPPPPPP>
##$VTLIST= <TTTTTTTTTTTTTTT>
##$WBST= 1024
##$WBSW= 4
##$XGAIN= (0..3)
0 0 0 0 
##$XL= 0
##$YL= 0
##$YMAX_a= 209681
##$YMIN_a= -142046
##$ZGOPTNS= <>
##$ZL1= 120
##$ZL2= 120
##$ZL3= 120
##$ZL4= 120
##$ABSF1= 182.463
##$ABSF2= -187.1042
##$ABSG= 5
##$ABSL= 3
##$ALPHA= 0
##$AQORDER= 0
##$ASSFAC= 0
##$ASSFACI= 0
##$ASSFACX= 0
##$ASSWID= 0
##$AUNMP= <proc_1d>
##$AZFE= 0.1
##$AZFW= 0.5
##$BCFW= 0
##$BC_mod= 2
##$BYTORDP= 0
##$COROFFS= 0
##$CY= -3
##$DATMOD= 1
##$DC= 0
##$DFILT= <>
##$DTYPP= 0
##$F1P= 0
##$F2P= 0
##$FCOR= 1
##$FTSIZE= 65536
##$FT_mod= 6
##$GAMMA= 0
##$GB= 0
##$INTBC= 1
##$INTSCL= 5.30512e-09
##$ISEN= 30
##$LB= 1
##$LEV0= 0
##$LPBIN= 0
##$MAXI= 10000
##$MC2= 0
##$MEAN= 0
##$ME_mod= 0
##$MI= 50
##$NCOEF= 0
##$NC_proc= -6
##$NLEV= 6
##$NOISF1= 182.463
##$NOISF2= 159.3651
##$NSP= 0
##$NTH_PI= 0
##$NZP= 0
##$OFFSET= 182.463
##$PC= 4
##$PHC0= -1672.33
##$PHC1= 52.00197
##$PH_mod= 1
##$PKNL= yes
##$PPARMOD= 0
##$PSCAL= 0
##$PSIGN= 0
##$REVERSE= no
##$SF= 81.0140089999434
##$SI= 65536
##$SIGF1= 159.3651
##$SIGF2= -187.1042
##$SINO= 113.3802
##$SIOLD= 16384
##$SREGLST= <1H.CDCl3>
##$SSB= 0
##$STSI= 65536
##$STSR= 0
##$SW_p= 29940.119760479
##$SYMM= 0
##$S_DEV= 0
##$TDeff= 32768
##$TDoff= 0
##$TI= <>
##$TILT= no
##$TM1= 0
##$TM2= 0
##$TOPLEV= 0
##$USERP1= <user>
##$USERP2= <user>
##$USERP3= <user>
##$USERP4= <user>
##$USERP5= <user>
##$WDW= 1
##$XDIM= 65536
##$YMAX_p= 298856718
##$YMIN_p= -42989932
$$ End of Bruker specific parameters
$$ ---------------------------------
##NTUPLES= NMR SPECTRUM
##VAR_NAME=  FREQUENCY,     SPECTRUM/REAL,   SPECTRUM/IMAG
##SYMBOL=    X,             R,               I
##VAR_TYPE=  INDEPENDENT,   DEPENDENT,       DEPENDENT
##VAR_FORM=  AFFN,          ASDF,            ASDF
##VAR_DIM=   65536,         65536,           65536
##UNITS=     HZ,            ARBITRARY UNITS, ARBITRARY UNITS
##FACTOR=    0.456856943014862, 1,           1
##FIRST=     14782.0589164792, 0,            0
##LAST=      -15158.0608439998, 0,           0
##MIN=       -15158.0608439998, -42989932,   0
##MAX=       14782.0589164792, 298856718,    0
$$ Real data points
##PAGE= N=1
##DATA TABLE= (X++(R..R)), XYDATA
$$ [...]
4309C276923k841122k661992j145846j47775r3880L18892R29416Q7728j367665
4300c645321k52685L292061M747824K155799n59716l32465r9419k829731n130634
4291b654287k670222J726271K185186n53159r37778J302602P90279l490906n646397
4282i948411k384875J753311J782268p36589j554913M1803K324937M441661N348869
4273A068061L194638q78012j976925J816930N453999L765394q77471k499202n34697
4264H532715N04922j070204k213134j105244N9770o53548j863249j539300J84944
4255H37672K040560L122745K643124M19776j890862k232568j053792n08231r13394
4246B465030q98059r42591k948568n587648m414068J394956O402376N886198K026580
$$ y = [3276923, 435801, -2226191, -3372037, -3519812, -3613692, -3294800, -2365384, -2277656, -3645321, -3898006, -605945, 4141879, 6297678, 5737962, 5405497, 5306078, 2476347, -2654287, -5324509, -3598238, -1413052, -1966211, -2903989, -1601387, -811108, -4302014, -9948411, -12333286, -10579975, -8797707, -9534296, -11089209, -11047406, -8722469, -4280808, 1068061, 4262699, 3384687, 1407762, 3224692, 8678691, 12444085, 11566614, 9067412, 8532715, 9037637, 7967433, 5754299, 4649055, 4708825, 4055277, 2192028, 652728, 837672, 2878232, 6000977, 8644101, 9063877, 7173015, 4940447, 3886655, 3378424, 2465030, 1566971, 624380, -2324188, -7911836, -12325904, -10930948, -4528572, 1357626, 3384206]
4237C384206k26618k45475m42812n89405J230108L295478J661273k918590m969736
4228A78429k443174K74269l99954j923501p40449J666286K095009J553840K817537
4219C078292M397151K595010j408258k378746O11910K283020n83422l992770k949149
4210A653038J066652K727207N49676k040672k265616j043067m75824r48250j283166
4201b060022l51391J687669L106339K225143r4203j006425K50087Q61043j125878
4192C492362l063638j444255K186155K934337k10192k875249j777867R47540J513236
4183A702429l42635k047253k042950q47880M74917J224600J282418J428804K362450
4174C194900K826923N89411l655743n644393k814090J665401K749560J61541j774161
$$ y = [3384206, 3157588, 2912113, 2469301, 1879896, 3110004, 6405482, 8066755, 5148165, 178429, -2264745, -1990476, -2390430, -4313931, -5054380, -3388094, -1293085, 260755, 3078292, 7475443, 10070453, 8662195, 6283449, 6895359, 9178379, 8594957, 4602187, 1653038, 2719690, 5446897, 5996573, 3955901, 1690285, 647218, 171394, -776856, -2060022, -2411413, -723744, 2382595, 4607738, 4513535, 3507110, 3757197, 4618240, 3492362, 428724, -1015531, 1170624, 4104961, 3894769, 1019520, -758347, 189193, 1702429, 1359794, -687459, -2730409, -3578289, -3103372, -1878772, -596354, 832450, 3194900, 6021823, 6611234, 2955491, -2688902, -5502992, -3837591, -1088031, -926490, -2700651]
4165b700651m49537J956228K224471K88018j563454j899367j162017m47329m55014
4156d208652j196092j957880j790841m61393J238927K260299K193939J547066
4148b374627J366089K170594K885519J648773j449916l433821j869479J429303
4140C72435K335774R117j984404r24067J261099J183334j033942k370261j347853
4131b498768N78681J567320J098194o17757k746215l359592j150020K023846K598960
4122b505351O7406j998696q62246J662674K165304L55657j476073k212393k337294
4113g141012j507646J083493L846710L546427L3797k514357r39676K379173K690803
4104A477712o92399l694139k932556M56588K965457K905825J461431N62056P31009
$$ y = [-2700651, -3150188, -1193960, 1030511, 1318529, -244925, -2144292, -3306309, -3753638, -4208652, -5404744, -7362624, -9153465, -9614858, -8375931, -6115632, -3921693, -2374627, -1008538, 1162056, 4047575, 5696348, 4246432, 812611, -1056868, 372435, 2708209, 2717326, 732922, -191145, 1069954, 2253288, 1219346, -1150915, -2498768, -1920087, -352767, 745427, 127670, -2618545, -5978137, -7128157, -5104311, -2505351, -2437945, -4436641, -5298887, -3636213, -1470909, -1115252, -2591325, -4803718, -7141012, -8648658, -7565165, -3718455, -172028, -138231, -2652588, -3592264, -1213091, 1477712, 785313, -2908826, -5841382, -5384794, -2419337, 486488, 1947919, 2509975, 3240984]
4095C240984P99438o44818l296126m726133k805645J275679L645973K280848k74575
4086e04375l30250J605321J465265k028402m687386k694483J236193J222286l060426
4077g776257n397512j865431L509863M657507J749865l45452J56993M64419r81059
4068e827064j998055j035476J18594j2802K73629K398681L956849J988716j904038
4059b040966l253886r26027J677496J839352R30286J359909K409976J324798k128118
4050A192820m425693k616793J346557K629642K5682k025934K84835M107273L694616
4041D213005q66394l343099n02822L200303K454505j541007l953290l184064q53773
4032d376636K226173N352827N398617M86358m850914m037739J854378M637011
$$ y = [3240984, 4040422, 3395604, 99478, -4626655, -7432300, -6156621, -2510648, -229800, -504375, -834625, 770696, 2235961, 207559, -4479827, -7174310, -5938117, -4715831, -7776257, -13173769, -15039200, -11529337, -6871830, -5121965, -5467417, -5310424, -4846005, -5827064, -7825119, -8860595, -8742001, -8754803, -8481174, -6082493, -2125644, -136928, -2040966, -5294852, -6220879, -4543383, -2704031, -1773745, -413836, 1996140, 3320938, 1192820, -3232873, -5849666, -4503109, -1873467, -1847785, -3873719, -3588884, 518389, 4213005, 3346611, 3512, -499310, 2700993, 5155498, 3614491, -338799, -3522863, -4376636, -2150463, 3202364, 8600981, 9087339, 4236425, 198686, 2053064, 6690075]
4024F690075N07830m729650m571917p04405J099096N631j18239J958379K947800
4015C084600O62421k514375l134145j165118O56250O28147m43784j320147k185296
4006e731447l256916k612346J895811P908134R019297K713181m735129n362560
3998a61975J18034L989031K675592J30706m46298j276696l670204l840273J42442
3989b339641K963093j04748m423419k404187M229609O720939K689539j143203
3981F187982m19379Q38928j532546m694775m250535j447448k1813K36254J694736
3972c408596L349423K192673j157525k681264n71940K727435M006704K285098
3964F742008j217392l843009l024084O25105K763068M51228l364697l679396o71521
$$ y = [6690075, 7197905, 2468255, -2103662, -2808067, -1708971, -1703340, -1821579, 136800, 3084600, 3747021, 1232646, -1901499, -3066617, -2410367, -1782220, -2226004, -3546151, -5731447, -8988363, -11600709, -9704898, -1796764, 7222533, 9935714, 5200585, -161975, -43941, 3945090, 6620682, 6751388, 6305090, 5028394, 1358190, -2482083, -2339641, 623452, 518704, -3904715, -6308902, -2079293, 4641646, 7331185, 6187982, 5768603, 6607531, 5074985, 380210, -3870325, -5317773, -5339586, -5103332, -3408596, -59173, 2133500, 975975, -1705289, -2277229, 450206, 4456910, 6742008, 5524616, 1681607, -1342477, -717372, 2045696, 2496924, -867773, -4547169, -5218690]
3955e218690R19458n83012j428100J134489M439855M829184K960595J628882R83809
3946I666470n03423k071066j526831N76903J261278k10615j239475k11420J081106
3937F822927P89016K31099J518327L529556K936753r79934m817982n100439k371837
3928B557486o8797p9488j002910r80797n45017j233305k445867j982839K79144
3919e502390J776533J221529O05857J509866J958319k55780l179052l254196r38300
3910f057614L32455L4442P21063K320282J636848j242040j666650J873576M183103
3901B135465J324464k794007k772264l76117o94649k876849j900424K011430L316809
3892b626142O14941j095001Q56310K492428L56566k700148k501601Q1550J521825
$$ y = [-5218690, -4299232, -4882244, -6310344, -5175855, -736000, 4093184, 7053779, 8682661, 9666470, 9163047, 7091981, 5565150, 6142053, 7403331, 7192716, 5953241, 5741821, 6822927, 7611943, 7843042, 9361369, 12890925, 15827678, 14847744, 10029762, 4929323, 2557486, 2488689, 2409201, 1406291, 425494, -119523, -1352828, -3798695, -5781534, -5502390, -3725857, -2504328, -1898471, -388605, 1569714, 1313934, -1865118, -5119314, -6057614, -5725159, -5690717, -4969654, -2649372, -1012524, -2254564, -3921214, -2047638, 2135465, 3459929, 665922, -2106342, -2482459, -3177108, -6053957, -7954381, -5942951, -2626142, -2011201, -3106202, -2249892, 242536, 599102, -2101046, -4602647, -4521097, -2999272]
3883b999272J075952K65678n05688j532577j951693j089817o4800J29092M41564
3874f231561J809796L165426L048521J457588j015959l633151m287418j063853
3866f750611L675704M512260L01248l529482k514846R79778K521914K151980K152234
3857C500179J998328K90932j277856q79935q97281m046049p351944n745051k70206
3848a4678883L114478K232934M80765J50299k45185j327088r22549J725766M091345
3839e378118M133209K585917Q06833m68928k13851J592356K249865p3707j983259
3830C250317P67057N210178L942951l392192q356224n617627O2154K117222J241790
3821g74374J508156K590176J606620n76872n89061J526884K376946M44253k395543
$$ y = [-2999272, -1923320, -1657642, -2163330, -3695907, -5647600, -6737417, -6802217, -6673125, -6231561, -4421765, -1256339, 1792182, 3249770, 2233811, -1399340, -5686758, -6750611, -3074907, 1437353, 1738601, -1790881, -4305727, -3325949, -804035, 1347945, 3500179, 5498507, 5789439, 4511583, 3631648, 2734367, -1311682, -8663626, -14408677, -14678883, -11564405, -9331471, -8850706, -8700407, -8945592, -10272680, -11195229, -9469463, -5378118, -1244909, 1341008, 2147841, 1678913, 1465062, 3057418, 5307283, 5233576, 3250317, 4017374, 9227552, 13170503, 9778311, 1422087, -4195540, -4133386, -2016164, -774374, 733782, 3323958, 4930578, 4353706, 3764645, 5291529, 7668475, 8112728, 5717185]
3812E717185m032837l947676k449610l93738Q59260P89276L16160K22008L34223
3803b585749P61901J874743K627160J579326k6652L64936J678683P0745m050605
3794B294488n120998r76633L127820K645716M94978R06691J646908j280355n105962
3785a367347l893911J428760M048995J687884q69838j90530J189193K19865j742869
3776E10202j797688K69675K539097L314551J924661p25573k088371n10416K342594
3767E778732L545876K518701M41718k198552m530775l878713N12375M115712K299523
3758H604597k455359l866659j465570p32279l511696m946191j696991K785914
3750g284234L966648K325285Q46355M26541N10192Q92879O78585j295267l407635
$$ y = [5717185, 1684348, -2263328, -4712938, -5106676, -4247416, -3458140, -3141980, -2919972, -2585749, -1823848, 50895, 2678055, 4257381, 4230729, 4595665, 6274348, 6345093, 2294488, -2826510, -3803143, -675323, 1970393, 2465371, 3372062, 5018970, 3738615, -1367347, -5261258, -3832498, 216497, 1904381, 1034543, 844013, 2033206, 2253071, 510202, -1287486, -1017811, 1521286, 4835837, 6760498, 6034925, 3946554, 3436138, 5778732, 9324608, 11843309, 12285027, 10086475, 5555700, 1676987, 2189362, 6305074, 8604597, 6149238, 2282579, 817009, 84730, -3426966, -8373157, -10070148, -7284234, -3317586, -992301, -145946, 280595, 790787, 1683666, 2362251, 1066984, -2340651]
3741b340651k430637Q01636J480984j522018l311532j048373J225206j06090j605743
3732h857218R51746M350695K873361j649534k331220J540563L431514K64785k882980
3723b308288j056178L344483M909022K694036k12731j841937k513657k371619
3715F43131r69829R98513J903374J336495N77984O50967J029123P09577k32044
3706F647291q57993q09024p35398j188769j851793k241381k353803k012308o36950
3697f040128J266179J613767m76082k449046j255876K107246L824128K798322
3689A388510J729600K302805K812872J707411J40966n99567j077331j345161J07419
3680G167524K776650K851659j405412n786497n235800p96609K139816J106137
$$ y = [-2340651, -4771288, -3969652, -2488668, -4010686, -7322218, -8370591, -7145385, -7251475, -8857218, -7905472, -3554777, -681416, -2330950, -4662170, -3121607, 309907, 574692, -2308288, -3364466, -19983, 4889039, 7583075, 7370344, 5528407, 3014750, 643131, -326698, 671815, 2575189, 3911684, 4489668, 5140635, 6169758, 6879335, 6647291, 5789298, 4980274, 4244876, 3056107, 1204314, -1037067, -3390870, -5403178, -6040128, -4773949, -3160182, -3636264, -6085310, -7341186, -5233940, -1409812, 1388510, 3118110, 5420915, 8233787, 9941198, 10082164, 9482597, 8405266, 7060105, 7167524, 9944174, 12795833, 11390421, 5603924, 368124, -428485, 1711331, 2817468]
3672B817468j330758j807114M10983L489070M296047Q90249m282911n735799j830286
3663c083051K329576J949573o03441k71444K236309K038900j515138m005406l047733
3654c971855p31975R51955J842384R09471k537404m909429j846313L726221L922011
3645b644934k105953n791895j798009M227227N093795K574422K329005L784441
3637E668099K463451j093131k353022j019206j095833l220204l503077o05617
3629d758540J800438J014656r79870j413767m78336M76145J342555K297342K829578
3620B130201K759536K240945N92036k427468m387054k524926J432038K472010
3612B287318p54106l875654l184335m62910O99250N3793o95985j629815l449007
$$ y = [2817468, 1486710, -320404, 90579, 3579649, 7875696, 8765945, 4483034, -1252765, -3083051, -753475, 1196098, 592657, 321213, 2557522, 4596422, 3081284, -924122, -3971855, -4703830, -3751875, -1909491, -1000020, -3537424, -8446853, -10293166, -6566945, -2644934, -4750887, -10542782, -12340791, -8113564, -3019769, -445347, 1883658, 5668099, 8131550, 7038419, 4685397, 3666191, 2570358, -649846, -4152923, -4758540, -2958102, -1943446, -2923316, -4337083, -4815419, -4339274, -2996719, -699377, 2130201, 4889737, 7130682, 7722718, 5295250, 908196, -1616730, -184692, 2287318, 1533212, -2342442, -5526777, -5989687, -5290437, -5236644, -5932629, -7562444, -11011451]
3603a1011451m405637k151021J992354L974967K413992L06636P40269L087310
3595e052581M462748L426456J062703q06560j407486j174716q29213n89252j95670
3586a103571N36522J384480J814626J295483j29109j373823j151391J54996M86194
3577A914407r19984j805588j20386K121454J217398k286079l707412j135095J604869
3568c116416R01938j299683j222031O57129J248292N28290R49133K121486J026642
3559A794780k117992k974226L28565L741468K875306r84726l176615j825084J029604
3550a308920K986991L277056J961499m55594k694884l551355k996996j602179
3542d384382L35632K068307K012590k46568k408678j784370J175501L322558K618805
$$ y = [-11011451, -15417088, -17568109, -15575755, -11600788, -9186796, -8880160, -8139891, -5052581, -589833, 2836623, 3899326, 3092766, 1685280, 510564, -318649, -907901, -1103571, -567049, 817431, 2632057, 3927540, 3798431, 2424608, 1273217, 1428213, 1914407, 994423, -811165, -931551, 1189903, 2407301, 121222, -3586190, -4721285, -3116416, -2214478, -3514161, -4736192, -4079063, -2830771, -2302481, -1353348, 768138, 1794780, -323212, -3297438, -2968873, 772595, 3647901, 2663175, -513440, -2338524, -1308920, 1678071, 4955127, 6916626, 6461032, 3766148, 214793, -2782203, -4384382, -4048750, -1980443, 32147, -214421, -2623099, -4407469, -3231968, 90590, 2709395]
3533B709395P8804j927039j943363j06353K133042K901651J587705l24155q93977
3524D215710M564P95250J64701j814078l888365m228275j847588J570245K551633
3515b476203m3675l100896l112436m55991K164698L635115L988042K144227j828691
3506I14190l746551J76443O239213O502018m4645n616307m865525j605960r43171
3497b990295j195939Q49840K197808j449134o570091n766396O14804M708688K940523
3488f660192l5972l04263n7350j396849j588877J495504M586010M030949J378054
3479A447014k28101j327000l384203m318659j835835J481396J654228r0097N05607
3470f095650L320195M094378J539087j137401j952924k305874k795056j888020
$$ y = [2709395, 2788199, 861160, -1082203, -1188556, 944486, 3846137, 5433842, 5109687, 4215710, 4220274, 5015524, 5180225, 3366147, -522218, -4750493, -6598081, -5027836, -2476203, -2519878, -5620774, -8733210, -9189201, -7024503, -3389388, 598654, 2742881, 914190, -2832361, -2655918, 3583295, 10085313, 10040668, 4424361, -441164, -2047124, -2990295, -4186234, -3336394, -1138586, -2587720, -9157811, -14924207, -14309403, -9600715, -6660192, -6696164, -7000427, -7057777, -8454626, -10043503, -8547999, -3961989, 68960, 1447014, 1218913, -108087, -3492290, -7810949, -9646784, -8165388, -6511160, -6601257, -6095650, -2775455, 1318923, 2858010, 1720609, -232315, -2538189, -5333245, -7221265]
3462g221265N4364K47778j343143j019382K209742L889106J046627k368783j207361
3453e712317K922469M194874J108618k247303k516057l16419K432371M373006
3445D239242L934775O17461k607521j970632J412445K408497n81259l127945j773018
3436B552045O25813k56927l353129m242454j912372P74354K164433L085892L446493
3427B884148J838788r93808k259540j674649k073245l923193l243183K157180
3419g287502P669810P077893R21654m359337m884747k995112k248130k501877
3411h607348j526848R89641L028235K834541P71415j028638p38100Q54105Q02035
3402b620962j906784l844530j255243M005985O106080L070236q83621j992657
$$ y = [-7221265, -7166901, -6919123, -8262266, -9281648, -7071906, -3182800, -2136173, -4504956, -5712317, -2789848, 1405026, 2513644, 266341, -2249716, -2566135, -133764, 4239242, 8174017, 8791478, 6183957, 4213325, 5625770, 8034267, 7453008, 4325063, 2552045, 3177858, 2920931, -432198, -4674652, -6587024, -5812670, -3648237, -562345, 2884148, 4722936, 3729128, 1469588, -205061, -2278306, -6201499, -9444682, -7287502, 382308, 7460201, 8381855, 4022518, -862229, -3857341, -6105471, -8607348, -10134196, -9144555, -6116320, -3281779, -2510364, -3539002, -4277102, -3422997, -2620962, -4527746, -8372276, -9627519, -5621534, 484546, 3554782, 2671161, 678504]
3394F78504j611083j722315k26925M717462Q778669N879772k307904p241588m797107
3385B147485l67529m32043l620372l966812k15240K666689Q46013l152577l912640
3376a0007026p6679L973755L648822J45174j043936K087595M726268K238351k267514
3367C424810k238346J797116K574175k060485m993688j315690K994216M23475
3359F05583n311200m573380K786411P001448L510107r94972k02196K827786K840038
3350H489625J052907N80768o62834n113575q117617l752903M299580O348748P69460
3341C894159l822356j708920K499069K539866l40102j473759p36539r96184j939217
3332b083983q05612K316556M313514L370398L37346l066782m691573k398576K708345
$$ y = [678504, -932579, -2654894, -2881819, 1835643, 10614312, 16494084, 14186180, 6944592, 2147485, 1779956, 1347913, -2272459, -6239271, -6454511, -3787822, -2941809, -6094386, -10007026, -10083705, -6109950, -2461128, -2315954, -3359890, -1272295, 3453973, 5692324, 3424810, 1186464, 2983580, 5557755, 3497270, -1496418, -2812108, 182108, 605583, -4705617, -9278997, -6492586, 508862, 4018969, 3023997, 2821801, 5649587, 8489625, 9542532, 10123300, 9460466, 4346891, -3770726, -7523629, -3224049, 3124699, 3894159, 71803, -1637117, 861952, 3401818, 3061716, 1587957, 851418, -144766, -2083983, -2889595, -573039, 3740475, 7110873, 7448219, 4381437, -310136, -2708712, -367]
3323c67N325306J959238l701376n525144l429136k073250k219517R7862N043518
3314d522866O569813J690307l667044k790843K090259L710358O45998j726983
3306A998999k63877J819787R10703j567470k004273l3132J378251Q5085k719132
3297c95059l960923k107955Q74133J532377o80873k337444o40963K425550K826777
3288b464380K51846j697799o99448J838901L590261L742226K333474M127j124826
3279E774382P32286L620529L270005j099186n364506n882387l137251Q28104M604396
3270C346372N638070J250711n676229p166653p42162N158943K180526n592468
3262a602890p616721k401346J706677L93136j475563j56491Q43966j094286j686521
$$ y = [-367, 5324939, 7284177, 3582801, -1942343, -5371479, -7444729, -9664246, -9566384, -4522866, 2046947, 3737254, 70210, -2720633, -630374, 3079984, 3725982, 1998999, 1735122, 3554909, 4465612, 2898142, 893869, 860737, 2238988, 2324073, -395059, -4355982, -6463937, -5589804, -4057427, -4738300, -7075744, -7716707, -5291157, -2464380, -2212534, -3910333, -4609781, -2770880, 819381, 4561607, 6895081, 6899208, 5774382, 6506668, 10127197, 13397202, 12298016, 6933510, 1051123, -2086128, -1258024, 3346372, 8984442, 10235153, 4558924, -2607729, -3349891, 1809052, 3989578, -1602890, -9219611, -11620957, -9914280, -9521144, -10996707, -11153198, -10309232, -11403518, -13090039]
3253a3090039K335545N884605L011332l053325m564318o00111L417270M971125
3245a687916N705085N051233P33542m353822l902489J525937L624980j207445
3237E489105n701373k718980L655707M496962m94768l358173l89546K973731J175111
3228E127776l335180m297458n39037L203793L188504R16756j16523O02976Q05800
3219E557407m46508j306186l24160J058226Q23335l19118k04501R85639P64904
3210F589038j784798m517871n018758k951376N59671L744493M257993J096123
3202A974515k940187l437999Q31L055845K718921R75065Q00632J623115J169868
3193E940606p86171l010541m701955m521694p30252M870397O565056K211635k246338
$$ y = [-13090039, -10754494, -4869889, -1858557, -4911882, -9476200, -10076311, -6659041, -1687916, 4017169, 9068402, 9801944, 5448122, 1545633, 3071570, 6696550, 5489105, -212268, -2931248, 724459, 5221421, 4726653, 1368480, 978934, 3952665, 5127776, 1792596, -2504862, -3043899, 159894, 3348398, 4265154, 4148631, 4751607, 5557407, 5110899, 3804713, 3480553, 4538779, 5362114, 5042996, 4838495, 5824134, 6589038, 4804240, 286369, -4732389, -7683765, -7124094, -3379601, 878392, 1974515, -965672, -4403671, -4402840, -1346995, 1371926, 2346991, 3147623, 4770738, 5940606, 5154435, 2143894, -2558061, -7079755, -7810007, -2939610, 3625446, 5837081, 3590743]
3184C590743p99413L108114J602743m913950p834825l335082K558701L947734
3176b075235K724238K623529K248252p40017l516321k139160J638051L258975
3168D022312K496599K116182J618483j467830n182436m578686J09784K895789
3160B030197R46540j657696j207036Q2709q63147k149397p22541J452130L44492
3151a743749k854185k878788J371272M779399L387924l35590j740895l30420R67878
3142F22846Q62943Q20008J610237J583577p38527l905592m607220j309044L687806
3133a372966O093067L806529q34791l571234k928478j321582j204248j851455
3125c185158j301609R2059M16548k49173J50089J897292K613005J135511l22981
$$ y = [3590743, 2791330, 5899444, 7502187, 2588237, -5246588, -8581670, -6022969, -2075235, 649003, 3272532, 5520784, 4780767, 1264446, -874714, 763337, 4022312, 6518911, 8635093, 10253576, 8785746, 3603310, -975376, -865592, 2030197, 2976737, 1319041, 112005, 194714, -668433, -2817830, -3540371, -2088241, -1743749, -4597934, -7476722, -6105450, -1326051, 2061873, 1726283, -14612, -345032, 622846, 1485789, 2305797, 3916034, 5499611, 4761084, 855492, -3751728, -5060772, -1372966, 4720101, 8526630, 7691839, 4120605, 1192127, -129455, -1333703, -3185158, -4486767, -4394708, -3978160, -4227333, -4077244, -2179952, 433053, 1568564, 1245583]
3116A245583L51239J726440J199521p18350j224732L49150J631492Q23147j047675
3107D335815k029663j704972j055365r66571j320078r84874J000298L471944L333613
3098D080147o18079m831799m371276Q31367N462473N094755Q49243k913046l495351
3089H8434j427749J069716J891909N30529j311297j580301o13361m39111j203451
3080b994682p11808J654700L302199K356171P04855Q35344J779749J012743j184604
3071F754667k348820j903382j478426j491344m95955J673121K823540J454855
3063D988256j036753k195915j256444N92749J603298P34860j463744l032795k605452
3054c671940j124158l88424k33091J018562L170612L468102M80647l019203k958467
$$ y = [1245583, 1596822, 3323262, 4522783, 3804433, 2579701, 2928851, 4560343, 5383490, 4335815, 2306152, 601180, -454185, -1420756, -2740834, -3725708, -2725410, 746534, 4080147, 3462068, -1369731, -5741007, -4909640, 552833, 5647588, 6496831, 3583785, 88434, -1339315, -269599, 1622310, 2152839, 841542, -738759, -1352120, -1791231, -2994682, -3706490, -2051790, 1250409, 3606580, 4311435, 5146779, 6926528, 7939271, 6754667, 4405847, 2502465, 1024039, -467305, -963260, 709861, 3533401, 4988256, 3951503, 1755588, 499144, 1091893, 2695191, 3430051, 1966307, -1066488, -3671940, -4796098, -5184522, -5417613, -4399051, -1228439, 2239663, 2720310, -298893, -3257360]
3045c257360Q08610L957459K786011j359920l808673k270687O78664J458726K76287
3036g30883R8155J643607K341917P90216q71352p07556k12489j168292j810958
3027f27635K52035L018612K318619j510491l636572j826698Q26457J470424J476487
3018A761238K592100K952206L11744l374079m315599k346119n20650r7527O08415
3009b428271K367826L261393J712342j047128k805746l109514k910677k522085
3001g481860j281460J010755L341378M435673L991737K604732P02366j734503
2993E588818m107117m751482k664190P11979K760636K698785J929500J428945
2985C595874O64898l93561l41834J251853K263613O35965k552299m338202l366067
$$ y = [-3257360, -2448750, 1508709, 4294720, 2934800, -873873, -3144560, -2465896, -1007170, -730883, -632728, 1010879, 3352796, 4143012, 3271660, 2564104, 2351615, 1183323, -627635, -375600, 2643012, 4961631, 3451140, -185432, -2012130, -1185673, 284751, 1761238, 4353338, 7305544, 7617288, 4243209, -72390, -2418509, -2939159, -3036686, -2428271, -60445, 3200948, 4913290, 3866162, 1060416, -2049098, -4959775, -7481860, -8763320, -7752565, -4411187, 24486, 4016223, 6620955, 7323321, 5588818, 1481701, -3269781, -5933971, -5221992, -2461356, 237429, 2166929, 3595874, 4260772, 3867211, 3525377, 4777230, 7040843, 7676808, 5124509, 786307, -2579760]
2976b579760p27049J655697K034441m04498l837831m207663J62819N375234O198651
2967C670041K686683o80868j757525k413572l297819j984635J736263L566041
2959A524609J110439j458091L99026L930337L100868j734901m363026k475717
2951C3544m91750j446694k257035J00811K963855K519565K850r90389l90799m01432
2941c57474p20072L08715J474676M62910j267101l21343K421263K569817n89136
2932C982255k815715j825809m56603j135370j871630l78632J730990J885455O95347
2923a89712L36518J148495K104992K460877J316725j779571m508107l554337j57551
2914b821671N20668k391177l279407O08176L602520O46486l759728k720632J568770
$$ y = [-2579760, -3306809, -1651112, 383329, -21169, -3859000, -8066663, -7903844, -2528610, 3670041, 6356724, 5675856, 3918331, 1504759, -1793060, -3777695, -2041432, 1524609, 2635048, 1176957, 1575983, 5506320, 8607188, 6872287, 2509261, 33544, -458206, -1904900, -4161935, -4061124, -1097269, 1422296, 1425146, 434757, 43958, -357474, -1077546, -768831, 705845, 1168755, -98346, -419689, 2001574, 4571391, 3982255, 1166540, -659269, -1115872, -2251242, -4122872, -4501504, -2770514, -885059, -189712, 146806, 1295301, 3400293, 5861170, 7177895, 5398324, 890217, -2664120, -2821671, -2301003, -4692180, -7971587, -7363411, -3760891, -3114405, -6874133, -9594765, -8025995]
2905h025995K048145p13972p2267L872155L573974k466401n711959r14497N304163
2896c106654M684287o49606k710638M99137L953391L710232O93282k256374l179715
2887A637342j748406L60307J031211P09071J381296K044353n92825n504239o756577
2878g438467k379841J623741L28646k281003j49401M539415M815797J19841l147761
2869c969033j552117J351927J453778p15311k312065j766605Q67708M171550N632786
2860C162618M095407J568561M28160J49130o32602r38165J35753N9637l492502
2851D535997p337853o284218j025081K675944K246026N49089P8365K91860R40426
2842c329445K585834L290912M14986l518766k817626K128713M101654N1678l739626
$$ y = [-8025995, -5977850, -6691822, -6764089, -2891934, 682040, -1784361, -7496320, -8410817, -3106654, 1577633, 928027, -1782611, -1283474, 2669917, 6380149, 7073431, 4817057, 1637342, -111064, 249243, 1280454, 1989525, 3370821, 5415174, 4822349, -681890, -7438467, -9818308, -8194567, -7865921, -10146924, -10296325, -5756910, -941113, -821272, -3969033, -5521150, -4169223, -2715445, -3430756, -5742821, -7509426, -6641718, -2470168, 3162618, 7258025, 8826586, 9254746, 9403876, 8771274, 7833109, 7968862, 8028499, 4535997, -2801856, -9086074, -10111155, -7435211, -5189185, -4640096, -4561731, -4269871, -3329445, -743611, 2547301, 2962287, -556479, -3374105, -1245392, 2856262, 2907940, -831686]
2833h31686j381775L748455M983683K299718L08681o9981j450309l494069k967174
2824A145543J01682J815191N09781j055951n79003N68129M23681l40794j43723
2815B444536N83980J09995j816860l280591k334051N86845K676209J712255j054587
2806c72269k140251l53178J530015P32448j527416j956392k3017J557028J019245
2797a533787r1744N04002K573777L906959L243272J452906K4495n03234l04315
2788I272331M90735J348043Q60922j649995m189533l765044n65881J741073J007244
2779D549895o01262o72136o24373k547308m313553k240845K477355M694928K598648
2770C321349l96163j419423j289294r71610M88726K816170L511201K024919J019864
$$ y = [-831686, -2213461, 1534994, 6518677, 8818395, 9127076, 9057095, 7606786, 4112717, 1145543, 1247225, 3062416, 3572197, 2516246, 1937243, 2505372, 2929053, 2588259, 2444536, 3028516, 3138511, 1321651, -1958940, -4292991, -3706146, -1029937, 682318, -372269, -2512520, -2865698, -1335683, -603235, -2130651, -4087043, -4110060, -2553032, -1533787, -1625531, -1121529, 1452248, 5359207, 8602479, 10055385, 10079880, 9576646, 9272331, 9763066, 11111109, 11972031, 10322036, 6132503, 2367459, 1801578, 3542651, 4549895, 3948633, 3276497, 2652124, 104816, -4208737, -6449582, -3972227, 722701, 3321349, 2925186, 1505763, 216469, -755141, -266415, 2549755, 6060956, 8085875, 9105739]
2761I105739J461585O26494k522434m353464k309288M10756o2899k044793j705335
2752a393639K87890O05149m96954j54171J219073N24705j927015k311396J07323
2743c539035J264292j154441l615004j759353L172598N683801K725021k849542
2735g1663n424384k445615L020238N632246L495420l61563k167275j306304M89076
2726H60176J663215J388011l00737j670568q86384N22699r63511m532880m527523
2717h447502P91753M894250K240927k647419k049104K497468K888863j899904
2709a730668m023379L79392N216973M359867J11217k385848l009293l975764m159043
2700i216546j478092K305799M051951M033639M001448K924873p31490m351237
$$ y = [9105739, 10567324, 11193818, 8671384, 4317920, 2008632, 2419388, 2356489, 311696, -1393639, -1105749, -500600, -997554, -1151725, 67348, 592053, -1334962, -3646358, -3539035, -2274743, -3429184, -7044188, -8803541, -5630943, 52858, 2777879, -71663, -5496047, -7941662, -4921424, 710822, 4206242, 3844679, 1677404, 371100, 860176, 2523391, 3911402, 3610665, 1940097, 1053713, 1576412, 612901, -3919979, -8447502, -7655749, -2761499, -520572, -3167991, -5217095, -2719627, 169236, -1730668, -5754047, -5374655, -157682, 4202185, 4313402, 1927554, -1081739, -5057503, -9216546, -10694638, -8388839, -4336888, -303249, 3698199, 6623072, 5891582, 1540345]
2692A540345l717692M30099K819670Q09378k540729l200215r97254J291464J583434
2683a981500J33655j343187j492605o15810n6075j84480O8962J222365K106363
2674b142312J674907P62301Q88984K181478L366321L050783O13126l005715n230557
2665B159316m262753j722885p46520j379262q31004J329912K163308P66072J56679
2656b367137J411506Q63450l045781n101374j146561L628615J639854m448931
2648h566359m722158K681200Q353485N874803P50224O57525L923136L976874K81101
2639A3209831k227619j849521j502961k462761k745797j763608j381325j780306
2631b504067q94420J169739J551100k42683r16360R53823J924022p56781m044527
$$ y = [1540345, -2177347, -1747248, 1072422, 1881800, -658929, -3859144, -4856398, -3564934, -1981500, -1847845, -3191032, -4683637, -5299447, -5355522, -5540002, -5471040, -4248675, -2142312, -467405, 294896, 1183880, 3365358, 6731679, 9782462, 10395588, 7389873, 2159316, -2103437, -3826322, -4572842, -5952104, -6783108, -5453196, -3289888, -2523816, -2367137, -955631, -92181, -3137962, -8239336, -9385897, -5757282, -4117428, -8566359, -13288517, -10607317, -2253832, 3620971, 4371195, 5028720, 8951856, 12928730, 13209831, 10982212, 9132691, 7629730, 5166969, 2421172, 657564, -723761, -2504067, -3398487, -2228748, -677648, -920331, -1836691, -882868, 1041154, 284373, -3760154]
2622c760154l377338K58148J866747J21569q84711J777146N219653M703510J62857
2613F087427l623629k939084N93521K302150K42605k613672k547149k16692M28898
2604b285625j836774l498628j637769J527821K129075N29779R9774J315534J308449
2595b348364p61458k209859j638864j058047j444816k88197L568463O191220L635271
2586C645349j548750l264664l14117K366037J054387j940385k062696J486078
2578e78761N148645N189631J423604k731626l688149j505360K31160j063228l587836
2569a161920l539017l4417L882415M771363K092508j708201l544224k562114j008816
2560b812423j226108j960671q6318L626635M164791l36997m694966l629720O24317
$$ y = [-3760154, -7137492, -6879344, -5012597, -4891028, -5775739, -3998593, 1221060, 5924570, 6087427, 2463798, -475286, 118235, 2420385, 2662990, 49318, -2497831, -2714523, -2285625, -4122399, -7621027, -9258796, -7730975, -5601900, -5072121, -4972347, -3656813, -2348364, -3109822, -5319681, -6958545, -8016592, -9461408, -9749605, -6181142, 10078, 3645349, 2096599, -1168065, -1482182, 883855, 1938242, -2143, -2064839, -578761, 4569884, 9759515, 11183119, 8451493, 4763344, 3257984, 3489144, 2425916, -1161920, -4700937, -4735354, -852939, 3918424, 6010932, 4302731, 758507, -1803607, -2812423, -4038531, -5999202, -6085520, -2458885, 1705906, 1368909, -3326057, -6955777, -6331460]
2551f331460K137931K74337m27428J811953L601020K110952j271090l642173l422759
2542e158717l50849M066994O288177M111847k04405l149060m709746o340587o586324
2533a2032670l699121l56504M3606m80910J317465K381914j526329n697626k170073
2524b2220248N657060O558620p5778l620414k093006n544255j3489403q162508
2516d2989932J6657122L7151297K8696045J764245j2668746o223705J369408k773352
2508B0982382q452007n169724N85945k626l040262k217430j055298m063252o213411
2499h645683j970767L639243L291967l31171l74723K134658J947186K96693J965058
2490A952461N235567M419229J32167j856275o12319o32887l160426m471369k895247
$$ y = [-6331460, -4193529, -3919192, -4346620, -2534667, 1066353, 3177305, 1906215, -1735958, -5158717, -5509566, -1442572, 4845605, 8957452, 8753047, 5603987, 894241, -5446346, -12032670, -15731791, -16088295, -16044689, -16525599, -15208134, -12826220, -14352549, -20050175, -22220248, -16563188, -10004568, -10080346, -13700760, -15793766, -21338021, -34827424, -42989932, -26332810, 10818487, 39514532, 41278777, 28610031, 22386326, 23755734, 20982382, 12530375, 7360651, 7946596, 7943970, 4903708, 2686278, 1630980, -2432272, -8645683, -10616450, -6977207, -3685240, -4016411, -4391134, -2256476, -309290, -12597, 1952461, 7188028, 11607257, 11739424, 9883149, 9270830, 8637943, 5477517, 1006148, -1889099]
2481a889099j033342o40980p06275o52956p26038L21088L424224N996477M955624
2472I048723J720225k36025j001720k482523l219851q37531K117454J279292j816628
2463D571416j967066N49086M73118k813839m060771j630200k35995j892462j903406
2454h910119K408484N957534L797747p85367j517310J528558L130309Q75642k627770
2445C857708l952641k020416J530422L148966O13787l198573k890172J759621
2437a151298M820250K967496L04080J113994K767232O81520l614283n000787k745326
2428A42878n14389j44048l86043n58495q82524l41138J646520K821667J390875
2419C175303j75374Q59647J962514o68567m457626l418135J961012M773021K144211
$$ y = [-1889099, -2922441, -3563421, -4269696, -4922652, -5648690, -5327602, -1903378, 4093099, 9048723, 10768948, 10532923, 9531203, 7048680, 3828829, 2991298, 5108752, 6388044, 4571416, 2604350, 3153436, 3626554, 812715, -3248056, -4878256, -5114251, -7006713, -8910119, -6501635, -544101, 3253646, 2468279, 950969, 2479527, 5609836, 6485478, 3857708, -94933, -2115349, -584927, 2564039, 3177826, -20747, -2910919, -1151298, 3668952, 6636448, 6940528, 8054522, 10821754, 11503274, 7888991, 2888204, 142878, -371511, -515559, -901602, -1460097, -2342621, -2683759, -1037239, 1784428, 3175303, 2999929, 3859576, 5822090, 5153523, 695897, -2722238, -761226, 4011795, 6156006]
2410F156006j167192j099070K27866k79730j716336k276367k448610k388490o12506
2401e604429K199445K721583P48612M09140K842287L318494n00928l295058m13936
2392B425210L742822K318866k989928m885058j854503J027504J452971K317568
2384C555452M499616M409248N21039l496714m371040l232913k117228q51302M98795
2375e85047J60330j946058k751863m20793K606399L116944J248669p37034j477273
2366g85726o50907J561289L504785K761574n40655l155222k842439j003337J9479
2357a131159m8894m45767r82583j070271M90408L023121L567148Q71019k226877
2348B046145k348398K22302K607818K943884J360057r79560k357281j574155L55947
$$ y = [6156006, 4988814, 3889744, 4117610, 3837880, 2121544, -154823, -2603433, -4991923, -5604429, -3404984, -683401, 65211, 474351, 3316638, 6635132, 6134204, 2839146, 2425210, 6168032, 8486898, 5496970, 611912, -1242591, -215087, 1237884, 3555452, 8055068, 12464316, 12985355, 9488641, 5117601, 1884688, -232540, -1083842, -585047, -424717, -2370775, -5122638, -5543431, -2937032, 179912, 1428581, 691547, -785726, -1436633, 124656, 3629441, 6391015, 5850360, 2695138, -147301, -1150638, -1131159, -1180053, -1625820, -2608403, -3678674, -3188266, -165145, 3402003, 4273022, 2046145, -302253, -79951, 2527867, 5471751, 6831808, 5852248, 3494967, 1920812, 2276759]
2339B276759J239669J007414J635638L195952L059364J69271l074961m521365
2331D987741m558548l543782r15907J698817J226241j057089l8116M112937M027481
2322E939775k915133p786501k600642O402082P422707Q87184k382812J055836
2314F022496L165376p50028m564654k686932Q20824K69878k102632j226789J657528
2305F05067J658482j526940l987085l833417k077844P16103M084173N494983K750158
2296C883680k253666n367960m935261k279791R82767L513739L756222J686044
2288a014226j90250J5913Q99181N34122O851J214478K730256J373034k646594
2279B922765n278128l571651J027444M509555M122086O27604k324741j734442
$$ y = [2276759, 3516428, 4523842, 6159480, 9355432, 12414796, 12584067, 9509106, 4987741, 429193, -3114589, -4030496, -2331679, -1105438, -2162527, -2200643, 1912294, 5939775, 3024642, -4761859, -7362501, -960419, 6462288, 7349472, 4966660, 6022496, 9187872, 8437844, 3873190, 1186258, 2007082, 2276960, 174328, -1052461, 605067, 2263549, 736609, -3250476, -7083893, -9161737, -8445634, -4361461, 1133522, 3883680, 1630014, -3737946, -8673207, -10952998, -9970231, -6456492, -2700270, -1014226, -1204476, -1188563, -289382, 244740, 251591, 1466069, 4196325, 5569359, 2922765, -2355363, -5927014, -4899570, -390015, 3732071, 4359675, 2034934, 300492]
2271C00492J271332K733494J032805j324502j886088j514031j845075k145755
2263c377328r66662J168234K866897L693129L132673L38202l038490k946587J211596
2254B081664M055724J328374l460215m096730q82306P34215p03043r93754K056082
2245A20011N000921M304694J031336j871432l397896l720448k526535m4068K257991
2236A154574L267257K956785J216163j888348m495800m225789j638845J32062
2228c521941j55263l74416J160882L042027L118508J288781j197771l253643l848351
2219c741187k423078l34382J10661j093550j477814n1018R77185j75391j738372
2210i946946q57983K234204M418200L426953J82537k244768j549681J446578L488682
$$ y = [300492, 1571824, 4305318, 5338123, 4013621, 2127533, 613502, -1231573, -3377328, -4343990, -3175756, -308859, 3384270, 6516943, 6855145, 3816655, 870068, 2081664, 6137388, 7465762, 4005547, -91183, -973489, -239274, -942317, -1936071, 120011, 5120932, 9425626, 10456962, 8585530, 5187634, 1467186, -1059349, -1103417, 1154574, 4421831, 7378616, 8594779, 6706431, 2210631, -2015158, -3654003, -3521941, -3677204, -4051620, -2890738, 151289, 3269797, 4558578, 3360807, 107164, -3741187, -6164265, -6498647, -6387986, -7481536, -8959350, -9010368, -8033183, -8208574, -9946946, -10804929, -8570725, -4152525, -725572, -543035, -2787803, -4337484, -2890906, 597776]
2201E97776K670965O69323j85183n37318k018902l104085j130886K080465J828285
2192H70440j457537j562931L702477P771498M623017k094658m841903l266674
2184C743729k706044l937032k274249L012328O017207L233478j071990j938710
2176D078717r22335j917481l926355l200136r6377J489392M62332n29227j95053
2167d756523n5401l35227J172681M701183O732618M672399L54709l126222n311084
2158D049133o834595o714405m173727j156768J37054P14426K633071M805307M559267
2149a981237K445142J527933K158572J501223j343762l695603l688298k613817
2141e689847j682992r5310K076499K632521R32781l61938N33855J603814O43850
$$ y = [597776, 3268741, 3938064, 3752881, 3215563, 1196661, -1907424, -3038310, -957845, 870440, -587097, -2150028, 1552449, 9323947, 13946964, 11852306, 7010403, 3743729, 1037685, -2899347, -5173596, -2161268, 3855939, 7089417, 6017427, 4078717, 3156382, 1238901, -2687454, -5887590, -5983967, -4494575, -4032243, -4561470, -4756523, -4811924, -5147151, -3974470, 726713, 7459331, 12131730, 12486439, 9360217, 4049133, -2785462, -9499867, -13673594, -14830362, -14693308, -13978882, -11345811, -6540504, -1981237, 463905, 1991838, 4150410, 5651633, 4307871, 612268, -3076030, -5689847, -7372839, -7468149, -5391650, -2759129, -1826348, -2188286, -1654431, -50617, 593233]
2132E93233j088218j436772q68371o83605k35652J197869K089686J059099o09183
2123A8086j435332k133893k841906j212227L175882N801883L041158j789032l018244
2114c93625o92334J099191J403607J934905J563065j859637n337723l689298J508411
2105d463438L301281K67682j552645Q27076K697475M92977k033995p68714J781712
2096E49411J390084r06995j695651j094208j021181q66061O31503J998249J573716
2087E58867P77611J194803J333461l9469n92665J371087K651895j10913m254838
2078B889839m884614k564833j652351k630707k062247N49156J837657Q31166N93995
2069g092939K518718L869242K626072N60822l81311j065481k446258l091832j841521
$$ y = [593233, -494985, -1931757, -2800128, -3483733, -3719385, -2521516, -431830, 627269, 18086, -1417246, -3551139, -6393045, -7605272, -4429390, 1372493, 4413651, 2624619, -393625, -1085959, 13232, 1416839, 3351744, 4914809, 3055172, -2282551, -5971849, -4463438, -1162157, -894475, -2447120, -1620044, 1077431, 1570408, -463587, -1232301, 549411, 1939495, 1032500, -663151, -1757359, -2778540, -3644601, -3013098, -1014849, 558867, 1336478, 2531281, 3864742, 3825273, 3232608, 4603695, 7255590, 7144677, 2889839, -1994775, -4559608, -6211959, -8842666, -10904913, -10355757, -8518100, -7686934, -7092939, -4574221, -704979, 1921093, 2481915, 2100604, 1035123, -1411135, -4502967, -6344488]
2060f344488l92468o77110j486567k73252K732677M550026L279452J38445k346890
2051h20175k806936j436210Q76336K996608L657158K229237k95971j888177j660243
2042H51627q14790o56955n64926O76104K275817K188382K89567j325839j480033
2033A438954j270236j746984k165220j321837Q42285L388906M787783L459408
2025G413059j83732k813641j905453K35207m76702l319978l596735k68142K333607
2016b582510J736425R46936K420868L565875J711141r52204j392930q29360j623134
2007C001107k562489j630025l98410j132265k163756o86882K144811L278227K759058
1998B609376K522434K451266J717218J530087K345976J238683l249154o740445
$$ y = [-6344488, -6736956, -7414066, -8900633, -9173885, -6441208, -1891182, 1388270, 1526715, -820175, -3627111, -5063321, -4186985, -1190377, 2466781, 4696018, 4400047, 2511870, 851627, 36837, -620118, -1185044, -508940, 1766877, 3955259, 4244826, 2918987, 1438954, 168718, -1578266, -3743486, -5065323, -4223038, -834132, 3953651, 7413059, 7229327, 4415686, 2510233, 2745440, 2268738, -1051240, -4647975, -4916117, -2582510, -846085, 100851, 2521719, 6087594, 7798735, 6846531, 5453601, 4624241, 3001107, 438618, -1191407, -1589817, -2722082, -4885838, -5572720, -3427909, -149682, 2609376, 5131810, 7583076, 9300294, 10830381, 13176357, 14415040, 11165886, 4425441]
1990D425441m891651o15581N37891p37833q5075J697779L59065k875578k595403
1981d780945R94685K205560K33356M06709L432718K696915m099424r139761n668853
1972a3719040J809760M548943J702777p21138L89832K487175K684328J130543
1964C13180l98207l98666J207482K341742P10404k578424l647725j029679K475473
1955a004420L927569L124731O69519k996831n493783l668843J337666M235353
1947A30961K731415M21418M37370P16070j419398m087014l898986j125325J427916
1938d665573K168001R40776j623788l009252n65787L634044L880207q59611m513978
1929d614961k873902L08164L66874n50068J526092M368510L378006M8664o23744
$$ y = [4425441, -466210, -1081791, -543900, -1281733, -1366808, 330971, 690036, -2185542, -4780945, -3786260, -1580700, -1347344, -940635, 2492083, 5188998, 1089574, -8050187, -13719040, -11909280, -7360337, -5657560, -6378698, -5988866, -3501691, -817363, 313180, -85027, -483693, 723789, 3065531, 3775935, 1197511, -2450214, -3479893, -1004420, 2923149, 6047880, 6717399, 3720568, -1773215, -5442058, -4104392, 130961, 2862376, 3283794, 3721164, 4437234, 3017836, -1069178, -4968164, -6093489, -4665573, -2497572, -1556796, -3180584, -6189836, -6755623, -3121579, 758628, -100983, -4614961, -7488863, -7180699, -6813825, -7363893, -5837801, -1469291, 1908715, 1957379, 1333635]
1920A333635J039059M99596k366481l146027j106183k23465j301692k45602L898799
1911a618361N898484K489673k079995k620480n75523n20321k454778k627277l08720
1902d417298J174246K7481j516900j194796K6002K37443k82937l38591n22812
1893f808162j985309l245424j401998K986131N422431L505847M82008J76045J185695
1884C17264K5875k097715r54795K889966L824932n3091l526933k197841J059600
1875g12738J261584r72737j370748P90802K044358L92172k163350k739913o75689
1866d146259K514375M606524M279842K245959K72466j090278k371522k864426
1858C446681j072409J947617K746181K70270k411317k608354j275573k29532P38149
$$ y = [1333635, 2372694, 2872290, 505809, -2640218, -3746401, -3969866, -5271558, -5517160, -1618361, 4280123, 6769796, 4689801, 2069321, 1493798, 973477, -1481301, -4108578, -4417298, -3243052, -3215571, -4732471, -5927267, -5901265, -5663822, -5946759, -6285350, -6808162, -8793471, -12038895, -13440893, -10454762, -5032331, -1526484, -1044476, -868431, 317264, 343139, -1754576, -2709371, 180595, 4005527, 3952436, 425503, -1772338, -712738, 548846, -423891, -1794639, -1003837, 1040521, 1432693, -730657, -3470570, -4146259, -1631884, 2974640, 7254482, 9500441, 9772907, 8682629, 6311107, 3446681, 2374272, 4321889, 7068070, 7338340, 4927023, 2318669, 1043096, 813564, 1551713]
1849A551713K058499K712963K317172K011262J730806l0447k315026j854898Q83182
1840I065226P77021l833056p257478m764111P5509J266813p11295j446734l46501
1831g174606J66632L44486J872346K989901P26499l380963m971415k903638P76520
1822a1554238M660384P171982N048072j666591o147903k970691K894007K723567
1814A58589k493811l835992J194686N356547L732373K18648o85416o79999k403457
1805E62168l761553j932565J498587L210799K548276N59956k047589l846764k936461
1796f145146j66505J138604J83242r5327J762509L238550K387872J022267J053482
1787D379548J178516j39996j347260l14433J931153K641102J193578n66177j024781
$$ y = [1551713, 3610212, 6323175, 8640347, 10651609, 12382415, 12351968, 10036942, 8182044, 9065226, 9842247, 6009191, -1248287, -6012398, -5936889, -4670076, -5381371, -6828105, -7174606, -7007974, -6663488, -4791142, -1801241, -1074742, -4455705, -9427120, -12330758, -11554238, -6893854, 278128, 5326200, 3659609, -2488294, -5458985, -2564978, 158589, -2335222, -6171214, -4976528, 380019, 4112392, 4331040, 3645624, 2965625, 562168, -3199385, -5131950, -3633363, -422564, 2125712, 2685668, 638079, -3208685, -6145146, -6311651, -5173047, -4989805, -5085132, -3322623, -84073, 2303799, 3326066, 4379548, 5558064, 5418068, 4070808, 3756375, 5687528, 8328630, 9522208, 8956031, 7931250]
1778G931250l92995Q970o32770j635370j734545j121468j276485k219374j975719
1769c048506Q4698J892149K219861K590245L671529L376099J155218M6155J095455
1760A3082903M38540l719513o345776l471290L02979p52099l351862j021903L827802
1751a010219L430599k011369m607085j580787J853926K437291K459512K851491
1743C823359J429753j014768r16118J064174Q20379j365253j524743j9698n72412
1734A724673k139617p26381J706988l6272l721682k382672K987891M739507K022923
1725D175358Q97773J513970j488540n789578l281066L790094M195086k533361
1717A479736m147287K920472P131755K041044l760505l219476j210970j750988
$$ y = [7931250, 7538255, 7547225, 6914455, 5279085, 3544540, 2423072, 1146587, -1072787, -3048506, -2963808, -1071659, 1148202, 3738447, 7409976, 10786075, 11941293, 11987448, 13082903, 13521443, 9801930, 3456154, -15136, 287843, -464256, -3816118, -4838021, -1010219, 2420380, 409011, -4198074, -5778861, -3924935, -1487644, 971868, 3823359, 5253112, 4238344, 3322226, 4386400, 5206779, 3841526, 2316783, 2297085, 1724673, -414944, -1141325, 565663, 529391, -3192291, -5574963, -2587072, 2152435, 4175358, 5073131, 6587101, 5098561, -691017, -3972083, -181989, 4013097, 1479736, -2667551, 252921, 7384676, 9425720, 5665215, 2445739, 1234769, -516219]
1709e16219p61213J971823p9589n208140l148719M870565N521098j738382k059249
1700a148025O094817O285249l351586l695261P470372O732655r216355j0413567
1692a241701R602828J2098183j3431852o846743O9410039J37786317R1479647
1685B98856718m4598503j30259986r4590757j5883660Q821987j0718264j2378690
1678g51155Q161515J0638647p893548j3710566m70063N779848k164888n022058
1670e432268K379502M391736j848001k055080N017823M853798l921396o751449
1662c365335r16070P34651m337421m317594K620559M411566j105180j833051M962045
1653c145830P054560M51944l128005J781329M985178L85779l434525l74739K427419
$$ y = [-516219, -1277432, 694391, 614802, -4593338, -7742057, -2871492, 2649606, 911224, -1148025, 4946792, 11232041, 7880455, 4185194, 11655566, 18388221, 9171866, -1241701, 8361127, 20459310, 7027458, 180715, 69590754, 207377071, 298856718, 254258215, 123998229, 29407472, 13523812, 22345799, 11627535, -751155, 7410360, 18049007, 10155459, -3555107, -4025170, 1754678, -410210, -5432268, -3052766, 1338970, -509031, -2564111, 2453712, 7307510, 3386114, -3365335, -4281405, -3546754, -7884175, -12201769, -9581210, -5169644, -6274824, -8107875, -3145830, 3908730, 4360674, 1232669, 3013998, 7999176, 8384955, 4950430, 4575691, 7003110]
1644G003110n80482l217340p72297P69727k732498m769438n14654L742376J921593
1635H50097j751287j750790n68923j495706j427344J802836L544398O71585k258959
1626b384093j384908l8374j121513j304357J337654K300316p02192k409579M67450
1617e239596K765987M31414j837881L55854K607067J73434k664096l14953L722973
1608B03L147259j38558l55776J553613P32422j920902j759916N81086M39258k402521
1598a23832l879111k838520j485922q2995K570227M594280K836579j561322m327827
1589d298443l836700j622366J106146L324138K776809q30822l372999j452013
1581h206250K254123L201010J889684J603775J812797m37417m198501n357792
$$ y = [7003110, 6422628, 3205288, 2432991, 3202718, 470220, -4299218, -4813872, -1071496, 850097, -901190, -2651980, -3220903, -4716609, -6143953, -4341117, -796719, -125134, -2384093, -3769001, -3807375, -4928888, -6233245, -4895591, -2595275, -3297467, -5707046, -5239596, -2473609, -2042195, -3880076, -3524222, -917155, -743721, -3407817, -3722770, 203, 3147462, 3008904, 2653128, 4206741, 4939163, 3018261, 1258345, 1839431, 2278689, -123832, -4002943, -6841463, -8327385, -8410380, -5840153, -1245873, 1590706, 29384, -4298443, -8135143, -9757509, -8651363, -5327225, -2550416, -3381238, -6754237, -8206250, -5952127, -2751117, -861433, 742342, 2555139, 2117722, -2080779, -7438571]
1573g438571k923604K68867K307838L268779K679340L74551j222836P821J953721
1564g24094J458268k07256K50462K001142J707803o6654K9206J322484k64372
1555E506989m459145n814375k146420J843097J689705q43824j642519k60328R51152
1546e175668J014763P94928R18911J301213J694576J577317N67552n55815o19077
1537A518700l9524l38659j457597j494664L32588K180913J808913p63414l246373
1528a499117l136028r7913L101791L045552r0592k336809j298712M59876l61572
1519b213524k547368k683851q62702Q1264n7998J131293L446604L582771P41541
1510F18030j600858j046384M45056N16943J57375J070251K191346J608453l0922
$$ y = [-7438571, -10362175, -10093308, -7785470, -4516691, -1837351, -1462800, -2685636, -2677815, -724094, 734174, 526918, 777380, 2778522, 4486325, 4419671, 4448877, 5771361, 5506989, 1047844, -4766531, -6912951, -5069854, -3380149, -4223973, -5866492, -6126820, -5175668, -4160905, -3365977, -2447066, -1145853, 548723, 2126040, 2693592, 2137777, 1518700, 1479176, 1140517, -317080, -1811744, -1479156, 701757, 2510670, 1747256, -1499117, -4635145, -4733058, -1631267, 1414285, 1323693, -1013116, -2311828, -1851952, -2213524, -4760892, -7444743, -8307445, -8226181, -8284179, -7152886, -3706282, -123511, 618030, -982828, -2029212, -1584156, -1067213, -909838, 160413, 2351759, 3960212, 3929290]
1501C929290o56785J8700O76414P36781N61703J29325p16242j261694o93819M80188
1491C203861R19722K3212j743910l478762m070984k638208K54718K411309K061357
1482c057685j88466k124767k213746n67496J663867L002505K355915J55727j481265
1473b455411r06908P39030O59974j688961l215197j044485L114713M529657J528573
1464A260985k183943k479091q1533J221813K03132q85678n10444K40156M41358
1455b773245J001004K304377K736018J142530j235954k726316l188989k776026
1447e516601j034749J159480J296042j006687k363824l34245K568294K696390
1439b535900R76896R55228K599920K464838k93106k377046j562892K33269M84200
$$ y = [3929290, 3272505, 3291205, 3967619, 4704400, 5266103, 5395428, 4679186, 3417492, 2723673, 3203861, 4123583, 4146795, 2402885, -1075877, -5146861, -7785069, -7530351, -5119042, -3057685, -3246151, -5370918, -7584664, -8152160, -6488293, -3485788, -1129873, -974146, -2455411, -3362319, -2623289, -1963315, -3652276, -6867473, -7911958, -4797245, -267588, 1260985, -922958, -3402049, -3483582, -2261769, -2058637, -2944315, -3454759, -3214603, -2773245, -1772241, 532136, 3268154, 4410684, 3174730, 448414, -2740575, -5516601, -6551350, -5391870, -4095828, -5102515, -7466339, -7800584, -5232290, -2535900, -1559004, -603776, 1996144, 4460982, 4167876, 1790830, 227938, 461207, 945407]
1430I45407k54640J2009J245257J358283q93189l908747m302304n46405M264506
1421b079823M961717O94854l326845k441749J376295K901150R75693j368831k475279
1412g82818l138131k914038l99047K593168K146584j442237l243816j138865J023667
1403g295533p9899k155804j753264K20837J182716J673094L116306L370318l77481
1394b098710n374336n243372J053049O589667N062986r24031l314738P50239N266229
1385A766983L596042k428531n085661j581782K410976J627577j305779j381648
1377b381823J4876j634713m421902j997811M780343P087793J758021k913428j10091
1368A81265M480742K063968m762829o228189q93946K976721J069681j476507o8704
$$ y = [945407, 690767, 702776, 1948033, 3306316, 2413127, -1495620, -5797924, -6344329, -2079823, 2881894, 3576748, 249903, -2191846, -815551, 2085599, 3061292, 1692461, -782818, -3920949, -6834987, -7234034, -4640866, -2494282, -3936519, -7180335, -8319200, -7295533, -7375432, -9531236, -11284500, -11063663, -9880947, -8207853, -5091547, -1721229, -2098710, -7473046, -12716418, -11663369, -5073702, -10716, -934747, -4249485, -3499246, 1766983, 5363025, 2934494, -2151167, -3732949, -1321973, 305604, -1000175, -2381823, -2366947, -4001660, -8423562, -10421373, -5641030, 1446763, 3204784, 291356, 181265, 4662007, 6725975, 1963146, -4265043, -5158989, -2182268, -1112587, -2589094, -2657798]
1359b657798K289208J679373J72368J131732K657310J134372k074374k953804
1351A378387j752746k101318m033742l372616J057577M421809K502916k087767
1343c987500l601170j090167J023511j34690k100355j340302J639294L664125
1335e927254L425669K009721J27765k166423l494984k152632O08733J459261n7039
1326f167183o69699J216256K641342Q00370k388047l243120j438678P89602K350678
1317f108479L031901J675694j634878l351661o75447L217874K749247j874701
1309b970450m877747l349816l97460R63919J811075L219875L117686M28596j597270
1300c651592o7018K387796J247465k830832m671185j753958K765703M510234K715161
$$ y = [-2657798, -368590, 1310783, 1483151, 2614883, 5272193, 6406565, 4332191, 1378387, -374359, -2475677, -6509419, -9882035, -8824458, -4402649, -1899733, -3987500, -7588670, -8678837, -7655326, -7790016, -9890371, -11230673, -9591379, -5927254, -2501585, -491864, -364099, -2530522, -6025506, -8178138, -7569405, -6110144, -6167183, -6836882, -5620626, -2979284, -2178914, -4566961, -7810081, -9248759, -8459157, -6108479, -3076578, -1400884, -3035762, -6387423, -7062870, -3844996, -1095749, -2970450, -7848197, -11198013, -11595473, -10631554, -8820479, -5600604, -2482918, -2054322, -3651592, -3718610, -1330814, -83349, -2914181, -7585366, -9339324, -6573621, -2063387, 651774]
1291F51774r7321j468120j010754J96758J284964K052302J794611p12895m435870
1282a744551m944863M90298P260023P454157M90505n222275l599898J164203J903705
1273C251304r34139j782409K81118J250272K16685L85677J888662Q18629k875969
1264B499830l510903J099456M824463K258475k691324l090377J01814L18807l416801
1255a606560m956564j026686L852858M544598K111084M49758J85326m21488j212825
1246A919501o72351O49712P07622o09102j544318j671228k138651k605318r70168
1237f934301K775099N115367L396616k24613j636782m76835j00383j895954k795675
1228b777461q9612L655645L443784j078636m540465k738059J896418L657222Q34680
$$ y = [651774, 554453, -913667, -1924421, -1727663, -442699, 1609603, 3404214, 2691319, -1744551, -6689414, -6199116, 1060907, 8515064, 9005569, 3783294, 183396, 1347599, 3251304, 2317165, 534756, 815874, 2066146, 2282831, 2668508, 4557170, 5375799, 2499830, -1011073, 88383, 4912846, 7171321, 4479997, 1389620, 1491434, 1810241, -1606560, -6563124, -7589810, -3736952, 807646, 2918730, 3368488, 3553814, 3132326, 1919501, 1247150, 1896862, 2604484, 1995382, 451064, -1220164, -3358815, -5964133, -6934301, -4159202, 956165, 4352781, 4128168, 2491386, 2014551, 1914168, 18214, -2777461, -2867073, 788572, 4232356, 3153720, -1386745, -4124804, -2228386, 1428836, 2263516]
1219B263516k863969l624736j600558Q28931K398120K995380K108821m79786l000378
1210i74659k913186k48547J890019R96197j727898k891931r24181K418716M286639
1201h8831L513416J013387j720865l742380m461063l273638j76380L381217N139210
1192d15927M076043J427709p94728j834282k104972j744192o07287M14255j78263
1183a761644j992922k263626O40883M307413M885282K199999l9471M59113J483969
1174G918996k312l093036m304414k745646j063251j071620j229524L60666K760324
1165b469817L866010L572021L034597K021057l33630k742413k754342p04454M05515
1156C894544j72290N86121M118392O481752L307767l255663o548668m027147j33777
$$ y = [2263516, -600453, -4225189, -5825747, -4996816, -2598696, 396684, 2505505, 2025719, -974659, -3887845, -4136392, -2246373, -1250176, -2978074, -5870005, -6794186, -4375470, -88831, 3424585, 4437972, 2717107, -1025273, -5486336, -8759974, -8936354, -5555137, -415927, 3660116, 5087825, 4293097, 2458815, 353843, -1390349, -1997636, -1583381, -1761644, -3754566, -6018192, -5377309, -1069896, 3815386, 6015385, 5975914, 6435027, 7918996, 7916684, 4823648, 519234, -2226412, -3289663, -4361283, -5590807, -5230141, -2469817, 1396193, 4968214, 8002811, 10023868, 9690238, 6947825, 4193483, 3489029, 3894544, 3722254, 4308375, 8426767, 14908519, 18216286, 14960623, 8411955, 4384808, 4251031]
1147D251031J84639k494319m173956l043541p24285P18263Q82803N53732M93039
1138c352594O52717J61286j346570k392669j100729J652071K555581M56245j549977
1129d264639n67947J570604J141527j440937k099662N19966K925842K120925l06932
1120d01253j389791j213524j400193j306867P61682L544538L795369J457337K42335
1111D089633J793006K628650o14328n442789o446941k757113J118445J799234
1103c832203O73053J15697k75093j440747j805050L35431L140050L344833J097400
1094A353371o75437j098744j803086k615107j123716K306807L420549L38394k895687
1085b792656k298089q2066n05757k258389n87519L987577N305308J050211l082465
$$ y = [4251031, 4435670, 1941351, -2232605, -5276146, -6000431, -5282168, -4399365, -3845633, -3352594, -2699877, -2538591, -3885161, -6277830, -7378559, -5726488, -3170907, -2714662, -4264639, -4832586, -3261982, -2120455, -3561392, -5661054, -5141088, -2215246, -94321, -401253, -1791044, -3004568, -4404761, -5711628, -4949946, -1405408, 2389961, 3847298, 4089633, 5882639, 8511289, 7896961, 2454172, -3992769, -6749882, -5631437, -3832203, -3159150, -3043453, -3318546, -4759293, -6564343, -6228912, -3088862, 255971, 1353371, 677934, -420810, -2223896, -4839003, -5962719, -3655912, -235363, 103031, -2792656, -5090745, -5172811, -5678568, -7936957, -8524476, -4536899, 768409, 1818620, -1263845]
1076a263845j651417K605562L285098k36685k800708j729639p7533q68005k343826
1067e080998j319955J438920K261373p86k440451k303370n21019J10165j122724
1058h978845k350234k090297j048461n81887o50382k11028R73322J855759J355517
1049a1726536m30813k253890k767552j735058j76035J011072K202382L901513
1041a1974917M870095L260198r9012j850848p26655L47959j197757l155064j733126
1032a2259127K326764M535610K986732J19412j834816l145268l655222j833443
1024a2759358J553999K811698P95053n94524J601853M304374L118283o26902k109047
1015a904571m64034Q31131J68663l75487N94808J990381L063118L899883K939851
$$ y = [-1263845, -2915262, -309700, 2975398, 2738713, -61995, -1791634, -1869167, -2737172, -5080998, -6400953, -4962033, -2700660, -2701446, -5141897, -7445267, -7966286, -7856121, -8978845, -11329079, -13419376, -14467837, -15049724, -15700106, -15911134, -14937812, -13082053, -11726536, -12157349, -14411239, -17178791, -18913849, -19089884, -18078812, -15876430, -11974917, -7104822, -3844624, -3943636, -5794484, -6521139, -6173180, -7370937, -10526001, -12259127, -9932363, -5396753, -2410021, -2290609, -4125425, -7270693, -10925915, -12759358, -11205359, -8393661, -7598608, -8193132, -6591279, -2286905, 831378, 204476, -1904571, -2368605, -1537474, -1368811, -1744298, -1149490, 840891, 3904009, 7803892, 10743743]
1006A0743743j337606n700806m543146J372747M229269J96103m453866k802102
998b295664K191477K858946j098967l185331j205723M8411k152976m035042k331234
989a1206103L45796N52334m25197J01096J205699P15474m49538l34259J58068
980i336630n45575q43947J370782L994659L307074J33160j314680r1768Q33581
971b493344L50504M45331J214943N4844k788306l221327j49346J826551k87390
962e047540k677546q94624K960536M042697K344857J159829O97160r00643k134885
953d50159k01330K483535P29810m135638m625848J344298O217259L694148k254753
944B801322m235086k278261j635055l070318k437107J094916L154795J454201
$$ y = [10743743, 9406137, 3705331, -837815, 534932, 4764201, 4960304, 506438, -2295664, -104187, 2754759, 1655792, -1529539, -2735262, -2686851, -4839827, -8874869, -11206103, -10860307, -10307973, -10733170, -10632074, -9426375, -8710901, -9160439, -9494698, -9336630, -9882205, -10726152, -9355370, -5360711, -2053637, -1920477, -3235157, -3326925, -2493344, -2142840, -1697509, -482566, -427722, -3216028, -6437355, -6586701, -4760150, -5047540, -7725086, -8619710, -5659174, -1616477, 728380, 1888209, 2585369, 1684726, -450159, -651489, 1832046, 2561856, -1573782, -6199630, -4855332, 1361927, 5056075, 2801322, -1433764, -3712025, -5347080, -8417398, -10854505, -9759589, -6604794, -5150593]
936e150593o55892M5335J809734J600797J93777K87579J650100J569142o80223
927F69756k789245k897087j812392j221835j407879j590761j379952q99616p1643
918a3400654J296082K808825L502801K732255Q64717r07590j441942n96480N71172
909d570814Q95683N12103N59529J177655Q61616j107434k618276j173697J891878
900c571757K268192j382606m872880l812631M33625K721099J044531j328012o52129
891i152568K705646N138018L861895l68559l932638l912302j360331J33373l82566
882g270032M1325K691067L746749J82668l810021j972925L904731N760172J402484
873D676218k311944m91197K735504K016677q00910j392322q16877k300969m049504
$$ y = [-5150593, -5806485, -5761150, -3951416, -2350619, -2156842, -1869263, -219163, 1349979, 669756, -2119489, -5016576, -6828968, -8050803, -9458682, -11049443, -12429395, -13329011, -13400654, -12104572, -9295747, -5792946, -3060691, -2195974, -3103564, -4545506, -5141986, -4570814, -3675131, -3163028, -2603499, -1425844, -564228, -1671662, -4289938, -5463635, -3571757, -1303565, -2686171, -7559051, -11371682, -10938057, -8216958, -7172427, -8500439, -9152568, -6446922, -1308904, 2552991, 2184432, -1748206, -5660508, -7020839, -6887466, -7270032, -7228707, -4537640, -790891, -608223, -4418244, -6391169, -2486438, 3273734, 4676218, 2364274, 1873077, 4608581, 6625258, 5824348, 4432026, 3615149, 1314180, -2735324]
864b735324k105171K085512L587280J803732Q8327r68971l159695m605928j521655
855g531893L829766M545559j68690l066474j14986L487521K227717j321578j883215
846C727Q6748Q51768K36711M15368Q47760j59250j085376M32198K628010K054450
836F312114l84199r18718N01216L44756j975461k917972q92842J181019Q57046
827B106959k72478J47648J564640K099505J427930L47058p25938j529968j806015
818C359341k166114l385887m285088k489732J789606M924862M109285O63660k081185
809D38748k521253j226065O16780J732324J108055p28738j785792j027926L74755
800c019112J066589J289487J557561J223169n5026q56397J11377J709290J814118
$$ y = [-2735324, -4840495, -2754983, 832297, 2636029, 2724356, 1755385, -1404310, -6010238, -7531893, -3702127, 843432, 674742, -2391732, -2506718, 980803, 3208520, 1886942, 3727, 90475, 942243, 1178954, 1594322, 2442082, 2282832, 1197456, 1629654, 4257664, 6312114, 5927915, 5009197, 5510413, 5855169, 3879708, 961736, 68894, 1249913, 2106959, 1834481, 1982129, 3546769, 5646274, 7074204, 7421262, 6695324, 5165356, 3359341, 1193227, -2192660, -6477748, -8967480, -7177874, -2253012, 1856273, 2519933, 438748, -2082505, -3308570, -2691790, -959466, 148589, -580149, -2365941, -3393867, -3019112, -1952523, -663036, 894525, 2117694, 2062668, 1206271, 1317648, 3026938, 4841056]
791D841056K57461j434225k393651k614885j657703N40337K038739O66020k457407
782b214258l661709j560696J181559J786704P90752K16231M27713O98211J271486
773a064007K574010L364106K053699n22717j933680j723543j904902l447218m461273
764g065525k939145L91336L191886M159641L316251R83100j907406l461983k665120
755e996965j061510p78715j245800m9927K806957L994475J401246k382870l094018
746f407127k61846K476161K309170M24156m22808J59983K36107j081536k021926
737d589666n46514K690535M895918M379466K177631L41650l15876k87498j76527
728H569119k77633o94123j056718p05309R7139p8148j863507l770963m127165
$$ y = [4841056, 5098517, 3664292, 1270641, -1344244, -3001947, -2461610, -422871, 243149, -2214258, -5875967, -7436663, -6255104, -4468400, -3677648, -3461417, -3033704, -2335493, -1064007, 1510003, 4874109, 6927808, 6405091, 4471411, 2747868, 842966, -2604252, -7065525, -10004670, -9613334, -6421448, -2261807, 1054444, 2037544, 130138, -3331845, -5996965, -7058475, -7837190, -9082990, -9132917, -6325960, -2331485, -930239, -3313109, -6407127, -6668973, -4192812, -1883642, -1459486, -1882294, -1722311, -1486204, -2567740, -4589666, -5136180, -2445645, 2450273, 6829739, 9007370, 9349020, 9033144, 8745646, 8569119, 8291486, 7597363, 6540645, 5835336, 5932475, 5854327, 3990820, 219857, -3907308]
719c907308l387122k795694j741511R99509L826880L348887m54483l215765j930794
710i257401R34372J313366o27390j377081M03267K301965K046710M58725k12512
701d015979O73171J706503J410745M3985p25469k3705Q73922L36571r56182r04946
691a581384N59565J326534Q47802J068601K383112K008940j245717l824757k458468
682i15772L46610R6249k404114k464485P88765L326829K890119J721697J797557
673E183455K006055J410019R65315M42677k036382n524366n752336j608381K158344
664b755600J726307m42542o37099k10663k180574m807411m042231l93887K044009
655a1699691K247246K710797L893671L480314J302208K0503K68177k45969j904863
$$ y = [-3907308, -7294430, -10090124, -11831635, -10832126, -7005246, -3656359, -4110842, -7326607, -9257401, -8323029, -7009663, -7637053, -9014134, -8610867, -6308902, -4262192, -3803467, -4015979, -3342808, -1636305, -225560, -181575, -907044, -930749, -56827, 279744, -676438, -1581384, -1021819, 304715, 1152517, 2221118, 4604230, 6613170, 5367453, 1542696, -915772, -569162, -472913, -2877027, -5341512, -4552747, -1225918, 1664201, 3385898, 5183455, 7189510, 8599529, 9564844, 10007521, 7971139, 2446773, -3305563, -4913944, -2755600, -1029293, -1471835, -2108934, -2319597, -4500171, -9307582, -13349813, -13743700, -11699691, -9452445, -6741648, -2847977, 632337, 1934545, 1955048, 2223225, 1977256, 72393]
646G2393k040753O6877J473116N60772m59169k6365J4234j354657j507752J111934
636b089370L199752J465299j746776k057422J30362J066185J27593j21923O32854
627F06554J53931j283970p01799J821803K173977j134169l827044k153722J413938
618b930501K220800L56231l98875J098113K143646J005912n54218l08740J263360
609C895728J798315j99518l813483o108953m440444M84454M405816L839793Q8298
600d9994k677166k637895j470305p61093j32695O48971N63934m47393n88775Q85932
590f666479J956976Q65134r89776j321176n70423p35334j654516j243860R14721
581i444733K867080L311558K949804K413081J134530q64975k047713j417009q8712
$$ y = [72393, -1968360, -1901483, -428367, 132405, -326764, -353129, -338895, -1693552, -3201304, -2089370, 1110382, 2575681, 828905, -1228517, -1098155, -31970, 95623, -26300, 606554, 760485, -523485, -1225284, 596519, 2770496, 1636327, -2190717, -4344439, -2930501, -709701, -353470, -752345, 345768, 2489414, 3495326, 2941108, 2632368, 3895728, 5694043, 5494525, 1681042, -4427911, -8868355, -8383901, -3978085, -138292, -49994, -2727160, -5365055, -6835360, -7596453, -7729148, -7080177, -6516243, -6963636, -7552411, -6666479, -4709503, -3844369, -4834145, -6155321, -6725744, -7461078, -9115594, -10359454, -9444733, -6577653, -3266095, -316291, 2096790, 3231320, 2366345, 318632, -1098377, -1187089]
572a187089L29829j51602m17009M1764Q17434J248734O95314j058837l035093
563b716555l529608k045084j1304R95853R31714O65691P21026J320138K576982
554a091147L720361L193722O82203j857254k426813j449757o92293n54178j19583
545e94739O10795N18140n24941j205554r43771q34762j519872j620986K01522
536e914168K557350K656007L61091j082372M85633K481878O43283m584714p510520
527i906532m314023J673520M284262K526117Q73241J980463L140686J334375j729544
518a37435k315869k05063J421702N65014j677256l245389l112652j519222K11735
509a0014435O71512M04997J676136M628477N560709J693028l904298n615747k716788
$$ y = [-1187089, -857260, -1008862, -1425871, -1384107, -566673, 682061, 1377375, 318538, -2716555, -6246163, -8291247, -8302551, -7306698, -6374984, -5709293, -4988267, -3668129, -1091147, 2629214, 5822936, 6505139, 4647885, 2221072, 771315, 79022, -475156, -594739, 16056, 534196, 9255, -1196299, -2140070, -2974832, -4494704, -6115690, -5914168, -3356818, -700811, -339720, -1422092, -936459, 1545419, 2188702, -2396012, -9906532, -14220555, -12547035, -8262773, -5736656, -4863415, -2882952, 257734, 1592109, -137435, -2453304, -2658367, -1236665, -671651, -2348907, -5594296, -8706948, -10226170, -10014435, -9342923, -8937926, -7261790, -2633313, 2927396, 4620424, 716126, -4899621, -7616409]
500g616409K79742N85082L28729J839396L583004K855311j54041l010324l882058
491e191568k357713O65298K771308J842125q00599j449671O29241J799365k55684
482b347898k679934k039462J66549K83340j349382j313037Q86754K146931J136758
473e109381K45994J209473K267939J348755n22192r57411K41822J066760P6358
464a31883k035022l317598k432467R3887K367050L130492K855744K386737J502132
455D419072n5387j219581j048219p14758j883122l551024k981101J25030K787499
446d121591K592944K87828k002560l099328k687374r35711R78851J704285J613371
437e669285K016602K289028M67708k601671l010713N24489L808441K699006r71889
$$ y = [-7616409, -7336667, -6751585, -6422856, -4583460, -1000456, 1854855, 1700814, -1309510, -5191568, -7549281, -6883983, -4112675, -2270550, -3071149, -4520820, -3891579, -2092214, -2347898, -5027832, -7067294, -6900745, -6617405, -7966787, -9279824, -8393070, -6246139, -5109381, -4863387, -3653914, -1385975, -37220, -559412, -1516823, -1275001, -208241, -131883, -2166905, -5484503, -7916970, -7823083, -5456033, -2325541, 530203, 2916940, 4419072, 4363685, 3144104, 2095885, 1381127, -501995, -4053019, -7034120, -6909090, -4121591, -1528647, -1240819, -3243379, -6342707, -9030081, -9965792, -8986941, -7282656, -5669285, -3652683, -1363655, -895947, -3497618, -6508331, -5983842, -2175401, 523605, -448284]
428d48284k260862j56891J826108J252365n91393j676400j771196j437642r01374
419f165569n65536p85505p66344N97245K651409L525568K720517J240886o07614
410A845057l055925m534019k675267J457131L356813J014273k003575j696918
402f292430P80141J714934R12239J288467L316867M027046J976021m84591j244054
393E994640j610232l375094n065497l831651L2859K986433K502121l71070k735678
384e473169k697985m02394K503774M095132L670250K238124J095144L39496m83701
375D884671j046856r34748j033517k275375l251455j548702K070894L559085J051491
366A475488k068251j770383J019537K260601Q10853p22016n93133K8582p0824
$$ y = [-448284, -2709146, -2866037, -1039929, 212436, -378957, -2055357, -3826553, -5264195, -6165569, -6731105, -7516610, -8282954, -7685709, -5034300, -1508732, 1211785, 2452671, 1845057, -1210868, -5744887, -8420154, -6963023, -3606210, -2591937, -4595512, -6292430, -5512289, -3797355, -2885116, -1596649, 1720218, 5747264, 7723285, 7238694, 5994640, 4384408, 1009314, -4056183, -7887834, -7854975, -4868542, -2366421, -2737491, -5473169, -8171154, -8573548, -6069774, -1974642, 1695608, 3933732, 5028876, 5368372, 4884671, 3837815, 2903067, 1869550, -405825, -3657280, -5205982, -3135088, 423997, 1475488, -592763, -2363146, -1343609, 916992, 1727845, 1005829, 412696, 441278, 370454]
357C70454l03570j00826K9161O9776O31081Q43895r88295l673511l453510K23982
347f351363K811784J217386j212647n0763K834874K276488j529725l069002j95002
338c267970K745332J850065j091988k590762k642861k894993k699241n55330K242412
329h905336K727661M22172k092062k502631r01925J140796K248813K110995J498913
320d252604J192467Q34023k01104j004822o5165J882491K349593R61036m5227
311A650688r1346j429536m158103m156044N14677M768704K946746k376929l735193
302f066336K53841L377030J628444j528615j614627M03985J196240O44627P68055
293i37356J685314K012054J632061J297477P40648m91926j490495j327495q16019
$$ y = [370454, 66884, -33942, -4781, 64995, 696076, 1539971, 551676, -3121835, -6575345, -6351363, -3539579, -2322193, -3534840, -3585603, -750729, 1525759, -3966, -3072968, -3267970, -522638, 1327427, 235439, -2355323, -4998184, -7893177, -10592418, -11147748, -8905336, -6177675, -5755503, -7847565, -10350196, -11252121, -10111325, -7862512, -5751517, -4252604, -3060137, -2226114, -2427218, -3432040, -3497205, -1614714, 734879, 1695915, 1650688, 1559342, 129806, -4028297, -8184341, -7669664, -2900960, 45786, -2331143, -6066336, -5812495, -2435465, -807021, -2335636, -3950263, -3546278, -2350038, -1705411, -937356, 747958, 2760012, 4392073, 5689550, 6430198, 5938272, 4447777, 3120282, 2304263]
284B304263j023158j214921k48173J066145J023069l59856j645484k175838k222313
275d496266j628042o4495J773749K662951K149181M52357j916949l467084k278482
266f813080J129146L169712J592598j088131j238963L47514J42500j700282j066507
257e525493L150065O023059L008985l437347o690291m003004J050469L665040
249b758517K770557N16298j081147j569568j133327J2415J036011O71883j004020
240b539415j911501n58155J330073Q35092j640215k558774o12237J173824M21125
231f060183o39510Q51862L077046K295959o75710j459149P30306J736467p53053
222h95965l453557k558110Q45963K913710K184705K35379j082150j040947J8844
$$ y = [2304263, 1281105, 66184, -181989, 884156, 1907225, 1547369, -98115, -2273953, -4496266, -6124308, -6188803, -4415054, -1752103, 397078, 849435, -1067514, -4534598, -6813080, -5683934, -2514222, -921624, -2009755, -3248718, -2901204, -2758704, -4458986, -5525493, -2375428, 3647631, 6656616, 3219269, -3471022, -7474026, -6423557, -2758517, 12040, 528338, -552809, -2122377, -3255704, -3243289, -2207278, -1535395, -2539415, -4450916, -5009071, -3678998, -2843906, -4484121, -7042895, -7655132, -6481308, -6060183, -6699693, -5847831, -2770785, -474826, -1150536, -2609685, -1879379, -142912, -895965, -4349522, -6907632, -6061669, -3147959, -963254, -727875, -1810025, -2850972, -2832128]
213b832128O56937m82217k424259k478645j14953J808508J030352r89926j557236
204g383567l36836J340283K785832L516990K400568m10731k289559j346675N55272
195a168423N25013r42681j127184L03897R75996j16546j122349l49622J434152
186a587747K286546J222429j107156k791898k102479L77982J898239R95349n25867
177a334602o08857j25006p14214j322293j18740J536942Q51892j457821k057112
168e349811n77786L172j095071j096475J002969K265784R77296j92515J085799
159b976638K556686J183551j666917k435817p35743R47149J420790J408799J128666
150H30526K74704m40248m14424q30784k517733l378249j164871K175193K638834
$$ y = [-2832128, -2175191, -2657408, -5081667, -7560312, -7675265, -5866757, -4836405, -5826331, -7383567, -7720403, -6380120, -3594288, -77298, 2323270, 1912539, -377020, -1723695, -1168423, -643410, -1586091, -2713275, -2409378, -1433382, -1549928, -2672277, -3021899, -1587747, 698799, 1921228, 814072, -1977826, -4080305, -3702323, -1804084, -808735, -1334602, -1943459, -2068465, -2782679, -4104972, -4223712, -2686770, -1834878, -3292699, -5349811, -5927597, -5924425, -7019496, -8115971, -7113002, -4847218, -3869922, -4062437, -2976638, -419952, 763599, -903318, -3339135, -4074878, -3127729, -1706939, -298140, 830526, 1105230, 664982, 250558, -580226, -3097959, -6476208, -7641079, -5465886, -2827052]
141b827052K38859j042195L60303J434898P5148j307313n6613K055348J631663
132E63046q81549j912768j26954J971593J855956n135j463863j290363J73075
123a116962J706120J965019M47715j772380k857284k015360o2045J670030K206391
114A71244J018229j387164k858527j345071J945735K949730j00768l505266k519048
105e630906J990359M449185K206094j238998j914449q18055r92735j935105q27960
96d712570J997490L083216J325345n16072o13185o59992k023753k670751n25685
87e315957K509319K859691K45276k341260k810869j727463l61328P68095J423922
78d750574J457552J206607J008894O30125M9606l9104L98891Q8859j348047j993362
$$ y = [-2827052, -2588193, -3630388, -3270085, -1835187, -1760039, -3067352, -3123965, -1068617, 563046, -318503, -2231271, -2358225, -386632, 1469324, 1464189, 326, -1290037, -1116962, 589158, 2554177, 3001892, 1229512, -1627772, -3643132, -3705177, -2035147, 171244, 1189473, -197691, -3056218, -4401289, -2455554, 494176, 393408, -3111858, -5630906, -3640547, 808638, 3014732, 1775734, -138715, -956770, -1949505, -3884610, -4712570, -2715080, 368136, 1693481, 1177409, 564224, -95768, -2119521, -4790272, -5315957, -2806638, 53053, 298329, -2042931, -4853800, -6581263, -6942591, -6174496, -4750574, -3293022, -2086415, -1077521, -447396, -397790, -436894, -38003, 50856, -1297191, -3290553]
68c290553n00682J105117K78073j583066j050299J452101J818967j045689k933309
59e749340o38071L083049L688275J259984n41075j20343Q55850R64084M91041
50C293454l16827j576659k262717j037980J050778J239923r22817k642595j984757
41e160197n45071m43219q07144M00666K473031K704254O81976r15362l36466Q34190
31a113342N04105o72991p76396o7420n20059k165141k447384r8919K461861K365803
21b529883N72670N21120K784893L716776N39864m225328n542140k262768J531070
12d893726J839244o14842k115616q79462J367382K131544Q72169j069124k009416
3e371847j112121J002460K497463
$$ y = [-3290553, -3791235, -2686118, -2408045, -3991111, -5041410, -3589309, -1770342, -2816031, -5749340, -6387411, -3304362, 383913, 1643897, 1102822, 982479, 1838329, 2802413, 3293454, 2976627, 1399968, -862749, -1900729, -849951, 389972, -532845, -3175440, -5160197, -5705268, -6148487, -6955631, -6554965, -4081934, -1377680, -695704, -1611066, -1947532, -1113342, -609237, -1282228, -2058624, -2126044, -2646103, -4811244, -7258628, -7357547, -4895686, -2529883, -1957213, -1436093, 1348800, 5065576, 5605440, 1380112, -4162028, -6424796, -4893726, -3054482, -3669324, -5784940, -6664402, -5297020, -3165476, -2293307, -3362431, -5371847, -6483968, -5481508, -2984045]
0b984045
$$ y = [-2984045]
$$ Imaginary data points
##PAGE= N=2
##DATA TABLE= (X++(I..I)), XYDATA
65535C019846m37278j920355j768254n61105R03049K097452K141800N39790j239904
65526B775041j017904O72121P94028j516868l234499k191502o02874j033305j662095
65517g017857M35630L427426L086102p6076j434136J15475Q62783n69477q73921
65508b044051J088597J249914k307426m645397j507959L219653L425258L54251
65500a167160l10420J765771J993906k22875n90799J755073K346989n08554k403392
65491B658539m16267J815248L05767k771674l003270n42489J273554J455852J399397
65482B174657J293975L50611o50443m51270l9987j252870l367528l830527j882888
65473g656270Q35501K671484K895071J211301j389957k259230p7275K542496K059997
$$ y = [3019846, 2582568, 662213, -1106041, -1667146, -764097, 1333355, 3475155, 4014945, 2775041, 1757137, 2429258, 3223286, 1706418, -1528081, -3719583, -4322457, -5355762, -7017857, -6582227, -3154801, -68699, -144775, -1578911, -1463436, -600653, -1170130, -2044051, -955454, 294460, -2012966, -6658363, -8166322, -4946669, -1521411, -1167160, -1477580, 288191, 2282097, 2059222, 1468423, 3223496, 5570485, 5061931, 2658539, 2242272, 4057520, 4363287, 1591613, -1411657, -1954146, -680592, 775260, 2174657, 3468632, 3819243, 3168800, 2717530, 2677543, 1424673, -1942855, -5773382, -7656270, -6820769, -4149285, -1254214, -42913, -1432870, -3692100, -3769375, -1226879, 833118]
65464H33118r91435k819800j832094j76947L69252P90474J991465K495505J013266
65455A672804o73826J18296K745908L582671Q96569k505638k742769L3994J856049
65446D984058M23811j710971j042305J439075J604819j388478l552464k046554
65438a289009O08493O26724j329972j666272M88426K466389K291276P16387q40008
65429B072434j746456j483841K6313J221548L37426j692324k062546j69972J544182
65420a953236J453324R46774J585295K321973J356195p75989j899865j235107
65412A799364j05731J26849l69572m91983K97769J299955J400849N52158q2326
65403D427332J29259K30149o39536j406668n85243R80445J069654l27911q46966
$$ y = [833118, -158317, -2978117, -4810211, -4987158, -4617906, -3827432, -1835967, 659538, 1672804, 998978, 1117274, 3863182, 7445853, 8342422, 5836784, 3094015, 3128009, 4984058, 5407869, 3696898, 2654593, 4093668, 5698487, 4310009, 757545, -1289009, -680516, -53792, -1383764, -3050036, -2561610, -95221, 2196055, 2912442, 2072434, 325978, -1157863, -1131550, 89998, 427424, -1264900, -3327446, -3497418, -1953236, -499912, 446862, 2032157, 4354130, 5710325, 4934336, 3034471, 1799364, 1693633, 1820482, 1450910, 958927, 1256696, 2556651, 3957500, 4509658, 4427332, 4556591, 4786740, 4147204, 2740536, 2155293, 3135738, 4205392, 3877481, 3030515]
65394C030515L37475J000347n00754k405882k228752m82353M74347J45162Q3450
65385e46445Q69688J223857L75786n62508l16971O91748J025001Q1887j363498
65376A478545k115358j602391k04977J094363J461529Q86568J66363N2448L49493
65367A566583J27635q85303j506080n13413J242839J474005k77336j538235m07246
65358g16551J270189M71789k035168k224723J295827M774371M131677J22502l158680
65349C931233l303133j087189J743159L722746L346119J88373l365919l856426
65341A318963j041042J495125J115685m10094j1635J760191J715954n99412j833102
65332C510633q4132J838641O95123k016620k473218p18628l49936k129435k463121
$$ y = [3030515, 3367990, 4368337, 3867583, 1461701, -767051, -1249404, -775057, -629895, -546445, 323243, 1547100, 1922886, 1360378, 1043407, 1735155, 2760156, 2842043, 1478545, -636813, -2239204, -2444181, -1349818, 111711, 998279, 1164642, 1217090, 1566583, 1694218, 808915, -697165, -1210578, 32261, 1506266, 1228930, -309305, -716551, 553638, 1025427, -1009741, -3234464, -1938637, 2835734, 6967411, 7089913, 3931233, 628100, -459089, 1284070, 5006816, 8352935, 8541308, 5175389, 1318963, 277921, 1773046, 2888731, 2478637, 2467002, 4227193, 5943147, 5343735, 3510633, 3426501, 5265142, 5960265, 3943645, 1470427, 751799, 401863, -1727572, -4190693]
65323d190693K68575K233486J7143l541069l434066M367K272858J957451J790962
65314b620986K758139K355877j93181j737162k63991J783782J732891P56165Q61782
65305E433316Q80505j050591l265373k644071L40737K195695J396183l32738j315224
65296A638439j507039r51497M15844J309828K75951j383937p91206J819987K812107
65287C638477Q80988k58393K464552N840930M289671j785788n902651m309448
65279D858338p86771n18968k608144k438338M38645J567191j092215l781311k858387
65270g219960j96969N59583J82309K004337N450541O166928K620626j725653l672795
65261D168947l824885l516080k010645R11882K709549J392393r96083j135230
$$ y = [-4190693, -3922118, -1688632, -1671489, -5212558, -8646624, -8642257, -6369399, -4411948, -2620986, 137153, 2493030, 2299849, 562687, 298696, 2082478, 3815369, 4571534, 5433316, 6313821, 5263230, 1997857, -646214, -305477, 1890218, 3286401, 2953663, 1638439, 131400, -820097, -404253, 905575, 1181526, -202411, -993617, 826370, 3638477, 4519465, 4261072, 6725624, 12566554, 16856225, 15070437, 9167786, 4858338, 4071567, 3552599, 944455, -1493883, -1055238, 511953, -580262, -4361573, -7219960, -7416929, -6857346, -6675037, -4670700, 779841, 6946769, 9567395, 7841742, 4168947, 344062, -3172018, -5182663, -4270781, -1561232, -168839, -1164922, -2300152]
65253b300152P51085J648557M71997p02919n8923J481357J717137l2051k066981
65244I09107k086849N6579J845034J266914l03035l68539L38782r58384l564796
65235b865187l224549J054044M464322L353377O76670Q65584K776939K362884
65227I464084j97058j176790K22596J026698k94813k045775k611204j901458N5588
65218B541868K409571K265183j766433n675122m371385O54617L146337J403950
65210F08586k4660J319224K150894L11039q47414J401410L719740J896672k308509
65201H226982m098526k616793o07053O83850J864785K164180J32029k967276l991878
65192a209700k025266R06330K702178K590205O52390j737141k103238J41171K165002
$$ y = [-2300152, -1549067, 99490, 571487, -131432, -190355, 1291002, 3008139, 2976088, 909107, -1177742, -1121163, 723871, 1990785, 1687750, 1319211, 1657993, 699609, -2865187, -6089736, -5035692, -571370, 2782007, 3458677, 4324261, 7101200, 9464084, 9267026, 8090236, 8312832, 9339530, 9044717, 6998942, 4387738, 2486280, 2541868, 4951439, 7216622, 5450189, -224933, -4596318, -3941701, -795364, 608586, 583926, 1903150, 4054044, 4365083, 3517669, 4919079, 8638819, 10535491, 8226982, 4128456, 1511663, 904610, 1588460, 3453245, 5617425, 5749454, 2782178, -1209700, -3234966, -2328636, 373542, 2963747, 3616137, 1878996, -224242, -83071, 2081931]
65183B081931J621094L84861J271783K779018J331182k160080k921574J10758
65175D498973K309098O13848j795829r93490J314750R46501j646706k146161M68075
65166C569059K197154L82833k285948k320805p60674o83425j541960j90900L023105
65157A388439L760762M06636k846899k022395R88318K032696J095107R95355J771913
65148G569932J171134k99305P1092J707321J076999j838198k852660q86969l12474
65139E406872l278613n247909k314227J833394J530098j902420k715342L8616
65131f649531J897973O29855j214390j347317l13219J362203L966680N881157
65123D213411M422993M48353j827477p57876P10494J51190j023542j057482r91556
$$ y = [2081931, 3703025, 4087886, 5359669, 8138687, 9469869, 7309789, 4388215, 4498973, 6808071, 7421919, 5626090, 4632600, 5947350, 6893851, 5247145, 3100984, 3569059, 5766213, 6149046, 3863098, 1542293, 781619, 98194, -1443766, -1634666, 1388439, 5149201, 5555837, 2708938, 686543, 1674861, 3707557, 4802664, 5798019, 7569932, 8741066, 8441761, 8512853, 10220174, 11297173, 9458975, 6606315, 5719346, 5406872, 2128259, -3119650, -5433877, -3600483, -2070385, -3972805, -6688147, -6649531, -4751558, -4121703, -5336093, -6683410, -6996629, -5634426, -1667746, 4213411, 8636404, 9084757, 7257280, 6499404, 7209898, 7361088, 6337546, 5280064, 4288508]
65114D288508j948776k347774n99764J641114J689854j56704j256474m00579R73629
65105A883034Q62400j206341l613085l663567k41415M182705N684653L417822
65097G306206K18849j594604k495458l044068k085048L88093J487499m99365k482067
65088b799963n68390L577531M316381l6645m558295m189085m5183K633713J143471
65079e26465k164549l432958j535864J615592L813121M486348M044162K564329
65071H863716J95549j729805j584134K70091J486077O41147j127590k110529k194763
65062B709759j917511q67613J157739K486376J321716j225360k113216n12385
65054A039505J163801Q78345m61137j035845q00993n89513j1956J715229L561137
$$ y = [4288508, 2339732, -8042, -607806, 1033308, 2723162, 2566458, 1309984, 909405, 1883034, 2745434, 1539093, -2073992, -5737559, -5978974, -1796269, 3888384, 7306206, 7525055, 5930451, 3434993, 390925, -1694123, -1306030, 181469, -317896, -2799963, -3368353, 209178, 4525559, 4488914, -69381, -4258466, -4303649, -1669936, -526465, -2691014, -6123972, -7659836, -6044244, -2231123, 2255225, 6299387, 8863716, 9059265, 7329460, 5745326, 6015417, 7501494, 8142641, 7015051, 4904522, 2709759, 792248, -75365, 1082374, 3568750, 4890466, 3665106, 1551890, 1039505, 2203306, 3081651, 2620514, 1584669, 783676, 194163, 182207, 1897436, 5458573]
65045E458573L412631J080275j151650j400084k53094N23294R3863j285700l013355
65036C464753m066397l166343l29225K232229K078661n65890k864952k480164
65028e697328Q283J941520J506485k21551l04735K410180N000056L470448j611065
65019F502293m867595k972113Q13658J646479K08278O08055K696894K012467k237816
65010D410600m879875k624334Q40077Q86822j181532j369752L32897J140067Q94074
65001a550956J510253K531455J840697j07466r90411p71980j101249j448006j58933
64992b46596J438330P39051q85320J63579K757280J809044k968290n308562j817936
64983d319420K662450K669548K0140l27253J774870K844096J997958R50518k83863
$$ y = [5458573, 8871204, 9951479, 8799829, 7399745, 7146651, 7669945, 7763808, 6478108, 3464753, -601644, -3767987, -4097212, -1864983, 213678, -352212, -3217164, -5697328, -5689045, -3747525, -2241040, -2462591, -2767326, -357146, 4642910, 8113358, 6502293, 1634698, -1337415, -523757, 1122722, 1331000, 1939055, 4635949, 6648416, 4410600, -469275, -3093609, -2253532, -1366710, -2548242, -3917994, -3585097, -2445030, -1550956, -40703, 2490752, 4331449, 4223983, 3233572, 2461592, 1360343, -87663, -246596, 1191734, 1930785, 1045465, 1209044, 3966324, 5775368, 2807078, -2501484, -4319420, -1656970, 1012578, 1032718, 705465, 2480335, 5324431, 7322389, 8272907, 7989044]
64974G989044k768658m864348l779293n50843P76499q96739k430906j611719l2534
64965h169497K32808k57629n4946P07456J282384J998597L168694L425607J116980
64956C450454k773048m744651k643968J388247L091880J279831o29870O92076
64948h89049L690957M027239Q40327j966027j258806J248743J918624M6779k065342
64939E593445k491811j367463P213N38019M23746J216771L557715M965608K352700
64930A4795943k783769m922871j821037K051696J841955j052532k093799p55766
64922E259820k33897j417822j748111l1083J611005J327993l7849r50942j099773
64913B679341o56356J47189J98396j540765l736781l534365l91581K999065M391641
$$ y = [7989044, 5220386, 356038, -3423255, -3974098, -3197599, -4094338, -6525244, -8136963, -8169497, -7936689, -8194318, -8249264, -7541808, -6259424, -4260827, -1092133, 2333474, 3450454, 677406, -4067245, -6711213, -5322966, -2231086, -951255, -1581125, -889049, 2801908, 6829147, 7669474, 5703447, 4444641, 5693384, 7612008, 7658787, 5593445, 3101634, 1734171, 1741384, 2279403, 2703149, 3919920, 7477635, 12443243, 14795943, 12012174, 7089303, 5268266, 7319962, 9161917, 8109385, 6015586, 5259820, 5025923, 3608101, 1859990, 1828907, 3439912, 4767905, 4730056, 3779114, 2679341, 2022985, 2170174, 2368570, 827805, -2908976, -6443341, -6834922, -3835857, 555784]
64904E55784M460766M433567L348299j88463m499090n541180j758026L264177
64896D075834M435510J112326k276255k106022m9860J84797j264227j243024N53702
64887C422781J015398n60254r81112O82052O20209k717495m245331M8352N255761
64878B540361M055277j675334l385558Q76463L745246L80335m465399m447221
64870b375830o24734J874604J744094J307457J308035M97021r77337j548817r67569
64861B36924k69874L33093J169601J452427K97148j102775p24738R20777J044861
64852C357444j186836k782160q35005K917113L710130J36827l371426k135047
64844a88960K381346M640168K732956J60051n83930j581894m268428n112526q72602
$$ y = [555784, 5016550, 9450117, 12798416, 12609953, 8110863, 2569683, 811657, 4075834, 8511344, 9623670, 7347415, 5241393, 5191533, 5376330, 4112103, 2869079, 3422781, 4438179, 3877925, 2896813, 3578865, 4199074, 1481579, -2763752, -2715400, 2540361, 6595638, 4920304, 1534746, 2411209, 6156455, 6536790, 2071391, -2375830, -3000564, -1125960, 618134, 1925591, 3233626, 3730647, 2753310, 1204493, 236924, -32950, 300143, 1469744, 2922171, 3219319, 2116544, 1391806, 2312583, 3357444, 2170608, -611552, -1446557, 1470556, 5180686, 5317513, 1946087, -188960, 2192386, 6832554, 9565510, 9725561, 9141631, 7559737, 3291309, -1821217, -2693819]
64835b693819M930262N947632J736227k438444l420381k697840j766654l32884
64827g35901P00728l49586j931338o30921K713051L430439N68392j444068k51248
64818B069548J005255O4414m10289J473976K472168j77543l321030k870343m93491
64809a87335k91427j784434j483778O07902J291468j00152r49379M3448J401485
64800a452202J895954J850554J551174R16870M41283M53276K32814m32816l13227
64791E143680P60288N50419j912948l555566j430723K153624K424208j023052
64783C109930l871343l123456k01083J918143J891087K60581j361914j453245
64775b831300l23247J30992m55821J6447K184849K966402J11034l356921k948657
$$ y = [-2693819, 2236443, 8184075, 9920302, 7481858, 4061477, 1363637, -403017, -735901, -35173, -384759, -2316097, -2947018, -233967, 3196472, 3764864, 2320796, 2069548, 3074803, 3139217, 2728928, 4202904, 6675072, 6497529, 3176499, 306156, -187335, -478762, -2263196, -3746974, -3139072, -1847604, -1947756, -2897135, -2853687, -1452202, 443752, 2294306, 3845480, 4762350, 5203633, 5656909, 5889723, 5456907, 5143680, 5903968, 6454387, 4541439, 985873, -444850, 1708774, 4132982, 3109930, -761413, -3884869, -4085952, -2167809, -276722, -16141, -1378055, -2831300, -3154547, -3023555, -3479376, -3462929, -1278080, 1688322, 1799356, -1557565, -4506222]
64766d506222P00061K957925J819201m85092j784535k011199j210394P90313K520892
64757a209050J899984m89251j808828q70130O41995P91596p54406l052252m242542
64748i092884k579021R98069K892281J705197Q69277L315121N917742L674645
64740G700427k155416n152241k625015J362268K279161K48590j937931k382854
64732b663011p13333K086368L819113L097850J093005m17515j398867j890878
64724C012732m53294K513559K832157j508013n250586k494467L787340N609937
64716H049365J972444n99134P30461J515698r17033k690134n98478K470819K717576
64707A2651584O49245j740641l923142m518993j409653L264522L740963r16788
$$ y = [-4506222, -3806161, -848236, 970965, 485873, -1298662, -3309861, -4520255, -3729942, -1209050, 690934, 201683, -1607145, -2477275, -1835280, -1043684, -1798090, -4850342, -9092884, -11671905, -10673836, -7781555, -6076358, -5207081, -1891960, 4025782, 7700427, 5545011, 392770, -2232245, -869977, 1409184, 1657774, -280157, -2663011, -3376344, -1289976, 2529137, 5626987, 6719992, 6302477, 4903610, 3012732, 2559438, 5072997, 7905154, 6397141, 1146555, -1347912, 2439428, 8049365, 10021809, 9422675, 10153136, 11668834, 10751801, 8061667, 7463189, 9934008, 12651584, 13300829, 11560188, 7637046, 3118053, 1708400, 4972922, 8713885, 7797097]
64699G797097m585779l251721m72458j71378k25462K066181L816411J443438k731899
64690C684430m208244k902151j170271R30556L499506L749648L18434k854399
64682A047509k093646j302o95549k597968j728395R75542J709654N48126J51928
64673b684101J84071r08596r14365K800622O848303N558789M0109l214569k137553
64664E572710q37928j638894k002416k51280J535302J681872J158637O65941k90591
64655E593353r19877K10430J959398J985473Q88098Q42964J085473m82647k331939
64646H830726j438661O14163k04656k804508k376295P42709J075321k236580l431113
64637a228894L0478L117204J812646q77026j239483q10183j714018j812909O90903
$$ y = [7797097, 3211318, -40403, -512861, -684239, -909701, 1156480, 4972891, 6416329, 3684430, -523814, -3425965, -4596236, -3665680, -166174, 3583474, 3901908, 1047509, -1046137, -1047439, -1742988, -4340956, -6069351, -5093809, -3384155, -2836029, -2684101, -2500030, -3408626, -4322991, -1522369, 5325934, 10884723, 10924832, 7710263, 5572710, 4734782, 3095888, 1093472, 842192, 2377494, 4059366, 5218003, 5883944, 5593353, 4673476, 4883906, 6843304, 8828777, 9716875, 10559839, 11645312, 11162665, 8830726, 7392065, 8006228, 7801572, 4997064, 2620769, 3363478, 4438799, 2202219, -1228894, -1198416, 1918788, 3731434, 2854408, 1614925, 804742, -909276, -2722185, -2031282]
64628b031282K729899J403811o64993O5131J767586N90795k617143l760974j578299
64619d095469J809317M484131N389606L532326j84781k440005j673723l68644
64611F452758o16868o81314R69996J939511J65509j645737m89227J200909n15961
64602F779576l973994m293352j112311J611978K283295K595846K521264K8444
$$ y = [-2031282, 698617, 2102428, 1437435, 1502566, 3270152, 3860947, 1243804, -2517170, -4095469, -2286152, 2197979, 7587585, 11119911, 10935130, 8495125, 6821402, 6452758, 5835890, 5154576, 6124572, 8064083, 8229592, 6583855, 6094628, 7295537, 6779576, 2805582, -1487770, -2600081, -988103, 1295192, 3891038, 6412302, 6440746]
$$ [...]
##END NTUPLES=NMR SPECTRUM
##END=
