##TITLE=31Pdec_LR-713_CR9
 CDCl3, 124 sc
 9.7.2020
##JCAMPDX= 6.0         $$ Bruker NMR JCAMP-DX V2.0
##DATA TYPE= NMR SPECTRUM
##DATA CLASS= NTUPLES
##ORIGIN= UXNMR, Bruker Analytische Messtechnik GmbH
##OWNER= root
$$ XWIN-NMR		Version 3.5
$$ Thu Jul  9 10:21:17 2020 Russian Standard Time (UT+4h)  she@DPX200
##.OBSERVE FREQUENCY= 81.013821
##.OBSERVE NUCLEUS= ^31P
##.ACQUISITION MODE= SIMULTANEOUS
##.ACQUISITION SCHEME= undefined
##.AVERAGES= 124
##.DIGITISER RES= 17
##SPECTROMETER/DATA SYSTEM= spect
##.PULSE SEQUENCE= zgpg30
##.SOLVENT NAME= D2O
##.SHIFT REFERENCE= (INTERNAL, D2O, 0, 182.463)
##AUDIT TRAIL= $$ (NUMBER, WHEN, WHO, WHERE, WHAT)
$$ ##TITLE= Audit trail, XWIN-NMR		Version 3.5
$$ ##JCAMPDX= 5.01
$$ ##ORIGIN= Bruker BioSpin GmbH
$$ ##OWNER= she
$$ F:/spectra/data/she/nmr/P31/1/pdata/1/auditp.txt
$$ ##AUDIT TRAIL=  $$ (NUMBER, WHEN, WHO, WHERE, WHAT)
(   1,<2020-07-09 10:19:59.50 +0400>,<she>,<DPX200>,
      <continue with go, POWCHK disabled, PULCHK disabled
       configuration hash MD5:
       00 E9 B6 7A A2 85 ED C7 34 08 36 98 17 FE 4E 26
       data hash MD5: 32K
       DC 2B C0 C7 35 57 99 ED 7B 4B C8 28 6C 58 0B 63>)
(   2,<2020-07-09 10:20:01.34 +0400>,<she>,<DPX200>,
      <Start of raw data processing
       efp BC_mod = 2 LB = 1 FT_mod = 6 PKNL = 1 PHC0 = -2708.743 PHC1 = 824.2021 SI = 64K 
       data hash MD5: 64K
       EA DF 51 2F CF 84 F1 BD 2C 78 DD 02 50 31 56 5A>)
(   3,<2020-07-09 10:20:49.57 +0400>,<she>,<DPX200>,
      <pk PHC0 = 29.71854 PHC1 = -40.80002 
       data hash MD5: 64K
       DF DB ED 04 77 71 8C 97 EC D0 E3 5E 5E 08 25 65>)
(   4,<2020-07-09 10:20:53.28 +0400>,<she>,<DPX200>,
      <abs ABSG = 5 
       data hash MD5: 64K
       19 AA DF D1 0D AE 4E 7A 46 4B 79 26 D7 AC DC F8>)
$$ ##END=
$$ 
$$ hash MD5
$$ C6 2A A4 1B 4C 90 16 9F 35 BE 20 09 F6 F9 8E E6
##$RELAX= 
##$RELAX= 
##$RELAX= 
##$RELAX= 
##$RELAX= 
##$RELAX= 
##$RELAX= 
##$RELAX= 
$$ Bruker specific parameters
$$ --------------------------
##$DU= <F:/spectra>
##$EXPNO= 1
##$NAME= <P31>
##$PROCNO= 1
##$TYPE= <nmr>
##$USER= <she>
##$AMP= (0..31)
100 100 100 100 100 100 100 100 100 100 100 100 100 100 100 100 100 100 
100 100 100 100 100 100 100 100 100 100 100 100 100 100 
##$AQSEQ= 0
##$AQ_mod= 1
##$AUNM= <au_zg>
##$AUTOPOS= <>
##$BF1= 81.014009
##$BF2= 200.13
##$BF3= 200.13
##$BF4= 200.13
##$BF5= 200.13
##$BF6= 200.13
##$BF7= 200.13
##$BF8= 200.13
##$BYTORDA= 1
##$CFDGTYP= 0
##$CFRGTYP= 5
##$CHEMSTR= <none>
##$CNST= (0..31)
1 1 145 1 1 1 1 1 1 1 1 1 1 1 1 1 1 1 1 1 1 1 1 1 1 1 1 1 1 1 1 1 
##$CPDPRG= <waltz16>
##$CPDPRG1= <>
##$CPDPRG2= <waltz16>
##$CPDPRG3= <>
##$CPDPRG4= <mlev>
##$CPDPRG5= <mlev>
##$CPDPRG6= <mlev>
##$CPDPRG7= <mlev>
##$CPDPRG8= <mlev>
##$CPDPRGB= <>
##$CPDPRGT= <>
##$D= (0..31)
0 1 0 0 0 0 0 0 0 0 0 0.03 2e-05 3e-06 0 0 0 0 0 0 0 0 0 0 0 0 0 0 0 0 
0 0 
##$DATE= 1594275421
##$DBL= (0..7)
120 120 120 11 120 120 24 19 
##$DBP= (0..7)
150 150 150 150 150 150 150 150 
##$DBP07= 0
##$DBPNAM0= <>
##$DBPNAM1= <>
$$ [...]
##$SUBNAM3= <"">
##$SUBNAM4= <"">
##$SUBNAM5= <"">
##$SUBNAM6= <"">
##$SUBNAM7= <"">
##$SUBNAM8= <"">
##$SUBNAM9= <"">
##$SW= 369.568048894756
##$SWIBOX= (0..15)
0 1 3 0 0 0 0 0 0 0 0 0 0 0 0 0 
##$SW_h= 29940.119760479
##$TD= 32768
##$TD0= 1
##$TE= 0
##$TE2= 300
##$TE3= 300
##$TEG= 300
##$TL= (0..7)
0 120 53 12 22 120 120 120 
##$TP= (0..7)
150 150 150 150 150 150 150 150 
##$TP07= 0
##$TPNAME0= <>
##$TPNAME1= <>
##$TPNAME2= <>
##$TPNAME3= <>
##$TPNAME4= <>
##$TPNAME5= <>
##$TPNAME6= <>
##$TPNAME7= <>
##$TPOAL= (0..7)
0.5 0.5 0.5 0.5 0.5 0.5 0.5 0.5 
##$TPOFFS= (0..7)
0 0 0 0 0 0 0 0 
##$TUNHIN= 0
##$TUNHOUT= 0
##$TUNXOUT= 0
##$USERA1= <user>
##$USERA2= <user>
##$USERA3= <user>
##$USERA4= <user>
##$USERA5= <user>
##$V9= 5
##$VALIST= <valist>
##$VCLIST= <CCCCCCCCCCCCCCC>
##$VD= 0
##$VDLIST= <DDDDDDDDDDDDDDD>
##$VPLIST= <PPPPPPPPPPPPPPP>
##$VTLIST= <TTTTTTTTTTTTTTT>
##$WBST= 1024
##$WBSW= 4
##$XGAIN= (0..3)
0 0 0 0 
##$XL= 0
##$YL= 0
##$YMAX_a= 28138
##$YMIN_a= -16509
##$ZGOPTNS= <>
##$ZL1= 120
##$ZL2= 120
##$ZL3= 120
##$ZL4= 120
##$ABSF1= 182.463
##$ABSF2= -187.1042
##$ABSG= 5
##$ABSL= 3
##$ALPHA= 0
##$AQORDER= 0
##$ASSFAC= 0
##$ASSFACI= 0
##$ASSFACX= 0
##$ASSWID= 0
##$AUNMP= <proc_1d>
##$AZFE= 0.1
##$AZFW= 0.5
##$BCFW= 0
##$BC_mod= 2
##$BYTORDP= 0
##$COROFFS= 0
##$CY= -3
##$DATMOD= 1
##$DC= 0
##$DFILT= <>
##$DTYPP= 0
##$F1P= 0
##$F2P= 0
##$FCOR= 1
##$FTSIZE= 65536
##$FT_mod= 6
##$GAMMA= 0
##$GB= 0
##$INTBC= 1
##$INTSCL= 5.30512e-09
##$ISEN= 30
##$LB= 1
##$LEV0= 0
##$LPBIN= 0
##$MAXI= 10000
##$MC2= 0
##$MEAN= 0
##$ME_mod= 0
##$MI= 50
##$NCOEF= 0
##$NC_proc= -9
##$NLEV= 6
##$NOISF1= 182.463
##$NOISF2= 159.3651
##$NSP= 0
##$NTH_PI= 0
##$NZP= 0
##$OFFSET= 182.463
##$PC= 4
##$PHC0= -2679.024
##$PHC1= 783.4021
##$PH_mod= 1
##$PKNL= yes
##$PPARMOD= 0
##$PSCAL= 0
##$PSIGN= 0
##$REVERSE= no
##$SF= 81.0140089999434
##$SI= 65536
##$SIGF1= 159.3651
##$SIGF2= -187.1042
##$SINO= 113.3802
##$SIOLD= 16384
##$SREGLST= <1H.CDCl3>
##$SSB= 0
##$STSI= 65536
##$STSR= 0
##$SW_p= 29940.119760479
##$SYMM= 0
##$S_DEV= 0
##$TDeff= 32768
##$TDoff= 0
##$TI= <>
##$TILT= no
##$TM1= 0
##$TM2= 0
##$TOPLEV= 0
##$USERP1= <user>
##$USERP2= <user>
##$USERP3= <user>
##$USERP4= <user>
##$USERP5= <user>
##$WDW= 1
##$XDIM= 65536
##$YMAX_p= 379533197
##$YMIN_p= -172614302
$$ End of Bruker specific parameters
$$ ---------------------------------
##NTUPLES= NMR SPECTRUM
##VAR_NAME=  FREQUENCY,     SPECTRUM/REAL,   SPECTRUM/IMAG
##SYMBOL=    X,             R,               I
##VAR_TYPE=  INDEPENDENT,   DEPENDENT,       DEPENDENT
##VAR_FORM=  AFFN,          ASDF,            ASDF
##VAR_DIM=   65536,         65536,           65536
##UNITS=     HZ,            ARBITRARY UNITS, ARBITRARY UNITS
##FACTOR=    0.456856943014862, 1,           1
##FIRST=     14782.0589164792, 0,            0
##LAST=      -15158.0608439998, 0,           0
##MIN=       -15158.0608439998, -172614302,  0
##MAX=       14782.0589164792, 379533197,    0
$$ Real data points
##PAGE= N=1
##DATA TABLE= (X++(R..R)), XYDATA
$$ [...]
3982E8254925O036638R834579j0234423k7230165j4763185J0927615J5301921
3975D8127905q288781l3382159l1457316r33104K9402635K9206490M186263r878742
3967B6983191r97415j554420l0218016m6146706p091742N1099185N3650052l364439
3959D2359690m7588764l8198048j1293339k059025Q225835L5313687M6847106
3952C3607142K0246294o925296L704850K4837416J1439442k0556129k2399425
3945D3954294O461064K3942199J4309228k580515j5857351k5460163j5308219
3938B9460537K1006772M3377362J3348118l4396232l4765667K750182P395179
3931D8176251l3328000n1126616j2676866K5818846J6297567o059391M112552
$$ plain form
3982 58254925 64291563 74126142 63891719 36661554 21898369 32825984 48127905
3975 48127905 39839124 6456965 -25000351 -25933455 3469180 32675670 36861933 26983191
3967 26983191 25985776 24431356 -5786660 -51933366 -59025108 -7925923 45724129 42359690
3959 42359690 -5229074 -43427122 -54720461 -56779486 -48553651 -13239964 33607142
3952 33607142 53853436 46928140 50632990 75470406 86909848 66353719 43954294
3945 43954294 50415358 74357557 88666785 86086270 70228919 44768756 29460537
3938 29460537 50467309 93844671 107192789 72796557 38030890 40781072 48176251
3931 48176251 14848251 -36278365 -48955231 -23136385 -6838818 -12898209 -8785657
3924h785657K2234287R105435j0193057N394264K8626954O597900l9954449m2038587
3916b9012910L529364K6439679m499321l6190991k0326154J6706245K6264692
3909a7089396J0000730P85872N398653N565468l428054q437523l201717N914834
3901d491133J2224438J1781218K657259q105820p820855K736534P182126p34226
3893A5429541n465153N106430J9439021K0992664J1470140K73927j3816412l2167013
3885B1263145m0964909k7950091n610831M324053L795643J2444880L0173849L1147248
3877B8622987L360639k6345259k2715603J2019720L8555649K7007726p890172
3870E2615687k4580975m385572K5537004K4813506j0196266m1714588l7512171
$$ plain form
3924 -8785657 13448630 22554065 12361008 17755272 46382226 52980126 13025677 -29012910
3916 -29012910 -25483546 956133 -3543188 -39734179 -60060333 -43354088 -17089396
3909 -17089396 -7088666 -6302794 -904141 4661327 1233273 -7204250 -10405967 -4491133
3901 -4491133 7733305 19514523 22171782 14065962 6245107 8981641 16163767 15429541
3893 15429541 9964388 15070818 34509839 55502503 66972643 67246570 53430158 21263145
3885 21263145 -19701764 -47651855 -53262686 -48938633 -45142990 -32698110 -2524261 28622987
3877 28622987 31983626 5638367 -17077236 -5057516 33498133 60505859 52615687
3870 52615687 28034712 23649140 49186144 73999650 63803384 22088796 -15423375
3863a5423375q012960J3270694J4152854J1237731J7218967K0912329O939652
3856F0295892j8361710l2679022k4481559m281007J0048111J1713341P182040
3849I436086N464673Q894946J2087801O906499r550314k8170743l1418055j0825101
3841c7174208J8456020K9268646J3103690r027546j3386565k759646K202020n905971
3833e223560j4363375j2700450n465828k12587J893898r21841j1738797k1401805
3825g0134345j0346661K3646451N2100701M5821766J1352409j6876006j6936771
3818A8627544R69361J3362692R861578j086304n541958r50428n20527j6688152
3810A8033806l9962559m4912933k2480001N959713J6341350J1543589R960496
$$ plain form
3863 -15423375 -23436335 -10165641 3987213 15224944 32443911 53356240 60295892
3856 60295892 41934182 9255160 -15226399 -19507406 -9459295 2254046 9436086
3849 9436086 14900759 23795705 35883506 42790005 33239691 5068948 -26349107 -37174208
3841 -37174208 -18718188 10550458 23654148 14626602 1240037 -1519609 682411 -5223560
3833 -5223560 -19586935 -32287385 -37753213 -37965800 -36071902 -36993743 -48732540 -70134345
3825 -70134345 -80481006 -56834555 -4733854 41087912 52440321 35564315 18627544
3818 18627544 19596905 32959597 42821175 41734871 36192913 35242485 34721958 18033806
3810 18033806 -21928753 -66841686 -89321687 -83361974 -67020624 -55477035 -45516539
3803d5516539J5829586J8895761J6047309J3061634Q223055n246332k0651796
3796F42678k2208961j0471384k992930m578159J529044K2419454L6280704K2120732
3788D2741178n873049j5781738l584356J782722j7578906l9846276l2564354N84518
3780g0120261K1500080P852950j6744137j6083626P439731J7662688j035608k1178666
3772g0706849j4599928P605637J8156261J6529891K0550282K8089670K0720606
3765B6345570J494399n570589K976491L127670j2693265j8912827q27201J6196764
3757A2137012O054861j5317684j6402062q08556J759567j4376016k3064535q284222
3749e8301635J4436057K3590786J6639390L069041r561952j5500489j0813299
$$ plain form
3803 -45516539 -29686953 -10791192 5256117 18317751 26540806 21294474 642678
3796 642678 -21566283 -32037667 -35030597 -39608756 -38079712 -15660258 20620446 42741178
3788 42741178 36868129 21086391 17502035 19284757 1705851 -38140425 -70704779 -70120261
3780 -70120261 -48620181 -40767231 -57511368 -73594994 -66155263 -48492575 -49528183 -70706849
3772 -70706849 -85306777 -77701140 -59544879 -43014988 -22464706 5624964 26345570
3765 26345570 27839969 22269380 25245871 28373541 15680276 -3232551 -4059752 12137012
3757 12137012 18191873 2874189 -13527873 -14336429 -12576862 -26952878 -50017413 -58301635
3749 -58301635 -43865578 -20274792 -3635402 -566361 -10128313 -25628802 -36442101
3742c6442101q44253K375898m211585r396761k426947J2575655K0278426J0484991
3734g606677q330696j2625441J0747023M0954154M0022091J839511l3300042k9562983
3726B136940l640649K755280j5409256k5351274j1675887M363835N560442K555911
3718c8704658M549613L85270j1975062r027929J8485162L6763726J4107547k4720554
3710a0136885k8433555O647457L3427416K4255525L482622R76861J1115583J5885269
3702E7220293J6376931J7301726P027169j7836623k9356366m677287K7980171
3695G4036014J9267366k7914620n5178618k7517927K1041013L7908905J6799672
3688E8441805j1427408k6569261k7696504j2770409J5712796L3572986J7473457
$$ plain form
3742 -36442101 -37286354 -34910456 -39122041 -48518802 -50945749 -38370094 -18091668 -7606677
3734 -7606677 -15937373 -28562814 -17815791 23138363 63160454 64999965 31699923 2136940
3726 2136940 -1503709 1251571 -14157685 -39508959 -51184846 -46821011 -41260569 -38704658
3718 -38704658 -34155045 -33769775 -45744837 -54772766 -36287604 476122 14583669 -10136885
3710 -10136885 -38570440 -31922983 1504433 25759958 29242580 30219441 41335024 57220293
3702 57220293 73597224 90898950 97926119 80089496 50733130 46055843 74036014
3695 74036014 93303380 65388760 10210142 -17307785 3733228 41642133 58441805
3688 58441805 47014397 20445136 -7251368 -20021777 -4308981 29264005 46737462
3681D6737462j6791613k9332594j1045588O723727J663667j2124496j6100150
3674c0269585j4977352j5965507r355360Q054442J5338957k0863j2767804N731349
3666e4231723L8103185M0251128M232989l1118230l3628524j2502291N883581
3659d3009885J0943906O884163r65606p347342p600289m223636k594072J198876
3651d6713885J4127147K7509625K3276704K993941r385677j909019P867703K267052
3643B0033591p464325L06566K1515401K9647054J2599807j1122058j6943159l528753
3635D5044124R256188O293528p298950j8198690k4037663k9785780k8424435m821695
3627e1973373L2670453M6195661J6105562k1247546j5724881K2863207L2555084
$$ plain form
3681 46737462 29945849 613255 -10432333 -3708606 -2044939 -14169435 -30269585
3674 -30269585 -45246937 -61212444 -70567804 -62513362 -47174405 -47195268 -59963072 -54231723
3666 -54231723 -16128538 24122590 28355579 -2762651 -36391175 -48893466 -43009885
3659 -43009885 -32065979 -25181816 -26147422 -33494764 -41095053 -45318689 -47912761 -46713885
3651 -46713885 -32586738 -5077113 18199591 21193532 11807855 9898836 17766539 20033591
3643 20033591 12569266 12875832 34391233 64038287 76638094 65516036 48572877 45044124
3635 45044124 54300312 60593840 53294890 35096200 11058537 -18727243 -47151678 -51973373
3627 -51973373 -19302920 26892741 42998303 21750757 6025876 28889083 61444167
3620F1444167j1498245n5990668m2138610J2021054L7968793Q875604l3338304
3613b2656209m1196487j6569217P739574J3954500Q510737J402505k703968K198622
3605d9319943K0250225M0393884M0263109J2673070j9493569k6360768o419902
3598A1986106J3011553J1061913m299149j3310593r544391P51547J0891809J3286647
3590C3835442l61584k3218810l0078714q717606J6946558J7470381Q87721l006993
3582C756395O734041L122637j6583017j9168566J0843313M0843200L5336691M767364
3574F9652058j5588397j5671086j3341844j9086776k2912382j3529018N768584
3567b4708861K0053065J5211691p183099k5518152j9774170J781327J3383991
$$ plain form
3620 61444167 49945922 -6044746 -48183356 -36162302 1806491 10682095 -22656209
3613 -22656209 -63852696 -80421913 -72682339 -58727839 -50217102 -48814597 -51518565 -49319943
3605 -49319943 -29069718 11324166 51587275 64260345 44766776 18406008 11986106
3598 11986106 24997659 36059572 31760423 18449830 8905439 9656986 20548795 33835442
3590 33835442 33473858 10255048 -19823666 -28541272 -11594714 5875667 6763388 3756395
3582 3756395 10490436 13613073 -2969944 -22138510 -11295197 29548003 64884694 69652058
3574 69652058 54063661 38392575 25050731 5963955 -16948427 -30477445 -24708861
3567 -24708861 -4655796 10555895 3372796 -22145356 -41919526 -40138199 -26754208
3560b6754208Q955469N916483R802780M521084j2631144j7401896K970538K5439103
3552H18209K4853643P263679q931928j8711980j7783434N960628M3389484N5866557
3544I2724858K5313684j4282538k5111735j6474457j4513043j3230590K015307
3537C6441486J1369251r224772l7131447l4773137j3153267q168510j1183484
3530f5823880J2937407M9360263M6493636P097935p881578J9372739L2108521
3523I3665043l332770l7802784j9810985K1853885K7726438k394973k2850407
3516E7053447j6838733o302408m233650l023272k031230q816318j6725943j1339699
3508a2257806L425268R457303J536763q954437j3610781j4501269j5226690j4966118
$$ plain form
3560 -26754208 -17798739 -11882256 -2079476 2441608 -10189536 -27591432 -24620894 818209
3552 818209 25671852 32935531 24003603 5291623 -12491811 -6531183 36858301 92724858
3544 92724858 118038542 103756004 78644269 62169812 47656769 34426179 36441486
3537 36441486 47810737 38585965 1454518 -33318619 -46471886 -54640396 -65823880
3530 -65823880 -52886473 -3526210 42967426 50065361 42183783 61556522 93665043
3523 93665043 90332273 52529489 32718504 54572389 82298827 79903854 57053447
3516 57053447 40214714 33912306 29678656 26655384 24624154 15807836 -918107 -12257806
3508 -12257806 -8832538 624765 2161528 -6792909 -20403690 -34904959 -50131649 -65097767
3500f5097767q208060J1421651L7485220M5063787J9364286j3219442j2542061
3493A4267614J5507814K3610308m877644l0989328k4305089p238097p514270r276225
3485c0814917R864188K8479999J3808313j9649445k9709309r343562J1618891
3478b5745842J6324674J3904667J0749330L861429k353692j478231j8952l250200
3470A1993183k38635J2387088J2315597j2017863k9655688j0177150K1813800
3463F420332J9515246j4105418l4196859k3340952m957008N858368J6016104K1625161
3455g165026R786252o576036k489922J0602939o29397k7476603k4083819J6389768
3447c1641844M6046277L6306892J3337485K047793r830580k8012716k7281823
$$ plain form
3500 -65097767 -73305827 -61884176 -24398956 20664831 40029117 26809675 14267614
3493 14267614 29775428 53385736 48508092 17518764 -6786325 -14024422 -21538692 -30814917
3485 -30814917 -20950729 7529270 21337583 1688138 -28021171 -37364733 -25745842
3478 -25745842 -9421168 4483499 15232829 19094258 16740566 15262335 15243383 11993183
3470 11993183 11754548 24141636 36457233 24439370 -5216318 -15393468 6420332
3463 6420332 25935578 11830160 -22366699 -45707651 -50664659 -44806291 -28790187 -7165026
3455 -7165026 2621226 -3954810 -6444732 4158207 3528810 -23947793 -48031612 -31641844
3447 -31641844 14404433 50711325 64048810 66096603 56266023 28253307 971484
3440I71484k438667P689746j5961288l2770358q181064K5433982K2373623j062276
3432c944818j70101J9667158J8036593n975598j4478852J660634J1711185J723622
3424B8229823p791609n799272p143427j6229507j4594996L263245J5744946Q029134
3416C708337q676344k1070352k9078159k9308716j2436125J2835008K1758807
3409f2267544J1235584P513809K2672537L1937097J3001387j7413899k8615498
3402b1936527j7595308l382557L532878M024796k954194j4139800j4596645J668124
3394f5379233J5387498Q740801l838523K291732J9798202K0473819K854584n917091
3386e588211L430868J0242436N414743O988400J9023628J3332783k1383154m6324048
$$ plain form
3440 971484 -1467183 6222563 -9738725 -42509083 -50690147 -25256165 -2882542 -3944818
3432 -3944818 -4114919 15552239 33588832 27613234 13134382 14795016 26506201 28229823
3424 28229823 20438214 14638942 7495515 -8733992 -23328988 -20065743 -4320797 3708337
3416 3708337 -4968007 -26038359 -55116518 -84425234 -96861359 -84026351 -62267544
3409 -62267544 -51031960 -43518151 -20845614 11091483 24092870 6678971 -21936527
3402 -21936527 -39531835 -42914392 -39381514 -35356718 -38310912 -52450712 -67047357 -65379233
3394 -65379233 -49991735 -41250934 -45089457 -42797725 -22999523 -2525704 328880 -5588211
3386 -5588211 -2157343 8085093 13499836 20488236 39511864 52844647 31461493 -14862555
3378a4862555k5182208J5489922K1737565p523502k2774919j446343K5066639
3371i495401K7863444J7923783J1474623m49611k3868499l7087589k2459179K012712
3363c4085717R997096N340107P443337J6389096J8576942J2367792M894656k432816
3355C8490493n615403N815218K3896480J8187038j6788400l7873210j2844686
3348A3267530K3046364J5809454k2950584l4405754m171831K2027142J4170983
3341B6793304o790000j7271602k1755938k2370116p405499J4335116J5268854
3334a9195881P69797Q993594M0154048M1477998p801489n1505590l7601659M492298
3326b0216884J6650554L96617l818951O271823M47129j8997149j8455165O169816
$$ plain form
3378 -14862555 -40044763 -24554841 -2817276 -10340778 -33115697 -34562040 -9495401
3371 -9495401 18368043 36291826 47766449 47316838 23448339 -13639250 -36098429 -34085717
3363 -34085717 -24088621 -18748514 -11305177 5083919 23660861 36028653 40923309 38490493
3355 38490493 32875090 38690308 62586788 80773826 63985426 26112216 13267530
3348 13267530 36313894 52123348 29172764 -5232990 -9404821 12622321 26793304
3341 26793304 20003304 2731702 -19024236 -41394352 -48799851 -34464735 -19195881
3334 -19195881 -18426084 -9432490 30721558 72199556 64398067 12892477 -24709182 -20216884
3326 -20216884 -3566330 -3169713 -6988664 -716841 -269712 -19266861 -37722026 -31552210
3318c1552210K2904688J8195896J1216365J1067779L019402j5999722k6257298
3311g405100j8165615m884155L975054J2106775J6503768P532280p182905q506424
3303f026322J036722M71621r471894l957119J9063142K5567448k702524l4101055
3295a0119981k9648264K488662K2240744J3712801j709117m448538l022263j2733249
3287b3239205k5050633j6499411J3049426L0198351J0549836k1736169k3122653
3280e5850458M738645J5710836o682363j8801877J1523274M3718388K2310075
3273A6666520l1229157m3618293K279403M5176853L7597961M031586j1465558
3266A9439315o121789N65090O442864J4821775J2599962p680550k5579707k0989771
$$ plain form
3318 -31552210 -8647522 9548374 20764739 31832518 34851920 18852198 -7405100
3311 -7405100 -25570715 -30454870 -26479816 -14373041 2130727 9663007 2480102 -6026322
3303 -6026322 -4989600 -4517979 -13989873 -17946992 1116150 26683598 23981074 -10119981
3295 -10119981 -39768245 -37279583 -15038839 -1326038 -3035155 -7483693 -10505956 -23239205
3287 -23239205 -48289838 -64789249 -51739823 -21541472 -10991636 -32727805 -55850458
3280 -55850458 -51111813 -35400977 -42083340 -60885217 -49361943 -5643555 16666520
3273 16666520 -14562637 -58180930 -55901527 -10724674 26873287 30904873 19439315
3266 19439315 13317526 13882616 20325480 35147255 47747217 40066667 14486960 -6502811
3258f502811n910261j649088k893318O505090J7474918Q137938j5698121k4738701
3250b5274354j0721788J987231m631500j5604677p376811J6849600L1073480K0224124
3242F525305k037913j0759644J654490J8830292K0528961L839248j7150585k7434200
3234f004046k3225205j2316699n663001m956503O79114J6791508K5357532L975484
3226e361816l3280788m1322399n223341L1806885K6215397n665361j7797904k616752
3218e3246079J1468323J4456904K0216046K5870190J4192228n114617m822995
3211B3020000P577005k621777l2525122l8578133r910816J1811847M743802R60129
3203c5523065K0480196K9015657L32715l1149147k5813485j887969N446677O029117
$$ plain form
3258 -6502811 -12413072 -14062160 -16955478 -10450388 7024530 15162468 -535653 -25274354
3250 -25274354 -35996142 -34008911 -38640411 -54245088 -61621899 -44772299 -13698819 6525305
3242 6525305 4487392 -6272252 -4617762 14212530 34741491 38580739 21430154 -6004046
3234 -6004046 -29229251 -41545950 -47208951 -52165454 -51486340 -34694832 -9337300 -5361816
3226 -5361816 -38642604 -79965003 -85188344 -53381459 -27166062 -32831423 -50629327 -53246079
3218 -53246079 -41777756 -27320852 -7104806 18765384 32957612 27842995 23020000
3211 23020000 30597005 27975228 -4549894 -43128027 -53038843 -41226996 -36483194 -35523065
3203 -35523065 -15042869 13972788 14305503 -16843644 -42657129 -44545098 -39098421 -33069304
3195c3069304K1989457L1223130N222879k5930029j2794061K7738482L3203252
3188D7583806o117507l5166323k2364550Q52413k41736j6221205k1712024j0847810
3180f4234936Q920136K6877005K7134502O348891q456390P097269L0632417K2100359
3172E6419253j0110000k0251048K39710J3164402L138992j30435J7053260K4370507
3164H3894641K655531k2133985k4645931j5257546o362857J0717820L0128345
3157E8996018K0819842j7907372l7802121j4389307Q986783p751740l3028156
3150b2076053j9284067J3648534J3845197j3005289j7137515P905208J9615453
3143a6488532M431630m102784Q324423J3065192l244636j1290634O496490K0435152
$$ plain form
3195 -33069304 -11079847 20143283 25366162 -563867 -13357928 14380554 47583806
3188 47583806 41466299 6299976 -16064574 -15212161 -15453897 -31675102 -53387126 -64234936
3180 -64234936 -55314800 -28437795 -1303293 5045598 -3410792 3686477 34318894 56419253
3172 56419253 46309253 26058205 26297915 39462317 42601309 42470874 59524134 83894641
3164 83894641 86550172 64416187 39770256 24512710 18149853 28867673 58996018
3157 58996018 79815860 61908488 24106367 9717060 18703843 10952103 -22076053
3150 -22076053 -41360120 -27711586 -13866389 -26871678 -44009193 -36103985 -16488532
3143 -16488532 -12056902 -16159686 -7835263 5229929 1985293 -9305341 -2808851 17626301
3135A7626301K007124k8196322l2529751j0494790R196135J2718094R362157O322215
3127a3988837l12148j1826100j9816042j4055025O568996K7554884K6500897p16223
3119h9598k5624368j8200907R841128J8249217k827536j8244956l653187J6521806
3111b4028401R193141j6298334k6604770j4744283J45163J0858120K5311323L6389745
3103B21704K4051040p035293k2817571n471695J9937134K0124347k445290j7967763
3095H596613j1206954K923474L400376j0745165k1748420j5140860L161649J3582966
3087b7176321P274669k081878K199428J4539397J4960594M33532r014653j83957
3079I50811J4111860J5340420M579831m764937q119009r572099q882874k751085
$$ plain form
3135 17626301 19633425 -8562897 -41092648 -51587438 -42391303 -29673209 -20311052 -13988837
3127 -13988837 -14300985 -26127085 -45943127 -59998152 -53429156 -25874272 626625 -89598
3119 -89598 -25713966 -43914873 -34073745 -15824528 -18652064 -36897020 -40550207 -24028401
3111 -24028401 -14835260 -31133594 -57738364 -72482647 -72337484 -61479364 -36168041 221704
3103 221704 24272744 17237451 -5580120 -11051815 8885319 29009666 26564376 8596613
3095 8596613 -2610341 313133 3713509 -7031656 -28780076 -43920936 -40759287 -27176321
3087 -27176321 -19901652 -21983530 -19784102 -5244705 9715889 10149421 1134768 950811
3079 950811 15062671 30403091 34982922 30217985 22098976 12526877 3644003 892918
3071H92918O356776J4006257J9871711K0298970O136347j8408489k8787317j2189301
3063H177872O776766o17011j9356380j1556888J8972057K6111484n693703l1840300
3055i026103j3559573K4198510L3013226J0249085r236350j0870124j0271511
3048A4497160j5438317j6371470r905383l800391K155369J1565684J2485965p119620
3040a1931003k9092215k3176185N883645K3904900K0475410J8199781K3981681
3033B8246014J4432087j5396731l1595413j4232306P235748K114280j1384480
3026b0580801j621317J8074112J1257018j7465996k7515413p821977P889721j834249
3018c9618902j4030408k717621J9187221K2304196M631546j1247621j3933462
$$ plain form
3071 892918 7249694 21255951 41127662 61426632 67562979 49154490 20367173 8177872
3063 8177872 14954638 14337627 -5018753 -16575641 2396416 28507900 22814197 -9026103
3055 -9026103 -22585676 1612834 34626060 44875145 35638795 24768671 14497160
3048 14497160 -941157 -17312627 -27218010 -31018401 -28863032 -17297348 -4811383 -11931003
3040 -11931003 -41023218 -64199403 -58315758 -34410858 -13935448 4264333 28246014
3033 28246014 42678101 27281370 -4314043 -18546349 -11310601 -9196321 -20580801
3026 -20580801 -22202118 -4128006 7129012 -10336984 -37852397 -45674374 -37784653 -39618902
3018 -39618902 -53649310 -56366931 -37179710 -14875514 -10243968 -21491589 -35425051
3011c5425051j3084113j5709099j2916327K933724K1178603K4808527J4221723
3004a3992013O166901Q754144J1979070R159058J1149464K4085681K8184563L928101
2996H9414969k9027130l0887162l68574J9769713M905261j8155148j7153726o30937
2988A7867266O907209P167445J3856083J8741508O585570j1885780j5886841j0326349
2980C3026111j1913889j2940348K935128J9835415R012927j5231335p957269L1779342
2972D8546082M8161163R594090m0491222m2887525j595199K8860666J6687661
2965F6875716j6285145k9529158q549232K3555784L0028924N9292l5339465l8500733
2957g684017j2378998P491672M786200k921611k700775l911383p655322L421874
$$ plain form
3011 -35425051 -48509164 -64218263 -77134590 -74200866 -53022263 -28213736 -13992013
3004 -13992013 -7825112 929032 12908102 22067160 33216624 57302305 85486868 89414969
2996 89414969 60387839 29500677 29132103 48901816 53807077 35651929 18498203 17867266
2988 17867266 24774475 31941920 45798003 64539511 71125081 59239301 43352460 33026111
2980 33026111 21112222 8171874 11107002 30942417 39955344 24724009 16766740 48546082
2972 48546082 96707245 106301335 65810113 22922588 21327389 50188055 66875716
2965 66875716 50590571 21061413 12512181 36067965 66096889 66156181 30816716 -7684017
2957 -7684017 -20063015 -12571343 -7785143 -10706754 -13407529 -17318912 -24974234 -21552360
2949b1552360K6617244K7884822m840852l1600910j6619311J5622090J9204194
2942A4714917l081348j2654482j703515O85671j6464093k9419187k1226796k634765
2934g1783598J3140920K3681463K1423232k524532l1841828l3863156n001922
2927h6769421K0508638J7473461p10090r593697m912544N873729J8804087K6283987
2919a3041850J7016517k515255p536863Q980410K0494522M506941k3128718l1664117
2911b6888413j7456784p39821P705014J3550467J8761251J6416195O202304j022944
2903A6527269K620997J2506962J7612240J1130180m074910j7911777k3309500
2896A5101461k3119234k1171093j1315173J1227165L1075039K5661427o91179
$$ plain form
2949 -21552360 5064884 32949706 28108854 -3492056 -20111367 -4489277 14714917
2942 14714917 11633569 -1020913 -2724428 -2038757 -18502850 -47922037 -69148833 -71783598
2934 -71783598 -58642678 -34961215 -13537983 -16062515 -47904343 -81767499 -86769421
2927 -86769421 -66260783 -48787322 -49497412 -59091109 -64003653 -58129924 -39325837 -13041850
2919 -13041850 3974667 1459412 -6077451 2902959 23397481 27904422 4775704 -26888413
2911 -26888413 -44345197 -45085018 -37380004 -23829537 -5068286 11347909 17550213 16527269
2903 16527269 19148266 31655228 49267468 60397648 56322738 38410961 15101461
2896 15101461 -8017773 -29188866 -40504039 -29276874 1798165 27459592 26768413
2889B6768413j8312700j4346398q462058j4863381j6122816L904256K4724479
2882a6710205J5618378j6872327l6694367k6032515k36917J9290150K4180017
2875c7457786J6271112P170784J4401405L6588585M1773369O956132l9269267
2868D6434334m6788707j4119646Q540139p706233l2331446k6794456q71170Q720907
2860f4916278n786408j7657300o597054J8571780L5880060L2469181J1681978
2853C645959j0762521j8222139p884137P089708J2965672Q439954O58494m112779
2845h181789k780686M022854J0440019J0683016O411739J922169m849232j5315626
2837B352464j8728155m782338J4030874J3655299n411820j5599872k240223J6713709
$$ plain form
2889 26768413 8455713 -5890685 -14352743 -29216124 -45338940 -41434684 -16710205
2882 -16710205 -1091827 -17964154 -54658521 -80691036 -80927953 -61637803 -37457786
2875 -37457786 -21186674 -14015890 385515 36974100 78747469 85703601 46434334
2868 46434334 -354373 -14474019 -5933880 -13640113 -45971559 -72766015 -73637185 -64916278
2860 -64916278 -70702686 -88359986 -94957040 -76385260 -40505200 -8036019 3645959
2853 3645959 -7116562 -25338701 -33222838 -26133130 -13167458 -4727504 -4069010 -8181789
2845 -8181789 -10962475 -6939621 3500398 14183414 20595153 22517322 17668090 2352464
2837 2352464 -16375691 -21158029 -7127155 6528144 1116324 -14483548 -16723771 -10062
2829a0062K0850000J4391665R196348K318536j1008324j9734980j2982234q10689
2821B210260K97927p744625j1861606r661904o958878l486724J633931K44881
2813c5326738j0535497j3811822O299220L5190117M0392483J3019265k0822702
2806A4404326l1569053j6302569M435982J1389500N987960N697197J7152751K0850559
2798C2046653k057552l3852099l7975151j2814350O481650O449758J3260576L5618863
2790G158348L8671230O971729j5505741M499680K4219600q318430n8520745n2612533
2782e3436862P23610K1880150r615356k6256181Q597556L9498987J5334256k6205733
2774b9479573k3419323J4751000L5402968K4393288P945629j733857j2348496
$$ plain form
2829 -10062 20839938 35231603 44427951 46746487 35738163 16003183 3020949 2210260
2821 2210260 2508187 -5236438 -17098044 -26759948 -33718826 -37205550 -35571619 -35326738
2813 -35326738 -45862235 -59674057 -53374837 -18184720 22207763 35227028 14404326
2806 14404326 -17164727 -33467296 -29031314 -17641814 -11653854 -5956657 11196094 32046653
2798 32046653 29989101 -3862998 -41838149 -54652499 -48170849 -41721091 -28460515 7158348
2790 7158348 45829578 52801307 37295566 41795246 66014846 57696416 -824329 -53436862
2782 -53436862 -52713252 -30833102 -40448458 -66704639 -58107083 -18608096 -3273840 -29479573
2774 -29479573 -52898896 -38147896 -2744928 21648360 29593989 27860132 15511636
2767A5511636k0105598j5050684n946832n882163n912605O969936K0179450J3775518
2759C538658m278940r195984M119434J8834551K0852995Q187296j1827808k1851774
2751H378428q762197J1836453J0461093q453313r159623J2483181J4900213j7057844
2743A4626391l7664893j4837803J2514169R10573k2293995j1047966J3949549
2736d3843975M511923k1577655p276498M0046369N4430604J8510675j4025046
2729C0776397j0277811K099492Q63914L661408J5554128Q464608k0221121k9064302
2721A856713k363269J8007928L549616j1872247O866349L3632862K4654042j1709980
2713F2622014l3525286k7675878j4223375q137613r970794j8316687k4874799
$$ plain form
2767 15511636 -4593962 -19644646 -25591478 -31473641 -37386246 -30416310 -10236860 3538658
2759 3538658 -740282 -9936266 -5816832 13017719 33870714 42058010 30230202 8378428
2751 8378428 -383769 11452684 21913777 13460464 4300841 16784022 31684235 14626391
2743 14626391 -23038502 -37876305 -25362136 -24451563 -46745558 -57793524 -43843975
2736 -43843975 -39332052 -60909707 -68186205 -28139836 26290768 44801443 30776397
2729 30776397 20498586 22598078 23461992 27123400 42677528 51142136 30921015 1856713
2721 1856713 -506556 17501372 21050988 9178741 16045090 49677952 74331994 62622014
2713 62622014 29096728 1420850 -12802525 -20940138 -30910932 -49227619 -74102418
2706g4102418j3565125J3930470L0700866K1709749O613094O376510J0533130
2699B196276o45843k2024056l2988595k5084117n197533J3260453J4740288k711597
2691e8454724j3787907N004510L3920506L4097154J0966508N132280J7984391
2684C4862718P816782k6618588k9209484J6925455M7245245J6103657k6987811
2677D0137974k0020184J1329018O039573k6675710l0966109j616997J7608148
2670d164287J2090696L590902l748112j9270715k3600356N018490L7163008K9381705
2662C6461331o05887l147834J4662678M499952k8958100l0937402M861404K2556652
2654A9392794P51482j5953628k061175P140070j2884671l0251263j5814142R705752
$$ plain form
2706 -74102418 -87667543 -73737073 -43036207 -21326458 -14713364 -8336854 2196276
2699 2196276 1550433 -20473623 -53462218 -78546335 -83743868 -70483415 -55743127 -58454724
2691 -58454724 -72242631 -67238121 -33317615 779539 11746047 16878327 34862718
2684 34862718 42679500 16060912 -13148572 3776883 51022128 67125785 40137974
2677 40137974 20117790 31446808 37486381 10810671 -20155438 -21772435 -4164287
2670 -4164287 7926409 11517311 7769199 -11501516 -35101872 -30083382 7079626 36461331
2662 36461331 35855444 32707610 47370288 51870240 22912140 -8025262 -3163858 19392794
2654 19392794 20144276 4190648 2129473 9269543 -3615128 -33866391 -49680533 -39974781
2646c9974781J9581343K0257741J8687494J925391k3202913k1363413J2035212
2639a2053926L2791745J6339662p061002j2436067j9189493l7889783l6758563
2632g6257427k238749K2837072Q577610o838962J6343613M6435402L2876480q691651
2624C3043388k6266616j4714971p164995p834955N464071K8385512L5391275K5599938
2616G1902647J5310899R24706k3533216l1770855k07965M0010622M0696175J1522083
2608A24855096M34414J1667327N206142k6537047m4620725l0994457j1829064
2601B8181686m214682N653866J8068655O418036l1740646n5324787l4864477P420664
2593f0401685L1544286K4606595r82067k4999439k5591552K631051K9987792K1678744
$$ plain form
2646 -39974781 -20393438 -135697 18551797 20477188 -2725725 -24089138 -12053926
2639 -12053926 20737819 37077481 30016479 17580412 -1609081 -39498864 -76257427
2632 -76257427 -78496176 -55659104 -47081494 -53920456 -37576843 8858559 41735039 33043388
2624 33043388 6776772 -7938199 -15103194 -22938149 -17474078 10911434 46302709 71902647
2616 71902647 87213546 88138252 64605036 32834181 32626216 72636838 113333013 124855096
2608 124855096 125289510 136956837 142162979 115625932 71005207 40010750 28181686
2601 28181686 23967004 29620870 47689525 54107561 22366915 -32957872 -67822349 -60401685
2593 -60401685 -28857399 -4250804 -5232871 -30232310 -55823862 -53192811 -23205019 -1526275
2585a526275j0851568k4056436r499153k897512j8014569k1065179Q461433L6909921
2577d2539338K6153029j0600824l2945707k6636411o258335J2746282K1509950
2570e8571354J6623937Q825410J2899698J9049261K547488k8582885l3428702
2563f0637147k450640K0548677O620078j1660809K101292K4844673J6028398j0019312
2555a4624790r591222J3733820J7648581k206075m537442K2954587L6994839O083568
2547F6455866l9754676n2875767l0186429l897338Q025772J3551563J9369854
2540a9311155J8439640O397424o783239r136206l167380r72291l595767L395386
2532a4733588K5184752L9388251K1609728j5395326l3754949k3382130j1938088
$$ plain form
2585 -1526275 -12377843 -36434279 -45933432 -48830944 -66845513 -87910692 -79449259 -42539338
2577 -42539338 -16386309 -26987133 -59932840 -86569251 -92827586 -80081304 -58571354
2570 -58571354 -41947417 -33122007 -20222309 -1173048 1374440 -27208445 -60637147
2563 -60637147 -63087787 -42539110 -35919032 -47579841 -45478549 -20633876 -4605478 -14624790
2555 -14624790 -24216012 -10482192 7166389 4960314 422872 23377459 60372298 66455866
2547 66455866 26701190 -26174577 -56361006 -60258344 -52232572 -38681009 -19311155
2540 -19311155 -871515 5525909 -1257330 -10393536 -13560916 -14533207 -18128974 -14733588
2532 -14733588 10451164 49839415 71449143 56053817 22298868 -1083262 -13021350
2525a3021350j3551355n655017K1479056L2436675K280835k9369276j2592547
2518a7992979K5949133J3711099n3211043r2267773m8802739K9338547O2969607
2511h0306148M1511908J2046977K353601J407314l74297L462803J1020344P750140
2503a127358p773207j7840761j1447384J400342O403432K468902k168534j242094
2495c1326662N851733J4429418J6502109Q266995l144023n596750L371626J0964554
2487A9319000J600688k3044854l8530893k0975926J9081617L7888756Q340746
2480C679134l9748379n0808474j2149602L3775386M7577200L3568443J2952896
2473B8846604j0020093l3180633l7003737j1926270J4339541J0754038r045701
$$ plain form
2525 -13021350 -26572705 -32227722 -10748666 21688009 23968844 -5400432 -17992979
2518 -17992979 7956154 21667253 -31543790 -123811563 -172614302 -143275755 -80306148
2511 -80306148 -38794240 -26747263 -24393662 -22986348 -23360645 -19897842 -8877498 -1127358
2503 -1127358 -8900565 -26741326 -38188710 -36788368 -30384936 -27916034 -30084568 -31326662
2495 -31326662 -25474929 -11045511 5456598 13723593 10579570 4982820 8354446 19319000
2487 19319000 20919688 -2125166 -40656059 -61631985 -42550368 -4661612 3679134
2480 3679134 -36069245 -86877719 -99027321 -65251935 -17674735 15893708 28846604
2473 28846604 18826511 -14354122 -51357859 -63284129 -48944588 -38190550 -47236251
2466d7236251p868111J5079199K4224571O089302j1858794p582449O487128J2259882
2458a0405523J0717036L980512j4452633l3469212k1555372K4073855N5431221
2451A4319884L3826364j1567831k3455719J859822J6381862j511069j7442475
2444A2410838L66477L2093047L6989425P304125k9988529m8411086m0078571j1566309
2436d0880583J9852628L3453676K3775353P555562J854257K776310k920895j3909531
2428C1556777j7555570j2224160q948191j0073700k894371J8308142L6208037
2421C4376964K8375865k957142l0191027l1187756j2941445L93085k329958r251133
2413b5712547m619402J1267960K4692008K4081081Q776508j1011355j8820383
$$ plain form
2466 -47236251 -55104362 -40025163 -15800592 -9711290 -21570084 -29152533 -22665405 -10405523
2458 -10405523 311513 4292025 -10160608 -43629820 -65185192 -41111337 14319884
2451 14319884 48146248 36578417 13122698 14982520 31364382 29853313 12410838
2444 12410838 12777315 44870362 81859787 89163912 59175383 10764297 -29314274 -40880583
2436 -40880583 -21027955 12425721 36201074 43756636 45610893 48387203 45466308 31556777
2428 31556777 14001207 1777047 -7171144 -17244844 -20139215 -1831073 34376964
2421 34376964 62752829 59795687 29604660 -1583096 -14524541 -14131456 -16461414 -25712547
2413 -25712547 -30331949 -19063989 5628019 29709100 38485608 27474253 8653870
2406H653870n577017J4745070J4250058j3122929l6984524k8462644j907121N254366
2398d3150871j1837704k0294372k654101J7679474J7721580J1072859J9160532
2391a2302603L0152224J8129162r452570j7519666L708552K1640314O681705k6954806
2383A4082312m0609332j9969838J0543863K0335988P815692l541384N95603Q213164
2375b533932M480455j147471R698365K8633108K6957413Q84753j8461790j1953107
2367C6557794q87442r186767k3796465j9969200m372399j34527l999257N500124
2359b0288139K4724796K6382216M570864j4233392j0055137P521869J9726572
2352C8349649J8599199L843379j8069229l0411211k3052656j0593009j0944563
$$ plain form
2406 8653870 3076853 17821923 32071981 18949052 -18035472 -46498116 -48405237 -43150871
2398 -43150871 -54988575 -75282947 -77937048 -60257574 -42535994 -31463135 -12302603
2391 -12302603 17849621 35978783 26526213 9006547 12715099 34355413 41037118 14082312
2383 14082312 -26527020 -46496858 -35952995 -15617007 -7801315 -11342699 -10747096 -2533932
2375 -2533932 1946523 799052 10497417 39130525 66087938 66972691 48510901 36557794
2367 36557794 35670352 26483585 2687120 -17282080 -21654479 -21789006 -25788263 -20288139
2359 -20288139 4436657 30818873 35389737 21156345 11101208 18623077 38349649
2352 38349649 56948848 60792227 42722998 12311787 -10740869 -21333878 -32278441
2345c2278441j2749302N592768L0422980K4800091j2368053l8827437k8019961
2338f3427355K192606K7775771M4427478M3690396Q784061m4090024o2670308
2331d3317375k5375092K3925665L5410232J4083329n883109j1648467n361011
2324a8165828J6836585M3594436M0095147K9562k7302795m828375L0250991K1587988
2316A02097711j9604181l9656982k9308580k2518538k5364747j3021798R367403
2309c8009712R227162j0068849j2685632K29911q107480l1623125j7437586L8984557
2301f9490754O7734702K8648019k3897969k5375429O334591J5292340k241506
2294b996006j0584051m223846m866285r246357M353537K7928034L1215769J2576798
$$ plain form
2345 -32278441 -45027743 -39434975 -9011995 15788096 3420043 -35407394 -63427355
2338 -63427355 -61234749 -33458978 10968500 54658896 63442957 19352933 -43317375
2331 -43317375 -68692467 -44766802 -9356570 4726759 -1156350 -12804817 -18165828
2324 -18165828 -1329243 42265193 82360340 82389902 55087107 50258732 80509723 102097711
2316 102097711 82493530 42836548 13527968 -8990570 -34355317 -47377115 -38009712
2309 -38009712 -28782550 -38851399 -51537031 -51307120 -59414600 -91037725 -108475311 -69490754
2301 -69490754 -1756052 26891967 2993998 -22381431 -16046840 -754500 -2996006
2294 -2996006 -13580057 -17803903 -22670188 -31916545 -27563008 365026 31580795 44157593
2286D4157593l9292L323447M098762p403853j7533958j5344260o491507J273609
2278F040541N757315M168810l675896j0074965j0572851r993367n425591J7077352
2270f698652N0875213N8933602K2951092k1630204l2745728k0459687j9255317
2263C1970319k4562766p234897K3288994K7257193K937871j0024781R3083J660783
2255D5385799j4782469j4600262J3866532K6284719p468692m6300784l5276022
2248c2891179J3074847M0143654K2276458j1536305k8774365k2467767j20369
2241b0295026K3885203L0403940J5075659k471440q485623j6436681l4226071
2234a2550039l4675100L322047M3912362L2812574k1374815n4681670l7431880
$$ plain form
2286 44157593 44118301 47441748 51540510 44136657 26602699 11258439 4766932 6040541
2278 6040541 11797856 15966666 12290770 2215805 -8357046 -18350413 -23776004 -6698652
2270 -6698652 44176561 103110163 126061255 104431051 71685323 51225636 31970319
2263 31970319 7407553 172656 23461650 50718843 53656714 43631933 43725016 45385799
2255 45385799 30603330 16003068 29869600 56154319 48685627 2384843 -32891179
2248 -32891179 -19816332 20327322 42603780 31067475 2293110 -20174657 -20295026
2241 -20295026 3590177 33994117 49069776 46598336 38112713 21676032 -12550039
2234 -12550039 -47225139 -43903092 9270 32821844 11447029 -43234641 -80666521
2227h0666521n403692P071112J1633398K2692164K1070733m384782k0695025N28575
2219d8154038K9241294J9278950j7235353k8908065o443975R378298R71257j41758
2211d2013390K4907620M4811901K9394080j171937j1520926n132758o907739j4718145
2203A7648706q472597O126040M078685j2944093j6107953K150814J4746674L435880
2195A0662156j5572639k1003480j3828779k330910J3702719K8065907K2135471
2188B1830445o521823k9799344k3719137l95908J3950738J5247622J4275976J0655774
2180A5524343J93220n567162M359671J4194903J019578k5383201l2760486j4643852
2172d3062986K273407J730274j157706R167237K3372329K5439569J5918372M404393
$$ plain form
2227 -80666521 -86070213 -78999101 -67365703 -44673539 -23602806 -27987588 -48682613 -48154038
2219 -48154038 -18912744 366206 -16869147 -45777212 -52221187 -42842889 -41871632 -42013390
2211 -42013390 -17105770 27706131 57100211 55928274 44407348 39274590 32366851 17648706
2203 17648706 9176109 15302149 19380834 6436741 -9671212 -7520398 7226276 10662156
2195 10662156 -4910483 -25913963 -39742742 -42073652 -28370933 -305026 21830445
2188 21830445 15308622 -14490722 -38209859 -38605767 -24655029 -9407407 4868569 15524343
2180 15524343 15717563 10150401 14510072 28704975 29724553 4341352 -28419134 -43062986
2172 -43062986 -40789579 -39059305 -40217011 -31049774 -7677445 17762124 33680496 38084889
2164C8084889n609227j3362412j4405398o161303Q254161K3693195L1196128J7719694
2156G9409727j5354742l9134551k6900258N030949J4322064p664979k4953120
2149a5244910j2852026R426166J6266430J2289260J0601329M647321j2030402
2142A3103168k2571184j1243807Q404681J5874492J5344684J8994634J8541313
2135E6447981K920694j3435447j1831729l373200q691226j8188727r213912Q752683
2127C387117O600882j2740881j6772694K630424J8239534J4754507Q463513J1674557
2119C6236959J3371612N758460k128127o949948j6379345k4448419j4812739L924684
2111e426863L341531j4491233j3760614J2128359J9897254j4968434n2168299
$$ plain form
2164 38084889 32475662 19113250 4707852 -1453451 6800710 30493905 61690033 79409727
2156 79409727 64054985 24920434 -1979824 3051125 17373189 9708210 -15244910
2149 -15244910 -28096936 -18670770 -2404340 9884920 20486249 25133570 13103168
2142 13103168 -9468016 -20711823 -12307142 3567350 18912034 37906668 56447981
2135 56447981 59368675 45933228 34101499 30728299 22037073 3848346 -5365566 3387117
2127 3387117 9987999 -2752882 -19525576 -16895152 1344382 16098889 24562402 36236959
2119 36236959 49608571 55367031 53238904 46288956 29909611 5461192 -9351547 -5426863
2111 -5426863 -2085332 -16576565 -30337179 -18208820 1688434 -13280000 -65448299
2104f5448299m4883207p520811J5679054J9076903K6750822L7791814K9625314
2097A1071590M798710j0402193r176356p270964p412993K072739J6082878J6127329
2089A5890740L913880j517646J896373N15396l325200L539704J1539550j070976
2081C1381821k4524615k5745063l084126J0393973M419836N873529K3791602K8549088
2073E1056045O085621j3848162j0292446p489216k5652633l6690044r999350L0987424
2065a5842761M2118959K2568069K707074q540541j9183569j7862472Q125256L2480542
2057D6570557J9030579j5973778k1903144P649315K5828133O836827k1122523
2050D6915966k8682419k3689934j9839564j0481361M668879N052905j4480287
$$ plain form
2104 -65448299 -110331506 -117852317 -102173263 -83096360 -56345538 -18553724 11071590
2097 11071590 15870300 5468107 -3708249 -10979213 -18392206 -16319467 -236589 15890740
2089 15890740 19804620 18286974 20183347 20698743 17373543 20913247 32452797 31381821
2081 31381821 6857206 -18887857 -21971983 -11578010 -7158174 -1284645 22506957 51056045
2073 51056045 57141666 43293504 33001058 25511842 -140791 -36830835 -46830185 -15842761
2065 -15842761 26276198 48844267 51551341 43010800 23827231 5964759 14090015 46570557
2057 46570557 65601136 49627358 27724214 35373529 61201662 68038489 46915966
2050 46915966 18233547 -5456387 -25295951 -35777312 -31108433 -26055528 -40535815
2043d0535815k6108016j1232731J0565971J7526177J8535847K3921624J6251647
2036H924704j5834471m1788931k6258588J5286263L5215577J6870838j4021937
2029b1606545l1056245k7759730m611342L1009633N4492532M3765207J0251968
2022E4485478j3497046j4496472n474121K770278Q818911O150998j0128506k4957431
2014C672089j9674146l744094j191248r120435l086174J7220031K4852599J2612375
2006B1540997N068733J3987265J9463758R776851K854021Q506069M894204k1861919
1998F4229979m5887452l8960752j4288313k271649l762841Q97487J3058811J7793984
1990i190746J2987158P803221K345831n207803k822260J7006827L4188708K4609347
$$ plain form
2043 -40535815 -66643831 -77876562 -67310591 -49784414 -31248567 -7326943 8924704
2036 8924704 -6909767 -48698698 -74957286 -59671023 -24455446 -7584608 -21606545
2029 -21606545 -52662790 -80422520 -85033862 -54024229 468303 44233510 54485478
2022 54485478 40988432 26491960 21017839 23788117 32607028 38758026 28629520 3672089
2014 3672089 -16002057 -19746151 -20937399 -30057834 -33144008 -15923977 8928622 21540997
2006 21540997 26609730 40596995 60060753 69837604 72691625 81197694 86091898 64229979
1998 64229979 18342527 -20618225 -34906538 -37178187 -40941028 -40043541 -26984730 -9190746
1990 -9190746 3796412 11599633 13945464 8737661 5915401 22922228 57110936 81720283
1982H1720283k384833j7442950j2737411k700877N301100J0544046J295706k7117983
1974C6477081m7063632l1073603r43504J042263j5973518l505668L8318590M8285785
1966B5563794J666447m1369434k4645478J8675429K2304862j0446980k2390635
1959c0641995N19648J3660512o099347k4743455j1003057J5181550J8559442M46942
1951b4119760j1986070q731365m437940j0917010k0380352j6401079N392247K8232587
1943f3348742K8569861M702731j5630759q066148J4432249J7704143o870485l2517801
1935f1024951l5335164k0865288o445933K517565Q681356J2675365J8204011L1528029
1927e0065010M4023251L2057018q914133m4391723l7320204K193118K6689280
$$ plain form
1982 81720283 79335450 61892500 49155089 46454212 51755312 62299358 63595064 36477081
1974 36477081 -10586551 -41660154 -42603658 -41561395 -57534913 -61040581 -22721991 25563794
1966 25563794 27230241 -14139193 -38784671 -20109242 2195620 -8251360 -30641995
1959 -30641995 -30122347 -16461835 -22561182 -47304637 -58307694 -43126144 -24566702 -24119760
1951 -24119760 -36105830 -44837195 -49275135 -60192145 -80572497 -96973576 -91581329 -63348742
1943 -63348742 -34778881 -30076150 -45706909 -53773057 -39340808 -21636665 -28507150 -61024951
1935 -61024951 -96360115 -117225403 -123671336 -121153771 -112472415 -99797050 -81593039 -50065010
1927 -50065010 -6041759 26015259 17101126 -27290597 -64610801 -62417683 -35728403
1920c5728403J1304777j7415491j9892079O376349K8682640K2782539l27491j2725401
1912a6942560m112269R928613J1737168M311456M068651J5405459K3036443J2560910
1904E9993871j0154202k7105927k9844330k4106266j6004872m864605Q284333
1897d3801998J5538505J1970674L744567j438449o556797j7390465k5722495j5590732
1889g9247190J0021762K4660563J1928608r159369r208536R713839J8855756O616898
1881a5817669p270688n863340K250044N727675J1208635K2835031K3236409K36330
1873C6542427k4352577k2045008j969282M535480m258327j623780J4983692J4139056
1865A5951681j4975128l7522656k4976813K29505J276209j5954558j5997261R897420
$$ plain form
1920 -35728403 -24423626 -41839117 -61731196 -55354847 -26672207 -3889668 -4217159 -16942560
1912 -16942560 -21054829 -11126216 610952 4922408 8991059 24396518 47432961 59993871
1904 59993871 49839669 22733742 -7110588 -31216854 -47221726 -52086331 -43801998
1897 -43801998 -28263493 -16292819 -12548252 -13986701 -20543498 -37933963 -63656458 -79247190
1889 -79247190 -69225428 -44564865 -32636257 -41795626 -51004162 -41290323 -22434567 -15817669
1881 -15817669 -23088357 -28951697 -26701653 -20973978 -9765343 13069688 36306097 36542427
1873 36542427 12189850 -9855158 -11824440 -7288960 -11547287 -13171067 1812625 15951681
1865 15951681 976553 -36546103 -61522916 -61293411 -60017202 -75971760 -91969021 -82071601
1857h2071601L3933176L3928816J7167691J340109n999440n958384k655530j394238
1849a1709401k104950K408793J2756148J6592885P807612r01732o82636n297991
1841A8868728k3960707l3137192r376914K2819079J9462472j0524867j2073218
1834b7922619K7458981N0204510J4878122l6484460m0662457n648851J0536152
1827g640622q333676k2089771o238807J5007021J7190644J1514453J3545369J2270804
1819B5225415m792248k1052586j2288877J5084598K9950519J5477966j2117682
1812C5487105k1287979L227942M0366823M6552207M636327m4396616m4164762
1805B0421047J376509K9495431O668001k6556213k4208691n135659r901436k3061299
$$ plain form
1857 -82071601 -48138425 -14209609 2958082 4298191 -1701249 -7659633 -10315163 -11709401
1849 -11709401 -13814351 -11405558 1350590 17943475 25751087 24849355 24166719 18868728
1841 18868728 -5091979 -38229171 -47606085 -24787006 -5324534 -15849401 -27922619
1834 -27922619 -463638 49740872 64618994 28134534 -12527923 -18176774 -7640622
1827 -7640622 -15974298 -38064069 -44302876 -29295855 -12105211 -590758 12954611 25225415
1819 25225415 20433167 -619419 -12908296 2176302 32126821 47604787 35487105
1812 35487105 14199126 17427068 57793891 104346098 108982425 64585809 20421047
1805 20421047 21797556 51292987 57960988 31404775 7196084 2060425 -7841011 -30902310
1797c0902310j273167L8908426L4617042j7325334m1686741J725310N2338122
1790C6401348M0306860j0807365k9986315p863049O466681l832515n726172J2521837
1782C7481310J7992786m682296k2660474j0364323Q083541P10862k1238461k4724779
1774a9401834m521151J6752104K2762847J4273014k347503j8104425k2107640
1767a2694588j3305046k435680M880335J1838754J2363969o513928l3968371l5961778
1759g5796333m562891K2269293J4243475o648640n908627O731809R38450j4759225
1751f3492689n763094K4894595L5328267J0606498j5184582j3482321J415135
1744b5678191N213386M60752J237686O620015Q505416P549619O765472M738404
$$ plain form
1797 -30902310 -32175477 6732949 41349991 24024657 -17662084 -15936774 36401348
1790 36401348 76708208 65900843 35914528 28051479 34518160 30685645 24959473 37481310
1782 37481310 55474096 50791800 28131326 17767003 25850544 26561406 5322945 -19401834
1774 -19401834 -23922985 -7170881 15591966 29864980 27517477 9413052 -12694588
1767 -12694588 -25999634 -28435314 -23554979 -11716225 647744 -5866184 -39834555 -75796333
1759 -75796333 -80359224 -58089931 -43846456 -50495096 -56403723 -49671914 -48733464 -63492689
1751 -63492689 -69255783 -44361188 -9032921 1573577 -13611005 -27093326 -25678191
1744 -25678191 -20464805 -20004053 -18766367 -12146352 -3640936 3908683 10674155 15412559
1736A5412559M644728J3173348K3308578J7266306n935521k5272530k7028315
1729A5569153j9528357j3331301r135778j0335953k1356454k6895176l184940
1722h8198806L9022496N5018600K6004791j3115515k5461794j9668356k0815351
1715d7213935k4961301j4901690K339992P012589q88408q157038j0424525m658676
1707a01852992J7007238M1281702L1956471j3632125m0417329j0326024L3027580
1700d2955479K8286446o666684r377513J8926368K0688889j1056466k2079989
1693b4234428n45064L689430j1410340K7017189J29754169J77541865P7720376
1686C79533197q1467953j38085419p5404588k0843264m3278383p2456378m0415838
$$ plain form
1736 15412559 20057287 33230635 56539213 73805519 67869998 42597468 15569153
1729 15569153 -3959204 -17290505 -26426283 -36762236 -58118690 -85013866 -88198806
1722 -88198806 -49176310 5842290 31847081 18731566 -6730228 -26398584 -47213935
1715 -47213935 -72175236 -87076926 -84736934 -77724345 -78612753 -86769791 -97194316 -101852992
1707 -101852992 -84845754 -43564052 -11607581 -25239706 -65657035 -75983059 -42955479
1700 -42955479 -14669033 -21335717 -30713230 -11786862 8902027 -2154439 -24234428
1693 -24234428 -24779492 -21090062 -32500402 -5483213 124270956 301812821 379533197
1686 379533197 298065244 159979825 84575237 63731973 20453590 -52002788 -92418626
1679i2418626R730627J2440540q361658Q445033N0806178N5524746J4638963j5613646
1671C5192157p123914N904946m045027j2587249P022033L2809622K7591979l338344
1663H1426203k4016923k2563125j8611854k0446805j0045898K0135848M3922481
1656D9799927L3834838K61508k2005734j8188815n087455p21948j615664M167011
1648D0443668J5042369J6772975L72700k6798739m5948954m1788627j6824362
1641e8728970Q316148J3794652J248309q657439K08402K2016188L6363622K6813382
1633D1374294m539944l5645138m0469262j5187533J3720625J7719937L13616r936906
1625c2650311J108480J7678435K0597212J0496216k742766j5136887k1589856
$$ plain form
1679 -92418626 -82687999 -70247459 -78609117 -70164084 -19357906 36166840 50805803 35192157
1671 35192157 28068243 33973189 29928162 17340913 24362946 57172568 84764547 81426203
1663 81426203 57409280 34846155 16234301 -4212504 -14258402 5877446 49799927
1656 49799927 83634765 83896273 61890539 43701724 38614269 37892321 36276657 40443668
1648 40443668 55486037 72259012 72631712 45832973 -115981 -41904608 -58728970
1641 -58728970 -50412822 -36618170 -35369861 -44027300 -43818898 -21802710 14560912 41374294
1633 41374294 36834350 1189212 -39280050 -54467583 -40746958 -23027021 -22713405 -32650311
1625 -32650311 -31541831 -13863396 6733816 17230032 14487266 -649621 -22239477
1618b2239477j1208969J4118844L0399592J9468262l964250j2298381l273810
1611A1001811L211263Q013p90943M206060J607901j2032532j9149404r208430
1603b1146261K034621k185763j0847539k417408J8565855K5869091J1522246j549882
1595A9844960N949603K1679699K2016936P246864j959044K503978O986462J986576
1587H6256034k181773M413158J0519859j278887k6420767m1315271l2856681j2340333
1579a5204661J80651m361400j8965861k6033798j0203293K4134426N0578909M6511585
1571D6636558J8202493r947449k4445829k6812055j7552106K371666J8872648
1564G325926J7812755Q563370Q885139R801207j0894338l9322329l1957725J5871552
$$ plain form
1618 -22239477 -33448446 -19329602 11069990 30538252 26574002 14275621 11001811
1611 11001811 14213074 14221087 13430144 17636204 19244105 7211573 -11937831 -21146261
1603 -21146261 -19111640 -21297403 -32144942 -34562350 -15996495 9872596 21394842 19844960
1595 19844960 25794563 47474262 69491198 76738062 74779018 77282996 84269458 86256034
1587 86256034 84074261 88487419 99007278 97728391 71307624 29992353 -2864328 -15204661
1579 -15204661 -15024010 -19385410 -38351271 -64385069 -74588362 -50453936 124973 46636558
1571 46636558 64839051 54891602 30445773 3633718 -13918388 -11546722 7325926
1564 7325926 25138681 33702051 42587190 52388397 41494059 2171730 -29785995 -13914443
1556a3914443N0789382L3851950p170019k7243423k7370515l0388826k8241387
1549d9687281j711499L1063458L6508107K0946696J5529191J8779227N086171
1542G6514070j9083561k2482153q963437j2762863l1845734k6450162O027480
1535c9046360J7885456o955291k0872905N735024L0249747R764534k3859510j5870506
1527d2969811K1708946L1832248K021071k4570015j8168802O693609K6080889
1520B628135L0885172J7067401j2391791l5366737l0254047o360538J0373487
1513b3418918J4591552J7729984J7905196N490345r837777j1088076n969054j2977997
1505g574745k3087577j2771396J0634441J7647198P815267P826846J7644130P556319
$$ plain form
1556 -13914443 36874939 70726889 63556870 36313447 8942932 -21445894 -49687281
1549 -49687281 -51398780 -20335322 16172785 37119481 52648672 71427899 76514070
1542 76514070 57430509 34948356 25984919 13222056 -18623678 -45073840 -39046360
1535 -39046360 -21160904 -28116195 -48989100 -43254076 -13004329 -3239795 -27099305 -42969811
1527 -42969811 -21260865 10571383 12592454 -11977561 -30146363 -23452754 2628135
1520 2628135 33513307 50580708 38188917 2822180 -27431867 -33792405 -23418918
1513 -23418918 -8827366 8902618 26807814 32298159 22460382 11372306 5403252 -7574745
1505 -7574745 -30662322 -43433718 -32799277 -15152079 -7336812 490034 18134164 25690483
1497B5690483k2389129l1074852l025508K1637086J0289872j2774325j2729481
1490b4375854j369814q275818k4747985j9885997O072727K4814937K4382731J5334819
1482h050254L226636j1172831j3587626P319127L1248543K7353863O9623j8082502
1474A8324579j5010054o061548L643074K3189242L8721446J7139306l6604410
1467D3341635o6155855l4191344K4481897M9644083L0846520L317494j1814671
1460C9469759k3935889l6351456l2482375o507589K0406808K6462988J3568991
1453F31237k996050j2630080r440671Q752848L0704493L5276188J6585106o040398
1445F0842673j4262873j3911187j7995688k0139937n853267J7656278K7218903
$$ plain form
1497 25690483 3301354 -27773498 -30799006 -9161920 1127952 -11646373 -24375854
1490 -24375854 -25745668 -34021486 -58769471 -78655468 -72582741 -47767804 -23385073 -8050254
1482 -8050254 -4823618 -15996449 -29584075 -22264948 8983595 36337458 36407081 18324579
1474 18324579 3314525 -2747023 896051 24085293 62806739 79946045 43341635
1467 43341635 -22814220 -57005564 -32523667 17120416 47966936 51284430 39469759
1460 39469759 15533870 -20817586 -53299961 -59807550 -39400742 -12937754 631237
1453 631237 -2364813 -14994893 -24435564 -15682716 15021777 50297965 66883071 60842673
1445 60842673 46579800 32668613 14672925 -5467012 -11320279 6335999 33554902
1438C3554902J8256877R534784R460623K454452j9938578l7150119k7836176m443030
1430a6106265K649396j2327705k5004645j5425240J0236161L2795100L9151493
1423A5968295K6830931L420786j5883296k0949293j7580441j6273382j4161223
1416c8627623k528324J1678308J1697657j303180q106921l244955l308674j4275082
1408d8018794j5365757P348699L2423537L1160645R536125l089583J966311N983632
1400B1944815l135658j5227842j8415576j3704680m623820Q410204J7410387Q979763
1392A637593j3513123k5610338j1733368J1843420J6873097j017901j8515014
1385d0035634j3485538J2218831L7790349M3344752K4188632q030177l4181853
$$ plain form
1438 33554902 51811779 61346563 70807186 73261638 53323060 16172941 -11663235 -16106265
1430 -16106265 -13456869 -25784574 -50789219 -66214459 -55978298 -23183198 15968295
1423 15968295 42799226 46220012 30336716 9387423 -8193018 -24466400 -38627623
1416 -38627623 -41155947 -29477639 -17779982 -19083162 -27190083 -30435038 -33743712 -48018794
1408 -48018794 -63384551 -56035852 -23612315 7548330 17084455 13994872 15961183 21944815
1400 21944815 18809157 3581315 -14834261 -28538941 -33162761 -24752557 -7342170 1637593
1392 1637593 -11875530 -37485868 -49219236 -37375816 -20502719 -21520620 -40035634
1385 -40035634 -53521172 -41302341 -3511992 39832760 64021392 55991215 21809362
1378B1809362l9502396k1922516O326520K5825652K5345507J3268810P537228
1371C8688167J1233719Q488111q220331k0882037j2454727J290071q353907l5286111
1363b5497045m0563622q264800K9504975L7658932K2419859J0390993O058265
1356C1707557k270879r638727L0833K0432340K5276498O828330j3245735j6835196
1348D2285021j1005314r362946j1158857q269227J350916J3963523K1696195J2561957
1340E2061268j4910371l7446083k9975895m697823J375175j5513422j5909551
1333f5016702J7404527M2762584K0856941k0704345k8361649l735407R201705
1326b7592346L508116J3582252L9269842L3202981j4633063m3286894j1964617
$$ plain form
1378 21809362 -17693034 -39615550 -33289030 -7463378 17882129 31150939 38688167
1371 38688167 49921886 58409997 50189666 29307629 16852902 18142973 9789066 -25497045
1363 -25497045 -66060667 -74325467 -44820492 -7161560 15258299 25649292 31707557
1356 31707557 29436678 19797951 19828784 40261124 65537622 72365952 59120217 42285021
1348 42285021 31279707 21916761 10757904 2488677 3839593 17803116 39499311 52061268
1340 52061268 37150897 -295186 -30271081 -34968904 -33593729 -49107151 -65016702
1333 -65016702 -47612175 -4849591 16007350 -4696995 -33058644 -36794051 -27592346
1326 -27592346 -24084230 -10501978 28767864 61970845 47337782 4050888 -7913729
1319g913729K8238457R062814m5872692n2846423P367220O3817432N8352075J4599341
1311G4804495j4295765j7189259j4981289j5157783j0627228l928816l049572
1304d425217m125590l13895K071917m415186r781351L86508J9965253K8850196
1296B8212635K0546753O744474l005386j0295695j6456951j6099346n631141R743408
1288A3758751J9520993J4899549m255567k4762913k8719753j3922379J252776
1281b2228543K224995j216960P486016K0529404J2435687k0140310m4683123k9989635
1273g5582469J4006156M6347257M0880782J0763187j3041010j7087477j2395510
1266f109084j1930987j3105343o373917P641715J7783999J4905725j463522k2931302
$$ plain form
1319 -7913729 20324728 29387542 -16485150 -69331573 -61964353 1853079 60205154 74804495
1311 74804495 60508730 43319471 28338182 13180399 2553171 -1375645 -4425217
1304 -4425217 -8550807 -8864702 -6792785 -11207971 -20989322 -20602814 -637561 28212635
1296 28212635 48759388 55503862 52498476 42202781 25745830 9646484 4015343 13758751
1288 13758751 33279744 48179293 43923726 19160813 -9558940 -23481319 -22228543
1281 -22228543 -20003548 -21220508 -13734492 6794912 19230599 -909711 -45592834 -75582469
1273 -75582469 -61576313 -15229056 25651726 36414913 23373903 6286426 -6109084
1266 -6109084 -18040071 -31145414 -37519331 -29877616 -12093617 2812108 1348586 -21582716
1258b1582716l1648557j0889572K9138754M7361534J7516267k8772830l5389436
1251c4266556J725656K8409742J2305444j2431684m072319K2493731K7679051
1244D1843065J2141009M156325L990115q104201k1278765o831349K1381136J6953365
1236F4250700k0843221l6868902p265063J9368811n38672l6735731l6072359k644980
1228e7349417K1437688K6368657L3314862M0254745K2645917j5669828l9072092
1221C1930532l1213926j1386989K991631J3813740J8275774M993565j6310581
1214A3093746j6173632R465272K6468141J1666448j3133507j6781697m721715
1207I883056m505159k0735578k9703920j3818598J7158091L9075060L7752374
$$ plain form
1258 -21582716 -53231273 -64120845 -34982091 12379443 29895710 1122880 -34266556
1251 -34266556 -32540900 -4131158 8174286 -4257398 -8329717 14164014 41843065
1244 41843065 53984074 58140399 62130514 54026313 32747548 25916199 47297335 64250700
1236 64250700 43407479 6538577 -726486 18642325 18103653 -18632078 -54704437 -57349417
1228 -57349417 -35911729 -9543072 23771790 64026535 86672452 71002624 31930532
1221 31930532 716606 -10670383 -7678752 6134988 24410762 29404327 13093746
1214 13093746 -3079886 6385386 32853527 44519975 31386468 14604771 9883056
1207 9883056 5377897 -15357681 -45061601 -58880199 -41722108 -2647048 35105326
1200C5105326K0983523Q894547Q926921N221409j5022385l2370969j7348536J8879056
1192C3268892K9275777j901513l0626498j5397146K1290386K7339970l075312
1185F0174556k7196724j8864243K916991J2347002Q859159J823140p642729j6318934
1177A6098218j3180244J480946R176407l09932j0787247l106372J5295704K0557974
1169C5225454M934567j5728090k3716131j6396325k700958P281652Q446307L230358
1161E76834o28971J891382Q080098J2646890J4943132J7076220J6913524Q360847
1153G9859956r471431k5969334k6381066q610137J0157458J0819416l388246j0020091
1145A6996525J430066J4281530R910641n143523j2919861j3282968j8015025k3420881
$$ plain form
1200 35105326 56088849 64983396 73910317 79131726 64109341 31738372 14389836 33268892
1192 33268892 62544669 60643156 30016658 14619512 35909898 63249868 60174556
1185 60174556 32977832 14113589 17030580 29377582 38236741 40059881 32417152 16098218
1177 16098218 2917974 4398920 13575327 13265395 2478148 -628224 14667480 35225454
1169 35225454 40160021 24431931 715800 -15680525 -18381483 -11099831 -2653524 576834
1161 576834 -52137 1839245 9919343 22566233 37509365 54585585 71499109 79859956
1153 79859956 70388525 44419191 18038125 9427988 19585446 30404862 27016616 16996525
1145 16996525 18426591 32708121 42618762 37475239 24555378 11272410 -6742615 -30163496
1137c0163496j4994947K368650O746939m924136j1436131m084370J278908r68379
1129e6176962O703311K5640750K5004590o769045k9070152p285931K4961831J2638473
1121d353135k9965389l5612293J0697722M6126418K6394431r996493o976925K5353635
1113B1667971L5785748J0989152j6664567k4692192k0609994j1785083N468136
1106A59171K2898403J9045049q952560l5382068l7709183k0929004k304804J1621909
1098e1553087K2121119K5212229J5236086k956427j5760976j5307576o768632
1091b9777264M57293N162481J2526194J9493444J1593701j5749054l9696035l1029089
1083f7018329P039578L9079403M0327084K0774074J067627j3040960k1233510
$$ plain form
1137 -30163496 -45158443 -42789793 -36042854 -40966990 -52403121 -56487491 -55208583 -56176962
1129 -56176962 -49473651 -23832901 1171689 -5597356 -34667508 -41953439 -16991608 -4353135
1121 -4353135 -34318524 -69930817 -59233095 -13106677 13287754 3291261 -3685664 21667971
1113 21667971 57453719 68442871 51778304 27086112 6476118 -5308965 159171
1106 159171 23057574 42102623 33150063 -2232005 -39941188 -60870192 -63174996 -51553087
1098 -51553087 -29431968 -4219739 11016347 8059920 -7701056 -23008632 -29777264
1091 -29777264 -29319971 -24157490 -11631296 7862148 19455849 3706795 -35989240 -67018329
1083 -67018329 -59978751 -20899348 19427736 40201810 41269437 28228477 6994967
1076F994967j7587977o358202o969537k2988143k7874852n266753K0068703K1325814
1068c8655980J4897161K6697399L5860426N485312m2146205m4470102J899863
1061d0432126K5730843j2173548n7342135m4601972P791399L6207235K6739306
1054e8080998J6582042K2143496K2316867P494808m067025k314377J248191R01142
1046F224146M296440R171988L641718o917376l986848R606713J1393943L84771
1038C3815495J214534J7320700J8061704q353905k6049283n681102K2807598J1512539
1030F4648280k9595034m3486859r858878K6232363K1748535n828638j2234873
1023A1624896P305696J9000362P226055m813879L480894J7567377J3468989m064972
$$ plain form
1076 6994967 -10593010 -16951212 -23920749 -46908892 -74783744 -80050497 -59981794 -38655980
1068 -38655980 -23758819 2938580 38799006 44284318 2138113 -42331989 -40432126
1061 -40432126 -14701283 -26874831 -84216966 -128818938 -121027539 -84820304 -58080998
1054 -58080998 -41498956 -19355460 2961407 10456215 6389190 4074813 5323004 6224146
1046 6224146 10520586 19692574 23334292 16416916 12430068 22036781 33430724 33815495
1038 33815495 35030029 52350729 70412433 62058528 36009245 30328143 53135741 64648280
1030 64648280 35053246 -8433613 -18292491 7939872 29688407 23859769 11624896
1023 11624896 18930592 37930954 45157009 40343130 43824024 61391401 74860390 70795418
1015G0795418j1687896n000506j542577r198964j5929077j4639725j5374056k3527424
1007b6104807k6159793j3319952L567862R538953Q066338R337078J0070088L671442
999b1332791q61700Q381761K2050319J9962987J868719j3054212j5203612j2388628
991a0577157r298531l52049J4102182K3448777K2981196J8081370R263924r595628
983E8054084l3462554m3909396l2619237j3511262l407334j539931L801849J5898618
975e0695163K4091604J5844625o476433k1379826r208906J9274921L0099935J1339228
967A2889985q177136k666601J0313632J553443j7760092j4394092Q557002J5703483
959F019624j879778j7060163j7403389j8722042k1546467l727277K9777704L9324802
$$ plain form
1015 70795418 59107522 54107016 52564439 43365475 27436398 12796673 -2577383 -26104807
1007 -26104807 -52264600 -65584552 -62016690 -52477737 -44411399 -35074321 -25004233 -21332791
999 -21332791 -22194491 -13812730 8237589 28200576 30069295 17015083 1811471 -10577157
991 -10577157 -19875688 -20227737 -6125555 17323222 40304418 58385788 67649712 58054084
983 58054084 24591530 -19317866 -51937103 -65448365 -68855699 -70395630 -66593781 -50695163
975 -50695163 -26603559 -10758934 -17235367 -38615193 -47824099 -28549178 1550757 12889985
967 12889985 4712849 2046248 12359880 13913323 -3846769 -18240861 -9683859 6019624
959 6019624 4139846 -12920317 -30323706 -49045748 -70592215 -74319492 -44541788 -5216986
951e216986J2833618j2024049j0700893p299970j9223967j9021460J0026825L0792515
943a9834367J2597089j0946807J052256K3214305R624325k2008044k1802454K890108
935b5213589M838086j2760767l140198L1095255L3371304q328786l5343762j2594675
927b8077132J9774283J7594325n140691j7432211k0750257k3094429j1434790
920f8560902J4957037K6365477J1556211L947784K4956139M2002552K0891526
913G6115824j7374982l2557957k4790070j7246716r823157O694313J6309661J676418
905i96666j8423201j6607490k785827l095991j2552344r452605J443790K472360
897e9997974L013788K1769806M3157230L6843806J0207015l910708k702343r880981
$$ plain form
951 -5216986 7616632 -4407417 -15108310 -22408280 -41632247 -60653707 -50626882 -19834367
943 -19834367 -7237278 -18184085 -17131829 6082476 15706801 -6301243 -28103697 -25213589
935 -25213589 -20375503 -33136270 -36276468 -5181213 28190091 19861305 -15482457 -28077132
927 -28077132 -8302849 9291476 4150785 -13281426 -34031683 -57126112 -68560902
920 -68560902 -53603865 -27238388 -15682177 -11734393 13221746 55224298 76115824
913 76115824 58740842 26182885 1392815 -15853901 -25677058 -18982745 -2673084 -996666
905 -996666 -19419867 -36027357 -38813184 -41909175 -54461519 -63914124 -62470334 -59997974
897 -59997974 -56984186 -35214380 7942850 44786656 54993671 51082963 48380620 38499639
889C8499639k3561034j7609239N632595J3645336k73997o553264O394821J2866251
881B9041108j931250j6054733r859912N211299J3141060J6004295J5387724K984911
873E3924502j5368158j7141375K08212R825065k301645j5751344j2324245l928826
865b857814n240780p311782N77623Q273544N147462N47790M075663O575356q52748
856H934314r274616r641066o988789k948134J1423518L1049101L3359763J6077938
848G1992029P009346J5987359J2720499j9402535m4066792k5329441J0517665
841B9428130J2379599j7840752l3229453j4904334J0227894J8931874J4751301
834A9744259L520253j3019084j8876292J355586K7569817K3090338q127585k3163685
$$ plain form
889 38499639 14938605 -2670634 2961961 16607297 16333300 9780036 16174857 29041108
881 29041108 27109858 11055125 1195213 6406512 19547572 35551867 50939591 53924502
873 53924502 38556344 21414969 21623181 31448246 29146601 13395257 1071012 -2857814
865 -2857814 -8098594 -15410376 -14832753 -6559209 -1411747 -863957 3211706 9787062 8934314
856 8934314 -340302 -9981368 -16970157 -19918291 -8494773 22554328 55914091 71992029
848 71992029 79001375 94988734 107709233 88306698 44239906 18910465 29428130
841 29428130 41807729 23966977 -9262476 -24166810 -13938916 4992958 19744259
834 19744259 23264512 10245428 -8630864 -7275278 20294539 43384877 35257292 12093607
826A2093607n301089J3832872R234640j249541M862670J5990191J0511556q173443
818E1801463k4254164l4097579l6719014k2120254Q036295K8164289K0755331
811h433633L332357N49248O689841J412838j2632233j6984628j1548678j1203345
803d8818233j3590322j007972K4513722L6517813K1351620k784827j2376350n505774
795a700323N473272J0835990N057043j1574613k3805493j1379708J9590124L2720761
787B5217053O740222k9332623k9517573Q223378L9993572L4396080O926043j1006939
779E1639213j2768297j1004023j0501656p093597k818837k220849l1124Q966323
771A4167153J3777362J525373j6078727j4485543N069209J4794846M306308j984244
$$ plain form
826 12093607 6792518 20625390 29860030 28610489 33473159 49463350 59974906 51801463
818 51801463 27547299 -6550280 -43269294 -65389548 -57353253 -29188964 -8433633
811 -8433633 -5101276 -4552028 2137813 3550651 -9081582 -26066210 -37614888 -48818233
803 -48818233 -62408555 -63416527 -38902805 -2384992 18966628 16181801 3805451 -1700323
795 -1700323 3772949 14608939 19665982 8091369 -15714124 -27093832 -7503708 25217053
787 25217053 31957275 2624652 -26892921 -18669543 21324029 55720109 62646152 51639213
779 51639213 38870916 27866893 17365237 10271640 7452803 5231954 5200830 14167153
771 14167153 27944515 29469888 13391161 -1094382 3974827 18769673 23075981 21091737
763B1091737J4547952L3824770K6862480M87265j4084861p904397k757492j3948065
755E8119389k8121209k4854887m981027J1475053R124828o381237j4776755m178576
747d574421J3557158J6397993K45882j7062724k0493705j2106278J596654J7359032
739e080409K4296579Q756903j8073563k2310659N652084L1705043K7008020Q565666
731F0519664K384613l655697k9114674m9000302k5681906K1067417L3847254M586854
723A4953223j7327213r118305m389562k1549064k5299734P652808L9482888L1061892
715A5466933N980129N519691J5983973k499387l8082332l8647664M913713M1616596
707A0251652L3281889J27275j9524364j9692376j8429987k2558921k0632210k672071
$$ plain form
763 21091737 35639689 69464459 96326939 96814204 82729343 74824946 72067454 58119389
755 58119389 29998180 5143293 162266 11637319 20762147 14380910 -395845 -4574421
747 -4574421 8982737 25380730 25626612 8563888 -11929817 -24036095 -22439441 -5080409
739 -5080409 19216170 27973073 9899510 -12411149 -6759065 24945978 51953998 60519664
731 60519664 62904277 59248580 30133906 -18866396 -44548302 -23480885 10366369 14953223
723 14953223 -2373990 -11492295 -15881857 -37430921 -62730655 -55077847 -15594959 15466933
715 15466933 21447062 26966753 42950726 40451339 2369007 -36278657 -31364944 10251652
707 10251652 43533541 43660816 24136452 4444076 -13985911 -36544832 -57177042 -59849113
699e9849113K4319959M0301023L2665478J3361364N582990R919235J692813k7498381
691D0495368m8021082l2552420J575167J7466051J0974167O966080J3353323J2928497
683B3185151p40826j0963289o035339N062580J0032612P083497o99491q545541
675A8379354r403933m793720q141820k0586983j8814604Q032020K7851880Q467882
667I90076k4467938j9580870J8090684L2714718Q382129p964259P800645J3247083
659B9212268k1234054m8259577j5659731L9824359M0078147j4938323m7376920
652c8353831j9428665J8377431J4345206r860561o881950J9067723K8126397J2738077
644A8129827L041524J2460119J9836772J0385687l62883L112263Q764553j129895
$$ plain form
699 -59849113 -35529154 4771869 37437347 50798711 56381701 66300936 67993749 40495368
691 40495368 -7525714 -40078134 -38502967 -21036916 -10062749 -3096669 10256654 23185151
683 23185151 22444325 11481036 5445697 10508277 20540889 27624386 26924895 18379354
675 18379354 8975421 4181701 -3960119 -24547102 -43361706 -35329686 -7477806 990076
667 990076 -23477862 -43058732 -24968048 7746670 16128799 8164540 15965185 29212268
659 29212268 7978214 -40281363 -55941094 -16116735 23961412 9023089 -38353831
652 -38353831 -57782496 -39405065 -25059859 -34920420 -41802370 -22734647 5391750 18129827
644 18129827 21171351 33631470 53468242 63853929 63491046 66603309 75367862 74237967
636G4237967j8520779k1698057r035763M96074l149655r815726p146293N716792
628A1084560K1995120L0366781J7456458j4502036l6386020k3104944N440955
621A2350874N678275k2916961l1074346M493377M0229059L0999511j374661p765381
613C0619747R038253O984551k0063034l5874135k6510406j7227333j9989611j5108774
605h8130742L714140J3588911O764983O070390J8651700J8709852k039865j0714112
597c3384743J2662534L8616112L6975082K2952299J8968003Q906994k5246836
590H0449445n3389668l5700580R604410K8866636J1275031n746700l135081j009446
582C1214047r958563j0315718O328122J5411440q50194k2044075j9627042J666690
$$ plain form
636 74237967 55717188 34019131 24983368 25479442 22329787 12514061 5367768 11084560
628 11084560 33079680 63446461 80902919 66400883 30014863 6909919 12350874
621 12350874 18029149 -4887812 -35962158 -31468781 8760278 39759789 38385128 30619747
613 30619747 39658000 46642551 26579517 -9294618 -35805024 -53032357 -73021968 -88130742
605 -88130742 -84416602 -70827691 -64062708 -57992318 -39340618 -20630766 -22670631 -33384743
597 -33384743 -20722209 17893903 54868985 77821284 96789287 105696281 80449445
590 80449445 27059777 -8640803 963607 29830243 41105274 35358574 32223493 31214047
582 31214047 21255484 10939766 17267888 32679328 31829134 9785059 -9841983 -8175293
574h175293J3013543J402213j6067899j5776437K781809J4748140J100210k1282421
566b8256135j7189384J4629295L1034213L739723l4861871l3495645P811839M3018702
558a3569263M4463490K5450770L448538k0232187l9334033l6570041j0970551
551d7313277J3871299J9064316Q392222o743870j8170402j4148459J2405866M2449575
543I807270M2536726P583407k9066550l6725405j9252997M67781P706711O09809
535a6333248j2811065j5603408K451060K5935383K9050349J1073042n233046j0597026
527G932041j7028932k5612820j8639407N772238K1669688J2640521n303469j2601498
519c1171638j1573945p879387N570795K6757989L2641910J1828380j2994845j8054487
$$ plain form
574 -8175293 4838250 6240463 -9827436 -25603873 -22822064 -8073924 -6973714 -28256135
566 -28256135 -45445519 -30816224 217989 3957712 -30904159 -64399804 -56587965 -13569263
558 -13569263 30894227 56344997 59793535 39561348 227315 -36342726 -47313277
551 -47313277 -33441978 -14377662 -5985440 -12729310 -30899712 -45048171 -32642305 9807270
543 9807270 52343996 59927403 30860853 -5864552 -25117549 -24649768 -16943057 -16333248
535 -16333248 -29144313 -44747721 -42296661 -16361278 12689071 23762113 18529067 7932041
527 7932041 -9096891 -34709711 -53349118 -47576880 -25907192 -13266671 -18570140 -31171638
519 -31171638 -42745583 -50624970 -45054175 -18296186 14345724 26174104 13179259 -4875228
511d875228j2946059j7619769k4409864j1724997J6671424L3510918K3848275
504B454700j124233k1077804k2582776n455352J5079786K1579297J7012846J9383679
496B5270143K8498743K2327145k987199j9351426j1285363l046647j5906027k9686945
488f167576k0021218m479337j0017747j8891549L466589M1864504M6484604J0781345
480D3019615j8303369j3213102O51865k998093j1313455n193878N182060K665730
472D97373o545215q178102m467831l841667m000630j801006l121488q529389o213642
463d6201597P128587J5772602R234658m30780l71332J599196n662689j3935060
455c2866415r867536P07910L226431K84948O492419K1941461L0005765K1635655
$$ plain form
511 -4875228 -17821287 -35441056 -59850920 -71575917 -54904493 -21393575 2454700
504 2454700 1330467 -19747337 -42330113 -47785465 -32705679 -11126382 5886464 25270143
496 25270143 53768886 76096031 73108832 53757406 42472043 39425396 23519369 -6167576
488 -6167576 -26188794 -30668131 -40685878 -59577427 -56110838 -14246334 32238270 43019615
480 43019615 24716246 11503144 12155009 9156916 -2156539 -7350417 -2168357 497373
472 497373 -6047842 -14225944 -18693775 -22535442 -26536072 -28337078 -31458566 -39987955 -46201597
463 -46201597 -39073010 -23300408 -14065750 -14496530 -14867862 -13268666 -18931355 -32866415
455 -32866415 -42733951 -42026041 -38799610 -38514662 -32022243 -10080782 19924983 41560638
447D1560638O424694l033651o205729r812677j5246570j6438124r710922k303676
439a4766017n387792j6096406j5305517O428222K8343355K2073532p652056k5280267
431b7642946j0890134J5812894K5760544J5706321J556339o794203r384226p422433
423c297844n043399j0341379k1928967k3397565l519349K6012477M4158034M3535822
415D6177830K9771816Q778659j2121628k0453183j1763791P7945J50283o457398
407C4160533n359477K305134K816026o636601j4804180j4983443j0494505k724582
399a5721095R497699J8191229J1401259o570571j6569804j1368473m983549p726011
391b3849316q222115O643999K6200044K7741370Q827243r373525j2194241r146231
$$ plain form
447 41560638 47985332 44951681 38745952 28933275 13686705 -2751419 -12462341 -14766017
439 -14766017 -20153809 -36250215 -51555732 -45127510 -16784155 5289377 -2362679 -27642946
431 -27642946 -38533080 -22720186 3040358 18746679 20303018 13508815 4124589 -3297844
423 -3297844 -8341243 -18682622 -40611589 -64009154 -67528503 -41516026 2642008 46177830
415 46177830 75949646 84728305 72606677 52153494 40389703 40467648 40617931 34160533
407 34160533 28801056 31106190 33922216 27285615 12481435 -2502008 -12996513 -15721095
399 -15721095 -6223396 11967833 23369092 16798521 228717 -11139756 -16123305 -23849316
391 -23849316 -32071431 -25427432 772612 28513982 37341225 27967700 15773459 6627228
383F627228j3977545j9530067p336774K0951303L8122793K4047008p608098k6245870
375A5049978k0950815p108670l73805k24410q77332j869270j091369P984478K2339326
366A2878111K5428940R276947j0100021j3077732l389728O38523n155048q378339
358H121653l275898J648053J39624l413986m790886n621361n807108l140090k215067
349a8355066r231479j5343678k589826K6525749M2993338K7350943k554802j5488192
341C3306987p464792Q331m576954j0472748q192824m372650n475921l415910R692971
332i63510K3192418J9763966J550399j0887562p139831j77578m037633j0627475
324A0673194l111455J3023632J1418525j6718121m2177675l1471630P247635L1744937
$$ plain form
383 6627228 -7350317 -26880384 -34217158 -13265855 24856938 48903946 41295848 15049978
375 15049978 -5900837 -13009507 -13383312 -13607722 -14485054 -16354324 -17445693 -9461215 12878111
366 12878111 38307051 47583998 37483977 24406245 21016517 21655040 16499992 8121653
358 8121653 4845755 6493808 6633432 3219446 -1571440 -7192801 -12999909 -16139999 -18355066
349 -18355066 -27586545 -42930223 -45520049 -18994300 23999038 51349981 48795179 33306987
341 33306987 25842195 25850526 21273572 10800824 2608000 -1764650 -7240571 -10656481 -963510
332 -963510 22228908 41992874 43543273 32655711 25515880 25338302 21300669 10673194
324 10673194 7561739 20585371 32003896 15285775 -26891900 -58363530 -51115895 -19370958
316a9370958J9565634o185148j3609249n011294m210401j3685631j1395154R849837
308d4052364K6850511K0418947L295533k850911m12750l788682p624313M600933
300c563096K5097886K6037253L957613j0256496J607017J5964305N551375j7005174
292D7390683k1119849p272252k231997j3025239j8576673q098075K929753K527078
284a7476571J059889Q253302J3477783M024325j2989314k1230162j5899988k976611
276d3757347J0541441J5986479N408539j4635222k3489347j1111226Q868724J9682240
268c2505719K1177127J8964156J0498289l177851p405869N860058K0234213J6536432
260E0180836J316884o166945m746988o405086r322781j581919J2490990J5515424
$$ plain form
316 -19370958 194676 -5990472 -19599721 -24611015 -28821416 -42507047 -53902201 -44052364
308 -44052364 -17201853 3217094 6512627 3661716 3248966 -539716 -8164029 -3563096
300 -3563096 21534790 47572043 51529656 41273160 42880177 58844482 64395857 47390683
292 47390683 26270834 18998582 16766585 3741346 -14835327 -22933402 -20003649 -17476571
284 -17476571 -16416682 -8163380 5314403 9338728 -3650586 -24880748 -40780736 -43757347
276 -43757347 -33215906 -17229427 -11820888 -26456110 -49945457 -61056683 -52187959 -32505719
268 -32505719 -11328592 7635564 18133853 14956002 7550133 13410191 33644404 50180836
260 50180836 51497720 45330775 40583787 34178701 24855920 23274001 35764991 51280415
252E1280415N886785j077973j287965n810539j3748224q117017J2679639K4298271
244F4103392J0937779r861835j2840073m37609M032741j0183478k8808464l0171722
236a3229269p930059K0960439K9883678J0486746j5267518k1128496r658041l081807
228h964327o436939m312360N742583O387528m855878m866618J5040479K6773575
220B4508043O334239k5657724l0962678n300698K2493439L0181896J7391835o286446
212C2701906k4612975j8693252P382874J8194706p918817l9525835l1760306O319424
204e7912275K5019006R814428k494893J0780495K3985296J2286060o926946q361558
196F189613o88819l608234r786538k231159J0355062Q152217m544244r785371
$$ plain form
252 51280415 57167200 56089227 54801262 48990723 35242499 27125482 39805121 64103392
244 64103392 75041171 65179336 52339263 51901654 55934395 45750917 16942453 -13229269
236 -13229269 -21159328 -198889 29684789 40171535 24904017 3775521 -5882520 -8964327
228 -8964327 -15401266 -19713626 -13971043 -7583515 -12439393 -17306011 -2265532 24508043
220 24508043 30842282 5184558 -25778120 -31078818 -8585379 21596517 38988352 32701906
212 32701906 8088931 -10604321 -3221447 14973259 7054442 -32471393 -64231699 -57912275
204 -57912275 -32893269 -23078841 -25573734 -14793239 9192057 21478117 14551171 6189613
196 6189613 5500794 1892560 -7893978 -10125137 229925 8382142 3837898 -5947473
188e947473r451464j6696457k3617078j1172517J3124422K1029753P341743m064568
180b9453639q64244L104853L49385L992621J6789765J6830321o550143k8451650
172b4252731k2976026j562034P921120L695617M339207J2169030J2151782L306277
164e207758K296568J2599049J5185016j686821k2632429k5404970p864363J3617838
156a9097870K2389630J2466813q117515j9796500q470973J4603100K1823089M294677
148B0094451j5531003j5117557j350250N023045J852195L153806J1048237J2067668
140B1240592K171445m893170n01745M692907m75630q428154n398877O040662J1616409
131B6064439P609661L509587L310231q34097j2399458k1056561j7155004n793159
$$ plain form
188 -5947473 -15398937 -32095394 -55712472 -66884989 -53760567 -32730814 -25389071 -29453639
180 -29453639 -30317883 -27213030 -26863645 -22871024 -6081259 10749062 4198919 -24252731
172 -24252731 -47228757 -48790791 -40869671 -37174054 -32834847 -20665817 -8514035 -5207758
164 -5207758 -2911190 9687859 24872875 23186054 553625 -24851345 -32715708 -19097870
156 -19097870 3291760 15758573 7641058 -12155442 -20626415 -6023315 15799774 20094451
148 20094451 4563448 -10554109 -11904359 -6881314 -5029119 -1875313 9172924 21240592
140 21240592 23412037 18518867 18017122 22710029 22234399 13806245 8407368 14448030 26064439
131 26064439 33674100 37183687 40493918 39659821 27260363 6203802 -10951202 -16744361
123a6744361K831065Q712745J5558369J5550297k163432k7464735l2429484p083835
115d3233371K2882014K7313114R539871l105736R70017P904620P078746O837281
107C6186556J4087190J7828685O921544r430883j4867430j0211076p985399r255132
99B3274055m839526K735751o52213j4438426j7040308K976644K4802035K0798668
91C7616680m677468k0509321j1480149K985145n27035j5393745j6247640K646332
83b5587201J8265932J1512918o039473r203486N661267J7202511R378083q904363
75A2286188j8648057j4228278m908349l22350k022079n184048k911944P543119
67b8395798J8810192J8593334M813280j0417672j5892246j2636100n704233M331954
$$ plain form
123 -16744361 -13913296 -5200551 10357818 25908115 23744683 -3720052 -36149536 -43233371
115 -43233371 -20351357 6961757 16501628 13395892 14365909 22270529 29349275 36186556
107 36186556 50273746 68102431 75023975 65593092 50725662 40514586 32529187 23274055
99 23274055 18434529 21170280 20518067 6079641 -10960667 -7984023 16818012 37616680
91 37616680 32939212 12429891 949742 3934887 3407852 -11985893 -28233533 -25587201
83 -25587201 -7321269 4191649 -1847824 -11051310 -5390043 11812468 21190551 12286188
75 12286188 -6361869 -20590147 -25498496 -25820846 -27842925 -33026973 -35938917 -28395798
67 -28395798 -9585606 9007728 13821008 3403336 -12488910 -25125010 -30829243 -26497289
59b6497289J3630154J1382549k905247r862628M292883K1814956J5196322r797945
51A7253755j8858377O76637K0809664J4277391p958342j6647406m983871R062853
43A3632304J1368295N247441K10822l7220Q62029l790018j4803018k0767420r836944
34a7913729R634556J4108998l070312k0131697j7493048l837353K524336K668899
26c3509350Q294407J6016671J2629008m23442q619460o730559j476130L618209
18a0200646P933641M301838r753040j7330100k332387K0369214K2054732N099058
10B0142310m98107J2170013J4884837o565119k6565111k1937429q240742q645591
2b5254939j3875796l742525
$$ plain form
59 -26497289 -12867135 -1484586 -4389833 -14252461 -9959578 11855378 27051700 17253755
51 17253755 -1604622 -927985 19881679 34159070 26200728 9553322 4569451 13632304
43 13632304 25000599 30248040 30458862 30421642 31283671 27493653 12690635 -8076785 -17913729
34 -17913729 -8279173 5829825 2759513 -17372184 -34865232 -38702585 -36178249 -33509350
26 -33509350 -25214943 -9198272 3430736 3007294 -5612166 -12342725 -13818855 -10200646
18 -10200646 -2267005 2034833 -7718207 -25048307 -27380694 -7011480 15043252 20142310
10 20142310 19644203 31814216 46699053 40133934 13568823 -8368606 -16609348 -25254939
2 -25254939 -39130735 -42873260
0d2873260
$$ plain form
0 -42873260
$$ Imaginary data points
##PAGE= N=2
##DATA TABLE= (X++(I..I)), XYDATA
65535g735344J3282332L126404P037615J5182228O152138j1074905r093943J0598073
65527B7474598J7612165P62687j6492354j5103140n947929n324872q988836m647769
65519a0655450P286767J8428630K4347113K1753449P205713j1872965j8511498
65512C7981759q940677j067924q985616k1539224j9349761k360725J3756615J9724474
65504I218921J6429031M164488j5418712l0478821k7838130j0239588P181055
65497d6981756J5682476J6385355Q887255p313456j9985696j0841215J8181611
65490b5985426L9488133L0736380K062450j7572133j5086462l819605j768033
65483H055304r704467j4276153o910463O304127J3195531Q987053j714744j2271651
$$ plain form
65535 -7735344 5546988 8673392 15711007 30893235 37045373 25970468 16876525 27474598
65527 27474598 45086763 45849450 29357096 14253956 8306027 2981155 -6007681 -10655450
65519 -10655450 -3368683 15059947 39407060 61160509 68366222 56493257 37981759
65512 37981759 29041082 27973158 18987542 -2551682 -21901443 -24262168 -10505553 9218921
65504 9218921 25647952 29812440 14393728 -16085093 -43923223 -54162811 -46981756
65497 -46981756 -31299280 -14913925 -6026670 -13340126 -33325822 -44167037 -25985426
65490 -25985426 13502707 44239087 46301537 28729404 13642942 9823337 8055304
65483 8055304 -1649163 -15925316 -22835779 -16531652 -3336121 5650932 3936188 -8335463
65475h335463j7119825j0453460P673772K3006057J7962581l284509j4344453
65468d895300j673831J3849565O831740j3143500j5100159N827491K1100109J1768987
65460B4565102o400244j0048286K90487P934790L235000j2288809l0717333l6796187
65452f0225480j7865211J4183281K7423291R808078j2080849r973476P667627
65445d1062739J4209538N678647k025860m401685q350928q596015N180751K0081626
65437a9286665J0963224j6672672k6453187l738273K1100585J7837283j074744
65430a7324449m665856R493797J7815706R377625k834184o483696m776027m347571
65422c744655l762245N86455O488113R067305P496402N092405L831788N95409
$$ plain form
65475 -8335463 -25455288 -35908748 -28234976 -5228919 12733662 9449153 -4895300
65468 -4895300 -6569131 7280434 14112174 968674 -14131485 -8303994 12796115 24565102
65460 24565102 18164858 8116572 8407059 16341849 19576849 7288040 -23429293 -60225480
65452 -60225480 -78090691 -63907410 -36484119 -26676041 -38756890 -48730366 -41062739
65445 -41062739 -26853201 -21174554 -23200414 -27602099 -35953027 -44549042 -39368291 -19286665
65437 -19286665 -8323441 -24996113 -51449300 -55187573 -34086988 -16249705 -17324449
65430 -17324449 -21990305 -12496508 5319198 14696823 11862639 5378943 602916 -3744655
65422 -3744655 -7506900 -6920445 -432332 8634973 16131375 21223780 25055568 25650977
65414B5650977q632354j9475134j9615955n423696P378128J944905j3774909j5696889
65406d7644927R63702J4204698R370728L40297L897660J1586727O237038o694043
65398g738120p015491O941562J5041349N469356j0352795j6261445j0113427K60133
65390b3768878Q171558J0244340N952526o28471l724012k108761J220553L618217
65382a022928K399438n243671j4664242j2679808M505950J8343083Q902311j3994881
65374a3454748k0113779j805657J3571824L991264j4363796j2272623Q678687
65367c5768828K1140516J5454726J1447136K1092358K4378070L86697l3531379
65360B4599296l8849571q729045K1018792J9950555n0190r420697m236878l690312
$$ plain form
65414 25650977 17018623 -2456511 -22072466 -27496162 -20118034 -18173129 -31948038 -47644927
65406 -47644927 -46681225 -32476527 -23105799 -22765502 -18867842 -7281115 -1044077 -7738120
65398 -7738120 -14753611 -7812049 7229300 12698656 2345861 -13915584 -24029011 -23768878
65390 -23768878 -15597320 -5352980 599546 -28925 -3752937 -5861698 -4641145 -1022928
65382 -1022928 1376510 -3867161 -18531403 -31211211 -26705261 -8362178 540133 -13454748
65374 -13454748 -33568527 -35374184 -21802360 -17811096 -32174892 -44447515 -35768828
65367 -35768828 -14628312 826414 12273550 33365908 57743978 58130675 24599296
65360 24599296 -14250275 -22979320 -1960528 17990027 17939837 8519140 4282262 591950
65352E91950j4536746k2264714j6229712k145860J2424446K5363724K9828828
65345A3031916J7672671r23376k638440J4475887K2725251M250222k1641023k7927416
65337A9025692j7969590j2678710j5073392j2703563n083341k489124k771191
65330d9743219N301147J7309921J5724721j370587j4948380j0908564O259355
65323c2375606K5637909L7495161L0319848J803724k6446323k7782834p023293
65316A628586M861961l498069r228896M948250K2660154K1422077O459677k363018
65308D6890722j520481j789616n705453n449027K151268J1808774J6402387R363627
65300G2152201j0902398l1043648k9092975k018924K3973436K3208569R57617
$$ plain form
65352 591950 -13944796 -36209510 -52439222 -54585082 -42160636 -16796912 13031916
65345 13031916 30704587 29781211 27142771 41618658 64343909 68594131 46953108 19025692
65337 19025692 1056102 -11622608 -26696000 -39399563 -44482904 -46972028 -49743219
65330 -49743219 -44442072 -27132151 -11407430 -12778017 -27726397 -38634961 -32375606
65323 -32375606 -6737697 30757464 61077312 62881036 36434713 8651879 1628586
65316 1628586 6490547 2992478 -6236418 -1288168 21371986 42794063 49253740 46890722
65308 46890722 45370241 43580625 37875172 32426145 34577413 46386187 62788574 72152201
65300 72152201 61249803 30206155 1113180 -905744 23067692 46276261 47233878
65293D7233878j8330499k2993364j9552051j4552935p960032j336922J555896
65286c5936029J405222J109302j6873k032573j99969O454949R534224L814665
65278a5867082k292588N26452P231270P620145K918949N50343J39921j610048
65270g82638J37827R473499J6952516J1693111m81621p612507j2360898k2224847
65262e205558k6533413q437372K2561510L6865809K6062868J1820952Q237752
65255F5372548K734462j4567966k8638246k3742896r058165j613753q87556J006394
65247i395178K38019o518457n503558J3813482L2675571K4524014l426423j8505447
65239B7902023j1051889m707078j3741039k0717154r937048L772147L04894j1178463
$$ plain form
65293 47233878 28903379 5910015 -13642036 -28194971 -36155003 -37491925 -35936029
65286 -35936029 -34530807 -33421505 -33438378 -35470951 -35670920 -29215971 -19681747 -15867082
65278 -15867082 -18159670 -17633218 -10401948 -2781803 137146 687489 827410 -782638
65270 -782638 -644811 8828688 25781204 37474315 36992694 29380187 17019289 -5205558
65262 -5205558 -31738971 -40176343 -17614833 19250976 45313844 57134796 65372548
65255 65372548 68107010 53539044 24900798 1157902 -7900263 -9514016 -10401572 -9395178
65247 -9395178 -9157159 -15675616 -21179174 -7365692 25309879 49833893 46407470 27902023
65239 27902023 16850134 12143056 -1597983 -22315137 -32252185 -28480038 -28175144 -39353607
65231c9353607o778679J4612135L1172487K9236937J4117483n455970k3193639
65224A4357147k8029444j2449463J0388695J7389270O292843l036036p70307J340379
65216E483084l031988m99366J5895472K8038604J8752929r60342j0872631j2573195
65208D0232567j8967025k5475233j7612984L42355J0004441P700413M137444j46845
65200B15133j2149723k2019452j1237982J3229525K3544289J4466638J0223525
65193A6271953J9454571J7949850p147169k8707352j9390915O143219J5700420
65186B0274577N734571m064468n691954n112174k541702L988228O453951J276623
65178B0317652K704006J7533879K2305127m014237l8066320l8498466o766893
$$ plain form
65231 -39353607 -46132286 -31520151 -347664 28889273 43006756 37550786 14357147
65224 14357147 -13672297 -26121760 -15733065 1656205 7949048 4913012 4142705 5483084
65216 5483084 2451096 1951730 17847202 45885806 64638735 63678393 52805762 40232567
65208 40232567 21265542 -4209691 -21822675 -21480320 -11475879 -3775466 361978 215133
65200 215133 -11934590 -33954042 -45192024 -31962499 -8418210 6048428 16271953
65193 16271953 35726524 53676374 46529205 17821853 -1569062 4574157 20274577
65186 20274577 26009148 21944680 16252726 11140552 8598850 12587078 19041029 20317652
65178 20317652 23021658 40555537 62860664 58846427 20780107 -17718359 -24485252
65171b4485252J5980824J0673514L17051M224611J0576333N910933k197819p127430
65163A3872765j7553653l2348036k9188846J70502K6799696K1376383l359852
65156b0231041j2087959L215255J8057785J4298646R26921n075103j047664L517381
65148A574221K026936j559893J433614J1530612J6838147P257077r864862j7981821
65140A1254031j3266393n759818k31866P764155J6000042J4715077N480920J294555
65132C7250703K905094k723925j3429923q264013J3737624K0115076p423522l8167164
65124C999950l4600802p899771L968456k619510N48814J6997122J7719095m018826
65116e905472j4148338P589657L1434747K2639203n395558j5076679l318931p83832
$$ plain form
65171 -24485252 -8504428 2169086 2486137 6710748 17287081 23198014 21000195 13872765
65163 13872765 -3680888 -36028924 -65217770 -65047268 -38247572 -16871189 -20231041
65156 -20231041 -32319000 -29103745 -11045960 3252686 4179607 -895496 -1943160 1574221
65148 1574221 3601157 2041264 3474878 15005490 31843637 39100714 29235852 11254031
65140 11254031 -2012362 -7772180 -8004046 -239891 15760151 30475228 35956148 37250703
65132 37250703 40155797 37431872 24001949 15737936 29475560 49590636 42167114 3999950
65124 3999950 -30600852 -38500623 -34532167 -37151677 -36602863 -19605741 -1886646 -5905472
65116 -5905472 -20053810 -12464153 18970594 41609797 36214239 21137560 17818629 17034797
65108A7034797j8902720l2000002j7911710J0408075K5904943K1690801J0674249
65101A6898433L166955p53319k562973j599846J365466N030516J0199230J4936928
65093D6681390J0885900o386526k5611027k9259269j5329437Q74890Q239444J0870017
65085I65382J3490030R995881l226364j4234135j0295115J144072J782073j0315627
65077a0693803j8424515j2517137k085892L74559l553455l993395K604616J0868230
65069c7420792J4139490J0842631N186347J804207j114154q416778j5056341o818273
65061c6853663J7265868L4803979K7344352P764109P06640M152872l580422k1968616
65053B9635119k4405197j890357J9278289J6148842m05888r498293j0967539j3323591
$$ plain form
65108 17034797 -1867923 -33867925 -51779635 -41371560 -15466617 6224184 16898433
65101 16898433 20065388 19312069 16749096 15149250 16514716 21545232 31744462 46681390
65093 46681390 57567290 51180764 25569737 -3689532 -19018969 -18144079 -9904635 965382
65085 965382 14455412 24451293 21224929 6990794 -3304321 -2160249 -378176 -10693803
65077 -10693803 -29118318 -41635455 -43721347 -43346788 -46900243 -50893638 -48289022 -37420792
65069 -37420792 -23281302 -12438671 -7252324 -5448117 -6562271 -14979049 -30035390 -36853663
65061 -36853663 -19587795 15216184 42560536 50324645 51031285 55184157 51603735 29635119
65053 29635119 5229922 3339565 22617854 38766696 38360808 28862515 17894976 4571385
65045D571385j1518300Q62036J2281767Q305204m792926j0858057q280628n575441
65037a5004960k958663L331323Q208947P094354P244705J1424528L951612k3275782
65029A6064m3348853k3298156K4473682N0908275L2849817j031214j3328705j925422
65021B5315488R788140O924076o051230j6734834j6756385q605165m275762j0916853
65013b1312525j9147556j4961334k72309J0492432J1311104Q139429M219148k356046
65005b3887657p396948l358441N802784P789226J201811k506134L250803J3932804
64997e171752K3745563K7403872J5910967j1371070l3533848k7816914j657481
64990a2490663J6019110J4403735P972421M574418m858028j9266606j9709453
$$ plain form
65045 4571385 -6946915 -6084879 6196888 14502092 9709166 -1148891 -9429519 -15004960
65037 -15004960 -17963623 -14632300 -6423353 671001 7915706 19340234 23291846 16064
65029 16064 -43332789 -66630945 -42157263 8751012 41600829 40569615 27240910 25315488
65021 25315488 35103628 42027704 35976474 19241640 2485255 -6119910 -10395672 -21312525
65013 -21312525 -40460081 -55421415 -55693724 -45201292 -33890188 -25750759 -21531611 -23887657
65005 -23887657 -31284605 -34643046 -28840262 -21051036 -19849225 -22355359 -19104556 -5171752
64997 -5171752 18573811 45977683 61888650 50517580 16983732 -10833182 -12490663
64990 -12490663 3528447 17932182 25904603 30479021 25620993 6354387 -13355066
64983a3355066o21146J6633088J5308498O098125M834173Q675882Q501896M917613
64975E0993063j161945j3008047k0952995n610313K6025216L4921613K690497
64968G3897089l5186048l5529755n057440J7449106J6779988N930597q686106
64961B9597431k8952608m0667248k5452323M188225J5430332J913651j0987802
64954e4930342q842920l875602l738788K133079J4621975J4008156p286719k5544286
64946g3455447j6627630J2304219L6677443M3711860L4280683J1493522j7206192
64939C1178458l7332238l8949800k3787114K566615L1364740M2009406J6773143
64932B3823210k5693627l7616528j769174L8745596L4876720k932639k3708761
$$ plain form
64983 -13355066 -13976212 2656876 17965374 24063499 28897672 37573554 46075450 50993063
64975 50993063 49831118 36823071 15870076 10259763 36284979 71206592 73897089
64968 73897089 38711041 3181286 -1876154 15572952 32352940 38283537 29597431
64961 29597431 644823 -40022425 -65474748 -61286523 -45856191 -43942540 -54930342
64954 -54930342 -63773262 -67648864 -71387652 -69254573 -54632598 -40624442 -47911161 -73455447
64946 -73455447 -90083077 -77778858 -41101415 2610445 36891128 48384650 31178458
64939 31178458 -6153780 -45103580 -68890694 -66324079 -34959339 7050067 23823210
64932 23823210 -1870417 -39486945 -41256119 -2510523 32366197 29433558 5724797
64925E724797q120191J2643409Q428425j2058112k2926123j5716056q45691Q895484
64917b3974058P056540k120481l684543J0597003K3710148J0717119k1860309
64910D41419l6659827j5660528J2822024J4064796n837408j5032793l384648J1649385
64902c7597580J8251725K0820551J8721328L015144j9763138k6135352q829340
$$ plain form
64925 5724797 -2395394 10248015 18676440 6618328 -16307795 -32023851 -32869542 -23974058
64917 -23974058 -16917518 -19037999 -22722542 -12125539 11584609 22301728 441419
64910 441419 -36218408 -51878936 -39056912 -24992116 -30829524 -45862317 -49246965 -37597580
64902 -37597580 -19345855 1474696 20196024 23211168 3448030 -22687322 -31516662
$$ [...]
##END NTUPLES=NMR SPECTRUM
##END=
