##TITLE=31Pdec_LR-713_CR8
 CDCl3, 124 sc
 9.7.2020
##JCAMPDX= 6.0         $$ Bruker NMR JCAMP-DX V2.0
##DATA TYPE= NMR SPECTRUM
##DATA CLASS= NTUPLES
##ORIGIN= UXNMR, Bruker Analytische Messtechnik GmbH
##OWNER= root
$$ XWIN-NMR		Version 3.5
$$ Thu Jul  9 10:32:18 2020 Russian Standard Time (UT+4h)  she@DPX200
##.OBSERVE FREQUENCY= 81.013821
##.OBSERVE NUCLEUS= ^31P
##.ACQUISITION MODE= SIMULTANEOUS
##.ACQUISITION SCHEME= undefined
##.AVERAGES= 124
##.DIGITISER RES= 17
##SPECTROMETER/DATA SYSTEM= spect
##.PULSE SEQUENCE= zgpg30
##.SOLVENT NAME= D2O
##.SHIFT REFERENCE= (INTERNAL, D2O, 0, 182.463)
##AUDIT TRAIL= $$ (NUMBER, WHEN, WHO, WHERE, WHAT)
$$ ##TITLE= Audit trail, XWIN-NMR		Version 3.5
$$ ##JCAMPDX= 5.01
$$ ##ORIGIN= Bruker BioSpin GmbH
$$ ##OWNER= she
$$ F:/spectra/data/she/nmr/P31/1/pdata/1/auditp.txt
$$ ##AUDIT TRAIL=  $$ (NUMBER, WHEN, WHO, WHERE, WHAT)
(   1,<2020-07-09 10:30:35.67 +0400>,<she>,<DPX200>,
      <continue with go, POWCHK disabled, PULCHK disabled
       configuration hash MD5:
       00 E9 B6 7A A2 85 ED C7 34 08 36 98 17 FE 4E 26
       data hash MD5: 32K
       F3 B3 F4 CE 75 AB E3 26 DD 95 C2 8D 44 03 4E 29>)
(   2,<2020-07-09 10:30:38.09 +0400>,<she>,<DPX200>,
      <Start of raw data processing
       efp BC_mod = 2 LB = 1 FT_mod = 6 PKNL = 1 PHC0 = -2679.024 PHC1 = 783.4021 SI = 64K 
       data hash MD5: 64K
       0D 3D 5B AF 39 27 84 8F C2 09 C1 CC F4 EE 7D CB>)
(   3,<2020-07-09 10:31:09.57 +0400>,<she>,<DPX200>,
      <pk PHC0 = 64.73265 PHC1 = -53.99998 
       data hash MD5: 64K
       2B CB FB E0 FB 55 02 3D 5C CE F5 93 4F 87 B4 FA>)
(   4,<2020-07-09 10:31:46.43 +0400>,<she>,<DPX200>,
      <pk PHC0 = 276.0057 PHC1 = -771.4005 
       data hash MD5: 64K
       6A 93 0E C8 36 13 30 0D 31 73 E3 AB E7 75 70 AA>)
$$ ##END=
$$ 
$$ hash MD5
$$ EB D7 98 B6 79 2A 5C 59 F3 B3 A6 5B 49 5F 43 BB
##$RELAX= 
##$RELAX= 
##$RELAX= 
##$RELAX= 
##$RELAX= 
##$RELAX= 
##$RELAX= 
##$RELAX= 
$$ Bruker specific parameters
$$ --------------------------
##$DU= <F:/spectra>
##$EXPNO= 1
##$NAME= <P31>
##$PROCNO= 1
##$TYPE= <nmr>
##$USER= <she>
##$AMP= (0..31)
100 100 100 100 100 100 100 100 100 100 100 100 100 100 100 100 100 100 
100 100 100 100 100 100 100 100 100 100 100 100 100 100 
##$AQSEQ= 0
##$AQ_mod= 1
##$AUNM= <au_zg>
##$AUTOPOS= <>
##$BF1= 81.014009
##$BF2= 200.13
##$BF3= 200.13
##$BF4= 200.13
##$BF5= 200.13
##$BF6= 200.13
##$BF7= 200.13
##$BF8= 200.13
##$BYTORDA= 1
##$CFDGTYP= 0
##$CFRGTYP= 5
##$CHEMSTR= <none>
##$CNST= (0..31)
1 1 145 1 1 1 1 1 1 1 1 1 1 1 1 1 1 1 1 1 1 1 1 1 1 1 1 1 1 1 1 1 
##$CPDPRG= <waltz16>
##$CPDPRG1= <>
##$CPDPRG2= <waltz16>
##$CPDPRG3= <>
##$CPDPRG4= <mlev>
##$CPDPRG5= <mlev>
##$CPDPRG6= <mlev>
##$CPDPRG7= <mlev>
##$CPDPRG8= <mlev>
##$CPDPRGB= <>
##$CPDPRGT= <>
##$D= (0..31)
0 1 0 0 0 0 0 0 0 0 0 0.03 2e-05 3e-06 0 0 0 0 0 0 0 0 0 0 0 0 0 0 0 0 
0 0 
##$DATE= 1594276055
##$DBL= (0..7)
120 120 120 11 120 120 24 19 
##$DBP= (0..7)
150 150 150 150 150 150 150 150 
##$DBP07= 0
##$DBPNAM0= <>
$$ [...]
##$SUBNAM2= <"">
##$SUBNAM3= <"">
##$SUBNAM4= <"">
##$SUBNAM5= <"">
##$SUBNAM6= <"">
##$SUBNAM7= <"">
##$SUBNAM8= <"">
##$SUBNAM9= <"">
##$SW= 369.568048894756
##$SWIBOX= (0..15)
0 1 3 0 0 0 0 0 0 0 0 0 0 0 0 0 
##$SW_h= 29940.119760479
##$TD= 32768
##$TD0= 1
##$TE= 0
##$TE2= 300
##$TE3= 300
##$TEG= 300
##$TL= (0..7)
0 120 53 12 22 120 120 120 
##$TP= (0..7)
150 150 150 150 150 150 150 150 
##$TP07= 0
##$TPNAME0= <>
##$TPNAME1= <>
##$TPNAME2= <>
##$TPNAME3= <>
##$TPNAME4= <>
##$TPNAME5= <>
##$TPNAME6= <>
##$TPNAME7= <>
##$TPOAL= (0..7)
0.5 0.5 0.5 0.5 0.5 0.5 0.5 0.5 
##$TPOFFS= (0..7)
0 0 0 0 0 0 0 0 
##$TUNHIN= 0
##$TUNHOUT= 0
##$TUNXOUT= 0
##$USERA1= <user>
##$USERA2= <user>
##$USERA3= <user>
##$USERA4= <user>
##$USERA5= <user>
##$V9= 5
##$VALIST= <valist>
##$VCLIST= <CCCCCCCCCCCCCCC>
##$VD= 0
##$VDLIST= <DDDDDDDDDDDDDDD>
##$VPLIST= <PPPPPPPPPPPPPPP>
##$VTLIST= <TTTTTTTTTTTTTTT>
##$WBST= 1024
##$WBSW= 4
##$XGAIN= (0..3)
0 0 0 0 
##$XL= 0
##$YL= 0
##$YMAX_a= 35750
##$YMIN_a= -28135
##$ZGOPTNS= <>
##$ZL1= 120
##$ZL2= 120
##$ZL3= 120
##$ZL4= 120
##$ABSF1= 0
##$ABSF2= 0
##$ABSG= 0
##$ABSL= 0
##$ALPHA= 0
##$AQORDER= 0
##$ASSFAC= 0
##$ASSFACI= 0
##$ASSFACX= 0
##$ASSWID= 0
##$AUNMP= <proc_1d>
##$AZFE= 0.1
##$AZFW= 0.5
##$BCFW= 0
##$BC_mod= 2
##$BYTORDP= 0
##$COROFFS= 0
##$CY= -3
##$DATMOD= 1
##$DC= 0
##$DFILT= <>
##$DTYPP= 0
##$F1P= 0
##$F2P= 0
##$FCOR= 1
##$FTSIZE= 65536
##$FT_mod= 6
##$GAMMA= 0
##$GB= 0
##$INTBC= 1
##$INTSCL= 5.30512e-09
##$ISEN= 30
##$LB= 1
##$LEV0= 0
##$LPBIN= 0
##$MAXI= 10000
##$MC2= 0
##$MEAN= 0
##$ME_mod= 0
##$MI= 50
##$NCOEF= 0
##$NC_proc= -8
##$NLEV= 6
##$NOISF1= 182.463
##$NOISF2= 159.3651
##$NSP= 0
##$NTH_PI= 0
##$NZP= 0
##$OFFSET= 182.463
##$PC= 4
##$PHC0= -2338.285
##$PHC1= -41.99841
##$PH_mod= 1
##$PKNL= yes
##$PPARMOD= 0
##$PSCAL= 0
##$PSIGN= 0
##$REVERSE= no
##$SF= 81.0140089999434
##$SI= 65536
##$SIGF1= 159.3651
##$SIGF2= -187.1042
##$SINO= 113.3802
##$SIOLD= 16384
##$SREGLST= <1H.CDCl3>
##$SSB= 0
##$STSI= 65536
##$STSR= 0
##$SW_p= 29940.119760479
##$SYMM= 0
##$S_DEV= 0
##$TDeff= 32768
##$TDoff= 0
##$TI= <>
##$TILT= no
##$TM1= 0
##$TM2= 0
##$TOPLEV= 0
##$USERP1= <user>
##$USERP2= <user>
##$USERP3= <user>
##$USERP4= <user>
##$USERP5= <user>
##$WDW= 1
##$XDIM= 65536
##$YMAX_p= 249869345
##$YMIN_p= -297328313
$$ End of Bruker specific parameters
$$ ---------------------------------
##NTUPLES= NMR SPECTRUM
##VAR_NAME=  FREQUENCY,     SPECTRUM/REAL,   SPECTRUM/IMAG
##SYMBOL=    X,             R,               I
##VAR_TYPE=  INDEPENDENT,   DEPENDENT,       DEPENDENT
##VAR_FORM=  AFFN,          ASDF,            ASDF
##VAR_DIM=   65536,         65536,           65536
##UNITS=     HZ,            ARBITRARY UNITS, ARBITRARY UNITS
##FACTOR=    0.456856943014862, 1,           1
##FIRST=     14782.0589164792, 0,            0
##LAST=      -15158.0608439998, 0,           0
##MIN=       -15158.0608439998, -297328313,  0
##MAX=       14782.0589164792, 249869345,    0
$$ Real data points
##PAGE= N=1
##DATA TABLE= (X++(R..R)), XYDATA
$$ [...]
6015 113223 -7481990 -19565486 -19403535 -6710343 4455310 9174504 14369121 18234589
6007 18234589 7407689 -19169112 -41385694 -43212566 -33110299 -27978901 -28381717 -23035986
5999 -23035986 -9610506 3138781 9406128 9921389 5068916 -3247188 -5870040 3843506
5991 3843506 15568689 11949278 -5540968 -16183798 -10221542 -3160150 -9951638 -19987043
5983 -19987043 -13888441 5142748 16780737 16032081 18201849 28908304 31372288 14292706
5975 14292706 -5727477 -5790110 11341424 24803168 27289166 29281909 34411616 31514880
5967 31514880 15513244 -1100168 -5398892 61140 5762899 8338604 7534788 699424
5959 699424 -10727816 -17713540 -14995592 -8247508 -2848295 4656077 14965699 17085385
5951 17085385 4232236 -9961038 -6730674 11372663 24644207 23573187 16458472 11198898
5943 11198898 5775796 -1248447 -5269587 -4188521 -535471 6917047 20952941 33488107
5935 33488107 30448873 14034145 5019402 14819163 29107960 29806877 20911099 18549155
5927 18549155 24275590 24540094 13506583 996147 -4130194 -6247249 -13330083 -22870124
5919 -22870124 -24628194 -15464446 -5538782 -6832998 -17564718 -23226164 -15056740 -1494787
5911 -1494787 4507195 3495420 4513754 6451951 -234666 -12191244 -11023473 9812840
5903 9812840 31297475 33901218 23928527 20201527 24270823 21932874 9565196 -558697
5895 -558697 -2659076 -7629425 -24266054 -43143991 -48036940 -36110299 -19571181 -11948320
5887 -11948320 -17919465 -32224291 -43069090 -39303408 -19552972 5494733 21800006
5880 21800006 22844933 12380586 -819130 -9846292 -13388708 -13998608 -12665467 -6898516
5872 -6898516 3820049 13259624 13679566 5289881 -3703013 -6251958 -1438539 9074338
5864 9074338 23207925 34901835 34365626 17400554 -7514806 -26069189 -31998257 -30955049
5856 -30955049 -30510132 -30402577 -25606525 -16253834 -8654272 -5430918 -1121818 7339171
5848 7339171 11509926 2612840 -10237434 -6136344 18998515 42412215 42732917 28465099
5840 28465099 24536808 36033957 42497217 29550462 9281410 877046 3617072 1738212
5832 1738212 -10415116 -21760046 -22012683 -13365942 -1164327 16262810 39769949 57330259
5824 57330259 51569297 21350623 -12200251 -25941749 -16623974 863566 11462487
5817 11462487 9941255 -2098687 -18977960 -30529079 -28043889 -13684175 1988802
5810 1988802 13111215 22118105 29465690 29929574 23578723 20435966 26808238 35229939
5802 35229939 36374405 33004450 31649161 27707567 12816725 -6459537 -12646016 -1288151
5794 -1288151 12825805 17326695 17771635 24375786 32988949 29693972 10668375 -11555876
5786 -11555876 -22164473 -18823272 -10733810 -6587833 -6839270 -7258404 -5749090 -2280846
5778 -2280846 4610034 14432435 18672664 7193454 -16583358 -35923650 -40737464 -37752761
5770 -37752761 -34871309 -27483604 -11433135 1785785 -892767 -12130376 -14342284 -7219315
5762 -7219315 -5074637 -8505032 -1860726 16613090 25206883 10449452 -10531290 -14018290
5754 -14018290 -1850951 6337509 2619810 -4079799 -6070456 -4307732 -341324 5513037
5746 5513037 8396843 2564736 -8540975 -14951291 -13816830 -12838576 -18768721 -28381000
5738 -28381000 -32493957 -25574377 -11201310 -102560 -903409 -10442335 -16213171 -11328222
5730 -11328222 -3458861 -4992839 -17337491 -29268972 -29331197 -17288115 -4676353 -4235617
5722 -4235617 -15622684 -22768250 -11226339 13189470 31467908 35830454 34904396 33631010
5714 33631010 24475823 5811269 -7131662 -2457056 9599206 12468295 7761128 8181683
5706 8181683 14272625 16348497 14802448 19293752 28043441 25983481 7326018 -14187948
5698 -14187948 -22314592 -15019025 -1195699 9282824 9550509 -711956 -12582359 -16117903
5690 -16117903 -12438853 -10552153 -13471269 -16892549 -20159901 -26738777 -33422676 -31375118
5682 -31375118 -19956618 -8059336 241377 9436031 19981739 25267720 24702379 25927299
5674 25927299 28939450 22854419 6256346 -4230371 2622312 13269031 7808259 -11395649
5666 -11395649 -25055356 -25137578 -21390820 -21205728 -18693331 -7774702 5297973 9314631
5658 9314631 2634890 -5256750 -5662373 -1285563 -3093834 -15313256 -26325890 -21036891
5650 -21036891 -2543581 7807233 -3165686 -22597777 -28158118 -15805431 -851725
5643 -851725 4325903 1864640 -1565255 -4934559 -10102978 -17204924 -26259678 -36952244
5635 -36952244 -43837335 -38453078 -20870148 -3835134 343674 -6294470 -12159380 -11973752
5627 -11973752 -10569697 -11416746 -10108568 -3134061 4285217 6628546 9704219 23605288
5619 23605288 44468265 54289714 43182587 22897726 11886342 14152264 20220341 22263427
5611 22263427 18717486 8906010 -5670877 -16595261 -15503014 -5535331 2813798 6111345
5603 6111345 9270572 14264185 18165721 21498321 26932932 29508747 20368315 1615417
5595 1615417 -14606117 -23162309 -28963984 -31811739 -24623397 -11330441 -8735455 -21155376
5587 -21155376 -29265202 -16990583 3338474 7024883 -10921381 -33159081 -42608740 -35962560
5579 -35962560 -20781691 -9553557 -11058397 -19664083 -20568622 -11833382 -9062243 -19608977
5571 -19608977 -27891047 -20248269 -8248838 -7993241 -10756484 1280070 20706811 24773289
5563 24773289 14691043 14877701 31339868 40232501 25715771 3109052 -7587161 -9138654
5555 -9138654 -13499797 -18418401 -13839144 -383409 12088615 16783801 12298015 1503311
5547 1503311 -5297013 3045680 21875495 32166605 25363894 13796907 8861520 4441172
5539 4441172 -6466883 -14128724 -7321611 5464424 8047699 2053814 2584660 13261133
5531 13261133 22997593 25563027 25953491 27079553 25278096 21497695 23475089 32104299
5523 32104299 36333024 27877231 14318342 11509503 25158904 42864683 44689204 23377676
5515 23377676 -5199885 -16372270 -4000691 12809765 14687439 5223831 742491 5094591
5507 5094591 8340510 6925514 9451227 19619406 26488290 18741828 1193273 -9809089
5499 -9809089 -4363211 11800049 24584018 25514674 18350302 11968591 8786533 4999873
5491 4999873 1555628 5263103 14654772 15616802 874096 -15114079 -13781875 1725481
5483 1725481 13866660 19001874 28806373 42934030 42017103 16965710 -12057794 -19306376
5475 -19306376 -4650544 12223159 19878012 22093591 21378548 12423505 -4467390 -15430948
5467 -15430948 -6907288 16023895 31611801 23789078 580610 -13820104 -7154234 5902844
5459 5902844 3402088 -13559385 -22103852 -9325170 11820234 24097106 28320769 32002109
5451 32002109 28664411 7445035 -22331558 -36830071 -29488901 -19030147 -20945122 -28096911
5443 -28096911 -28050457 -23360837 -21175162 -15834113 106129 15145868 9647672 -13388828
5435 -13388828 -27828288 -19032154 -1582697 5356749 3757304 4872089 5708805 -3491953
5427 -3491953 -15151911 -9512870 14098275 30403105 20998852 -255921 -6339771 7990213
5419 7990213 23853745 26349020 20793446 18916571 20155481 14218627 -1851300 -16795532
5411 -16795532 -17815086 -7079203 -634953 -8964326 -23053915 -25588516 -13785855 -2725520
5403 -2725520 -4759996 -14674714 -20062275 -18532557 -17214207 -20612150 -27135315 -34359486
5395 -34359486 -40076836 -40668756 -35834290 -32397461 -35359183 -37523307 -27700181 -8408702
5387 -8408702 5520297 7603756 7475297 13130937 16411295 5630222 -14358212 -26415141
5379 -26415141 -23733151 -17394942 -18892652 -23956255 -20230742 -6452420 4261545 965246
5371 965246 -11819809 -21060162 -20901589 -15658650 -9609663 -1532518 9249054 18271741
5363 18271741 21339136 20143251 18714875 17457639 13665663 5064664 -8781852 -24490128
5355 -24490128 -33576201 -30054953 -21224581 -21585562 -31611907 -33701546 -17722656 576943
5347 576943 -104651 -16083625 -24337277 -14216238 2979429 14506187 19475152 20181461
5339 20181461 15894885 9162369 4976708 275081 -12526207 -28343361 -30546716 -14750705
5331 -14750705 2820641 7741709 4525372 3552918 4879846 5204376 7946143 14177375
5323 14177375 14684383 4422921 -4492842 1584182 16640849 23842427 19727975 14620917
5315 14620917 12603370 6666000 -5931652 -16891489 -18806553 -15182818 -15480369 -24538965
5307 -24538965 -37162524 -41184494 -29608592 -11483105 -3209954 -6309395 -5602173 4543351
5299 4543351 7849653 -7297275 -24190681 -19930138 -127504 10734054 6277715 1333281
5291 1333281 2033107 -644072 -6328828 -1286841 14392290 20576762 8277371 -5559902
5283 -5559902 -6890021 -6622753 -17710166 -29287561 -23802831 -6065201 5828794 9097561
5275 9097561 15134954 25782579 30920087 27493469 22655882 17859547 6704290 -8770063
5267 -8770063 -14763247 -4439214 10709266 14401487 4152447 -7743981 -7736260 6143187
5259 6143187 21952368 25249349 15717496 8506568 14368736 24752841 25011927 15835860
5251 15835860 8703627 4369045 -6976165 -22805494 -24102580 -3018548 20010948 20556765
5243 20556765 2903151 -6662326 4078114 19095631 18328064 2949259 -10978624 -15276114
5235 -15276114 -15302590 -15819498 -12683861 -2287164 8626333 9515321 -684162 -12877620
5227 -12877620 -18992540 -18403000 -14146320 -8750308 -4383649 -2016233 106735 2539523
5219 2539523 361053 -10180456 -21727311 -22711800 -16029071 -18874897 -37931283 -56052311
5211 -56052311 -53577751 -34339918 -18687279 -16281243 -18285156 -13962171 -3357302 6287359
5203 6287359 7545896 -3086870 -19916907 -28773210 -21954053 -10276114 -10118193 -20382070
5195 -20382070 -24158275 -13058152 2818784 11340779 12888193 14822447 21503394 32748530
5187 32748530 42406857 37184084 9870669 -23224644 -33553518 -16171216 1080848
5180 1080848 -5237182 -23066374 -26405274 -14833533 -9884652 -17949727 -20939456 -7512780
5172 -7512780 7017678 2652252 -16578741 -28447410 -21103328 -5222819 1006638 -8220834
5164 -8220834 -22348936 -26752462 -17858504 -6326563 -4400953 -11152765 -13959737 -5279575
5156 -5279575 6780699 8318178 -2457623 -12052685 -7438960 8171269 18249394 11184358
5148 11184358 -7422275 -22161588 -24772068 -20268547 -17795968 -20411321 -24568369 -25049289
5140 -25049289 -18751257 -7791232 -593116 -5070131 -17851923 -24808756 -15898558 4175884
5132 4175884 22797993 31806686 29540604 17276246 567208 -10580918 -10693133 -5080301
5124 -5080301 -340028 7088450 23456038 41761484 45351231 29075738 6487404 -7759802
5116 -7759802 -14063366 -21466389 -31964992 -37699971 -31101746 -13798462 3512063 9536252
5108 9536252 3355410 -3941818 -2821624 1589308 -2592697 -13977068 -16371126 -614976
5100 -614976 21775339 32701448 27496683 14540376 2323781 -5023099 -5295582 -917529
5092 -917529 -861935 -10856205 -23429636 -26183160 -19006908 -14285125 -19065549 -25358402 -21563766
5083 -21563766 -7716430 4864770 6372323 -1780392 -8858170 -5923727 3642670 6355086
5075 6355086 -5238179 -20298212 -19421963 2378943 27923387 36080034 23830603 6418966
5067 6418966 -1775632 -1405493 -2816272 -10864256 -18722909 -16337359 -1715022 17884390
5059 17884390 33292501 38684258 32086982 17272356 6020801 11164275 32378246 53222680
5051 53222680 57422866 44972181 27680112 13389680 1963770 -6143167 -7166620 -1300001
5043 -1300001 5108512 7616326 8148114 8458922 4650104 -7186896 -22907288 -32360412
5035 -32360412 -29268021 -17519169 -8084242 -9264000 -18171568 -22962466 -16598758 -6928244
5027 -6928244 -8135964 -22761134 -38462857 -43542946 -38732477 -30947758 -22739712 -13464415
5019 -13464415 -5397020 -1674853 -1052052 -1111253 -4772489 -16890357 -34454086 -46308399
5011 -46308399 -44559439 -32480768 -19443122 -10807142 -4535989 3849329 14501033 21531489
5003 21531489 18628592 6596819 -6654412 -14854114 -19423176 -24432393 -28979062 -29756657
4995 -29756657 -29532077 -36097837 -50718550 -62935416 -60757396 -43347351 -20643726 -3062929
4987 -3062929 4985209 4166189 -1290823 -3872869 2918608 17392697 29471714 30260406
4979 30260406 19965408 4771588 -10491267 -23032714 -29526677 -29712131 -30992917 -41111948
4971 -41111948 -54989908 -57511866 -43221976 -24728229 -15221791 -11060100 -1854735 8418955
4963 8418955 4480888 -16451047 -37020094 -39714705 -24981544 -5827154 6483404 6917374
4955 6917374 -3763559 -16770588 -19247867 -7910256 5374661 7112487 -3132665 -16335628
4947 -16335628 -26520989 -33333880 -37165712 -38790547 -40097647 -39151188 -29418803 -10897375
4939 -10897375 3734443 3668186 -3617528 -1768614 10585312 17408732 7673431 -10940254
4931 -10940254 -24049722 -27143322 -25851414 -26689749 -31851260 -38279809 -39113156 -30438233
4923 -30438233 -17812102 -10900000 -11437150 -13461479 -15854413 -25113990 -42261875 -56474669
4915 -56474669 -58102989 -50873690 -44259213 -39656628 -31869269 -20194283 -10209599 -6486289
4907 -6486289 -9489254 -17397944 -25288656 -25295425 -14494183 -1193972 3380192 -981195
4899 -981195 -4489442 -2105183 116107 -4882555 -15578377 -25636378 -31475214 -31978681
4891 -31978681 -26132272 -17074072 -14503352 -24720212 -38999601 -40739147 -26712813 -12753558
4883 -12753558 -12629786 -19003252 -15251482 -1547772 4149864 -7974737 -25928710 -33705996
4875 -33705996 -31300246 -28153603 -25905786 -19419714 -9620353 -3190047 -1504063 3638
4867 3638 3298461 7960470 16774215 29633508 34466248 18488446 -10701303 -29287007
4859 -29287007 -25229028 -8863762 7073019 22099616 36160426 39324777 25304803
4852 25304803 4094555 -10790273 -18949754 -26194863 -30239824 -26156313 -19098053 -18097289
4844 -18097289 -21550719 -20990658 -15368552 -9733154 -3433464 7527528 18245704 17665141
4836 17665141 4186199 -11299328 -18160007 -13953368 -1816662 11080194 15052092 7719405
4828 7719405 150710 3775097 14643061 21183588 22420570 24348229 22687094 7777003
4820 7777003 -13413117 -19981477 -6665900 7297611 6381378 -748420 1119792 10413555
4812 10413555 15640653 14263700 11503079 8207734 2162194 -4141865 -7482600 -10667345
4804 -10667345 -16263727 -19012119 -13521897 -4151256 1930495 6094553 12871157 18455372
4796 18455372 15860664 8173257 5078650 7520260 6865042 -217892 -6098782 -3709090
4788 -3709090 3873434 8054859 3956759 -6307349 -15654876 -17174751 -10635635 -3112140
4780 -3112140 -590291 -1733162 -3049180 -5485202 -10522991 -14237283 -11904102 -5012076
4772 -5012076 2331131 9103591 12486142 4041531 -18314578 -39831839 -44067617 -35819412
4764 -35819412 -33883517 -41401958 -40870698 -23252989 -4849774 -4733827 -18199311 -25552089
4756 -25552089 -19082876 -8075563 -1328680 2619944 7939595 13637335 15139452 8863783
4748 8863783 -4544553 -18076993 -22264991 -16126189 -11113834 -18006097 -32377266 -40150069
4740 -40150069 -36122586 -29318842 -29686360 -36635117 -42300911 -40223378 -29232012 -14285182
4732 -14285182 -4848543 -6279961 -10627735 -2787469 19956969 40608854 40878513 23079770
4724 23079770 6996463 6867982 17899593 25106921 19398841 3727775 -11780365 -18518367
4716 -18518367 -15941956 -10869555 -9039994 -8618031 -4869707 1160691 4284166 4227357 5544045
4707 5544045 7643600 3585039 -7369584 -14350128 -8760805 2744044 7116703 2043174
4699 2043174 -4546924 -8512152 -12518150 -15671049 -11076961 2746320 15916062 17642342
4691 17642342 8609535 -490661 -749319 5531824 5584812 -11435633 -39168913 -55117503
4683 -55117503 -44133556 -17968460 -2472479 -7342521 -19479617 -25637366 -27928481 -33250371
4675 -33250371 -40326414 -44059627 -42736129 -34758867 -18238090 -125543 5366079 -4122630
4667 -4122630 -12104611 -5173119 8189400 12282654 8375944 10244419 21766608 32979007
4659 32979007 34825785 25824259 7993090 -12177256 -23079353 -20376325 -15485325 -19452269
4651 -19452269 -24352341 -15598152 2832941 13191963 10651612 6423202 6003922 4616699
4643 4616699 4428573 13896074 26255694 21905668 203622 -13407698 -3642916 11601637
4635 11601637 8838025 -8341294 -20492427 -20639930 -13655761 -866366 15315630 22161609
4627 22161609 12519402 2247695 11111960 31274069 35691309 16201566 -6647324 -12765801
4619 -12765801 -3261700 10879639 23895217 33148017 34994967 29306315 20131791 9602315
4611 9602315 -1046242 -5880061 -1008544 4548726 -1072372 -11507014 -7785914 11623000
4603 11623000 24331854 15527513 -895390 -4771085 1112272 230196 -8802667 -10681100
4595 -10681100 2173157 19439860 28315600 26851271 19431337 9286377 -14028 -2895241
4587 -2895241 2831306 11863474 16103838 12558931 5900682 4123111 10569035 18747555
4579 18747555 17645025 5185878 -6808796 -5990946 5127757 14103514 17018482 22370727
4571 22370727 34666078 44311712 40296730 25312718 9668392 -4213556 -20283239
4564 -20283239 -34664184 -36325590 -24618299 -14126927 -15774516 -22949883 -24500295 -22439376
4556 -22439376 -25557684 -32339482 -34260897 -32769555 -37642265 -48086077 -51153220 -42957840
4548 -42957840 -36323733 -39774160 -42429734 -30392073 -7591320 11211533 19630463 20093100
4540 20093100 13347243 1681217 -3366187 7414843 23644656 24998605 8565026 -7679670
4532 -7679670 -10482914 -5933225 -4059928 -2850960 3557510 10530722 7433314 -7172748
4524 -7172748 -22306578 -25674396 -14809329 1208711 9923674 7782739 3919091 8291055
4516 8291055 18028228 21424637 13802082 1780203 -7538352 -13013923 -14640288 -11325245
4508 -11325245 -5462119 -1791213 -173659 2788982 4864101 790538 -5776941 -5133631
4500 -5133631 1116317 -999930 -16206852 -30550988 -31198230 -23175610 -17028428 -11954963
4492 -11954963 -3420130 2746271 -1311397 -9443417 -8707162 412379 4638045 -1873585
4484 -1873585 -9893548 -9088698 -391407 7632970 8382303 1736719 -6935483 -11854716 -12183426
4475 -12183426 -9869067 -3017819 10589611 22535192 19230526 4344941 1400430 22474726
4467 22474726 47244118 48591328 28386295 9626590 1657335 -5031261 -13720539 -15038095
4459 -15038095 -7624687 -3890749 -9532719 -14945819 -12919414 -8753596 -6683947 -1930840
4451 -1930840 6539390 9929901 4130713 -2910301 -5589421 -8892597 -14675422 -14236627
4443 -14236627 -4477738 2098508 -4921513 -17854787 -24047571 -23760570 -23050575 -20214676
4435 -20214676 -13124802 -9811755 -16261883 -21884664 -13404028 2946096 9574084 3353598
4427 3353598 -3492437 -5641227 -10284834 -19660704 -24169935 -17294607 -5377054 1916828
4419 1916828 2237840 -767376 -1755377 4356765 17469213 29372626 32512218 29814677
4411 29814677 28385322 27178996 20640231 10657408 3241357 -3028674 -11797562 -15752471
4403 -15752471 -5158385 12004043 17519582 12184036 16601927 36608349 49402720 36301433
4395 36301433 10763859 -2303920 -497455 1396922 46759 6007007 21326084 33510956
4387 33510956 32995108 22847896 10025152 -1067851 -5210018 1553371 13005314 15163453
4379 15163453 1876989 -17856263 -30614806 -31497789 -24919856 -17634414 -12992123 -8880612
4371 -8880612 -707913 11162892 18500476 13673380 -147774 -11298633 -11378560 -1885251
4363 -1885251 8670619 11128486 2290098 -11042274 -17829734 -15468008 -11290891 -8334529
4355 -8334529 773063 17937590 28525121 20291412 5618046 6730917 22170025 28510077
4347 28510077 17012482 6792527 13774555 26958833 29087453 24011158 25286904 29092052
4339 29092052 19763041 -1723781 -14941404 -7911281 7928243 15359465 11812911 6366967
4331 6366967 5670247 9410941 13841463 14398424 8839012 1385315 -66529 6543958 14835959
4322 14835959 18676779 17868589 12661975 231812 -17018219 -26060369 -16267285 3989463
4314 3989463 13911389 5119810 -9041869 -12910365 -8608677 -9210206 -17785357 -23778660
4306 -23778660 -19242811 -8717601 -619095 2781602 2605274 -2023770 -10310696 -15857329
4298 -15857329 -13342025 -6067810 -798613 1700965 4301853 5039283 -365992 -8964235
4290 -8964235 -12666353 -10150392 -8053911 -9739206 -12380204 -16559353 -27121467 -39667286
4282 -39667286 -38035494 -14721428 14394762 26613977 18936124 7710073 5148240 7375650
4274 7375650 5582805 -1583000 -9995954 -16961611 -21845792 -23852195 -22482250 -18442087
4266 -18442087 -13001453 -7973683 -5838369 -7509724 -10568552 -12156693 -12925914 -15833647
4258 -15833647 -21918434 -29127054 -33883660 -32630706 -25025272 -17537594 -19143198 -29580947
4250 -29580947 -36815708 -31713583 -20592999 -16011949 -19091330 -20141233 -14666930 -8225406
4242 -8225406 -4749286 -665410 5545983 6897113 -2611445 -17416247 -25575997 -21802921
4234 -21802921 -10304326 3643744 19549663 37440892 50717974 48045431 25932597
4227 25932597 -2213089 -16200079 -11177987 -3834129 -11337566 -29494371 -39466701 -32257289
4219 -32257289 -16832685 -5082167 1137979 5844112 9985630 10725803 5834074 -2543509
4211 -2543509 -6178412 3975044 25060445 38849015 30112511 6155621 -12211944 -17211919
4203 -17211919 -18933396 -24014634 -25318409 -17840201 -10206552 -11277626 -16367662 -16481084
4195 -16481084 -12295411 -9092174 -5580189 1328769 6226591 1040641 -11193297 -17783181
4187 -17783181 -11135324 4105820 17156717 19354609 8981378 -6777710 -16474589 -14932098
4179 -14932098 -7288111 -1024812 1236245 -865590 -7889017 -16078875 -17522154 -10505237
4171 -10505237 -3455038 -2953778 -4434773 -1029464 5109135 7626584 6164710 4234009
4163 4234009 1910368 -2506278 -8069616 -13495826 -18002188 -16321254 -2754779 14426557
4155 14426557 15845286 -1694847 -14257230 -1786961 21383982 25306602 5737409
4148 5737409 -13474642 -15363404 -6671020 352143 3544365 4319585 1467226 -3213027
4140 -3213027 -4817896 -4268826 -7138166 -12403643 -12984697 -7541885 -585003 7849607 19412323
4131 19412323 25793341 16053233 -3101149 -11213474 -2370843 6278247 207566 -13100876
4123 -13100876 -18393212 -13946793 -9675137 -12263209 -19090258 -21531892 -12135045 5255291
4115 5255291 14633550 7254003 -1823150 8431343 33252251 46932875 39223810 25214589
4107 25214589 16129578 5136056 -9170066 -10272753 10024576 33305748 39512300 33059015
4099 33059015 27017012 18296511 -606361 -18372944 -16531555 2138003 16601639 15129559
4091 15129559 3653603 -9476578 -21695532 -30987356 -34560359 -31793523 -22142425 -5946882
4083 -5946882 7578930 4519944 -13286291 -24891584 -17723870 -4474752 -751313 -2288262
4075 -2288262 -95140 -1018104 -12295618 -20499370 -10159288 7956026 12467499 6104661
4067 6104661 8197629 19241513 21022661 9140083 -2064036 -6811500 -13913463 -24012237
4059 -24012237 -25815860 -17980369 -11540921 -7819960 3324086 20742603 30612544 30426439
4051 30426439 30786876 30728613 16760270 -9175057 -27153305 -30667368 -33747027 -39775865
4043 -39775865 -32542911 -9514349 5514046 -1318380 -12138609 -9453772 -3852986 -8812824
4035 -8812824 -12426165 479096 17463418 16266016 -478692 -12752527 -14045840 -12288554
4027 -12288554 -10237686 -6641760 -8122640 -19457491 -29985096 -28523164 -23353395 -28995088
4019 -28995088 -42193782 -49765493 -50739606 -50978831 -45488594 -27754459 -8579681 -3260718
4011 -3260718 -6601368 -3006762 4754830 505134 -16109481 -29428183 -34282632 -38881209
4003 -38881209 -42594460 -35299673 -20067904 -13087951 -18114351 -22707160 -22523660 -27104692
3995 -27104692 -37495117 -40354957 -30476488 -18721702 -11383912 -1857132 10440085 13478749
3987 13478749 3652956 -5909092 -7350856 -9428477 -16600210 -16400952 -1701771 11542548
3979 11542548 5786144 -10790058 -14969477 684163 21097002 28111426 17119196 -1731138
3971 -1731138 -13288368 -12866845 -12835203 -25365013 -40972006 -39925152 -24772252 -20055788
3963 -20055788 -34368791 -46222811 -38421740 -22883206 -15663395 -10325774 2714569 10814663
3955 10814663 -531277 -17024986 -13934160 4588001 13456403 7911960 6857842 16049610
3947 16049610 17989273 3736331 -11797422 -15219563 -12965978 -14327824 -15856648 -13481301
3939 -13481301 -12647669 -14923645 -10319824 4883834 16972637 14232930 4494212 -84219
3931 -84219 -2912242 -11880901 -19641745 -13904874 -405961 4059869 -1940494 -4813443
3923 -4813443 -2041889 -6760475 -21563763 -28294255 -14994934 3171251 4453271 -9571986
3915 -9571986 -20627072 -22157535 -22701387 -23839171 -14546865 8076507 28716125 32914372
3907 32914372 24697253 16603200 12143664 7928296 4458250 3037737 -1711106 -13557691
3899 -13557691 -23131624 -18077682 -2723797 5979705 1935675 -4569974 -6129069 -7891475
3891 -7891475 -13321446 -15195483 -9468489 -5700959 -12554755 -22082323 -20445167 -8117279
3883 -8117279 2348380 4961328 5685259 10759596 19049624 25934492 27691891 22209502
3875 22209502 10862135 -924763 -8654768 -11779687 -8971293 3395186 22057798 32846670
3867 32846670 25221787 6870435 -5499603 -6723794 -4895816 -5514072 -5413748 -2185110
3859 -2185110 1689463 6251595 15995404 31032933 43694800 46870242 39956778 25410686
3851 25410686 6223104 -11702602 -21806781 -23987322 -23656342 -22356209 -15984025 -4195343
3843 -4195343 5515530 6426930 -48497 -7848504 -11800585 -8434286 1834758 10794105
3835 10794105 7666805 -7956722 -24195500 -31166985 -31007344 -30067579 -28545390 -24314691
3827 -24314691 -21317843 -25724284 -35681783 -41991859 -39296359 -31907827 -27916428 -30652662
3819 -30652662 -36655268 -40201699 -38926755 -34772495 -29425099 -21261794 -9844935 -1141175
3811 -1141175 -2286660 -10885790 -15850513 -11083912 -2675538 591786 -1437849 -2712048
3803 -2712048 -364118 3490166 6829048 9562834 10895425 8566634 1689080 -6435149
3795 -6435149 -8797556 -431763 13308553 17163705 1547533 -22805259 -34140439 -25204488
3787 -25204488 -10167312 -2869671 -33653 5528459 6824703 -6800427 -27211620 -34096242
3779 -34096242 -24844727 -19629915 -29981929 -39037272 -26186215 909493 16638681 13639832
3771 13639832 8701402 12123489 12293560 -582723 -13895812 -11584735 -1140621 -2419712
3763 -2419712 -16419614 -26128760 -26112998 -28413683 -35939307 -34064302 -18593892 -9207112
3755 -9207112 -18693866 -28578701 -17258150 2933617 3279924 -15866783 -26118607 -15170885
3747 -15170885 -868643 2484144 3803237 11461447 14936557 5238666 -5813948 -3419346
3739 -3419346 7712607 14410242 15899083 17601286 15139003 2129600 -13129980 -15475451
3731 -15475451 -3751727 9480156 15545942 15321866 11576605 7179375 7134470 11919312
3723 11919312 13107461 5209227 -4366173 -7719476 -10855863 -22226531 -34688362 -35719303
3715 -35719303 -30096295 -33068758 -42780296 -39983334 -18460610 2805872 4868967 -8236008
3707 -8236008 -19667740 -21724366 -19546971 -20382703 -25665327 -29961224 -26214266 -16196211
3699 -16196211 -12585961 -22411129 -33099806 -28149548 -13469652 -10894198 -24947457 -35577059
3691 -35577059 -29466854 -19012321 -19351579 -23759656 -17391429 -3344963 2424678 -4010788
3683 -4010788 -10714881 -8913783 -2779080 61275 -2427105 -8482407 -15761836 -20878115
3675 -20878115 -20729504 -15891781 -10131749 -6317495 -4216536 -1655010 2730757 7005995
3667 7005995 7473166 4577734 3620807 5151922 255165 -15619474 -29205954 -23514555
3659 -23514555 -3859120 6096002 -3352872 -15856969 -14692256 -4454835 1427626 10179
3651 10179 -5188791 -14404041 -25449812 -28401893 -19220373 -9196991 -8678840 -11248485
3643 -11248485 -7111710 -1786421 -5584787 -12959780 -10033524 2402778 10432987 8536041
3635 8536041 4191339 3709847 7964876 18872110 34847920 42945619 31929697 11454635
3627 11454635 1981491 7049586 12359251 10949935 10165497 12525357 9603607 -612909
3619 -612909 -8267610 -8556722 -7083458 -4070277 7579306 22083864 19565871 -3946289
3611 -3946289 -24396894 -21421883 -5254173 3534043 4905857 10344992 15604795 5982853
3603 5982853 -15852759 -28821859 -21417394 -4614114 5468538 5196367 1370612 1471797
3595 1471797 7866363 14547222 10181659 -8380351 -27558750 -30256870 -15934205 908489
3587 908489 10198813 14438555 18349914 21479648 23555729 27902331 34845038 37518868
3579 37518868 28843873 10444537 -7387231 -13896671 -7320605 2070494 1137837 -11020915
3571 -11020915 -20438704 -14235418 4610443 22139350 27932643 19902884 1042497 -20625630
3563 -20625630 -33515523 -32819323 -26941152 -26580290 -31039321 -32504307 -28711530 -22363881
3555 -22363881 -13404811 -2693916 1865044 -4330231 -10559643 -3759340 9840113 12688408
3547 12688408 3614973 -1505010 2604399 3735280 -2500437 -3414933 5066719 6484209
3539 6484209 -6812327 -13482165 5818920 33317139 35939910 12864731 -5654762 -3046109
3531 -3046109 7181089 11050038 13021296 17614729 16478160 6610762 1492719 8465015
3523 8465015 11556230 -4878665 -28185102 -33845630 -21934029 -15103436 -23035076 -31273531
3515 -31273531 -28017229 -20426300 -16044986 -7047277 13483872 33762601 38210968 31190667
3507 31190667 28564843 30478793 20991808 -4645235 -29606286 -37496581 -30802477 -20771361
3499 -20771361 -11673790 -4380364 -4681501 -15715262 -28629823 -32621597 -29847622 -29058543
3491 -29058543 -28566668 -19011626 -1877279 8902019 6311100 -1323759 -5490392 -9216677
3483 -9216677 -17102290 -24052960 -22948647 -16228466 -10614952 -5704386 2675998 11296942
3475 11296942 11548973 1942705 -9255696 -13838753 -9797425 1122210 14079054 19027579
3467 19027579 6922389 -17764191 -36910581 -36533204 -21429316 -7662039 -3548557 -4057905
3459 -4057905 -3008666 -3086591 -9458647 -18345185 -19553400 -10479972 -531749 1449265 -2101068
3450 -2101068 -4662805 -7768975 -17119914 -29342253 -33199941 -25301030 -15488440 -13895646
3442 -13895646 -20624681 -30879951 -41537836 -48652856 -47299708 -39138318 -31976022 -27015314
3434 -27015314 -16286791 1479520 14632524 17334151 21156813 34244026 41773345 26611532
3426 26611532 120051 -11231969 -5637457 -6112880 -19579985 -23911005 -5554953 15216715
3418 15216715 13027096 -7782186 -25115141 -30708380 -30496649 -25815944 -15873465 -11244002
3410 -11244002 -22593951 -38750777 -37084844 -16719726 -2224118 -10390784 -30359126
3403 -30359126 -42672503 -42725780 -36684800 -26931498 -13496291 -3103782 -5141933 -19011116
3395 -19011116 -31855021 -30299338 -13366727 5904169 13072519 8437044 6992924 17946507
3387 17946507 29713832 24289166 2808166 -15270239 -17960986 -12657718 -9739445 -7622471
3379 -7622471 -737475 8307391 13222959 13927630 14506494 16153208 17670883 18339552 16268456
3370 16268456 9509780 2224696 2544367 9956554 12746927 3741171 -9000070 -13733032
3362 -13733032 -10114263 -5733878 -4370246 -5168580 -7412246 -9000651 -6450592 -3055033
3354 -3055033 -9196822 -26619895 -41177468 -41217360 -34315360 -33480430 -35174925 -26477645
3346 -26477645 -8536395 3742453 3169507 -3740035 -10638219 -16171085 -15981132 -5534859
3338 -5534859 8335205 13207175 8917608 5510116 4566379 -311135 -4782760 3877934
3330 3877934 22351054 30596548 22348890 15013769 19712952 23079574 12065900 -3865041
3322 -3865041 -11952017 -18134473 -29674216 -33347152 -15889166 6466996 6382413 -13341859
3314 -13341859 -23938603 -13669243 -146080 2093408 700407 5157069 9125515 3730927
3306 3730927 -7330475 -15568945 -18307195 -14498129 -2247726 12573711 17085626 8226240
3298 8226240 -1348938 -604504 6681576 11936950 14196106 15374007 13187425 6813262
3290 6813262 1538757 883508 1507547 1042772 2041791 3290054 -1684496 -10757862 -9999244
3281 -9999244 6209101 23063182 24853231 16979709 15782449 24356538 32006624 31664664
3273 31664664 24325690 11140380 -5097807 -14384978 -9431702 1327480 4045005 -119406
3265 -119406 126780 3363654 -3740536 -20371823 -26074816 -10391942 8101249 5442898
3257 5442898 -16171442 -34941226 -40504966 -42339612 -48113806 -49145448 -34258959 -9288407
3249 -9288407 6851910 4308541 -6787391 -10283660 -3917086 934742 -2093954 -4838764
3241 -4838764 1795907 12108509 12536623 1328176 -8690043 -7668670 -40374 4551532
3233 4551532 3644307 512050 -3388121 -8175218 -11030457 -7995837 -37400 6087460
3225 6087460 3623930 -7565550 -18683773 -17689626 -2150208 13528097 10543249 -11936935
3217 -11936935 -33935530 -38929035 -33194633 -32337323 -35234501 -25711733 -103037 22351374
3209 22351374 24251159 13572648 10446319 17431426 18319392 5912427 -5284683 -1038871
3201 -1038871 10742734 12166863 2092150 -3404618 4364305 15256301 16491682 9230308
3193 9230308 3541973 5133212 13020656 23595136 30661972 27284148 14502261 3578846
3185 3578846 2778743 6276810 3341942 -6051997 -13614809 -17000839 -20777164 -24192329
3177 -24192329 -19786307 -6920315 3577567 3446491 -2191754 -4074538 -2597887 -5069835
3169 -5069835 -12867071 -18996800 -17777379 -10640163 -1556132 7610146 14557126 14189350
3161 14189350 4221143 -8556652 -13897132 -11321731 -11649891 -21601900 -32845950 -33022495
3153 -33022495 -22694434 -11957724 -3773041 6779651 17412936 18156442 9981676 8371059
3145 8371059 20061128 30553881 25971436 13974098 8682178 6747617 -3903565 -20311264
3137 -20311264 -28676833 -26358160 -20299072 -8652931 14223422 37045851 39971440 25603855
3129 25603855 18071445 26406009 32298590 22055519 7465667 3407294 6092355 7413069
3121 7413069 11181215 19120474 18689877 3069882 -11734954 -8220177 7360102 18878275
3113 18878275 25571312 33448329 35176793 22391688 7855747 10054981 22848998 26096377
3105 26096377 20651254 24516848 36682036 35782813 18425955 8156243 16554135 23614534
3097 23614534 11638952 -5593229 -5958570 7900569 18502894 21760378 24561664 24738742
3089 24738742 14711311 -297508 -7267145 -7005119 -13485819 -30118712 -41435080 -33127541
3081 -33127541 -10220593 9982563 16863119 13835728 9803868 7044661 -976052 -18951046
3073 -18951046 -39392591 -48614046 -43090854 -32354742 -23616725 -12791295 3926899 18817038
3065 18817038 21834577 14897517 7920946 5109518 3873771 3219044 3849758 3010914 -1320128
3056 -1320128 -3599154 2007869 9398226 6711440 -5193532 -11914099 -5570613 5022730
3048 5022730 8270655 3662190 -4160841 -15314640 -29221743 -36240579 -27001875 -8657199
3040 -8657199 -394472 -9604084 -20842223 -14080273 10917784 34583499 39819666 28186637
3032 28186637 13406736 4589322 -51526 -5553479 -11838800 -14918862 -14102972 -14935293
3024 -14935293 -23305367 -36608870 -42870911 -32054346 -9052144 8135107 6253472 -9372184
3016 -9372184 -22371577 -24546635 -22237459 -24039821 -28954948 -29967401 -24780387 -18397235
3008 -18397235 -16884938 -21952579 -30286730 -35163748 -29991206 -14063582 4756262 15960434
3000 15960434 16318926 12436894 12531443 17077348 19114832 13076560 1293006 -8508285
2992 -8508285 -9996764 -1587019 13680401 27717770 29000086 11392152 -16386199 -35235148
2984 -35235148 -33475953 -17358307 -1430266 7313229 11926678 16752645 22388413 27516063
2976 27516063 30285047 28568525 22766455 17140730 15280187 16610554 20175508 27410753
2968 27410753 36849879 41586287 38255913 32857689 29946005 22775373 5374034 -11419342
2960 -11419342 -11034791 3746923 12913793 7782054 1288746 5304713 13167484 12545383
2952 12545383 2768991 -9431969 -20448987 -27206667 -24465853 -14445111 -9756171 -16285138
2944 -16285138 -21586421 -11659823 8117511 21290457 23624305 24039436 25079526 17445898
2936 17445898 -3174314 -25352083 -34403392 -30267784 -27013096 -34756143 -45627757 -42130691
2928 -42130691 -20950589 -1616231 -3047392 -16851774 -18384603 -3143674 6683283 -2756038
2920 -2756038 -15383092 -11025046 4205304 10459066 4589529 -672602 695233 4982276
2912 4982276 12101025 23351673 30077617 22903731 9647363 6151890 11188214 8838768
2904 8838768 -4703106 -15668303 -15729595 -12311042 -12440131 -12953462 -10849609 -8141884 -3244486
2895 -3244486 6692092 12157525 -1911238 -30553468 -48383711 -42309487 -27355010 -21695087
2887 -21695087 -24185526 -27355746 -33790710 -44220006 -45525374 -29170939 -9689078 -5760054
2879 -5760054 -11809025 -7905264 8425726 20778694 21713817 21593345 27466593 31566961
2871 31566961 27148924 21050542 21590328 24260500 19260267 7282894 -1555157 -2341487
2863 -2341487 -978823 -4248431 -10311105 -12953855 -12242355 -15122412 -24361976 -32337211
2855 -32337211 -30038388 -18594203 -6561419 1276501 5941856 7453983 3979091 -2502129
2847 -2502129 -6784272 -6481598 -1498074 9439353 22955646 26026748 10372089 -9775521
2839 -9775521 -10517130 9255190 25350331 22735050 14117904 15554434 21771754 19376691
2831 19376691 9788016 3050817 -326040 -5746682 -11474285 -13924630 -17812452 -26154489
2823 -26154489 -28175426 -13517003 7936884 17457650 13833750 10912361 12339491 7725373
2815 7725373 -5601176 -14880742 -10296818 2021440 9307194 4982693 -8806415 -22535742
2807 -22535742 -24615929 -15223360 -11645928 -27864536 -52443501 -61306289 -49992624 -36717051
2799 -36717051 -34055928 -35609024 -32940200 -27565090 -20933648 -9219643 5111897 11663448
2791 11663448 9371437 11017555 22195042 29574637 20365515 2023854 -8106232 -3923699
2783 -3923699 7894298 19226951 24691477 21889485 15320698 13621643 17456866 18225632
2775 18225632 13284187 11423518 16883903 20310671 14541359 7288212 7318695 9685350
2767 9685350 7316103 6071237 13097959 19850472 14379355 3819653 5512116 18830668
2759 18830668 25098143 16005782 3961098 832228 2872957 2340009 -283379 -2579305
2751 -2579305 -6324265 -9771423 -4834890 9531413 20797144 19087899 11458179 9189197
2743 9189197 8370986 -2527577 -18798622 -19655411 3160927 29917689 35651753 21133122
2735 21133122 10091088 18143427 35944195 45359492 41689148 32768227 23770906 13849747
2727 13849747 5192836 3456741 6597789 3298961 -11543685 -26725448 -27235452 -12585222
2719 -12585222 4326116 13642788 15965172 14054550 5879301 -9670240 -24867579 -27480601
2711 -27480601 -14322630 2918659 8932240 1485284 -7199443 -7325621 -4284145 -8853003
2703 -8853003 -19031235 -21523570 -11478381 -355096 -22217 -7645829 -12447218 -10627945
2695 -10627945 -6457454 -3683519 -3455783 -7255552 -14383647 -18649177 -14405055 -4628966
2687 -4628966 2821691 5368602 6030662 5133554 -989744 -12249037 -22065138 -24965338
2679 -24965338 -23255509 -23924503 -30591164 -39335801 -41837379 -33655802 -20315759 -12822179
2671 -12822179 -15310617 -19982248 -16961182 -6380785 2542404 2047223 -7627469 -19621824
2663 -19621824 -25163274 -19591297 -7233106 1787278 2234523 -1295001 -1867221 1662036
2655 1662036 6516249 10686625 12096947 8459523 1959823 -1716207 -2822175 -8181360
2647 -8181360 -17264226 -17949187 -5282186 5982072 1008576 -11436911 -11920154 -1817838
2639 -1817838 -2097736 -20381326 -38703750 -39180527 -25142295 -9798994 787458 4394088
2631 4394088 -3773368 -22189190 -37376024 -38615699 -31120243 -25012963 -19632364 -10472051
2623 -10472051 -4106208 -11059911 -26588635 -33409007 -24902416 -12881348 -8750682 -8485077
2615 -8485077 -3165592 4285351 2934719 -8643134 -18217372 -15026307 -2254620 9562382
2607 9562382 16378407 20957434 21885687 12486065 -5824938 -18665262 -15915660 -7873446
2599 -7873446 -13090410 -32460572 -47418615 -44879412 -32148014 -23142729 -20611448 -18648231
2591 -18648231 -14591366 -10748458 -9492219 -12527868 -20246643 -27412895 -25784785 -15908240
2583 -15908240 -8918272 -10648266 -12722180 -8069295 -5845680 -17456935 -34184837 -35686401
2575 -35686401 -19732423 -6228510 -7921468 -13632108 -9389181 -1936022 -6728836 -20842121
2567 -20842121 -25165010 -12983445 -230644 -1646013 -9999333 -9950903 -3544267 -6022239
2559 -6022239 -17978975 -19602220 -370935 19859518 14004689 -15398223 -39042253 -39108103
2551 -39108103 -28241332 -26803583 -36144278 -42380032 -35460320 -15380680 11823827 35018722
2543 35018722 42215572 33327478 22847637 21499057 22195424 13690119 149748 -5675081
2535 -5675081 -2422202 1822199 7217821 20426633 35396644 34345443 13216409 -9432358
2527 -9432358 -16837859 -14456625 -16596012 -23247220 -22017830 -7845924 9280878 15132948
2519 15132948 5360084 -8279946 -4623491 26300341 66253904 82234946 63112330
2512 63112330 33009316 20188796 23902357 25107560 20092819 23603970 40258919 53046698
2504 53046698 46829106 28663079 15632293 12878772 14029981 16555412 25012005 40193008
2496 40193008 53999782 57319893 48676466 33615180 18037901 3424891 -11746863
2489 -11746863 -25993422 -32020741 -23820092 -7095884 2635064 -3658023 -17165391 -20801868
2481 -20801868 -8907406 6763835 10569600 -1074565 -17947358 -27475281 -26296056 -21023710
2473 -21023710 -18604005 -17888638 -13308750 -5495647 -2070953 -5405881 -6304628 3611351
2465 3611351 17858955 22147298 13407588 2218398 -3592468 -6964116 -10657345 -9816717
2457 -9816717 -1973027 5569123 7688786 12730948 29920474 50382138 54111540 35397679
2449 35397679 9655702 -6280844 -10180718 -8688128 -6017339 -2996864 -42566 2928734
2441 2928734 4524380 -560652 -14685449 -28848020 -31998721 -28926026 -34432673 -46662644
2433 -46662644 -44325126 -20020908 1703776 -3848238 -25381892 -31763138 -15672408 1511386
2425 1511386 5245897 4935449 12179584 22033826 23654036 15379318 2506482 -8817948
2417 -8817948 -11739026 -4544451 1385732 -6669280 -21110567 -21312390 -6551641 -901720
2409 -901720 -16021313 -30774257 -23636522 -6091606 -2880963 -14104417 -21301299 -21054861
2401 -21054861 -25908281 -35921697 -35745713 -21722077 -8455152 -3890868 960418 11111299
2393 11111299 16300499 9604413 302890 -1974153 -1537889 -5169203 -9619457 -10828272
2385 -10828272 -13559479 -21465816 -28582924 -30523232 -32780932 -38180693 -39155992 -34244128
2377 -34244128 -37705179 -56709288 -72567652 -65114970 -45149287 -38747655 -46133180 -43275993
2369 -43275993 -23351742 -7891321 -10538399 -16799107 -12038456 -5738977 -10917143 -19303284
2361 -19303284 -17934824 -15276970 -26659375 -43154098 -41522557 -23190585 -16823284 -35807194
2353 -35807194 -56103228 -49717742 -23804378 -8926299 -16791812 -28336021 -24176475 -11032031
2345 -11032031 -9878040 -26586924 -45110228 -48373004 -36345548 -20252141 -7366722
2338 -7366722 363679 -1557964 -16095449 -31962798 -29433429 -6465532 12826119 7622434
2330 7622434 -10658502 -14275468 1230360 12153169 2389119 -15090499 -20207796 -12985291
2322 -12985291 -6414669 -3935065 805914 8086581 11150308 9010225 6647520 2336377
2314 2336377 -11871463 -33480655 -45243743 -34916964 -11982363 3166862 2700570 -3240641
2306 -3240641 -2815515 3179032 5368664 -435211 -8207215 -10326723 -7060745 -3933173
2298 -3933173 -1822339 3940061 13173349 16998257 10294593 2339012 5989027 18812166
2290 18812166 25200942 17456770 3858564 -7215664 -19314731 -36021029 -46723120
2283 -46723120 -37432251 -13037081 3905713 -729065 -16801080 -24609610 -18706683 -10609601
2275 -10609601 -10961630 -16239400 -15122936 -4142204 7107685 6860739 -5190967 -17441562
2267 -17441562 -18759610 -8712142 4340084 11537659 8629380 -2586837 -13907786 -15090619
2259 -15090619 -4268328 6999222 4837720 -9993942 -21327797 -15637154 3302240
2252 3302240 20033868 23754760 15941720 5204992 -775725 588410 6353288 10909983
2244 10909983 11098523 8325013 4912764 1051788 -1858829 1694366 14595614 28365026
2236 28365026 29126817 15048207 503769 -2446529 -11067 -5649675 -18179069 -23349563
2228 -23349563 -17070246 -13033615 -21380064 -32133581 -30363014 -18597008 -10502247 -8149628
2220 -8149628 -2202742 6403575 3550249 -13735439 -26768204 -19926572 -3196994 3353279
2212 3353279 -1890525 -4672343 -171107 1461081 -5894228 -15650958 -21320936 -24090908
2204 -24090908 -23671266 -14589236 2491099 17039135 22854775 25844398 31109123 33346458
2196 33346458 28750157 25341281 29594160 32063057 20740642 2387741 -5137440 1571098
2188 1571098 9606462 12142802 15410198 20979856 18856623 5919939 -3435867 4017513
2180 4017513 21106436 30246062 24895973 11209524 -4215457 -16874497 -20519028 -13670225
2172 -13670225 -7251083 -13174086 -25845871 -27206599 -11558262 6763786 14426535 16113318
2164 16113318 22950283 33194189 35379173 26448249 15636323 10258962 7273427 2009945
2156 2009945 -2639847 -1604906 2795888 3843256 869492 -759657 -180197 -3559837
2148 -3559837 -13379471 -22945533 -26699503 -28496820 -31785693 -28703664 -11134629 11305951
2140 11305951 19359505 10955280 4824689 13281232 26675257 32218101 32565574 33720335
2132 33720335 28726373 10199089 -11162237 -19736458 -20171632 -28905233 -43696890 -44180386
2124 -44180386 -25185457 -7690190 -9097568 -21150607 -26991025 -23664885 -16064065 -3126370
2116 -3126370 15571284 29865248 29824456 19677989 9669688 1481590 -7181085 -11844466
2108 -11844466 -8118104 -2323311 -1697827 -178175 11352361 25686906 26517091 12925473
2100 12925473 951248 1285318 10502978 24164714 41811832 56307590 55084921 38476037
2092 38476037 23204077 20878694 24861957 24507116 19868199 14711097 7257352 -2289291
2084 -2289291 -5425474 2529174 12096099 11911222 4274629 -1690218 -5123578 -9941866
2076 -9941866 -12288948 -5047345 7588837 12624258 5193882 -7266119 -17270643 -23563099
2068 -23563099 -25252390 -20391672 -12358758 -8339222 -8908814 -7400209 -1973884 494228
2060 494228 -3563688 -6763326 -968105 10809527 18865434 19409145 17206960 17702219 20816617
2051 20816617 21927108 17015225 7758630 1263787 1868277 4287199 336877 -7933874
2043 -7933874 -9674455 -1456742 7339177 9887421 12312940 20147955 24262854 14221836
2035 14221836 -289845 912724 17189921 23812119 6810131 -15547947 -18831498 -7228373
2027 -7228373 -4461635 -16291224 -22788292 -10549028 6068243 5977911 -8904318 -18320910
2019 -18320910 -12034287 -168107 3999020 -189803 -5506786 -8421701 -9789924 -9015226
2011 -9015226 -4575687 917137 2476058 929600 4181356 16536257 30201229 33135930
2003 33135930 24396461 14886496 11403211 7878145 -2345733 -13239714 -14716553 -9698458
1995 -9698458 -10086766 -16582096 -16140245 -2799191 11916352 15771524 11483394 7332056
1987 7332056 2762234 -5995783 -14734342 -17744350 -18504569 -21550880 -20486801 -8447049
1979 -8447049 5241987 5693562 -3588723 -5888462 346729 -1246267 -15898553 -27013447
1971 -27013447 -23129701 -16261720 -20378666 -27687987 -22610075 -7965652 11196 -3973160
1963 -3973160 -10825419 -14159437 -16621256 -20601558 -24043112 -24702793 -20689400 -10532923
1955 -10532923 -303278 -3072264 -19746344 -28650159 -11028604 17793088 22713830 -4929497
1947 -4929497 -35471842 -40908258 -28132231 -21807319 -29674778 -39882496 -43238790 -41719437
1939 -41719437 -37653649 -28518994 -14771911 -3923197 -3387670 -13396452 -27832068 -38565593
1931 -38565593 -39338396 -29812701 -16809352 -8199677 -4117124 3382974 20021716 40039612
1923 40039612 50196506 44442846 32427218 29145992 35524086 34940096 13917549 -17576611
1915 -17576611 -34131936 -23179861 1602645 16818199 12699660 -3446072 -20758712
1908 -20758712 -34606158 -44435253 -48558244 -44430717 -33069046 -21079019 -16010071 -18144679
1900 -18144679 -18745815 -10035177 3902229 11211826 8013714 3767223 7227741 13019888
1892 13019888 9356531 -4062686 -14864353 -15167513 -10849294 -9797666 -9469422 -4135841
1884 -4135841 1626228 -1454959 -9486782 -6627222 10919347 23784654 12226706 -17012792
1876 -17012792 -37712668 -34349668 -14610861 5607365 17379739 18483499 10402147 -166611
1868 -166611 -5918456 -8780605 -17082409 -30610442 -38464889 -35370606 -29038804 -25624125
1860 -25624125 -19264932 -4579746 10432543 14437708 8431007 1531552 -2409471 -4518536
1852 -4518536 -3769061 -212099 731484 -2612062 -1211810 11130835 23615260 21114839
1844 21114839 6324849 -4924478 -7365593 -10357791 -19180151 -27239896 -28910774 -27272608
1836 -27272608 -25998182 -24121769 -21593363 -20901600 -21130062 -18330804 -12616514 -7782770
1828 -7782770 -5195695 -5576447 -13081671 -27511264 -36874846 -30732729 -17707888 -15047065
1820 -15047065 -22933370 -25746107 -18657509 -14814699 -22697878 -33516077 -36909542 -34104993
1812 -34104993 -29071839 -20300773 -8160520 1552574 7374655 14623630 24150290 30429230
1804 30429230 33681088 40124256 47022615 43132895 28525517 17142225 13627761 5629843
1796 5629843 -12478618 -26924300 -27456573 -25623929 -35155270 -48180053 -47461987 -32347413
1788 -32347413 -17031681 -9719924 -6543811 -1525990 6834959 14641661 13556980 92897
1780 92897 -13981688 -12507772 1586327 9360921 5241326 3173057 8092668 6079805
1772 6079805 -5703994 -5622034 17553121 39861387 34532038 9390344 -10912639 -20873124
1764 -20873124 -27300504 -25327169 -10800512 -1685790 -15180789 -33891629 -27001043 1749116
1756 1749116 19040970 10823526 -4980167 -12689467 -14640711 -11405323 3756258 25436215
1748 25436215 36549471 33259045 27324442 21979313 9551422 -5020400 -4531988 11286027
1740 11286027 21421640 15440829 7661288 12576219 26415834 39433680 47455742 46289096
1732 46289096 33712724 21114084 23991310 37803048 42938687 35394364 30732451 35771251
1724 35771251 40287552 39985989 42479313 45807991 37292038 20427564 16445539 30360583
1716 30360583 41210928 35998043 27909289 29186933 30302967 19842877 4351918 -4126620
1708 -4126620 -2647728 8347892 26475723 38430546 31020272 14249217 10043986 18137424
1700 18137424 21003354 19496384 27713848 35581081 21670024 3093711 18068366 54245732
1692 54245732 60809735 45090218 73733901 140653907 125844797 -39158953 -237699734
1685 -237699734 -297328313 -207496967 -106007469 -76247686 -70448514 -34774478 2250532
1678 2250532 1178798 -16502083 -16126747 -7698733 -11961415 -17622414 -12222431 -13693212
1670 -13693212 -33685446 -46448426 -30537541 -8759256 -10746852 -24319606 -19793577
1663 -19793577 867552 13475327 11201836 3496991 -8232813 -24928433 -33979564 -25636734
1655 -25636734 -13085008 -12719478 -17189755 -10631448 2167588 4728779 -4160491 -13902895
1647 -13902895 -21910642 -29726421 -30189712 -18854600 -8287151 -11363423 -20024275 -19612251
1639 -19612251 -13860160 -15539362 -22166592 -22174821 -16938064 -15514727 -14799416 -6369756 2943108
1630 2943108 -885539 -14570499 -22027806 -20071166 -18559322 -17113886 -4002643 20081710
1622 20081710 37688610 38486058 30136259 20628430 6224448 -15709158 -35315768 -41331374
1614 -41331374 -36312632 -33334851 -40292556 -50797680 -50051450 -31326409 -7501731 -70605
1606 -70605 -13102233 -26803529 -23552567 -9975234 -2669458 -2746217 -133812 4718101
1598 4718101 2610301 -3873735 -1251874 11740774 20012329 15834073 9996096 11274972
1590 11274972 9717681 -6699753 -27995990 -30194818 -6789142 19750964 22810026 1476340
1582 1476340 -21277426 -27637269 -22565472 -18841931 -15125455 -1662973 16734422 20790658
1574 20790658 3844960 -16278118 -20713105 -12597724 -6769935 -7179606 -6743749 -2139443
1566 -2139443 3627386 8805272 12700093 11725950 4007138 -6306290 -15444879 -23728649
1558 -23728649 -27112836 -16339831 5767796 18508402 8822923 -7957062 -9199925 2335761
1550 2335761 5764998 -4609265 -14257648 -14340286 -12092140 -13918861 -16106777 -15280620 -12872169
1541 -12872169 -7000771 5778269 19204551 22054123 15039176 8496147 3623475 -6703771
1533 -6703771 -17661169 -13453890 5995586 19037399 12019851 -2316382 -6940900 -5247024
1525 -5247024 -10388869 -22459927 -30964370 -32051109 -30200114 -27892987 -24218379 -19827249
1517 -19827249 -15088280 -7270553 4123110 13916882 18110763 18133676 14127412 2477389
1509 2477389 -14448989 -25986857 -28325967 -31883119 -43559379 -51642200 -41813242 -20385471
1501 -20385471 -5395908 1056374 13195517 33651575 44234534 32407342 11673494
1494 11673494 2924516 5470466 2140195 -10854390 -16306092 -2039918 19866095 29528058
1486 29528058 25332615 21059076 22344067 20895325 12137783 3774202 2152183 2998153
1478 2998153 2567420 6054590 15790165 22096797 17537747 11054636 14565518 22878754
1470 22878754 21698200 10320743 841638 -1921129 -3827716 -6247256 -3415366 4374769
1462 4374769 9484114 10059546 11072145 11920182 7103973 -558101 -2760690 -2367581 -10263747
1453 -10263747 -23607212 -25748836 -12414769 573556 2113673 -235447 834586 -1251620
1445 -1251620 -10430135 -15932802 -10707838 -6074717 -12689583 -21003632 -17491771 -8351510
1437 -8351510 -8765508 -17206826 -18597814 -7956507 4820400 10024316 5114960 -8362391
1429 -8362391 -22414143 -22875893 -5096403 15608771 21372965 13996263 7493968 5389657
1421 5389657 229810 -9308253 -16137114 -16836583 -12908557 -3649549 9547819 17030190
1413 17030190 13275282 9911384 20189876 35393324 35011826 17337678 470999 -5719891
1405 -5719891 -7799744 -8265586 357729 15438975 20017952 8400861 -2499227 1235551
1397 1235551 9902433 8131042 -853355 -4222980 -1924987 -3059925 -5887963 1495451
1389 1495451 20360250 34441612 27953749 3692577 -19888610 -26346978 -14850492 1515985
1381 1515985 9487436 6874959 116959 -5457545 -8381794 -7125511 -752795 6911648
1373 6911648 10587056 10841457 11391315 10292536 2627682 -8254150 -12623462 -9467194
1365 -9467194 -9233369 -17567885 -25779312 -22743947 -8791831 6891923 16114159 15725633
1357 15725633 9246703 7266478 17751058 32828500 34751111 19087573 1907068 -967991
1349 -967991 9086439 23122625 38306466 52172614 55157185 42733844 27404394 24606748
1341 24606748 31525375 33174466 25788860 19941826 21072627 20464997 8707107 -11158205
1333 -11158205 -26797527 -26978879 -9220920 15966663 29599940 21312855 2057301 -7876109
1325 -7876109 -2926790 4428649 4182846 1382262 4392635 10541820 10831315 3421952 -4643000
1316 -4643000 -6745905 -2412431 5173123 13192389 20201753 25070626 26023964 21723004
1308 21723004 14028782 7772141 5080129 1305141 -9483575 -24963340 -34576173 -30884029
1300 -30884029 -18653609 -10613414 -14317873 -23774659 -25051765 -11733835 6176783 12581431
1292 12581431 4717825 -3302622 1237965 14150389 21975335 19458620 12579466 8316967
1284 8316967 8890724 13187971 16734760 13725368 6976682 10878140 32601508 53709176
1276 53709176 46283047 9358506 -26316504 -35446002 -25034675 -15321482 -9385626 2331934
1268 2331934 17227306 20536346 9483397 117287 5078982 16829028 19710294 10307061
1260 10307061 -1285952 -5200473 -78311 9684242 18992548 24119158 23100314 15786966
1252 15786966 4136230 -7045065 -11589185 -7376721 390559 4821273 5744593 8172920
1244 8172920 12560268 12632417 5119311 -4182415 -8321646 -8534529 -10002570 -11409403 -5980277
1235 -5980277 6916919 17743418 17337274 7811792 -140832 1197208 10224712 19538732
1227 19538732 22609855 17250513 5882077 -5584816 -10828767 -8124311 -2855773 -2756553
1219 -2756553 -9076868 -14191603 -10365240 125468 6691910 2301681 -9463527 -19788269
1211 -19788269 -23272272 -19253329 -8811360 4410872 12115440 6791786 -7829485 -15932446
1203 -15932446 -4629774 19993383 36255315 29253644 7434399 -7536898 -6355779
1196 -6355779 -699701 -3847916 -11112920 -8610634 3164298 7467555 -5455703 -25335195
1188 -25335195 -37370336 -40052904 -39473211 -35412060 -24864869 -13655941 -11550512 -17458631
1180 -17458631 -20816313 -17307353 -12746383 -11175504 -9706248 -6663045 -4939136 -5221830
1172 -5221830 -5126517 -6693099 -14853179 -26593185 -32503295 -31605540 -32444009 -35635272 -29609517
1163 -29609517 -11445464 1853513 -5198072 -23761102 -31666313 -20125045 1479402
1156 1479402 20397221 28772813 23752187 11432244 5532470 11136885 15804138 8107948
1148 8107948 -3039380 -2228301 6772872 7533661 -1086177 -3585819 5973966 16241681
1140 16241681 19392233 20453018 21355939 14636612 414467 -7648201 -2678221 4030663
1132 4030663 1252635 -6766328 -12584309 -18373140 -24903651 -22207550 -5708693 10248629
1124 10248629 10392039 -12716 -7295331 -12912045 -26096884 -40333171 -38799198 -21828628
1116 -21828628 -8669325 -9597692 -14588649 -14401529 -15545330 -25513718 -36996270 -38291328
1108 -38291328 -30787537 -24823946 -22842201 -17070424 -3348693 10632124 13534943 3562339
1100 3562339 -9233789 -13943114 -10243759 -6026761 -4378935 520534 11007995 16892752
1092 16892752 7516261 -11500353 -24366678 -26608879 -28680543 -36564693 -41266720 -33618059
1084 -33618059 -19109436 -8959917 -3783857 3064297 9990888 7328093 -6022500 -17061340
1076 -17061340 -15217121 -7074354 -7065648 -17150675 -24368099 -18994716 -7008857 -212027
1068 -212027 91394 2370204 10076253 15516049 10588213 -1541079 -8901484 -2982973
1060 -2982973 12801076 25502558 23947297 9859025 -3882794 -9081318 -12569727 -24300479
1052 -24300479 -39110203 -41751592 -29987965 -19385051 -20954954 -27026896 -26536582 -21607572
1044 -21607572 -18235166 -12032743 2194878 14938475 12804320 512883 -5115261 -1846665
1036 -1846665 -4708117 -19102696 -28815071 -19136258 1438657 13346945 11026325 5028264
1028 5028264 4252204 6610352 6367298 2491395 -2478189 -7604184 -14458623 -22813658 -27133685
1019 -27133685 -20768191 -5455413 7102975 7541200 -25630 -4373727 -2035932 900475
1011 900475 50189 -2188326 -2899914 -2451162 -939536 2499338 5799430 5488491 2379418
1002 2379418 -718241 -6352849 -19251645 -35623485 -45024663 -44420415 -40759326 -37496698
994 -37496698 -29705836 -16990854 -9526594 -13026618 -16854392 -7136433 13900776 30823711
986 30823711 33292678 23383853 8179497 -6058062 -13295461 -9374052 3270226 15639903
978 15639903 18218703 7514818 -10483489 -23084981 -21893384 -12432084 -7503060 -9797020
970 -9797020 -8781579 1899999 12913520 11922413 835228 -7700862 -6267052 2332031
962 2332031 11633772 15413579 9077430 -4500103 -13614721 -10726163 -4424287 -9373641
954 -9373641 -25473276 -36430541 -29900126 -10602555 8391761 19444239 22031225 17561925
946 17561925 8258976 -1682800 -8502157 -12321692 -16311369 -22443016 -28611118 -30052764
938 -30052764 -24364298 -15405375 -10646369 -13529337 -19570965 -20646681 -12293153 1939406
930 1939406 10884440 3361324 -18374736 -34654156 -27506808 -4863623 5695938 -8389483
922 -8389483 -28859575 -33697782 -26784373 -26206318 -33130807 -32113197 -19365975 -10024767
914 -10024767 -13307107 -18322044 -12978213 -2818017 12416 -3799356 -4929169 -2768502
906 -2768502 -5284556 -12949610 -14866733 -4475480 8518722 7400190 -12672911 -38261641
898 -38261641 -49688560 -38480877 -13923659 6052359 10206270 1612005 -7936583 -10103447
890 -10103447 -7323462 -8654027 -17900992 -26554765 -21400254 -332137 22501249 30268328
882 30268328 20565508 6370595 1232643 6137900 10473543 4239420 -10283349 -19171498
874 -19171498 -11855649 4663716 11901781 1958334 -13221165 -18975587 -17094615 -20113078
866 -20113078 -31909511 -43919381 -48064471 -43485180 -31646857 -15294455 -2716287 -1973077
858 -1973077 -8059542 -6307887 6886513 16997689 11943164 291972 -1391769 7032742
850 7032742 10356631 1882564 -7083507 -5478212 1060521 955096 -2911559 3696785 22543534
841 22543534 35084500 26425795 8441283 5939940 22121177 32869762 20180086 -2611530
833 -2611530 -10173038 -186369 6693880 -839696 -9185903 -1730828 16233341 24382551
825 24382551 13586749 -4142273 -11441288 -4737355 4620649 5037984 -2883610 -8780529
817 -8780529 -4855965 6808553 18262056 23165269 19733008 10623844 2115702 -120122
809 -120122 3453234 7974519 11684716 16018915 17839936 10817119 -1919488 -7008644
801 -7008644 511503 8197274 4885277 -2347412 -2025076 1599806 -1343275 -4700276 4788640
792 4788640 21181481 24396333 12352565 5943808 17079578 32407451 36473496 31753094
784 31753094 25554277 14944439 -2336473 -16779314 -20665542 -20746694 -24892920 -28081893
776 -28081893 -24688357 -22358342 -28302357 -32752110 -23342847 -7260859 -797547 -3544285
768 -3544285 -2257793 4244554 4972486 211804 2798408 11660728 5252251 -27515383
760 -27515383 -64868992 -74724278 -52225193 -22948136 -12011291 -19993462 -29941270 -30350600
752 -30350600 -25525689 -24176918 -24432956 -17545734 -5294804 -2712514 -17410740 -35066265
744 -35066265 -35304765 -16422804 6030369 20495940 26873000 25619512 14297759 -2224064
736 -2224064 -10538706 -3745524 9687501 16484391 12098393 831926 -11229163 -19537764
728 -19537764 -21947032 -20012109 -17555601 -17076879 -19149201 -23235712 -25708590 -20581025
720 -20581025 -7884049 1974387 -846468 -13140428 -24243994 -30103727 -32607118 -29330962
712 -29330962 -16814829 -2424409 1256820 -4763892 -6465909 1031493 6280300 1694883
704 1694883 -3587342 -24089 5272544 -594985 -16281391 -28302466 -28506255 -20225023
696 -20225023 -10593231 -4714092 -4784038 -8456787 -10182705 -8545211 -8794306 -14313266 -20389027
687 -20389027 -20737056 -15029795 -5729102 6296039 17872391 22143377 17736091 13111089
679 13111089 14765605 17468023 14204354 9203612 10847462 16700004 17252360 11912448
671 11912448 9511954 13438888 17511743 17882956 18499197 21499370 21160163 12328539 -1161520
662 -1161520 -11039930 -13568939 -10662362 -5514413 -479654 2445108 1481495 -4340204 -13745652
653 -13745652 -21716748 -22022216 -14048738 -5132750 -3095220 -8353915 -15769778 -20683516
645 -20683516 -19794676 -11278978 49209 2830711 -7114841 -16931472 -11013960 6460723
637 6460723 14965891 4894271 -10194452 -12661700 -1622571 11619116 20004554 23947562
629 23947562 23977924 19722065 14581445 14087648 19166620 25117428 26863755 22588295 14099281
620 14099281 6707482 6527655 14086031 21851068 21265603 11345504 -1470524 -9701534
612 -9701534 -9221615 -1347355 5657299 1316407 -14755348 -27860293 -22725994 -2379490
604 -2379490 14905593 18368201 16176039 20214991 27417684 24789695 9770454 -4209855
596 -4209855 -4743426 4074894 8253054 2358800 -4667279 -2234790 8116846 14224513
588 14224513 6682651 -11462675 -27704596 -31160445 -21030721 -5750273 5283600 9366463
580 9366463 10821228 15047095 23069744 31142220 34363972 31230936 25951586 24843689
572 24843689 27727916 24843609 8063240 -14648205 -23662666 -10523445 10564394 20208975
564 20208975 16135767 9097634 2856777 -7477103 -18594553 -17544876 -2869450 7854482
556 7854482 1951176 -9051975 -7600352 2140991 2430635 -7013690 -6925490 9662229 22935794
547 22935794 13500753 -10176414 -24132837 -19237658 -6057979 4022054 8140905 4983742
539 4983742 -6818253 -20544778 -22968837 -9478201 9129712 19089679 17785610 12489551
531 12489551 10154227 11997933 14535564 13091728 6900507 1741061 3965824 11684964
523 11684964 16883847 16582492 15107018 13758861 6650213 -8557739 -23177803 -27227313
515 -27227313 -21275078 -12498539 -4255013 3651191 9454142 12046956 14757231 18207350
507 18207350 13964111 -4325556 -26656880 -35742099 -30049463 -25582251 -32822836 -43914973
499 -43914973 -46983327 -42095021 -36559830 -33416934 -31908502 -32180592 -32068975 -25232559 -10151859
490 -10151859 3818564 7067869 2882709 2829599 11703698 23635282 30790772 29614627
482 29614627 20467851 7367534 -3065425 -7553039 -9510667 -12103240 -11245558 -1678579
474 -1678579 12687423 21617169 20372261 12385356 2274507 -6332989 -7993541 63032
466 63032 10305418 11195071 3044030 -1479555 4336675 11782548 10487998 2672657 -3610721
457 -3610721 -7736096 -13298178 -16916195 -12061258 -3178767 -4520795 -21504001 -41728875
449 -41728875 -49503337 -43200525 -32905941 -26086756 -22627772 -21002595 -21112002 -20803692
441 -20803692 -16938640 -11820757 -11755958 -15996659 -14225040 -1034206 13028282 13511601
433 13511601 1811610 -6978452 -5093759 -268059 -833879 -3487007 -1674554 2387216
425 2387216 1799454 -4406315 -11786237 -17195902 -18521534 -12324402 913261 12947389
417 12947389 16650681 15435245 16420083 18226675 14834574 8406717 7208182 11686047
409 11686047 14009740 12332820 13938941 21212367 25533858 20279967 10570730 4171867
401 4171867 817587 -2964451 -5695940 -5180832 -5569285 -12626779 -24993652 -35703532
393 -35703532 -39436647 -34461440 -22339194 -10465005 -9155520 -19688963 -30024385 -29245780
385 -29245780 -21561086 -18279538 -20688386 -20848200 -16569136 -14274376 -16534680 -17266007 -12302729
376 -12302729 -6344868 -5463060 -9108004 -13274940 -16121586 -16714744 -13018469 -5422360 832171
367 832171 361386 -6738657 -15128587 -17681624 -9267268 7567092 19823656 13833607
359 13833607 -8551885 -29250945 -33663496 -25519988 -17210884 -12249305 -6076967 568821
351 568821 889240 -5589336 -10958242 -11847226 -14145705 -19926259 -19472943 -5079713 13742593
342 13742593 19419586 8281354 -6189007 -11559525 -8653938 -4290479 -1135299 795320
334 795320 -424327 -5638719 -10884189 -11626518 -8385309 -4961337 -4082050 -7470023 -15843045
325 -15843045 -25016940 -26836931 -19369938 -11750594 -12262990 -15693398 -11185981 -171034
317 -171034 4060318 -4441907 -15495959 -16742935 -8260698 1320292 6419574 6735570 3253890
308 3253890 -1960721 -5348320 -6104725 -7852413 -12077030 -13878826 -9233938 -2431716 184909
299 184909 694646 5782489 13662854 13990768 3202930 -7990105 -7646762 2058179 8728532
290 8728532 6003868 -1199983 -7314782 -13989371 -23421741 -30207691 -27683734 -20073895
282 -20073895 -19055554 -26536658 -30167845 -21496158 -10069891 -9812123 -17312675 -17128263
274 -17128263 -7555183 -5757709 -21610217 -39610995 -38081715 -18910831 -5278856 -11382543
266 -11382543 -25925455 -28795509 -16244897 -3619411 -5661000 -19388036 -28647297 -23768992
258 -23768992 -12191485 -6954514 -9107419 -8858112 -2707898 858043 -3680958 -7941211
250 -7941211 -1328442 12892638 22268706 22106833 18787953 18199670 19814251 22091562 25293143
241 25293143 27154863 22712956 11337745 -906230 -8479294 -12239217 -15862338 -19371521
233 -19371521 -18907362 -12251861 -3325981 -14584 -5360547 -11283648 -5957132 10322649
225 10322649 22337656 17814251 2766381 -7900426 -10473206 -13548661 -21037697 -25052933
217 -25052933 -18151270 -3916448 8855635 16232073 19073942 17867332 12764498 6400219
209 6400219 2199454 -119116 -4850688 -14856073 -26202621 -30585341 -25799664 -21445028
201 -21445028 -27544487 -37808992 -34558732 -14386136 3013128 916375 -10890991 -12970095
193 -12970095 -7283836 -11579415 -26617648 -31848946 -17340523 1305665 8440688 9802421
185 9802421 16039847 20826397 11738453 -7367522 -21295863 -24959565 -25468424 -26879078
177 -26879078 -26482384 -24304864 -24065350 -24890703 -21898639 -14771855 -7672529 -1951267 3401108
168 3401108 6402302 5445520 5357804 11089096 17947335 18011407 13881374 14642589 19353510
159 19353510 17499656 7296106 469670 4647943 12834888 16443922 18247086 24407483
151 24407483 31942150 33079673 26512612 16086684 2934303 -12455767 -23460644 -21808849
143 -21808849 -8700743 5679615 14107879 17539532 18156195 14726130 8218695 5835826
135 5835826 13202248 24864511 28657372 19929932 6425470 -2646913 -7283470 -12332556
127 -12332556 -16843917 -15289336 -8687531 -5978808 -11005201 -15283366 -9708181 1412535
119 1412535 5203911 -3184758 -15522663 -21204810 -17342107 -8808525 -3569613 -7302863
111 -7302863 -17339672 -22870381 -16999984 -7360135 -7438437 -17989881 -26130959 -24100734
103 -24100734 -18399918 -15789717 -10703860 4595443 24511471 35426741 33365438 26594601
95 26594601 21875684 17683217 11914420 7118802 4515361 66483 -8525121 -16125065
87 -16125065 -16934334 -13113872 -10426777 -7674408 1853254 17664692 28472722 25775304
79 25775304 15807023 11627821 16081808 20014325 16960200 11113851 7808153 4437509
71 4437509 -2297326 -6205848 1414289 16462134 23940905 17160427 6356170 3985814
63 3985814 8641280 9765079 3394799 -4320732 -7538529 -7609594 -8457995 -9996137 -8844355
54 -8844355 -3969920 138355 -3306970 -15591538 -27887951 -27825044 -13094389 4437429
46 4437429 11686449 8546396 4190702 2005728 -3411825 -13376674 -18909173 -13719576 -6575779
37 -6575779 -11025853 -25132994 -31975510 -22301533 -7024970 -1484621 -4843986 -3858203
29 -3858203 7023550 19394486 24256469 21993759 16588457 8485252 -1894837 -10022848
21 -10022848 -12585631 -12686320 -14617594 -17597952 -19867463 -24041951 -31154082 -33530398 -23070799
12 -23070799 -5127158 5706905 4441609 940185 4081222 10294188 12833256 13883507
4 13883507 19462545 27519859 29904484 24396326
0 24396326
$$ Imaginary data points
##PAGE= N=2
##DATA TABLE= (X++(I..I)), XYDATA
65535 10824990 10362869 10538047 8535662 1332546 -6625416 -6879577 1812229 10104226
65527 10104226 9294749 3586728 5296321 17032479 25865922 20349116 7158473 2086047
65519 2086047 7999778 12711354 8616174 2583687 2591702 5388519 4214433 231400 -1777143
65510 -1777143 -2312988 -2934336 1440390 15805416 33345031 40404567 33021748 20516514
65502 20516514 12715207 11331053 14286272 19968201 24234420 20240568 6307044 -9315129
65494 -9315129 -15388936 -8501628 4194886 11881918 9830454 3734140 3403874 10888925
65486 10888925 17632218 15916806 9001109 5100101 5538572 6172772 7535749 14081618
65478 14081618 23570656 26871245 20572362 11415084 5166270 -856746 -9847907 -17337488
65470 -17337488 -16824824 -9035592 -808058 1851652 -3188455 -13451140 -21364022 -19685705
65462 -19685705 -10265582 -1914698 2353529 7856841 14708720 12380234 -4517838 -24392126
65454 -24392126 -32785091 -30702309 -27581809 -23441790 -12584398 -212226 1715901 -5166367
65446 -5166367 -5969271 4317806 13877937 14855630 15332641 22750910 29738072 27155161
65438 27155161 19659872 16444850 16047778 12943641 11024691 16424674 22764587 18348449
65430 18348449 4823728 -5632218 -9727210 -14872180 -21932343 -21827466 -12231182 -3023897
65422 -3023897 -107796 2616964 8573199 9189202 -1101883 -11812388 -10426867 -1527044
65414 -1527044 1046110 -3795709 -3708369 6834150 17887008 18142011 8873863 244537
65406 244537 -764585 4065085 7194449 2578894 -7579643 -13631625 -8718015 3026414
65398 3026414 11502280 11755116 6305153 -714526 -6109507 -6209306 509382 9369392 13448109
65389 13448109 11607852 8052957 5373762 4167641 8146847 21075625 37121270 42426212
65381 42426212 30350340 9715482 -5489870 -9957937 -8143173 -7011412 -11216236 -20535016
65373 -20535016 -28097822 -25442814 -13299582 -3126439 -3550235 -9464351 -9930909 -3179491
65365 -3179491 3095710 4412582 4710684 7849457 10642791 8130119 1929293 -1086551
65357 -1086551 2665067 9773894 14912344 16650305 16743601 16065858 14179469 11705312 9347440
65348 9347440 4805510 -4669372 -15594369 -19464247 -13232118 -3281472 4239056 10469007
65340 10469007 16379080 16513107 9000468 4211658 10704576 17797664 7955402 -15194720
65332 -15194720 -28812876 -22955968 -12441211 -10533104 -9437172 1520427 14639943
65325 14639943 16630686 10690099 8368881 7883931 -545735 -12096292 -9531809 10944801
65317 10944801 32241377 38166726 30016152 18673813 12259746 15125757 27656162 41865188
65309 41865188 46075276 38405965 27972590 20159484 10531327 -2313574 -8518883 60913
65301 60913 15703100 22703363 16156043 5666692 2118019 6665309 12570464 13844914
65293 13844914 11283169 11007771 16651150 23863109 25381041 20763268 16440877 15624002
65285 15624002 13559548 5104318 -7562875 -18022463 -23293393 -25274539 -26183349 -24917619
65277 -24917619 -17824630 -3279927 13648219 23096663 19907589 9739875 2470925 1424690
65269 1424690 2981439 4188849 5128436 5512034 5124220 6648175 12146720 18068506 20039619
65260 20039619 20763498 25558259 31405866 29061626 16030240 -420275 -12555165 -16489524
65252 -16489524 -9495232 6239882 18498073 16211432 5845128 3288508 9143409 8265398
65244 8265398 -3526843 -11012933 -4699753 4477554 6328374 9029301 20702702 29619403
65236 29619403 21580541 4965812 -1571721 2511225 3996473 1703734 5957653 15718824
65228 15718824 18625787 14115933 15040062 23252310 24326584 12624518 2524459 6020461
65220 6020461 15742926 20165641 20768944 22794068 22378103 16243980 13415312 22561137
65212 22561137 35145535 36017662 26083067 19746267 22026450 23192034 17508690 13043027
65204 13043027 17008430 22527427 19029029 9201541 5177512 9509871 9992024 -3134140
65196 -3134140 -21887847 -29105557 -19406880 -4510035 2311571 -191935 -5531315 -9791444
65188 -9791444 -11826057 -8820052 112668 8362683 8019548 1203982 -2179165 1698095
65180 1698095 6535797 7298632 7943814 13618425 20772019 20567374 10084068 -3621352
65172 -3621352 -10212720 -5654717 4015082 8667631 5172488 919158 3822393 11701346
65164 11701346 16472369 16421192 17232847 21416519 24592402 23767392 21684883 19713330 13132199
65155 13132199 -1476536 -18259401 -26354588 -20902494 -8162638 -1212917 -9478299 -28137959
65147 -28137959 -38971846 -28422356 -5099630 8660886 4250696 -3924746 -1148963
65140 -1148963 6189652 1864089 -14213626 -24249594 -16629144 -857644 5582584 -1487036
65132 -1487036 -10225057 -8386085 3571982 15513031 20057158 18649863 16009763 13336307
65124 13336307 10282359 10180828 17165187 28160115 33512227 27737439 15812212 6814656
65116 6814656 4441061 5619353 5847287 4035694 3396951 7874721 16526731 22915135
65108 22915135 22264716 16729484 10539219 4278377 -404254 4255600 22387965 42203517
65100 42203517 45426880 29947957 12070139 4742354 5451229 8056080 12173811 14399087
65092 14399087 4883761 -15833946 -27849969 -13901752 16077291 35670700 33313450
65085 33313450 20734083 12912375 12293824 13337443 11864689 7012257 852872 -1992314
65077 -1992314 927510 5649419 6703471 4883525 5337503 10006997 17310070 26674185
65069 26674185 36589400 39914064 28961918 6245176 -15528985 -25601057 -23936637
65062 -23936637 -18041422 -14411666 -13431176 -11192674 -6700423 -5643860 -12273195 -18930666
65054 -18930666 -12972043 3854949 14075576 8122320 -1877350 -242771 11113539 20088189
65046 20088189 22340153 19078895 7270133 -11833213 -22851315 -13679902 3069720
65039 3069720 5980569 -2143519 182922 15959441 23867296 14085014 3767440 5903426
65031 5903426 6707141 -9267204 -30637664 -35858558 -25069256 -15081034 -11982208 -9303546
65023 -9303546 -7766351 -15558291 -28965985 -31572758 -17039791 1508759 9714679 8022048
65015 8022048 4537809 2575012 2341280 6794968 16949100 25327399 22176034 7412898
65007 7412898 -9440840 -20963888 -27697773 -31366948 -29154086 -19947860 -11460481 -12807420
64999 -12807420 -21427549 -26795415 -27759531 -34204092 -46757555 -48717155 -29481500 -4282771
64991 -4282771 5410135 2308298 4339260 11114996 4323647 -16969321 -27866872 -14088618
64983 -14088618 6265416 11423975 6222358 6267017 9524354 5336022 -1168501 2326617
64975 2326617 9830085 4309736 -12261217 -19039270 -7463975 8645820 17140516 21556052
64967 21556052 25502467 22520356 11297936 4869880 12294882 23005737 22069314 12240985
64959 12240985 7936055 13129869 18392280 17704522 15909544 17558637 17948323 10407168
64951 10407168 -2473658 -10721182 -9466123 -4857474 -4912231 -7654819 -4344475 5375861
64943 5375861 9574753 131384 -14195282 -18811787 -12297362 -4356341 1526660 10401348
64935 10401348 20776045 21466227 8707133 -5416015 -9386452 -7753008 -11120121 -18182159
64927 -18182159 -18960689 -11991631 -6326785 -5913681 -2427086 11792778 30187445 37711088
64919 37711088 28531626 13109283 6186292 10531678 15902841 13515888 6635845 3936003
64911 3936003 6971515 10552452 13108280 18105757 24203612 23016974 11387763 -1231073
64903 -1231073 -4375831 -658958 -409273 -4956990 -4334520 7307952 22116380 28878952
64895 28878952 27870223 29194903 37964328 47591129 49806726 46105852 44058583 44669563
64887 44669563 40482511 27846507 14645897 11119538 16987901 23088195 23273024 19166533
64879 19166533 14847389 12609594 13112877 14232200 10742239 919016 -8171273 -9330984
64871 -9330984 -7512946 -13225856 -23326517 -21458305 -2798394 14727288 14156585 3906946
64863 3906946 4516257 17555226 24309566 14209071 -2202641 -12414520 -18586635 -26770929
64855 -26770929 -32272875 -27985957 -18982248 -14829577 -11737489 2381722 24855695 35895282
64847 35895282 25234267 8218000 5454051 15728024 21380454 14804534 5331562 872046
64839 872046 -2707708 -9734891 -14241376 -8976956 2612981 11033277 12709898 11164655
64831 11164655 10173486 11214862 14176818 15947790 12415119 6178506 6471328 15344060
64823 15344060 20349040 9918644 -8776267 -18036342 -13420894 -8241094 -13970000 -26390779
64815 -26390779 -33687768 -30161629 -18872687 -6696467 936201 4729018 11065227 22508519
64807 22508519 31356487 29689911 22718081 22064358 27562999 28032330 20607248 15423631
64799 15423631 17298725 16686879 6229434 -5734219 -7873163 -2739014 -307483 -1348496
64791 -1348496 1841577 11538528 20512986 20463873 8950271 -9357764 -24032192 -25820773
64783 -25820773 -16806229 -9041943 -9391821 -12195098 -11032918 -8824874 -9328594 -7763209
64775 -7763209 434833 9152678 10685071 8729168 10727456 13257946 8390437 210911
64767 210911 123961 7208039 8142663 -2090332 -13035816 -14968094 -9941359 -3099296
64759 -3099296 5478544 15244993 21249775 21161227 18641661 15851189 10398262 3228110
64751 3228110 895121 5273322 8890614 5499441 -1934947 -8300872 -13405418 -16631534
64743 -16631534 -13012298 -2017682 7000092 6591405 2533695 4447474 10275985 10554576
64735 10554576 4923581 2610270 6125460 5793819 -5081186 -17655264 -16569087 1799534
64727 1799534 24794327 35998575 29948359 15866420 8689502 15176507 27482019 31642516
64719 31642516 23203835 12065608 9756069 14673668 15028086 6397450 -275986 6962706
64711 6962706 23097593 30636469 21951961 8345690 3047703 3447730 -1656751 -12384162
64703 -12384162 -16374487 -7115684 6110703 9945794 1636806 -11522642 -20964818 -20349994
64695 -20349994 -6357359 16504709 34421668 35204750 21575375 8540777 6718156
64688 6718156 13027515 19155375 23060029 27013497 28468521 21211289 6208867 -6515129
64680 -6515129 -10655049 -11679199 -16287152 -20204518 -16007926 -8887675 -11596370 -23488487
64672 -23488487 -28744415 -20156900 -11002568 -14485826 -23310638 -21743088 -8821998 4318791
64664 4318791 13547757 22696114 29108103 24482478 10484606 -626076 -2702456 -990183
64656 -990183 -8454 1158116 662802 -5054045 -10060625 -3636153 10439720 15118983
64648 15118983 5952078 -967793 5008567 12344772 8533810 2012676 6782873 17810344
64640 17810344 20380721 15460852 16200915 23480463 23991623 12444890 -873460 -6580806
64632 -6580806 -6449200 -4912457 -2262428 1259938 4619072 10506949 21336511 31005503
64624 31005503 31131806 24906748 23029083 26366110 26180065 21913038 22647683 27690617
64616 27690617 23507287 7653405 -1755496 6966679 17537901 7830898 -16792184 -31060318
64608 -31060318 -25599280 -16202900 -17347559 -23818543 -23232176 -13105208 1150979 14941608
64600 14941608 23975375 22634963 10292665 -5275925 -16333822 -23062495 -28570387 -30949658
64592 -30949658 -26302173 -16121068 -5164552 5929895 19332925 31855692 34444829
64585 34444829 21853886 -298004 -18968425 -22534133 -8139041 15752986 35060207
64578 35060207 42226960 41513225 38728394 30132771 10153879 -12558656 -19973177 -8758441
64570 -8758441 3287394 1992909 -4072134 -283350 8843944 7249780 -5287280 -11346765
64562 -11346765 -1891477 12312169 19125302 20168761 21170691 20089737 13550434 5249682
64554 5249682 -990062 -8611222 -20027311 -27712318 -22449306 -5585296 13938754 29147214
64546 29147214 35385180 29169796 15530631 8686570 14509347 19361430 9253506 -6144762
64538 -6144762 -4795355 15273465 32956451 35526188 34864547 44192015 53619940 42610072
64530 42610072 10094249 -20482095 -25934998 -5846020 20214062 33059484 29467864
64523 29467864 19118654 9565925 -631848 -12533900 -18550502 -12010058 -445610
64516 -445610 2079901 -4792286 -7084764 1849755 11297163 10421802 4650020 5981326
64508 5981326 14347807 18615139 12839556 3140939 -735131 4924363 15793948 23322874
64500 23322874 21858341 14595637 10296969 12464962 15749840 15218245 13595690 15196308
64492 15196308 18117078 18237044 16676035 16781586 16827024 12553520 5257567 971086 2369553
64483 2369553 6843137 11453114 14236315 11752756 1897447 -10558959 -17529197 -18023556
64475 -18023556 -19174205 -24736547 -28307119 -21940610 -7395021 5902626 11594338 10273926
64467 10273926 4258611 -5268105 -14397867 -15693299 -6534298 4211719 4148559 -7341278
64459 -7341278 -17409215 -15889550 -7810509 -5117611 -10240076 -14705875 -12076147 -4699895
64451 -4699895 2575940 8049799 10661829 8681252 4179079 2926481 5643236 4398520
64443 4398520 -7084167 -23200250 -32150501 -29843231 -22963090 -19128631 -18888768 -18133933
64435 -18133933 -14812618 -11267958 -10760676 -12759867 -12867714 -8676088 -4402393 -6436302
64427 -6436302 -14351921 -20326661 -18674043 -12275751 -7907973 -8502820 -11543776 -11766221
64419 -11766221 -4415268 9745848 21108709 18315194 1902917 -13921756 -16974752
64412 -16974752 -10353656 -6174295 -10401561 -18447572 -22055608 -15952691 -1321305 12768714
64404 12768714 15436503 6469345 -1872942 -1255583 443714 -7909694 -20516948 -20029907
64396 -20029907 -2581244 15387419 18699954 10714858 3437850 378037 -2065467 -3119107
64388 -3119107 1800312 11509610 19458879 23562376 27401069 30496545 25716356 10475573
64380 10475573 -5677525 -10170922 -465026 16409869 32807670 42642850 39237706 21404470
64372 21404470 1114504 -6190329 -1838771 -3285755 -17585940 -27367915 -14022175 14311267
64364 14311267 32130009 28842997 16507219 7484528 914419 -6066725 -8907773 -3884060
64356 -3884060 4971287 12365454 15975430 11625453 -3694353 -20095828 -19880949 -1019044
64348 -1019044 17920695 24220962 27873496 40966230 54623952 52022000 33972460 15413391
64340 15413391 4303303 -350551 3024133 14783116 24057152 19843666 8620778 4604634
64332 4604634 6505956 1852419 -8823636 -12147556 -5583101 -413439 455155 6662153
64324 6662153 18608864 23113185 17676883 17564041 28175202 30905269 11504329 -14324288
64316 -14324288 -21125990 -7255534 9092553 17989648 23917757 29278863 29180604 22192428
64308 22192428 13362243 5931553 -837071 -6118783 -7076927 -2669577 6942604 20636692
64300 20636692 31352638 28468906 13020593 2942232 12680427 33456003 44815109
64293 44815109 40337689 29231601 16823929 -737810 -21454967 -31673646 -21233977
64286 -21233977 3906173 28730336 43173742 46334746 41909757 32940909 19838428
64279 19838428 3664755 -8814634 -8957050 1328574 8043537 2896776 -4393340 -1397162
64271 -1397162 5915657 1002519 -17309342 -31908235 -31732592 -24969226 -23814367 -28238347
64263 -28238347 -30924480 -28572012 -21603135 -10117073 3461120 13102964 15358526 12297033
64255 12297033 5991299 -3322393 -11247043 -10144865 -784230 5439477 2252707 -1608120
64247 -1608120 3592088 11786040 8859283 -6830601 -22794470 -30386635 -33957472 -39822653
64239 -39822653 -44657952 -39994889 -24099028 -4791450 8606244 13787594 15808947 19651387
64231 19651387 23539431 21588058 12924098 4406323 2147157 3773446 2550978 -3383979
64223 -3383979 -9728107 -11822428 -7723923 2462212 15278499 22977119 19460490 7855797
64215 7855797 -2341692 -6487970 -8712379 -13421375 -17831805 -16323282 -9129049 -2479214
64207 -2479214 -154493 2692718 15401636 39667875 61360276 59160486 26935145 -14657561
64199 -14657561 -36553386 -31958683 -20750549 -21279371 -28015293 -24127189 -7163166 9383659
64191 9383659 15591194 13895662 9649471 5023803 3680158 10015932 20054594 22940700
64183 22940700 15944861 9111182 10517584 15987500 18402814 17409643 13666227 4075599
64175 4075599 -8987500 -14540492 -9475266 -7135634 -16348344 -23284002 -12005956 6461768
64167 6461768 8547477 -3267690 -3035385 15278256 24966043 7905212 -16036320 -18556656
64159 -18556656 -3441706 3573003 -5918084 -15393831 -10603023 4219868 17254337 22006920
64151 22006920 17839501 7998593 -987718 -4201906 -2539318 1222030 6091686 8632231
64143 8632231 2614686 -10439103 -18511056 -15363648 -11232930 -17223149 -27643534 -30132426
64135 -30132426 -25302096 -21887606 -19081656 -9900117 2572190 9173639 11671232 18520737
64127 18520737 26189399 23666421 14871744 15728398 26232064 26924829 9996163 -6485656
64119 -6485656 -5904235 3226674 4190647 -1705635 -662570 11846003 28644517 43132157
64111 43132157 52185043 52720945 45845168 39548439 38907505 39216421 36054242 34383026
64103 34383026 38656482 41766874 34913990 22536203 15995328 16695102 16683828 13071295
64095 13071295 10823134 12302881 13678411 11886173 7676027 1728131 -6250779 -14734390
64087 -14734390 -20687143 -21239203 -13266659 3310810 18765031 18408994 916238 -15827404
64079 -15827404 -15280524 -1288580 12235339 21735119 31422943 37841665 33580495 23591533
64071 23591533 21254426 27533857 29297719 20862459 12512292 12687820 15126505 11196945
64063 11196945 4349613 3397747 8515723 12298691 10573894 5534079 647261 -2843747
64055 -2843747 -5900152 -10496613 -16603798 -20080081 -16839689 -8605184 -126892 7955281
64047 7955281 17225328 23958268 22304627 15440611 13496808 17577042 16144837 2750960
64039 2750960 -11981948 -13820575 -3371723 7321646 11433403 11651635 11047025 9144082
64031 9144082 7239524 9731515 17155582 22061253 15272021 -3701061 -23315536 -29158932
64023 -29158932 -19373640 -9498246 -16406329 -37201142 -51266816 -45584701 -29535571 -19104998
64015 -19104998 -14975865 -6200971 9636905 22239676 24382120 21025148 19594421 19498855
64007 19498855 16122548 9878242 6282269 9351777 17825103 26268971 28850481 24555381
63999 24555381 19416937 20571291 27661674 33774049 34876559 32851838 28202225 17290873
63991 17290873 1219218 -9413320 -5747737 7757027 20255079 28839313 36934402
63984 36934402 41772335 35640670 20248820 7577448 2854217 -1666343 -10867279 -17475366
63976 -17475366 -17093221 -19560934 -32146977 -42630301 -36845225 -25127488 -29431579 -47025596
63968 -47025596 -51758664 -35004718 -19646646 -22785035 -29394853 -21121177 -9602644 -15428086
63960 -15428086 -28766591 -22229379 1835084 9106886 -15880182 -44316634 -41463808
63953 -41463808 -9876136 21001710 33056471 30458670 22821089 15399750 12572937 16461098
63945 16461098 21705965 21181007 16657277 16343548 22867094 30442283 32732179 27432429
63937 27432429 14975480 -673040 -11500296 -12798058 -10402399 -13713320 -21561947 -22466813
63929 -22466813 -10890360 3462633 6802432 -2157310 -11314364 -9844741 -257835 5444544
63921 5444544 216501 -10162613 -15368214 -14177710 -14833226 -21772878 -28647631 -28014585
63913 -28014585 -21892816 -16459529 -10622169 1813297 19853975 33537114 35847365 29514209
63905 29514209 19536674 5722052 -12358383 -27798856 -31129861 -22716844 -14641580 -16854961
63897 -16854961 -23875913 -19964032 938720 24367939 29719296 14690761 -1774478
63890 -1774478 -3968550 1003042 -3555243 -16494838 -18138148 1014357 24015738 28246591
63882 28246591 13398602 -2493530 -9272652 -12781385 -17456485 -16673745 -7420996 -1994163
63874 -1994163 -12623127 -30812003 -35556826 -20996368 -3535262 466702 -7274718 -15596241
63866 -15596241 -19683792 -20055103 -13770780 2174613 21144824 30085297 23302556 7328022
63858 7328022 -7600100 -15693652 -16115971 -11096254 -4231278 2567338 9179882 12026547
63850 12026547 4216675 -12599635 -22556692 -12893638 6171470 12288096 1577892 -6674536
63842 -6674536 390357 10880322 8373569 -3482125 -9882827 -8409872 -8086311 -10412685
63834 -10412685 -7558060 1273072 6104210 1213855 -7301477 -11358535 -8291475 3128101
63826 3128101 22327437 38816875 37140709 18080016 4380595 13954867 34389862
63819 34389862 37420320 15825604 -8273332 -13748373 -5490593 -1685528 -6082163 -5104505
63811 -5104505 9942329 29303827 37031167 29828738 18079859 11023259 6709564 -2110198
63803 -2110198 -15434216 -23068568 -15897759 1462621 13641360 12445996 7553147 13551039
63795 13551039 29018805 37391250 29539394 15477375 8838745 9305022 8867694 7542417
63787 7542417 10911564 16252855 14172025 3808852 -4950160 -5327509 544406 9876818
63779 9876818 21239113 26706756 15979789 -6100196 -18919427 -10781696 6895977
63772 6895977 18476644 25480772 37339347 50723616 53230883 42785599 29222573
63765 29222573 18821081 10004711 3176180 2167303 4900881 3597090 -3596811 -10042297
63757 -10042297 -11208467 -9782627 -9182162 -9934612 -13423562 -21071185 -28435837 -28132408
63749 -28132408 -20572689 -14635109 -16040682 -21911660 -27775435 -32293904 -33686049 -29436674
63741 -29436674 -21685717 -15682063 -11476479 -4828728 3020099 6215792 6500671 12951019
63733 12951019 25396073 30359074 20990620 9878043 11510345 20487376 19506777 4215753
63725 4215753 -12042985 -16612465 -10081335 -241871 7640283 12622192 16165570 20255750
63717 20255750 24386115 25213953 22028865 19448505 20219295 19243817 11375715 1950501
63709 1950501 1133966 8965675 14851627 12706354 8189940 8525949 12621015 14800095
63701 14800095 12189827 4954807 -4605643 -9011874 1576033 26257961 47311254 45801389
63693 45801389 22884966 -1072687 -8799603 -1352105 9155282 13945156 10958904 1253901
63685 1253901 -10348698 -14512910 -5504706 10260351 20777705 23937396 28864555 39851481
63677 39851481 47644250 42531159 29235890 20478455 19589434 18329348 10410873 -1425577
63669 -1425577 -11869878 -18322711 -18448405 -10456814 1437476 8899553 10053089 11410363
63661 11410363 15563937 14628807 2472562 -12644688 -16366807 -6456404 5537588 10171590
63653 10171590 9820494 10779725 12337105 8558662 -1252090 -8290314 -2494630 15158404
63645 15158404 30751318 30799305 17408362 6192514 7754408 15922509 17966901 12260802
63637 12260802 9707972 19006824 36370303 50501572 53273412 44485257 30245932 18892434
63629 18892434 15764321 19257493 22462953 19526554 9886058 -3197567 -15869895 -24428696
63621 -24428696 -25154546 -16556207 -2618140 8110099 9341894 3740407 820157 6375283
63613 6375283 15611325 19500627 16368805 12512028 11380559 8359933 -583042 -10505621
63605 -10505621 -13394301 -9233555 -4550093 -1352873 4590640 12879552 14134890 2718863
63597 2718863 -11232355 -11204324 4723902 20607821 22907570 16111507 12270159 12109187
63589 12109187 7211318 -2058295 -4371878 3800732 9883935 3172650 -9180588 -14370203
63581 -14370203 -13688019 -16983917 -23099820 -21483083 -11817612 -5783489 -6895733 -4513391
63573 -4513391 6136933 13014968 6368516 -3203210 1356447 18914077 32222644 31231241
63565 31231241 23331624 21447750 30389320 44523494 52633695 46221285 28278639 12069852
63557 12069852 6940067 8626004 8027512 4550888 4320941 9619653 17405814 24836196
63549 24836196 29399427 27366924 19185546 12346601 11669909 11666024 6649240 2405682 7411883
63540 7411883 18092732 24918352 27772732 30991040 28318559 11300804 -9002978 -9536120
63532 -9536120 12386526 34510454 42907680 47908632 56880673 54761058 30793446 5944067
63524 5944067 8144235 30266167 39187652 23395388 5543744 4818065 11691134 10010875
63516 10010875 3507889 4526858 9688593 4682824 -11822837 -24311244 -20439410 -4300766
63508 -4300766 11337129 17928141 14856821 7003633 1184609 1084019 4478528 8268176
63500 8268176 14776850 27251607 39395253 37769901 19001544 -1902767 -7487538 1209781
63492 1209781 7212899 66874 -12364677 -16529117 -10158029 -1466841 3704584 6862797
63484 6862797 9926216 9745064 2234588 -10763100 -21559338 -23866938 -19371607 -16183150
63476 -16183150 -19696425 -25890351 -26446352 -20353759 -15852880 -18560738 -22256653 -16255543
63468 -16255543 688539 19008787 29441232 30499824 25853775 19941347 16665538 17290948
63460 17290948 18351910 15734024 11211480 9864581 10503167 5802383 -4692590 -8987132
63452 -8987132 2711748 21829360 28767910 16583442 -427836 -4898094 2755276 7161212
63444 7161212 -1095160 -14081152 -17533418 -8427643 2494286 4031938 -3551130 -9954961
63436 -9954961 -5129994 12138188 32587803 42435838 34698539 17103618 6049847 9920043
63428 9920043 20440702 23017499 13025416 -1333214 -9550489 -7637570 1555676 11172736
63420 11172736 13651936 6633098 -3031534 -5345528 1159303 7420457 5168425 -3399274
63412 -3399274 -9803412 -10013864 -7343609 -6348666 -8265829 -13119363 -22208954 -34886315
63404 -34886315 -44284315 -41058053 -23649370 -2101810 11173842 12608666 7096909 -133977
63396 -133977 -6319406 -8662962 -6289643 -3910790 -5923086 -7104012 1574954 16712202
63388 16712202 23202042 15441548 6540836 9302126 18546455 21792071 18100329 14603576
63380 14603576 11604572 4176725 -5954895 -12518606 -15453560 -18446468 -19658888 -16564011
63372 -16564011 -15567849 -23363585 -32291092 -29077541 -15877760 -7193040 -7401575 -8015091
63364 -8015091 -6694507 -10213831 -16364015 -12709827 972394 7976991 412286 -8147068
63356 -8147068 -5368144 1864158 4122911 7561048 20219167 33723653 35356204 28462860
63348 28462860 24771848 24693166 21446063 17959688 22594837 31824280 33327522 24943899
63340 24943899 16300772 12218279 8086553 2633890 2607400 11307234 21699796 24666910
63332 24666910 18521004 8819432 2993540 4819919 10462523 11752384 6634197 2641097
63324 2641097 6197481 13666824 17986059 18350188 17375206 14942994 11883619 13323531
63316 13323531 20118397 22923133 14029351 398713 -4104378 4323798 17828366 27530000
63308 27530000 28551039 20467799 10589881 10050975 18526947 21184996 10327305 -136433
63300 -136433 5074100 17510993 16736647 586296 -14050210 -16955691 -13421061 -8706907
63292 -8706907 -504528 11945207 24678619 35069205 39948722 31805067 10901054 -3954671
63284 -3954671 5347272 28874665 39338458 28847104 15345872 12489117 14515610 14100276
63276 14100276 13881346 14178862 8503515 -1918275 -6680204 -4766024 -6154417 -9775677
63268 -9775677 -1332820 18630283 27167432 12274270 -6977306 -9344758 -1876546 -3345650
63260 -3345650 -12959132 -15859760 -8767524 -659080 4391133 7740983 6183780 -2472924
63252 -2472924 -9417127 -5191986 5080534 10145901 10073624 11448271 11883864 5457450
63244 5457450 -885934 6631103 26944693 43221366 44348567 35143381 24625465 15722122
63236 15722122 8484653 3945895 1977615 1146594 1322485 2380494 2571488 2553787 7041920
63227 7041920 17163761 25769134 26060246 20178531 14117589 10038396 8463764 10102059
63219 10102059 9708002 -1978401 -22425122 -34392555 -28851283 -19374821 -20920621 -25646904
63211 -25646904 -16477460 3979855 17142166 16628867 14298425 19491748 28646958 35524502
63203 35524502 37439642 31658077 18806992 8631838 9202879 12594874 5466977 -8895801
63195 -8895801 -15674180 -14162136 -19224690 -34320290 -41863095 -28477341 -5778111 3742743
63187 3742743 -6478849 -21462923 -21767134 -3848330 13866812 8558251 -18734023 -40536169
63179 -40536169 -37550348 -24656369 -27102566 -42246729 -47732878 -40336724 -38648301 -47647346
63171 -47647346 -49757202 -36808802 -23439470 -19246793 -13403026 838508 10920256
63164 10920256 9200450 9183731 19610905 23561684 4667547 -23337705 -36117515 -34113314
63156 -34113314 -35598251 -45384636 -53476154 -56531380 -57640331 -50560714 -27313247 711178
63148 711178 10487370 -3094919 -22382650 -30916857 -26449958 -12670712 4141102 11137985
63140 11137985 -199436 -18146287 -22387824 -12178979 -5677069 -10619044 -15283368 -12144681
63132 -12144681 -9746300 -12805962 -9563012 8533082 29102818 34836769 27486756 22855994
63124 22855994 28016011 34528874 30952248 14775600 -4817542 -12347506 -320842 18785529
63116 18785529 23600441 10879824 289856 5941722 16279921 13153734 -1420594
63109 -1420594 -12720177 -17880597 -24070975 -27094989 -13389564 14121883 31719470 24844309
63101 24844309 8119830 5297304 19366354 33152352 32608590 18995806 1999328
63094 1999328 -9619177 -12076933 -8772544 -7651521 -11288746 -12307603 -4433449 5783115
63086 5783115 6729606 -1150560 -6196782 -3744935 -2612546 -9834870 -19019032 -20696673
63078 -20696673 -16769185 -16226990 -21036122 -24815049 -23387170 -18807729 -13436388 -6863268
63070 -6863268 836735 8527757 17100454 27568823 35498218 33506882 21537919 9224208
63062 9224208 4667820 5105645 2731400 -3445795 -6743070 -3080138 2724026 3011825
63054 3011825 -2740695 -7010077 -3514909 4844552 9047249 3871477 -6973763 -14410238
63046 -14410238 -10635013 5209553 23312549 27263057 9482288 -16883335 -29798780
63039 -29798780 -24005688 -15389838 -16570307 -20805212 -18396025 -15829418 -23739553 -35053079
63031 -35053079 -33692881 -21220757 -15636521 -23039214 -28880388 -21525865 -7845366 855792
63023 855792 3249656 720764 -10002987 -27055176 -37961287 -34320396 -22701228 -12424709
63015 -12424709 -3120390 5989164 6350529 -6601065 -19202012 -14026830 6190023 23058254
63007 23058254 27646827 27630618 31079225 36241130 38431136 36718481 32461692 28924083
62999 28924083 31688626 41712046 49696820 46073130 34996712 29008035 30757418 30209624
62991 30209624 20732763 8339749 2533199 5366123 11729606 14990026 11966876 7344211
62983 7344211 11207027 25690819 37341350 32005568 14784000 3735688 4698326 5901635
62975 5901635 -197891 -4370533 2833540 13858828 14147183 2539173 -8787667 -11743542
62967 -11743542 -10646280 -13006970 -18317217 -18406098 -7463370 9146416 17713738 10587809
62959 10587809 -3767376 -10273462 -6118630 -2686209 -6939689 -9868858 158534 19040320
62951 19040320 31035175 29042229 21953241 20464673 23155648 21424740 13704287 7657426
62943 7657426 7915697 7991436 -1066716 -16872939 -26136391 -19033246 957335 21618922
62935 21618922 31973347 27865202 13870461 1517453 -452822 3243173 -491930 -14616641
62927 -14616641 -26054873 -23086660 -10686052 -1253670 2881742 8237104 16337311 21583644
62919 21583644 21216836 18511292 16281560 13735508 9326345 2609691 -4146688 -3519364
62911 -3519364 11077267 32080134 39837900 26522100 8538358 4157658 8925491 8002465
62903 8002465 3227314 7978150 20370932 23616741 13118752 2793590 1961424 4780086
$$ [...]
##END NTUPLES=NMR SPECTRUM
##END=
