##TITLE=31Pdec_LR-713_CR7
 CDCl3, 24 sc
 9.7.2020
##JCAMPDX= 6.0         $$ Bruker NMR JCAMP-DX V2.0
##DATA TYPE= NMR SPECTRUM
##DATA CLASS= NTUPLES
##ORIGIN= UXNMR, Bruker Analytische Messtechnik GmbH
##OWNER= root
$$ XWIN-NMR		Version 3.5
$$ Thu Jul  9 10:11:20 2020 Russian Standard Time (UT+4h)  she@DPX200
##.OBSERVE FREQUENCY= 81.013821
##.OBSERVE NUCLEUS= ^31P
##.ACQUISITION MODE= SIMULTANEOUS
##.ACQUISITION SCHEME= undefined
##.AVERAGES= 124
##.DIGITISER RES= 17
##SPECTROMETER/DATA SYSTEM= spect
##.PULSE SEQUENCE= zgpg30
##.SOLVENT NAME= D2O
##.SHIFT REFERENCE= (INTERNAL, D2O, 0, 182.463)
##AUDIT TRAIL= $$ (NUMBER, WHEN, WHO, WHERE, WHAT)
$$ ##TITLE= Audit trail, XWIN-NMR		Version 3.5
$$ ##JCAMPDX= 5.01
$$ ##ORIGIN= Bruker BioSpin GmbH
$$ ##OWNER= she
$$ F:/spectra/data/she/nmr/P31/1/pdata/1/auditp.txt
$$ ##AUDIT TRAIL=  $$ (NUMBER, WHEN, WHO, WHERE, WHAT)
(   1,<2020-07-09 10:08:42.71 +0400>,<she>,<DPX200>,
      <continue with go, POWCHK disabled, PULCHK disabled
       configuration hash MD5:
       00 E9 B6 7A A2 85 ED C7 34 08 36 98 17 FE 4E 26
       data hash MD5: 32K
       82 9C D4 DF 4E 7B CB 51 AC 12 E3 B6 13 93 5B D9>)
(   2,<2020-07-09 10:10:16.84 +0400>,<she>,<DPX200>,
      <Start of raw data processing
       efp BC_mod = 2 LB = 1 FT_mod = 6 PKNL = 1 PHC0 = -2413.357 PHC1 = 313.8019 SI = 64K 
       data hash MD5: 64K
       BD D4 5E 9C A8 23 E2 08 9F DF DF 56 A6 2D 72 AE>)
(   3,<2020-07-09 10:10:46.32 +0400>,<she>,<DPX200>,
      <pk PHC0 = -83.50687 PHC1 = 143.8 
       data hash MD5: 64K
       AB 03 B5 8B A9 A1 93 62 A1 FB E4 C5 2B AA DD AA>)
(   4,<2020-07-09 10:10:49.93 +0400>,<she>,<DPX200>,
      <abs ABSG = 5 
       data hash MD5: 64K
       48 7E 8F AA 97 91 1B 45 30 09 BA 9C 77 AC B5 14>)
$$ ##END=
$$ 
$$ hash MD5
$$ 24 E2 01 88 D4 FA AD 7E 9F AA 51 1C D7 A5 82 6F
##$RELAX= 
##$RELAX= 
##$RELAX= 
##$RELAX= 
##$RELAX= 
##$RELAX= 
##$RELAX= 
##$RELAX= 
$$ Bruker specific parameters
$$ --------------------------
##$DU= <F:/spectra>
##$EXPNO= 1
##$NAME= <P31>
##$PROCNO= 1
##$TYPE= <nmr>
##$USER= <she>
##$AMP= (0..31)
100 100 100 100 100 100 100 100 100 100 100 100 100 100 100 100 100 100 
100 100 100 100 100 100 100 100 100 100 100 100 100 100 
##$AQSEQ= 0
##$AQ_mod= 1
##$AUNM= <au_zg>
##$AUTOPOS= <>
##$BF1= 81.014009
##$BF2= 200.13
##$BF3= 200.13
##$BF4= 200.13
##$BF5= 200.13
##$BF6= 200.13
##$BF7= 200.13
##$BF8= 200.13
##$BYTORDA= 1
##$CFDGTYP= 0
##$CFRGTYP= 5
##$CHEMSTR= <none>
##$CNST= (0..31)
1 1 145 1 1 1 1 1 1 1 1 1 1 1 1 1 1 1 1 1 1 1 1 1 1 1 1 1 1 1 1 1 
##$CPDPRG= <waltz16>
##$CPDPRG1= <>
##$CPDPRG2= <waltz16>
##$CPDPRG3= <>
##$CPDPRG4= <mlev>
##$CPDPRG5= <mlev>
##$CPDPRG6= <mlev>
##$CPDPRG7= <mlev>
##$CPDPRG8= <mlev>
##$CPDPRGB= <>
##$CPDPRGT= <>
##$D= (0..31)
0 1 0 0 0 0 0 0 0 0 0 0.03 2e-05 3e-06 0 0 0 0 0 0 0 0 0 0 0 0 0 0 0 0 
0 0 
##$DATE= 1594274745
##$DBL= (0..7)
120 120 120 11 120 120 24 19 
##$DBP= (0..7)
150 150 150 150 150 150 150 150 
##$DBP07= 0
##$DBPNAM0= <>
##$DBPNAM1= <>
##$DBPNAM2= <>
$$ [...]
##$SUBNAM3= <"">
##$SUBNAM4= <"">
##$SUBNAM5= <"">
##$SUBNAM6= <"">
##$SUBNAM7= <"">
##$SUBNAM8= <"">
##$SUBNAM9= <"">
##$SW= 369.568048894756
##$SWIBOX= (0..15)
0 1 3 0 0 0 0 0 0 0 0 0 0 0 0 0 
##$SW_h= 29940.119760479
##$TD= 32768
##$TD0= 1
##$TE= 0
##$TE2= 300
##$TE3= 300
##$TEG= 300
##$TL= (0..7)
0 120 53 12 22 120 120 120 
##$TP= (0..7)
150 150 150 150 150 150 150 150 
##$TP07= 0
##$TPNAME0= <>
##$TPNAME1= <>
##$TPNAME2= <>
##$TPNAME3= <>
##$TPNAME4= <>
##$TPNAME5= <>
##$TPNAME6= <>
##$TPNAME7= <>
##$TPOAL= (0..7)
0.5 0.5 0.5 0.5 0.5 0.5 0.5 0.5 
##$TPOFFS= (0..7)
0 0 0 0 0 0 0 0 
##$TUNHIN= 0
##$TUNHOUT= 0
##$TUNXOUT= 0
##$USERA1= <user>
##$USERA2= <user>
##$USERA3= <user>
##$USERA4= <user>
##$USERA5= <user>
##$V9= 5
##$VALIST= <valist>
##$VCLIST= <CCCCCCCCCCCCCCC>
##$VD= 0
##$VDLIST= <DDDDDDDDDDDDDDD>
##$VPLIST= <PPPPPPPPPPPPPPP>
##$VTLIST= <TTTTTTTTTTTTTTT>
##$WBST= 1024
##$WBSW= 4
##$XGAIN= (0..3)
0 0 0 0 
##$XL= 0
##$YL= 0
##$YMAX_a= 29285
##$YMIN_a= -37692
##$ZGOPTNS= <>
##$ZL1= 120
##$ZL2= 120
##$ZL3= 120
##$ZL4= 120
##$ABSF1= 182.463
##$ABSF2= -187.1042
##$ABSG= 5
##$ABSL= 3
##$ALPHA= 0
##$AQORDER= 0
##$ASSFAC= 0
##$ASSFACI= 0
##$ASSFACX= 0
##$ASSWID= 0
##$AUNMP= <proc_1d>
##$AZFE= 0.1
##$AZFW= 0.5
##$BCFW= 0
##$BC_mod= 2
##$BYTORDP= 0
##$COROFFS= 0
##$CY= -3
##$DATMOD= 1
##$DC= 0
##$DFILT= <>
##$DTYPP= 0
##$F1P= 0
##$F2P= 0
##$FCOR= 1
##$FTSIZE= 65536
##$FT_mod= 6
##$GAMMA= 0
##$GB= 0
##$INTBC= 1
##$INTSCL= 5.30512e-09
##$ISEN= 30
##$LB= 1
##$LEV0= 0
##$LPBIN= 0
##$MAXI= 10000
##$MC2= 0
##$MEAN= 0
##$ME_mod= 0
##$MI= 50
##$NCOEF= 0
##$NC_proc= -10
##$NLEV= 6
##$NOISF1= 182.463
##$NOISF2= 159.3651
##$NSP= 0
##$NTH_PI= 0
##$NZP= 0
##$OFFSET= 182.463
##$PC= 4
##$PHC0= -2496.864
##$PHC1= 457.6019
##$PH_mod= 1
##$PKNL= yes
##$PPARMOD= 0
##$PSCAL= 0
##$PSIGN= 0
##$REVERSE= no
##$SF= 81.0140089999434
##$SI= 65536
##$SIGF1= 159.3651
##$SIGF2= -187.1042
##$SINO= 113.3802
##$SIOLD= 16384
##$SREGLST= <1H.CDCl3>
##$SSB= 0
##$STSI= 65536
##$STSR= 0
##$SW_p= 29940.119760479
##$SYMM= 0
##$S_DEV= 0
##$TDeff= 32768
##$TDoff= 0
##$TI= <>
##$TILT= no
##$TM1= 0
##$TM2= 0
##$TOPLEV= 0
##$USERP1= <user>
##$USERP2= <user>
##$USERP3= <user>
##$USERP4= <user>
##$USERP5= <user>
##$WDW= 1
##$XDIM= 65536
##$YMAX_p= 558997449
##$YMIN_p= -420275925
$$ End of Bruker specific parameters
$$ ---------------------------------
##NTUPLES= NMR SPECTRUM
##VAR_NAME=  FREQUENCY,     SPECTRUM/REAL,   SPECTRUM/IMAG
##SYMBOL=    X,             R,               I
##VAR_TYPE=  INDEPENDENT,   DEPENDENT,       DEPENDENT
##VAR_FORM=  AFFN,          ASDF,            ASDF
##VAR_DIM=   65536,         65536,           65536
##UNITS=     HZ,            ARBITRARY UNITS, ARBITRARY UNITS
##FACTOR=    0.456856943014862, 1,           1
##FIRST=     14782.0589164792, 0,            0
##LAST=      -15158.0608439998, 0,           0
##MIN=       -15158.0608439998, -420275925,  0
##MAX=       14782.0589164792, 558997449,    0
$$ Real data points
##PAGE= N=1
##DATA TABLE= (X++(R..R)), XYDATA
$$ [...]
44586B3029762j0403657n3034629m4290993K9079879P8407843M0347803l3508378
$$ 23029762 12626105 -40408524 -84699517 -55619638 22788205 63136008 29627630
44579B9627630o0072284l6754358j7297691j9841533j6043374R002444L4186419
$$ 29627630 -30444654 -67199012 -84496703 -104338236 -120381610 -111379166 -77192747
44572g7192747L6896814K0735934O730951R462011K0914854J7710419p412363
$$ -77192747 -40295933 -19559999 -12829048 -3367037 17547817 35258236 27845873
44565B7845873k9002803k2883786p994871k4016281o8326423q9183694n0572186
$$ 27845873 -1156930 -24040716 -32035587 -56051868 -124378291 -213561985 -264134171
44558b64134171K3299665P7505100P8584603L3302425k1209240m2936983k3082483
$$ -264134171 -240834506 -163329406 -84744803 -51442378 -72651618 -115588601 -138671084
44551a38671084K392529J697374m853172J7413746M6400000K7453909l0817294
$$ -138671084 -136278555 -134581181 -139434353 -122020607 -75620607 -48166698 -78983992
44544g8983992n3325569j1860061K7289658Q310518k6835840j4856903K0176569
$$ -78983992 -132309561 -144169622 -116879964 -108569446 -135405286 -150262189 -130085620
44537a30085620J2397522k7198036k8022874J4686241K5833168k1831553n4676419
$$ -130085620 -117688098 -144886134 -172909008 -158222767 -132389599 -154221152 -208897571
44530b08897571j4210322M8940528N7787666K7702727K5597430M7301352K6314235
$$ -208897571 -223107893 -174167365 -116379699 -88676972 -63079542 -15778190 10536045
44523A0536045m1201498p1796292k0237482M8411447N7873571K9193091K9066935
$$ 10536045 -30665453 -102461745 -122699227 -74287780 -16414209 12778882 41845817
44516D1845817N5508786N0366262N191101k3056217n705083J6341959L746357
$$ 41845817 97354603 147720865 152911966 129855749 124150666 140492625 144238982
44509A44238982k3975302k7901222m517493K2538201L1476375P404503m4259597
$$ 144238982 120263680 92362458 87844965 110383166 141859541 149264044 105004447
44502A05004447p6938965m1418796L7328922P3214963L2664466k1558037l1922744
$$ 105004447 28065482 -13353314 23975608 97190571 129855037 108297000 76374256
44495G6374256k6457790m7373724o4070494l0033203K2902269L0803667M753254
$$ 76374256 49916466 2542742 -61527752 -91560955 -68658686 -37855019 -33101765
44488c3101765N020809L0653914K6088061j1604954k5740034m973480l316288
$$ -33101765 -28080956 2572958 28661019 17056065 -8683969 -13657449 -16973737
44481a6973737l6896815m7808659k971448M6886436M6424542J1162188j5016664
$$ -16973737 -53870552 -101679211 -104650659 -57764223 -11339681 -177493 -15194157
44474a5194157k3669301k6482561k3643798j9351187k5206705k4876355J4946188
$$ -15194157 -38863458 -65346019 -88989817 -108341004 -133547709 -158424064 -143477876
44467a43477876P6641333R2149938L9014322k2373213l8025762k6244299k0494291
$$ -143477876 -66836543 25313395 64327717 41954504 3928742 -22315557 -42809848
44460d2809848j1739790Q887665J2804734j1566738k6001629j2454923j2386657
$$ -42809848 -54549638 -45661973 -32857239 -44423977 -70425606 -82880529 -95267186
44453i5267186m3234955m6781950J1200538O0587308L0591954k8886078k6341489
$$ -95267186 -138502141 -185284091 -174083553 -113496245 -82904291 -111790369 -138131858
44446a38131858K3863718M1050698K3694344L4185235O0157733K1720692p4419566
$$ -138131858 -114268140 -73217442 -49523098 -15337863 44819870 66540562 -7879004
44439g879004j11689685l0694507Q0096538J06914767M7367445j9906128m1024275
$$ -7879004 -119568689 -150263196 -70166658 36748109 84115554 64209426 23185151
44432B3185151k0218322Q526029J1930304j0567871j7527596J8221399N6830379
$$ 23185151 2966829 11492858 23423162 12855291 -4672305 13549094 70379473
44425G0379473M6686818J2498844J5916036M4672495L1750022k0006773l6619696
$$ 70379473 117066291 129565135 145481171 190153666 221903688 201896915 165277219
44418A65277219o538777k975180m5070834n4322242J440776L6230520j1657921
$$ 165277219 158738442 155763262 110692428 56370186 57810962 94041482 82383561
44411H2383561p0910621n6893943o854437K264510j0069843J6230081N4593435
$$ 82383561 11472940 -45421003 -52275440 -50010930 -60080773 -43850692 10742743
44404A0742743L7947012j1890009j7386179J9683911K7172143j0142415l7135977
$$ 10742743 48689755 36799746 19413567 39097478 66269621 56127206 18991229
44397A8991229l2820719k8203037k4900333N719139M2389971L0509499j6176359
$$ 18991229 -13829490 -42032527 -66932860 -61213721 -18823750 11685749 -4490610
44390d490610k6832253N278066J2337400k2401095l2952662O764913L1738230
$$ -4490610 -31322863 -26044797 -13707397 -36108492 -69061154 -62296241 -30558011
44383c0558011O20013l3253800j8015636J5632465K5793730L0092408M4277053
$$ -30558011 -29937998 -63191798 -81207434 -65574969 -39781239 -9688831 34588222
44376C4588222L1438136j7125587l0144181K9931678P5471701J8095995p5927673
$$ 34588222 66026358 48900771 18756590 48688268 124159969 142255964 66328291
44369F6328291p4209419J5305701N6694608k863602o4694031m4645182J0904241
$$ 66328291 -7881128 7424573 64119181 61255579 -3438452 -48083634 -37179393
44362c7179393K4417786N211727K152666J0975521J290208j2835930L34565K3477903
$$ -37179393 -12761607 -7549880 -5397214 5578307 6868515 -5967415 -5632850 17845053
44354A7845053J4022383k3385992m4069303l1935914j1265607K451409J5336581
$$ 17845053 31867436 8481444 -35587859 -67523773 -78789380 -76337971 -61001390
44347f1001390K0847785r7028l7768633n3314980l1541806L1597J5807523K1711682
$$ -61001390 -40153605 -40250633 -78019266 -131334246 -162876052 -162844455 -147036932 -125325250
44339a25325250K6614888K0742666N153254Q176938L9573354N6631808J8619816
$$ -125325250 -98710362 -77967696 -72814442 -64637504 -25064150 31567658 50187474
44332E0187474m2852474n7333850j4238051K4991030K1535319R742677K6371904
$$ 50187474 7335000 -49998850 -64236901 -39245871 -17710552 -7967875 18404029
44325A8404029M2683685J5955063k9080079l3513022k387491j804388n3361450
$$ 18404029 61087714 77042777 47962698 14449676 12062185 10257797 -43103653
44318d3103653r5480453p2060258n719271M7640988O9319288O5322386K9061102
$$ -43103653 -138584106 -210644364 -216363635 -168722647 -99403359 -34080973 -5019871
44311e019871l1327042o1961977k1686525M4480900N2291483n388204n0221760
$$ -5019871 -36346913 -98308890 -119995415 -75514515 -23223032 -28611236 -78832996
44304g8832996l2623143O773803R994857j8855649l8673271l2451846q304702
$$ -78832996 -111456139 -104682336 -94687479 -113543128 -152216399 -184668245 -192972947
44297a92972947K5594003N1642500L9232488j1504722m8393543k9223035J7291611
$$ -192972947 -167378944 -115736444 -76503956 -88008678 -136402221 -165625256 -148333645
44290a48333645L3869635J6782758P036491J4551021Q813950j4017505j2697022
$$ -148333645 -114464010 -97681252 -90644761 -76093740 -67279790 -81297295 -93994317
44283i3994317L1202485P2338236N7038460q206339o7969981p9342043m5621804
$$ -93994317 -62791832 9546404 66584864 58378525 -9591456 -88933499 -134555303
44276a34555303m592584N611164j6057935k6333697J1372305O8184569P3829967
$$ -134555303 -139147887 -133536723 -149594658 -175928355 -164556050 -96371481 -22541514
44269b2541514Q424171o4354079p4153293k4065595K7627046L9090996J4462698
$$ -22541514 -14117343 -78471422 -152624715 -176690310 -149063264 -109972268 -95509570
44262i5509570j5666480j9475212J2182452M8854799M8077458J3115656p481041
$$ -95509570 -111176050 -130651262 -118468810 -69614011 -21536553 -8420897 -15901938
44255a5901938O219683J5157227o465918j8849758J3838873M7384678K1160259
$$ -15901938 -9682255 5474972 -990946 -19840704 -6001831 41382847 62543106
44248F2543106l2565023k6836185M0905811P5746127K6257176m2460795m9990435
$$ 62543106 29978083 3141898 44047709 119793836 146051012 103590217 53599782
44241E3599782p319467K1232683J0060439k0596808m9553114o1410167l9220073
$$ 53599782 46280315 67512998 77573437 56976629 7423515 -53986652 -93206725
44234i3206725Q507655L8868165K7288884K552823j529997N075561M333287J3681977
$$ -93206725 -84699070 -45830905 -18542021 -15989198 -17519195 -12443634 -8110347 5571630
44226E571630M2794154M4218962k4950581j13119274j20183877l1776967O1283680
$$ 5571630 48365784 92584746 67634165 -45485109 -165668986 -197445953 -136162273
44219a36162273Q5832496O2283930L9808204K1654568p921956l3049513k9182849
$$ -136162273 -50329777 11954153 51762357 73416925 65494969 32445456 3262607
44212C262607p491648K867519k718592r717031j2920853j1830300K713320K8864146
$$ 3262607 -4229041 -1361522 -4080114 -13797145 -26717998 -38548298 -35834978 -6970832
44204f970832L9283512J6041673j6867010k6974481k2373264l0391678m0871335
$$ -6970832 32312680 48354353 31487343 4512862 -17860402 -48252080 -89123415
44197h9123415j7350625L4671067N8804860K4843512k3532935k6383915J2048032
$$ -89123415 -106474040 -71802973 -12998113 11845399 -11687536 -38071451 -26023419
44190b6023419L3577325P092921l2552326l3509692N996207L6736563K1412524
$$ -26023419 7553906 14646827 -17905499 -51415191 -45418984 -8682421 12730103
44183A2730103j7938210k8534103L996554L8529642L7702523J6555413Q768257
$$ 12730103 -5208107 -33742210 -29745656 8783986 46486509 63041922 71810179
44176G1810179J0489046j642694j3709996Q155590M4735202L4060914k5902945
$$ 71810179 82299225 80656531 66946535 75102125 119837327 153898241 127995296
44169A27995296n4783208j1336477L1368583j836169o1975842n4228601J168703
$$ 127995296 73212088 61875611 93244194 91408025 29432183 -24796418 -23627715
44162b3627715L490061m7226696l7728828O3222314J30803005P1853692k9512544
$$ -23627715 -20137654 -67364350 -105093178 -41870864 88932141 160785833 131273289
44155A31273289m8533227p009837p990965n4146539o4173333l0132281k0285868
$$ 131273289 82740062 75730225 67739260 13592721 -50580612 -80712893 -100998761
44148a00998761l7331679r884233O3090093Q8878039L3160925k3403986k3679159
$$ -100998761 -138330440 -148214673 -85124580 3753459 36914384 13510398 -10168761
44141a0168761j5485902l8078347l7004510K9906717R4694730P7849019J2470835
$$ -10168761 -25654663 -63733010 -100737520 -70830803 23863927 101712946 114183781
44134A14183781k0296976j7957842k5560052l1571910L005888M6474084K9186669
$$ 114183781 93886805 75928963 50368911 18797001 21802889 68276973 97463642
44127I7463642m0814726q3812947o2691071j5601888J6540297K6279949J5073456
$$ 97463642 56648916 -27164031 -89855102 -105456990 -88916693 -62636744 -47563288
44120d7563288l762366M651050M3040187M9808771j0507868o7314212m2633877
$$ -47563288 -51325654 -46674604 -3634417 46174354 35666486 -31647726 -74281603
44113g4281603J4936066O273303m5408229l3806284L5690310M6292971k1527402
$$ -74281603 -59345537 -53072234 -98480463 -132286747 -96596437 -50303466 -71830868
44106g1830868m4834459L0592177R1248835M5874042k8352757l0206189L46804
$$ -71830868 -116665327 -86073150 5175685 51049727 22696970 -7509219 -7162415
44099g162415j9050757n3357816k3973695L4555138L0773291k2023043l4799295
$$ -7162415 -26213172 -79570988 -103544683 -68989545 -38216254 -60239297 -95038592
44092i5038592j96643Q412577k2099387k6966545J5375665N2978747N4308053
$$ -95038592 -95235235 -86822658 -108922045 -135888590 -120512925 -67534178 -13226125
44085a3226125L7030411N001463m8816499q0747875l7834841L8555995N3336428
$$ -13226125 23804286 28805749 -20010750 -100758625 -138593466 -100037471 -46701043
44078d6701043O159913j0017175K9767051M2848217q704085m8440178k1744521
$$ -46701043 -40541130 -50558305 -20791254 22056963 13352878 -35087300 -56831821
44071e6831821J2528976j593233j2681679L5845656Q4590622M5543905m6992151
$$ -56831821 -44302845 -45896078 -58577757 -22732101 61858521 107402426 60410275
44064F0410275q0868761l0312037K2811034J8141190j9754285m5690888m7554417
$$ 60410275 -20458486 -50770523 -27959489 -9818299 -29572584 -75263472 -122817889
44057a22817889k8558634N838018L4334997L5253212J6731522r85351k0094205
$$ -122817889 -151376523 -145538505 -111203508 -75950296 -59218774 -60204125 -80298330
44050h0298330m5358482n0670556j2249864M2025658O5156502N6145216M2735062
$$ -80298330 -125656812 -176327368 -188577232 -146551574 -81395072 -25249856 17485206
44043A7485206K1124014k4573573n9574341l0187244M2187655P3424224L4229320
$$ 17485206 38609220 14035647 -45538694 -75725938 -33538283 39885941 74115261
44036G4115261j5256689k5608210k1199818l4075855m2439039j8300690J5784379
$$ 74115261 58858572 33250362 12050544 -22025311 -64464350 -82765040 -66980661
44029f6980661K2393640L020817j9140380l2511475k5157826J4749303N6912850
$$ -66980661 -44587021 -41566204 -60706584 -93218059 -118375885 -103626582 -46713732
44022d6713732M2363639k2343880m6267637J6360668Q1198199N2953344k6923536
$$ -46713732 -4350093 -26693973 -72961610 -56600942 24597257 77550601 50627065
44015E0627065m7095074j292192J5436202k8556749n8367579k8285308J0396011
$$ 50627065 3531991 2239799 17676001 -10880748 -69248327 -97533635 -87137624
44008h7137624J2344210R074392K8087846L0891236p829393l7533660j5766381
$$ -87137624 -74793414 -65719022 -37631176 -6739940 -14569333 -52102993 -67869374
44001f7869374J4763548N025521j1376586R135161K2612997k5076521p4281105
$$ -67869374 -53105826 -48080305 -59456891 -50321730 -27708733 -52785254 -127066359
43994a27066359k6873374P9485026J03788274J3310382o6655365m5661386J2644932
$$ -127066359 -153939733 -74454707 29333567 42643949 -24011416 -69672802 -57027870
43987e7027870K0733004M219139K4437575N2804077K6233763k8188805l0740634
$$ -57027870 -36294866 -32075727 -7638152 45165925 71399688 43210883 12470249
43980A2470249J7598042M0838103J7173797M353013K6192677K7743182k1747894
$$ 12470249 30068291 70906394 88080191 92433204 118625881 146369063 124621169
43973A24621169o1165200k9981545K7215580J9979130m9301271q0820154j9811304
$$ 124621169 63455969 33474424 60690004 80669134 31367863 -49452291 -69263595
43966f9263595O1348029O1749118j0196364n6462469l2886297k429081k3770099
$$ -69263595 -7915566 53833552 43637188 -12825281 -45711578 -48140659 -71910758
43959g1910758n4523289k3550693M6107920O7118068K3468598j1407891R57047
$$ -71910758 -126434047 -149984740 -103876820 -36758752 -13290154 -24698045 -23740998
43952b3740998J1188701j6723847l8344057j4757610J2240179K0760p685436M0118309
$$ -23740998 -12552297 -29276144 -67620201 -82377811 -70137632 -70116872 -77802308 -37683999
43944c7683999Q9015900M9193850n1385514r4085750m5077583M820096p960260
$$ -37683999 51331901 100525751 49140237 -44945513 -90023096 -85203000 -93163260
43937i3163260l2754358r781130K9041309K5358269n650854p744762K5065008
$$ -93163260 -125917618 -135698748 -106657439 -81299170 -86950024 -94694786 -69629778
43930f9629778N0229268M4792715K2132019k456431k2604416k9470291j9925619
$$ -69629778 -19400510 25392205 47524224 45067793 22463377 -7006914 -26932533
43923b6932533n389386O170488J8869500K6331108J0308086k0110562k4185958
$$ -26932533 -32321919 -26151431 -7281931 19049177 29357263 9246701 -14939257
43916a4939257R337412L4386145J4965271j6469273j1168047J8163512K4092126
$$ -14939257 -5601845 28784300 43749571 27280298 16112251 34275763 58367889
43909E8367889M688553k214598P355868j575180l2142969m0618723q737001K2731920
$$ 58367889 63056442 60841844 68197712 66622532 34479563 -6139160 -14876161 7855759
43901G855759K0070582R809746K6385117M1997792K981254p4956788j05342973
$$ 7855759 27926341 37736087 64121204 106118996 109100250 34143462 -71199511
43894g1199511m2836788M6713421O4960895N938039m4778883l1135985Q187901
$$ -71199511 -114036299 -67322878 -2361983 3576056 -41202827 -72338812 -64150911
43887f4150911J6871315R802285L3702691P2829970O3706585q40577n1733655
$$ -64150911 -47279596 -37477311 -3774620 69055350 132761935 131921358 80187703
43880H0187703m4318023j7069421j9099076l3478108j7482512K0466312L4590840
$$ 80187703 35869680 18800259 -298817 -33776925 -51259437 -30793125 3797715
43873C797715R965610k6452181m7168038m1246166q338730L0359720L6280109
$$ 3797715 13763325 -12688856 -59856894 -101103060 -109441790 -79082070 -42801961
43866d2801961M580923j3282599K0034766O1862262M8347753l256111j9260165
$$ -42801961 -38221038 -51503637 -31468871 30393391 78741144 75485033 56224868
43859E6224868J2688355K8385755L9412j6811996J5385981M1643221J174496o4594440
$$ 56224868 68913223 97298978 97338390 80526394 95912375 137555596 138730092 74135652
43851G4135652o7013450p342574K2889439j7646588n6929420k1626694M7407855
$$ 74135652 7122202 -220372 22669067 5022479 -51906941 -73533635 -26125780
43844b6125780N1686280k0792386p6378492m5694841K8822726O4509986M7388811
$$ -26125780 25560500 4768114 -71610378 -117305219 -88482493 -23972507 23416304
43837B3416304K0608881k95155l3093785o1840598m0512823K1298133M8654307
$$ 23416304 44025185 43730030 10636245 -51204353 -91717176 -70419043 -21764736
43830b1764736J1574780k1586566Q260692N2299876L5031804j5835673j5228339
$$ -21764736 -10189956 -31776522 -23515830 28784046 63815850 47980177 32751838
43823C2751838K9372087K3213616n2920278r5696174l8325588L8952020K9445855
$$ 32751838 62123925 85337541 32417263 -63278911 -101604499 -62652479 -33206624
43816c3206624l8724723n1530838J9095030Q6522412Q4931321M5233693J7156169
$$ -33206624 -71931347 -123462185 -104367155 -17844743 67086578 112320271 129476440
43809A29476440p887739n3196561r0158937p2413963j1470396L5361587M3856438
$$ 129476440 121588701 68392140 -21766797 -94180760 -105651156 -70289569 -26433131
43802b6433131L9600003L4632974L051035n6338276q3615101l2344752M9815747
$$ -26433131 13166872 47799846 50850881 -5487395 -89102496 -121447248 -71631501
43795g1631501P4163144L2863788L133166K4441931M3062381R803391l3933444
$$ -71631501 2531643 35395431 38528597 62970528 106032909 115836300 81902856
43788H1902856k3941635K1634620L4661903O386335r822305M738588Q795953j9157223
$$ 81902856 57961221 79595841 114257744 120644079 110821774 115560362 124356315 105199092
43780A05199092m2967080l2635661j0997390q648298j5864673q652257J0621987
$$ 105199092 62232012 29596351 18598961 9950663 -5914010 -14566267 -3944280
43773c944280K3686323K0317564m430253m6006048p0171202l6057303M0342238
$$ -3944280 19742043 40059607 35629354 -10376694 -80547896 -116605199 -76262961
43766g6262961Q5438203N7678845J451307j8623332j691609P862676o615207k1603631
$$ -76262961 9175242 66854087 68305394 49682062 47990453 55853129 49237922 27634291
43758B7634291j6540188O794907L5974857N1464804L4098803n800195k6462962
$$ 27634291 11094103 17889010 53863867 105328671 139427474 133627279 107164317
43751A07164317q137983J4521983L408751k5272074l1218899j4382424m928867
$$ 107164317 99026334 113548317 116957068 91684994 60466095 46083671 41154804
43744D1154804o560146J214660J3714574M904436j9250398j9760461J4181808
$$ 41154804 34594658 35809318 49523892 54428328 35177930 15417469 29599277
43737B9599277M4953893M0527906J3052606j0717390k4921012l2685860k6089526
$$ 29599277 74553170 115081076 128133682 117416292 92495280 59809420 33719894
43730C3719894k05516K8842608L8222897K3286978q97074j5512106j1530804M331678
$$ 33719894 33514378 62356986 100579883 123866861 122969787 107457681 95926877 100258555
43722A00258555J5014342J0360272l887255j8800341l2476048l8469443k1831398
$$ 100258555 115272897 125633169 121745914 102945573 70469525 32000082 10168684
43715A0168684J5551701M3484773M0395368K3710867J6017618K904742l5424183
$$ 10168684 25720385 69205158 109600526 133311393 149329011 152233753 116809570
43708A16809570o8192246m3010390L1273390Q4588566P7974870M5330191K7088206
$$ 116809570 48617324 5606934 36880324 121468890 199443760 244773951 271862157
43701B71862157J4067781j3028411l2946074j5232862K4031522L8906803J4497651
$$ 271862157 285929938 272901527 239955453 224722591 248754113 287660916 302158567
43694C02158567j9519751k9326619r004625K0521357K8787161K022860l6218457
$$ 302158567 282638816 253312197 244307572 264828929 293616090 295638950 259420493
43687B59420493m5483327k0092483N88858j2465335l8475425m4982537l8335312
$$ 259420493 213937166 193844683 194433541 181968206 143492781 98510244 60174932
43680F0174932m2117522m4706967j1877530N0956487R0063531O9201828J5243084
$$ 60174932 18057410 -26649557 -38527087 12429400 102492931 171694759 186937843
43673A86937843j9553985k2251471k4642128m9469495p3218304n5709075J323021
$$ 186937843 167383858 145132387 120490259 71020764 -2197540 -57906615 -56583594
43666e6583594M6964291M1686098N470211j5778770j4695346j8075346k6342571
$$ -56583594 -9619303 32066795 37537006 21758236 7062890 -11012456 -37355027
43659c7355027n908072M6115240P7184193M8495191p597486l4287539k5275910
$$ -37355027 -43263099 2852141 80036334 128531525 120934039 86646500 61370590
43652F1370590j3832556j0232253L688658K7212051L2433341O806579k8037156
$$ 61370590 47538034 37305781 40994439 68206490 100639831 107446410 79409254
43645G9409254m4974608l7082460j5309086J122725k672198j7782970j5640219
$$ 79409254 34434646 -2647814 -17956900 -16834175 -19506373 -37289343 -52929562
43638e2929562J2494450L9026466M1968722L5501159L1541394P813234m1449046
$$ -52929562 -40435112 -1408646 40560076 76061235 107602629 115415863 73966817
43631G3966817o0955149o145558O6463233O0595353j6950564o0947366k2272481
$$ 73966817 13011668 6866110 73329343 133924696 116974132 56026766 33754285
43624C3754285L2545779M1182237L3425981N1864475O6511196L4708042j6065774
$$ 33754285 66300064 107482301 140908282 192772757 259283953 293991995 277926221
43617B77926221l5491761l1798289l6854777l4161276L398473M0163797K3367038
$$ 277926221 242434460 210636171 173781394 139620118 143018591 183182388 206549426
43610B06549426k1593810k3749058J8965686L9641264J2675392j6923498j9722520
$$ 206549426 184955616 161206558 180172244 219813508 232488900 215565402 195842882
43603A95842882j8209847k2274881l779113L9926890O3825938M4803268J5012038
$$ 195842882 177633035 155358154 151579041 191505931 255331869 300135137 315147175
43596C15147175Q60653j2070113k7843316j8357761J3709838J5590025k8035315
$$ 315147175 316007828 303937715 276094399 257736638 271446476 287036501 259001186
43589B59001186n1286174o455633M9397624L4523279l4284232p1666845m7963934
$$ 259001186 207715012 201259379 250657003 285180282 250896050 179229205 131265271
43582A31265271r937485O457337J2218610J7247808J0667594l909386n392555
$$ 131265271 121327786 127785123 140003733 157251541 167919135 164009749 158617194
43575A58617194N396188O964410R335N259899J7169920O542410k4553478l7323987
$$ 158617194 164013382 170977792 170987127 176247026 193416946 199959356 175405878 138081891
43567A38081891j8181737k498584j7223760l6402033j8960237L2467986P2686741
$$ 138081891 119900154 117401570 100177810 63775777 44815540 77283526 149970267
43560A49970267O3066032Q954905m4766117n5509890k7546401m625590r208977
$$ 149970267 213036299 221991204 177225087 121715197 94168796 89543206 80334229
43553H0334229j3258495R792284L6392630L3668657J7971312K1892695K9252982
$$ 80334229 67075734 76868018 113260648 146929305 164900617 186793312 216046294
43546B16046294N753758k5089667j1076535L1738802L3056038j6058305m7009905
$$ 216046294 221800052 196710385 185633850 217372652 250428690 234370385 187360480
43539A87360480k8626079q131454r165827J4498444P4466822R2826397K4877114
$$ 187360480 158734401 150602947 141437120 155935564 230402386 323228783 348105897
43532C48105897m6746196l1880161K0909562M030866p0877528r2947571l1598424
$$ 348105897 301359701 269479540 290389102 294419968 223542440 130594869 98996445
43525I8996445K1960570K556463m3872355n1254766k2838367P536722L2729075
$$ 98996445 120957015 123513478 79641123 28386357 5547990 13084712 45813787
43518D5813787M9480117L5411390q319516l5035459j2947957K6009510L1863221
$$ 45813787 95293904 130705294 122385778 87350319 74402362 100411872 132275093
43511A32275093K955694k3682944k5028164q158330R474407J5850901J1932350
$$ 132275093 135230787 111547843 86519679 78361349 87835756 103686657 115619007
43504A15619007J0319540J2307005n842598n4116844q8480000n8884638N480567
$$ 115619007 125938547 138245552 132402954 78286110 -10193890 -69078528 -63597961
43497f3597961K2191586k1159880m1060815J3155822P7146688P1823366K1982728
$$ -63597961 -41406375 -62566255 -103627070 -90471248 -13324560 58498806 80481534
43490H0481534K024813J2026593l126038l7503493k5872014L5247889O3097266
$$ 80481534 82506347 94532940 91406902 53903409 28031395 63279284 126376550
43483A26376550J5737897l6392093j6113385M4069229N5475094O338193l0020120
$$ 126376550 142114447 105722354 89608969 133678198 189153292 195491485 165471365
43476A65471365j1602107J4895989p215124n7399713o7497442j6893796M2168598
$$ 165471365 153869258 168765247 161550123 104150410 36652968 19759172 61927770
43469F1927770N5978289L2494980J4007872R828784p717586m2017070m9298083
$$ 61927770 117906059 150401039 164408911 174237695 166520109 124503039 75204956
43462G5204956k167195N4886903N5816853N672780k6694446j1580759K184706
$$ 75204956 73037761 127924664 183741517 189414297 162719851 151139092 153323798
43455A53323798k2938709l9193984J2989954Q9887441Q1079365l2922302j33163753
$$ 153323798 130385089 91191105 104181059 194068500 275147865 242225563 109061810
43448A09061810j09705202k984621N6480487J7781841m4580913m7404402J990449
$$ 109061810 -643392 -3628013 52852474 70634315 26053402 -21351000 -19360551
43441a9360551M1854584M2649448K3190446P398720J319037M733764J6713685
$$ -19360551 22494033 65143481 88333927 95732647 97051684 101785448 118499133
43434A18499133K6487832J6297477j8529653n6411642o1568447j6855753M9108837
$$ 118499133 144986965 161284442 142754789 86343147 24774700 7918947 57027784
43427E7027784P7058001L6071279l6515796p3548704n4107094j8573107r589465
$$ 57027784 134085785 170157064 133641268 60092564 5985470 -12587637 -22177102
43420b2177102k7788056n0874621o3173800n3191715j4111024L4559238N4976639
$$ -22177102 -49965158 -100839779 -164013579 -217205294 -231316318 -196757080 -141780441
43413a41780441M0856296L0456285M7745197O2415977L8061540q812810l3047322
$$ -141780441 -100924145 -70467860 -22722663 39693314 77754854 68942044 35894722
43406C5894722k1605471L862497K4426175L0685317J4106311j3632147j5283236
$$ 35894722 14289251 18151748 42577923 73263240 87369551 73737404 58454168
43399E8454168K1314027N1710254L3980591p530261k3262127j4257778j2585564
$$ 58454168 79768195 131478449 165459040 157928779 134666652 120408874 107823310
43392A07823310j4662281L73560R451854k1310731n7501611l4699233K8342610
$$ 107823310 93161029 93534589 102986443 81675712 24174101 -10525132 17817478
43385A7817478M5017104j965498l1958626K395526M8031513N1907040L9197356
$$ 17817478 62834582 60869084 28910458 31305984 79337497 131244537 170441893
43378A70441893M1458635K9736162j7904607n2963132l0121228J3053847J8050769
$$ 170441893 211900528 241636690 223732083 170768951 140647723 153701570 171752339
43371A71752339l744122r338439n205639j9977170l8920079l6017131l0984068
$$ 171752339 168008217 158669778 153464139 133486969 94566890 58549759 27565691
43364B7565691m3658922l5395563K4203012P5005410M4620477k4312308l0150828
$$ 27565691 -16093231 -51488794 -27285782 47719628 92340105 68027797 37876969
43357C7876969K3686079L5382253k3354291o0923593j9648097L3588056K2054812
$$ 37876969 61563048 96945301 73591010 12667417 -6980680 26607376 48662188
43350D8662188k4814446l3976362p58319K7408050L2139426K8039638J8497337
$$ 48662188 23847742 -10128620 -10886939 16521111 48660537 76700175 95197512
43343I5197512J368483l980266J9436800N1139261N6348263K9100221j2872239
$$ 95197512 96565995 92585729 112022529 163161790 219510053 248610274 235738035
43336B35738035n5138601q3187648p5058537k6565395L0922692N9212056M6120972
$$ 235738035 180599434 97411786 22353249 -4212146 26710546 85922602 132043574
43329A32043574N37312n7726742r0909032o3620587O088163N1746661M2241668
$$ 132043574 132580886 74854144 -16054888 -79675475 -73587312 -21840651 20401017
43322B0401017K2115456L3304984M1253006l816133o4858242n3797548L4234525
$$ 20401017 42516473 75821457 117074463 113258330 48400088 -5397460 28837065
43315B8837065R7653318O1983405k3830013o1780529k9979928J4482329K9674899
$$ 28837065 126490383 188473788 164643775 102863246 72883318 87365647 117040546
43308A17040546K9401208L2734003K4926686j0592998n3116977o4410636l3821089
$$ 117040546 146441754 179175757 204102443 193509445 140392468 75981832 42160743
43301D2160743J4913392N0043241M9385162Q221566m6539184o3711066k0171819
$$ 42160743 57074135 107117376 156502538 164724104 118184920 54473854 34302035
43294C4302035M0691470N4850612J6873648k3530183l9127017m8793241n7521396
$$ 34302035 74993505 129844117 146717765 123187582 84060565 35267324 -22254072
43287b2254072l4450371K1795033N4647973K9798571p184587m933891J1366512
$$ -22254072 -56704443 -34909410 19738563 49537134 42352547 37418656 48785168
43280D8785168l180014j9371362J7306491P1635458N2491432l8114177q9194058
$$ 48785168 45605154 26233792 43540283 115175741 167667173 129552996 40358938
43273D0358938l9309799L7444916M7059714K954797j9819539l335153O540785
$$ 40358938 1049139 38494055 85553769 88508566 68689027 65353874 71894659
43266G1894659j4426776l5933802k3433254J5034233L8025112J5108708l6083975
$$ 71894659 57467883 21534081 -1899173 13135060 51160172 66268880 30184905
43259C0184905o1573480l4388349P046611J3249104j045283J5568646N8674595
$$ 30184905 -31388575 -65776924 -58730313 -45481209 -46526492 -30957846 27716749
43252B7716749O6233395J5151980m4074360o4456452n2856960k6086432J7576246
$$ 27716749 93950144 109102124 65027764 571312 -52285648 -78372080 -60795834
43245f0795834N8925534N6967153J7688186k005641J1842485P084770k9558913
$$ -60795834 -1870300 55096853 72785039 70779398 82621883 89706653 60147740
43238F0147740l3121824K0627987N0560730J232730n0935597k1477989L1723032
$$ 60147740 27025916 47653903 98214633 99447363 48511766 27033777 58756809
43231E8756809L725388p2137989p4843334J6761L4690423j2656881m9058369j3012003
$$ 58756809 62482197 -9655792 -84499126 -84482365 -49791942 -62448823 -111507192 -124519195
43223a24519195L3998704L1940845J9900360M1330536N1638257M330975m6024306
$$ -124519195 -90520491 -58579646 -38679286 2651250 54289507 58620482 12596176
43216A2596176j9929818N4132281P3309291Q426856n8729590m8365994K4574569
$$ 12596176 -7333642 46798639 120107930 128534786 69805196 21439202 46013771
43209D6013771Q4204008Q3375595M0750459K870619j3641013l1610153o4941117
$$ 46013771 130217779 213593374 254343833 257214452 243573439 211963286 147022169
43202A47022169q4637660n8178123m953952K5042300J8719131O223640P507803
$$ 147022169 62384509 4206386 -747566 24294734 43013865 49237505 56745308
43195E6745308J6896520L3764896N7405472N6672189M377946n9003663o4328045
$$ 56745308 73641828 107406724 164812196 221484385 225862331 166858668 102530623
43188A02530623k1790217j1213531m7987400m9938679K1646242Q0506620M4236234
$$ 102530623 80740406 69526875 21539475 -28399204 -6752962 73753658 117989892
43181A17989892l1920460l9722230J5551343L2625100k4194361p6371181m9948340
$$ 117989892 86069432 46347202 61898545 94523645 70329284 -6041897 -55990237
43174e5990237L1464333R0860263Q4560375K9650967k0225131j9126891K5849798
$$ -55990237 -24525904 66334359 150894734 180545701 160320570 141193679 167043477
43167A67043477N7012915L4839536j3460731m0808604m6773880n5255432n4209304
$$ 167043477 224056392 258895928 245435197 204626593 157852713 102597281 48387977
43160D8387977j6091325L6055611M6086505R205895j8152076j727925K7432938
$$ 48387977 32296652 68352263 114438768 123644663 105492587 103764662 131197600
43153A31197600K6945823j450112k5207099j8560714K0503890O3459767O4368543
$$ 131197600 158143423 156693311 131486212 112925498 133429388 196889155 261257698
43146B61257698J1941975m0633047l7977715k257313J073745l2868165m4138658
$$ 261257698 273199673 232566626 194588911 192331598 193405343 160537178 116398520
43139A16398520q900620K7759929L4508279L4924631M0287886J8207341l1234015
$$ 116398520 107497900 135257829 169766108 204690739 244978625 263185966 231951951
43132B31951951m4333868M121483L7821473r543699q1016016q2270610l1722884
$$ 231951951 187618083 191739566 229561039 220017340 139001324 56730714 25007830
43125B5007830k0825247n3792935m4714972K5053627O5793151K6300762k5932584
$$ 25007830 4182583 -49610352 -94325324 -69271697 -3478546 22822216 -3110368
43118c110368k3463649k576144j7380090l1115139J5789665Q5272998Q9820049
$$ -3110368 -26574017 -29150161 -46530251 -77645390 -61855725 23417273 113237322
43111A13237322L1034640q829430j013513L373724j5399579j0656498K6896115
$$ 113237322 144271962 135442532 134429019 137802743 122403164 111746666 138642781
43104A38642781K7856465m0634845j00078385p1246646L055602K6570184m107235
$$ 138642781 166499246 125864401 25786016 -45460630 -42405028 -15834844 -19942079
43097a9942079j2022575K4943781M6901439K2919009L3187J5858762L6700832
$$ -19942079 -31964654 -7020873 39880566 62799575 62832762 78691524 115392356
43090A15392356K2378786n315120n948005R774288L446001k3178439l0345129
$$ 115392356 137771142 132456022 126508017 136282305 139728306 116549867 86204738
43083H6204738j48529M0726227N4336551K5965144k7500699o8501751o8953361
$$ 86204738 86056209 126782436 181118987 207084131 179583432 111081681 42128320
43076D2128320l9626466j4134760r13011J8761681L9190710K3887415k5244068
$$ 42128320 2501854 -11632906 -12545917 6215764 45406474 69293889 44049821
43069D4049821m3268382R414006P6983405Q2145788L5637761O396425Q051119
$$ 44049821 781439 10195445 87178850 169324638 204962399 211358824 219409943
43062B19409943p167695m9522383o9270923m5198658j9661240k0741820j8810971
$$ 219409943 212242248 162719865 93448942 48250284 28589044 7847224 -10963747
43055a0963747O685317K3528110J2999774J7383447O4015566R4913584M3945900
$$ -10963747 -4278430 19249680 32249454 49632901 113648467 208562051 252507951
43048B52507951n0617673q8714912m8128299m166640r074364k8103304j6469414
$$ 252507951 201890278 113175366 65047067 60880427 51806063 23702759 7233345
43041G233345Q252845J0680156L978768K0606140M6566960L9124026J25628k0369905
$$ 7233345 15486190 26166346 30145114 50751254 97318214 136442240 136567868 116197963
43033A16197963j970062J0675568k2632717o6625702n4011136J1262820M8144178
$$ 116197963 114227901 124903469 102270752 35645050 -18366086 -7103266 41040912
43026D1040912J2876176l1422062m307861O8270972Q6797136K5129780l2759886
$$ 41040912 53917088 22495026 18187165 86458137 173255273 198385053 165625167
43019A65625167k2416934J1356472K061154k6953215j1534549L5292904M0376744
$$ 165625167 143208233 154564705 156625859 129672644 118138095 153430999 193807743
43012A93807743j0371357n4027066n3937638m1093256l7809298j7821832K8182907
$$ 193807743 183436386 129409320 75471682 34378426 -3430872 -21252704 6930203
43005F930203N7277492M3914507K4402994K9448325L0016238r35289k8936666
$$ 6930203 64207695 108122202 132525196 161973521 191989759 191054470 162117804
42998A62117804j8722037l278553k4451103m9910951k7657678J3968473J0390207
$$ 162117804 143395767 140117214 115666111 65755160 38097482 52065955 62456162
42991F2456162k1253557r801165L4060584K2794245n0770094p6864813K733154
$$ 62456162 41202605 31401440 65462024 88256269 37486175 -39378638 -36645484
42984c6645484R2052067P8753347n927257n0212437k6295933O41225o475551j7952487
$$ -36645484 55406583 134159930 128232673 78020236 51724303 52365528 45889977 27937490
42976B7937490r358975N051252J1878766J1108379p601612m4871731n6558532
$$ 27937490 18578515 23629767 35508533 46616912 39015300 -5856431 -62414963
42969f2414963k723358P1761247P5954229O82365o3099569n3615509j5662852
$$ -62414963 -65138321 6622926 82577155 83259520 20159951 -33455558 -49118410
42962d9118410j3510807l0676777j1107960M2340493P0846337M3376615j0675177
$$ -49118410 -62629217 -93305994 -104413954 -62073461 8772876 52149491 41474314
42955D1474314m6035749m3415507j1357297K6229178M7005100N1739196N9866429
$$ 41474314 -4561435 -47976942 -59334239 -33105061 13900039 65639235 125505664
42948A25505664P1402157N5168293k015932n7218530n8267147j7406988R77688
$$ 125505664 196907821 252076114 250060182 192841652 134574505 117167517 118145205
42941A18145205l2299746p1988933n9747735J508465N5657383O3950101M5637516
$$ 118145205 85845459 13856526 -45891209 -44382744 11274639 75224740 120862256
42934A20862256M3432172O1560686N6451059l021140q0740896j03697757m9519851
$$ 120862256 164294428 225855114 282306173 279285033 198544137 94846380 45326529
42927D5326529K1649951L7758372j472671l3000397j2339170L7330423N9454056
$$ 45326529 66976480 104734852 103262181 70261784 57922614 95253037 154707093
42920A54707093K9248492k4231221n3582070m1611245j1772484O067338R152296
$$ 154707093 183955585 159724364 106142294 64531049 52758565 58825903 67978199
42913F7978199J2916365J9070813J2212204j1807695l3476470l2253277q892057
$$ 67978199 80894564 99965377 112177581 100369886 66893416 34640139 25748082
42906B5748082J8480251K9222607J2627044j8795621l1748428q441568K3622915
$$ 25748082 44228333 73450940 86077984 67282363 35533935 27092367 50715282
42899E0715282K5070610M028900N115301L6199513N1655124K4629087j0544747
$$ 50715282 75785892 79814792 84930093 121129606 172784730 197413817 186869070
42892A86869070j5860360n692429q023093j0295230P760115K1470849Q22068k0756597
$$ 186869070 171008710 165316281 157293188 146997958 154758073 176228922 177050990 156294393
42884A56294393J3093410P8491698Q3745047K593698p3613437n6660098J7435769
$$ 156294393 169387803 247879501 331624548 334218246 260604809 203944711 221380480
42877B21380480M2331740j3210223p4770438p3250316k8646758j396317m038118
$$ 221380480 263712220 250501997 175731559 102481243 73834485 72438168 68400050
42870F8400050l428270R923293O734942k1324558l5512164r543662K4007011K4223572
$$ 68400050 64971780 74895073 81630015 60305457 24793293 15249631 39256642 63480214
42862F3480214N423007K361051K805070k0135668l1323364K4509094J06581411
$$ 63480214 68903221 71264272 74069342 53933674 22610310 47119404 153700815
42855A53700815J03918140K491157p5556664m8802188Q565453K656095k6501132
$$ 153700815 257618955 260110112 184553448 135751260 144316713 146972808 120471676
42848A20471676P245840P1802874O9283848O591669k1463562K491343N761550
$$ 120471676 127717516 199520390 268804238 275395907 253932345 256423688 262185238
42841B62185238k5398116k2684307K0875708K1746148m0773626p2713034k4490763
$$ 262185238 236787122 214102815 234978523 256724671 215951045 143238011 118747248
42834A18747248K0879672o306404m1783886p337409M6021216K7493560l4192529
$$ 118747248 139626920 133320516 91536630 84199221 130220437 157713997 123521468
42827A23521468m2554032K584748J5340324k3457369m0576010q29188L8459608
$$ 123521468 80967436 83552184 98892508 75435139 34859129 34029941 72489549
42820G2489549K5820708j0367860j7034911Q369967K6354475Q915299k9486200
$$ 72489549 98310257 87942397 70907486 79277453 105631928 114547227 85061027
42813H5061027m0408603Q378240P6558657P9014457l44183o8308002m5153910
$$ 85061027 44652424 53030664 129589321 208603778 208259595 139951593 94797683
42806I4797683K0847529L1770666r829011k0284998K0058496M4120003K0623914
$$ 94797683 115645212 147415878 137586867 117301869 137360365 181480368 202104282
42799B02104282k136975M474749Q797l8680380o2473016k9578213K2988008L7343832
$$ 202104282 199967307 204442056 204450853 165770473 103297457 73719244 96707252 134051084
42791A34051084J6096141L33925M721277J4658285J7736049P124940j8121066
$$ 134051084 150147225 150481150 155202427 169860712 187596761 194721701 176600635
42784A76600635l5656754j7393855J8963199J9175835k7005181o3158644m9273121
$$ 176600635 140943881 123550026 142513225 161689060 134683879 71525235 22252114
42777B2252114j5948717l347579J410075K4109759M8382477M8506902L7344172
$$ 22252114 6303397 2955818 4365893 28475652 76858129 125365031 162709203
42770A62709203L4271362K2558486j3087982m2050907l0738724K809134K4537758
$$ 162709203 196980565 219539051 206451069 164400162 133661438 136470572 161008330
42763A61008330L6518763M2532413Q923723p0856925j16071350n1540386O5436248
$$ 161008330 197527093 240059506 248983229 178126304 62054954 10514568 75950816
42756G5950816J06460814M9308007n529373K495618K1965522M856290j2777976
$$ 75950816 182411630 231719637 226190264 228685882 250651404 255507694 242729718
42749B42729718K447011N444021m4388519r2586140o1973853K8146806R0232855
$$ 242729718 245176729 250620750 206232231 113646091 51672238 79819044 170051899
42742A70051899Q6995458N3554221K2930127l767177k3058058k4898121k0772345
$$ 170051899 257047357 310601578 333531705 329764528 306706470 281808349 261036004
42735B61036004k9069130l8630843k9104684j3683336j4288341j1610599K2713807
$$ 261036004 231966874 193336031 164231347 150548011 136259670 124649071 147362878
42728A47362878N9004117M3813525m187182j1378653K9419118M1299427n101751
$$ 147362878 206366995 250180520 245993338 234614685 264033803 305333230 300231479
42721C00231479l2788693J3270927O0707732J6191680q0070395j06104137l7546827
$$ 300231479 267442786 280713713 341421445 357613125 277542730 171438593 133891766
42714A33891766K6872107J9557171j3257813q064016K0855179K7327346R967530
$$ 133891766 160763873 180321044 167063231 158999215 179854394 207181740 217149270
42707B17149270r061551l3659139o6668717o9334870q603705P4488195J02140269
$$ 217149270 208087719 174428580 107759863 38424993 29821288 104309483 206449752
42700B06449752N9111527K734093k4358165l6598799m9886112l8442232J9966136
$$ 206449752 265561279 268295372 243937207 207338408 157452296 119010064 138976200
42693A38976200Q9951240J07490953N1210604l8120240r8627688r3123952l2079083
$$ 138976200 228927440 336418393 387628997 349508757 250881069 157757117 125678034
42686A25678034K9340682L4840997r860611l6146390j362002M5931041L3552352
$$ 125678034 155018716 189859713 179999102 143852712 142490710 188421751 221974103
42679B21974103k0291266k6509672L5906498P6132133K5532175n1606449m9311389
$$ 221974103 201682837 175173165 211079663 287211796 312743971 261137522 211826133
42672B11826133K3064971O1375908K6900100q819338P056447K6868411n913095
$$ 211826133 234891104 296267012 323167112 314347774 321404221 348272632 342359537
42665C42359537n7724446o1934146k4419688k246734q381432p847462P750362
$$ 342359537 284635091 222700945 198281257 196034523 187653091 179805629 187555991
42658A87555991J0237035m154995o125597R619385J4269679J98177n613113N443698
$$ 187555991 197793026 193638031 187512434 197131819 211401498 211599675 205986562 211430260
42650B11430260P345225r053568j6621346l107996L704967j5250693l7180490
$$ 211430260 218775485 209721917 193100571 189992575 193697542 178446849 141266359
42643A41266359l6229927j8029739N255882L4938271N9390370N0436397J2005844
$$ 141266359 105036432 87006693 92262575 127200846 186591216 237027613 249033457
42636B49033457j1265086k870565l948297l7279051n3687032p862669N5869936
$$ 249033457 237768371 234897806 230949509 193670458 139983426 132120757 187990693
42629A87990693N9600933N592109l4582837k8728826j2242636j1393721q022657
$$ 187990693 247591626 253183735 218600898 189872072 177629436 166235715 158213058
42622A58213058O619834M438660k6449409m6680302j5741943M9688259R3729319
$$ 158213058 164832892 169271552 142822143 96141841 80399898 130088157 223817476
42615B23817476Q2116070K7621721l3110466p2478574q4191867p1360943l2431387
$$ 223817476 305933546 333555267 300444801 227966227 143774360 72413417 39982030
42608C9982030K7490867P5535313P0792150J7418986l0051002l1368013j180593
$$ 39982030 67472897 143008210 213800360 231219346 201168344 169800331 168619738
42601A68619738L1286294O1077163P7558373M6345532k8499654o9101894j8091772
$$ 168619738 199906032 260983195 338541568 384887100 356387446 287285552 269193780
42594B69193780O3130524O6487367j1121272o9840998n4901725j6669095j0610206
$$ 269193780 332324304 398811671 387690399 317849401 262947676 246278581 235668375
42587B35668375k0177154j0235213J1126813K3367332L4022331N0831380N3796562
$$ 235668375 215491221 205256008 216382821 239750153 273772484 324603864 378400426
42580C78400426K7914484p993732k9341418l3971933k7780072j4320427q229850
$$ 378400426 406314910 398321178 368979760 335007827 307227755 292907328 284677478
42573B84677478k2601048l6841680j8971626J5652042J6959633k1888936n3205665
$$ 284677478 262076430 225234750 206263124 221915166 238874799 216985863 163780198
42566A63780198n0667020l7867011k8648422l495907L4466254M5521447K1576331
$$ 163780198 113113178 75246167 46597745 43101838 77568092 123089539 144665870
42559A44665870M896834J1899766M376068l3521776n8530910m1763176r023412
$$ 144665870 149562704 161462470 165838538 132316762 73785852 32022676 22999264
42552B2999264K3147437P0593043J06156004O0697252m5634056q1131349Q191794
$$ 22999264 46146701 116739744 222895748 283593000 237958944 156827595 165019389
42545A65019389R4086052N6165239k5755695o491014Q0133798P8657411k9752899
$$ 165019389 259105441 315270680 289514985 283023971 363157769 441815180 412062281
42538D12062281j01960403o2856374M103860K1127662K0382203L7612260L4061049
$$ 412062281 310101878 247245504 251349364 272477026 292859229 330471489 364532538
42531C64532538j1666369m1261594j3149004K5339309K2425442J275434n18538
$$ 364532538 352866169 311604575 298455571 323794880 346220322 347495756 346977218
42524C46977218K042954j1221866j9891881j5160976k8054302n5285191l3679038
$$ 346977218 349020172 337798306 317906425 302745449 274691147 219405956 185726918
42517A85726918N0065231J01599043M8702911l8687914m8479889O713425K2963903
$$ 185726918 235792149 337391192 386094103 347406189 298926300 305639725 328603628
42510C28603628k7274451o4696766l4115038K6362818N8739575N3823163K9215963
$$ 328603628 301329177 236632411 202517373 228880191 287619766 341442929 370658892
42503C70658892j899013k1116737j0877669J3963174J8610619P96168p808324
$$ 370658892 368759879 347643142 336765473 350728647 369339266 370135434 362327110
42496C62327110J217315j688315k7240558l8521764n987565L9272853M0911399
$$ 362327110 363544425 361856110 334615552 296093788 290106223 329379076 370290475
42489C70290475o270012m4921987k4190509L7117718O9868826L5728093k6613924
$$ 370290475 364020463 319098476 294907967 332025685 401894511 437622604 411008680
42482D11008680n1182408k9293454j3276993l3257730n1441334k4289538K5320917
$$ 411008680 359826272 330532818 317255825 283998095 232556761 208267223 233588140
42475B33588140L9801298R923801k1010086k7567673k6493026k6527873o553682
$$ 233588140 273389438 283313239 262303153 234735480 208242454 181714581 175160899
42468A75160899L3237105M3776240q018091p3337021o9568354J0275401Q1881058
$$ 175160899 208398004 252174244 244156153 170819132 101250778 111526179 193407237
42461A93407237P5252241J7252388j6504760k188846J8080815Q464183j7682587
$$ 193407237 268659478 285911866 269407106 267218260 285299075 293763258 276080671
42454B76080671l0627185k2075550J720390L1860553M7230541K5795382j6170233
$$ 276080671 245453486 223377936 225098326 256958879 304189420 329984802 313814569
42447C13814569l0390666n048955J1348454j3810869l9396303j5934316K9505082
$$ 313814569 283423903 278374948 289723402 275912533 236516230 220581914 250086996
42440B50086996L5519496M996587j0109350m088177j5572417l5168175o935740
$$ 250086996 285606492 290603079 280493729 276405552 260833135 225664960 218729220
42433B18729220O0721400P8876388J4378614m1413091l073104P5103493P3491612
$$ 218729220 279450620 358327008 372705622 331292531 328219427 403322920 476814532
42426D76814532k3405972j10977638j05351701l2250813L0211428M4567823L0345336
$$ 476814532 453408560 342430922 237079221 204828408 235039836 279607659 309952995
42419C09952995J7881446J1316828k158849j7427540p068602L2926362N6682913
$$ 309952995 327834441 339151269 336992420 319564880 312496278 345422640 402105553
42412D02105553K4479488l1813545m9219945k7449686j8994876l1302658j8393577
$$ 402105553 426585041 394771496 345551551 318101865 299106989 267804331 249410754
42405B49410754K0876435K7018282r832341j8872556K6785594N1293346N199423
$$ 249410754 270287189 297305471 287473130 268600574 295386168 346679514 351878937
42398C51878937m3125459k8144342n433071m3238180q0888532k8108705N8215330
$$ 351878937 308753478 280609136 275176065 231937885 151049353 122940648 181155978
42391A81155978M9622730l5735449n3258742L1880966R2297654N2531432p5185
$$ 181155978 230778708 195043259 141784517 173665483 265963137 318494569 318419384
42384C18419384J9201554N3193742J8144795m8009282n4731052m396538K9013833
$$ 318419384 337620938 390814680 408959475 360950193 306219141 301822603 330836436
42377C30836436J9986207L356756l274774j3147009k4167418k0907622j1870259
$$ 330836436 350822643 354179399 350904625 337757616 313590198 292682576 280812317
42370B80812317j8500857l8555901n4009784n7349770m3856410o223064L6354782
$$ 280812317 262311460 223755559 169745775 112396005 68539595 62316531 98671313
42363I8671313M0740620M095226j6029900J3876279M3706921J8219183k6579263
$$ 98671313 139411933 143507159 127477259 141353538 185060459 203279642 176700379
42356A76700379j5951621M0523449N8858552J1510480l0101384o075198M3650971
$$ 176700379 160748758 201272207 260130759 271641239 241539855 235464657 279115628
42349B79115628M2453361j2991360n4550005l8629179M210082K0521037O15377
$$ 279115628 321568989 308577629 254027624 215398445 219608527 240129564 240744941
42342B40744941k5656012l7320489l5212484j5810413K5799203N8426163K9400859
$$ 240744941 215088929 177768440 142555956 126745543 152544746 210970909 240371768
42335B40371768n1845345r1773882k8001279O9969449Q5441373J5579229l7208512
$$ 240371768 188526423 96752541 68751262 138720711 224162084 239741313 202532801
42328B02532801k5475282p446411k1846905k0674408K4353394M7411320m279549
$$ 202532801 177057519 169611108 147764203 127089795 151443189 198854509 194574960
42321A94574960o7338462n3864665J2877379M6340901L4187418L0042784M0073036
$$ 194574960 127236498 73371833 86249212 132590113 166777531 196820315 236893351
42314B36893351K2120847j4777023j3399837K4270474K9525647j5663654m4586221
$$ 236893351 259014198 244237175 230837338 255107812 284633459 268969805 224383584
42307B24383584j8761446R087459j2013022m7676185m1151341m062464J3427407
$$ 224383584 205622138 214709597 202696575 155020390 113869049 109806585 123233992
42300A23233992L776105k167046N095409P693100j105205j1585041j8345898j6303408
$$ 123233992 127010097 124843051 129938460 137631560 136526355 124941314 106595416 90292008
42292I0292008O164563L9318729L8846227k0195455r1163441j00922719m1815429
$$ 90292008 96456571 135775300 174621527 154426072 63262631 -37660088 -79475517
42285g9475517K3263602M7292289M5364794M4441525L5150839M706406j8471744
$$ -79475517 -56211915 -8919626 36445168 80886693 116037532 120743938 102272194
42278A02272194O09176M0049012M2216832M52838k5796292k841492J8281781k2000698
$$ 102272194 102881370 142930382 185147214 185600052 159803760 156962268 175244049 153243351
42270A53243351r0314261r6605424k3509107M5579854M2349379j747875j7689307
$$ 153243351 62929090 -33676334 -57185441 -11605587 30743792 28995917 11306610
42263A1306610N524465L2870132N1669107P1581487P8037540M4022376j6561253
$$ 11306610 16831075 49701207 101370314 172951801 250989341 295011717 278450464
42256B78450464n7426210o2331378n4202426m2018459q763121L8282686N6032034
$$ 278450464 221024254 158692876 104490450 62471991 53708870 91991556 148023590
42249A48023590K6597117j2356659k4799621k5508267l8526569m1067302L284054
$$ 148023590 174620707 162264048 137464427 111956160 73429591 32362289 35646343
42242C5646343P1971641R5733944M8314995j7896231m1882281k6302896j4380130
$$ 35646343 107617984 203351928 251666923 233770692 191888411 165585515 151205385
42235A51205385j9644717j7404629K12393M223690k0504970m0909983k3576969
$$ 151205385 131560668 114156039 114368432 118592122 98087152 57177169 33600200
42228C3600200Q564152R159399j6927551k2823148p94394N574576j4811889r183243
$$ 33600200 42164352 51323751 34396200 11573052 10778658 16353234 1541345 -7641898
42220g641898M7926069Q9879753M5216622m9005332r1769935n5766409o860512
$$ -7641898 40284171 130163924 175380546 126375214 34605279 -21161130 -28021642
42213b8021642Q704785J7959967M4553551N2285815Q787721m5309633m5293943
$$ -28021642 -19316857 -1356890 43196661 95482476 104270197 58960564 13666621
42206A3666621M008638L4132418P875167l3125076k7124236K8058765P5693442
$$ 13666621 17675259 51807677 59682844 26557768 -566468 27492297 103185739
42199A03185739P2404803L5815461R773633K886454r501731l1552217l7461293
$$ 103185739 175590542 211406003 221179636 224066090 214564359 183012142 145550849
42192A45550849k3114508k0486574l8600518l8575360l195377J7717040j6401789
$$ 145550849 122436341 101949767 63349249 24773889 21578512 39295552 22893763
42185B2893763n8533913l8477568K6980424O2680712N0138756L2848926K3233207
$$ 22893763 -35640150 -74117718 -47137294 15543418 65682174 98531100 121764307
42178A21764307m729668l4959335k0411454J6003430l828220p2627619q1635907
$$ 121764307 117034639 82075304 61663850 77667280 73839060 1211441 -80424466
42171h0424466P950592Q5161236N1926672l0169549m6064853q34929J9154919
$$ -80424466 -72473874 12687362 64614034 34444485 -11620368 -12455297 6699622
42164F699622J682899Q164031M4858563M8530217J769039l4220844j8461621J5167060
$$ 6699622 8382521 16546552 61405115 109935332 111704371 77483527 59021906 74188966
42156G4188966K2724038Q344535k857576k111107R066231K5068390K8583944Q632128
$$ 74188966 96913004 105257539 102399963 100288856 109355087 134423477 163007421 171639549
42148A71639549j5763383k1551609j9649267k9392161l2368657N0874M6966802
$$ 171639549 155876166 134324557 114675290 85283129 52914472 52965346 99932148
42141I9932148N9510914L4158303J1388949Q362797P423386M164402Q233378K326371
$$ 99932148 159443062 193601365 204990314 213353111 220776497 224940899 233174277 235500648
42133B35500648l5986040p4889735o0244615q492363P864999k2734232k9862368
$$ 235500648 199514608 124624873 64380258 55887895 63752894 41018662 11156294
42126A1156294J9726049O3258118M1251854j5577066m4684381l6224825j3723625
$$ 11156294 30882343 94140461 135392315 119815249 75130868 38906043 25182418
42119B5182418J2873576K8838235N217996m4091794n2317277Q91415L9569104
$$ 25182418 38055994 66894229 72112225 28020431 -24296846 -23405431 16163673
42112A6163673L231513n1195039l7115674K4389342M7710651K4386128J6675779
$$ 16163673 19395186 -31799853 -68915527 -44526185 3184466 27570594 44246373
42105D4246373L0225693Q048683m3560553l9873390L7199975Q4559045K7428802
$$ 44246373 74472066 82520749 38960196 -913194 36286781 120845826 148274628
42098A48274628o3161697p8054003k8671684p790207l2583050k8684708L2418523
$$ 148274628 85112931 7058928 -21612756 -29402963 -61986013 -90670721 -58252198
42091e8252198P5595490L5170245m2163215n9449296J354241O4110794N9996999
$$ -58252198 17343292 52513537 10350322 -49098974 -47744733 16366061 76363060
42084G6363060J3024n5793697o4963470k7121774K7838835N6386414K9460803
$$ 76363060 76376084 20582387 -44381083 -71502857 -43664022 12722392 42183195
42077D2183195k9852280n2939629j467469P2689077Q0882118J1307789n3640834
$$ 42183195 12330915 -40608714 -42076183 30612894 111495012 122802801 69161967
42070F9161967m7535200k983979P702074k1571479l3882102k725925L2090345
$$ 69161967 21626767 18642788 26344862 4773383 -29108719 -31834644 255701
42063B55701K9815111O126557K500563K4605373L7645387J4927307k7850599m9939131
$$ 255701 30070812 36197369 38697932 63303305 100948692 115875999 88025400 38086269
42055C8086269l1088989O202264K6026478K5808573L3445778N2849815M4839197
$$ 38086269 6997280 13199544 39226022 65034595 98480373 151330188 196169385
42048A96169385j0839945o4020383n1988711N226308K5772062j3165872l8935150
$$ 196169385 185329440 121309057 69320346 74546654 100318716 87152844 48217694
42041D8217694L749152O1648369M7883704k8955330p5798267m4199979J4641194
$$ 48217694 51966846 113615215 161498919 132543589 56745322 12545343 27186537
42034B7186537L3736636J4685855J821989J1540450K3341979K1129109J0146048
$$ 27186537 60923173 75609028 77431017 88971467 112313446 133442555 143588603
42027A43588603n70089q709771j4782236k3756067m3648814o7187630o6738564
$$ 143588603 143018514 134308743 119526507 95770440 52121626 -15066004 -81804568
42020h1804568k9614939J2438122J8704789j438194j601104K7396408M0747579
$$ -81804568 -111419507 -98981385 -80276596 -81714790 -83315894 -55919486 -15171907
42013a5171907J4277962j0521584P325020L5671075J6709627l5278119m7755385
$$ -15171907 -893945 -11415529 -4090509 31580566 48290193 13012074 -34743311
42006c4743311J43994M6319008M1084692J3642557J0337276J8082388k789021
$$ -34743311 -34599317 11719691 52804383 66446940 76784216 94866604 92077583
41999I2077583m4119672o0983506l8813533k856190K6216640M1885077K9987056
$$ 92077583 47957911 -13025595 -51839128 -54695318 -28478678 13406399 43393455
41992D3393455j2198624m0848238n065692P1890540J04760467N6285512j5500707
$$ 43393455 31194831 -9653407 -14719099 57171441 161931908 218217420 202716713
41985B02716713m4177721l8860250m2913092n1884749k7598029K6874162O2104411
$$ 202716713 158538992 119678742 76765650 24880901 -2717128 24157034 86261445
41978H6261445N0884915J7022210r907860k8982980m4190689m0559321p470191
$$ 86261445 137146360 154168570 144260710 115277730 71087041 30527720 23057529
41971B3057529L3896911N0102909L4772073J0948294k000416p972621j8416079
$$ 23057529 56954440 107057349 141829422 152777716 150777300 142804679 124388600
41964A24388600k9680965k6098366l535379J9353582J9235572n620291l3166442
$$ 124388600 94707635 68609269 65073890 84427472 103663044 98042753 64876311
41957F4876311m0710812k5044784j631581R275704j681918k1719115k2973639
$$ 64876311 24165499 -879285 -2510866 6764838 5082920 -16636195 -39609834
41950c9609834O982764M4072035N2360351K7334488m885054k7908136m4974917
$$ -39609834 -32627070 11444965 63805316 91139804 86254750 58346614 13371697
41943A3371697m7147652j3680749L8326122N0172650L254079l6652081q865603
$$ 13371697 -33775955 -47456704 -9130582 41042068 44296147 7644066 -1221537
41936a221537M2154507K7402865m2517346o1957515O308381O2450787J5544714
$$ -1221537 40932970 68335835 25818489 -36139026 -29830645 32620142 48164856
41929D8164856p3755968p5038195K5795820J08835388Q4818141M38411m3144553
$$ 48164856 -25591112 -100629307 -74833487 34001901 118820042 119258453 76113900
41922G6113900j8568353K0132332K5285314P128007J540946J6441382K5128907
$$ 76113900 57545547 77677879 102963193 110091200 111632146 128073528 153202435
41915A53202435P702323j5869905r841518K2450665L3892776k173679m8803867
$$ 153202435 160904758 145034853 135193335 157644000 191536776 189363097 140559230
41908A40559230n3650490k0633015J605797r164044k8314145l0846438j8724510
$$ 140559230 86908740 66275725 67881522 58717478 30403333 -443105 -19167615
41901a9167615M9997K1795657L2516634K0547212Q008679K8097046O4262191N9625690
$$ -19167615 -19117618 2678039 35194673 55741885 63750564 91847610 156109801 215735491
41893B15735491J388540n4218620o2961210m6548338l6021356j6990285K3717206
$$ 215735491 217124031 162905411 99944201 53395863 17374507 384222 24101428
41886B4101428M7911668K1966748j5403484n983091L5374817M8219290K5474799
$$ 24101428 72013096 93979844 78576360 72593269 107968086 156187376 181662175
41879A81662175J2483428J7697477L34455m8387732q1968799o9781742l0740217
$$ 181662175 194145603 211843080 212177535 163789803 81821004 12039262 -18700955
41872a8700955J4538964O2308940Q4953203M2914532l7845914o9749797k0889825
$$ -18700955 -4161991 58146949 143100152 186014684 148168770 78418973 57529148
41865E7529148L4772231K6241442j6036587k2124240J0034690K9538214J5642574
$$ 57529148 92301379 118542821 102506234 80381994 90416684 119954898 135597472
41858A35597472j3506706m5325306p0691390o4213522k0529052J4508080K887731
$$ 135597472 122090766 76765460 6074070 -58139452 -78668504 -64160424 -61272693
41851f1272693j9780813M287102N8807084P3049602K7798668k1357608k6842172
$$ -61272693 -81053506 -76766404 -17959320 55090282 82888950 61531342 34689170
41844C4689170M54284K7546744L7163320K3335450r442905l7986934m2662063
$$ 34689170 35143454 62690198 99853518 123188968 113746063 75759129 33097066
41837C3097066l2075507j8610148O944261L9319878L4614631k0075824n1900196
$$ 33097066 1021559 -17588589 -10644328 28675550 63290181 43214357 -8685839
41830h685839L004101Q1568651P1252531j0894006l6263210K8664047O4237058
$$ -8685839 -5681738 75886913 147139444 136245438 99982228 128646275 192883333
41823A92883333q579739r9293896q9808734o112738M4239304L1585364N028845
$$ 192883333 184303594 85009698 -4799036 -10911774 33327530 64912894 69941739
41816F9941739j0960537k6160437k9387484r723922j167589k8311475m3038777
$$ 69941739 58981202 32820765 3433281 -6290641 -7458230 -35769705 -78808482
41809g8808482L497559O2923862N5157006P34143j3867774J6880997J5876117
$$ -78808482 -75310923 -12387061 42769945 43504088 29636314 46517311 62393428
41802F2393428l4080727n9443421k5629503Q603392p72497j6419830k807017J0431763
$$ 62393428 28312701 -31130720 -56760223 -48156831 -48929328 -65349158 -68156175 -57724412
41794e7724412l259547j2603788O296807J8979788p94693j8490938o015485L602936
$$ -57724412 -60983959 -73587747 -67290940 -48311152 -49105845 -67596783 -73612268 -70009332
41786g0009332j3818646j6648066K0993148L8251972j5274306o9442601k5993024
$$ -70009332 -83827978 -100476044 -79482896 -41230924 -56505230 -125947831 -151940855
41779a51940855P5860522J01847022J9768104o0778396n7836783j6060670j669920
$$ -151940855 -76080333 25766689 45534793 -15243603 -73080386 -89141056 -90810976
41772i0810976J261008L1230019O3891407N6864629K8448252K3179237L3445159
$$ -90810976 -89549968 -58319949 5571458 62436087 90884339 114063576 147508735
41765A47508735K0021658j1974087k0073472K473896J6975927K854953j7394762
$$ 147508735 167530393 155556306 135482834 137956730 154932657 157787610 140392848
41758A40392848k2967751k2967534k8885750l2828229k6447856j5016604j244599
$$ 140392848 117425097 94457563 65571813 32743584 6295728 -8720876 -9965475
41751i965475K0766164M4276565M6298701J9276672j3944316l1157428l7052646
$$ -9965475 10800689 55077254 101375955 120652627 106708311 75550883 38498237
41744C8498237m2167027l6765532j0487909J7360686J8591932K218123O636876
$$ 38498237 -3668790 -40434322 -50922231 -33561545 -14969613 -12751490 -6114614
41737f114614L9702838N8214232K5792190l2551752o1357704m7597113k9252113
$$ -6114614 33588224 91802456 117594646 85042894 23685190 -23911923 -53164036
41730e3164036k9800747k0468430K9640830R0829291R8629355M0113960k3327648
$$ -53164036 -82964783 -103433213 -73792383 17036908 115666263 155780223 132452575
41723A32452575l4642843j1031826o814201k9780895l7297249j0291523J6109888
$$ 132452575 97809732 86777906 79963705 50182810 12885561 2594038 18703926
41716A8703926R231090j5421582k9356398l5057167m0989818k6626680K0000757
$$ 18703926 27935016 12513434 -16842964 -51900131 -92889949 -119516629 -99515872
41709i9515872N4795524K8283196k5913573k2433762M6737677Q7209744L8092170
$$ -99515872 -44720348 -16437152 -42350725 -64784487 -18046810 69162934 107255104
41702A07255104l5009370l7800315J5138437L3235602j0389546n3093797n1064621
$$ 107255104 72245734 34445419 49583856 82819458 72429912 19336115 -31728506
41695c1728506l4393051l5670518l2093280L177682M0617037L2784639j2087873
$$ -31728506 -66121557 -101792075 -133885355 -130707673 -90090636 -57305997 -69393870
41688f9393870l8477757j7145193K3612706M1452120K9724544J4076520J1979864
$$ -69393870 -107871627 -125016820 -101404114 -59951994 -30227450 -16150930 -4171066
41681d171066J1277083m722150k2054778j0467282K3124323L0540520l821211
$$ -4171066 7106017 2383867 -19670911 -30138193 -7013870 23526650 19705439
41674A9705439k2111858K5784277Q8068085O8738200k5143636p4905679j3565592
$$ 19705439 -2406419 23377858 111445943 180184143 155040507 80134828 66569236
41667F6569236P7341428Q2432120N074353n7088971n0869097j4867349m229371
$$ 66569236 143910664 226342784 231417137 174328166 123459069 108591720 104362349
41660A04362349k6588838n2441827m9498124q648753L8416147M2039584p92508
$$ 104362349 77773511 25331684 -24166440 -32815193 5600954 47640538 46848030
41653D6848030l1947989j3113592J6414883Q136142j1597046Q533550M6162922
$$ 46848030 14900041 1786449 18201332 26337474 14740428 23273978 69436900
41646F9436900L9886774K221015L203043M3760277M6412007j1528366n8139780
$$ 69436900 109323674 111544689 114747732 158508009 204920016 193391650 135251870
41639A35251870n3516868n2262796q6090343q7294354r812699O4395605M4402753
$$ 135251870 81735002 29472206 -56618137 -143912491 -153725190 -89329585 -44926832
41632d4926832j4733788J920794P4457503P6482191j5019591p8615227l9869200
$$ -44926832 -59660620 -57739826 16717677 93199868 78180277 -434950 -40304150
41625d0304150K5409359K9948334M298784J3581554L5472623J2754042l3018580
$$ -40304150 -14894791 15053543 19352327 32933881 68406504 81160546 48141966
41618D8141966l5747279J115067J3900014j2662382k6881798l2087L4326157L9657199
$$ 48141966 12394687 13509754 27409768 14747386 -12134412 -12166499 22159658 61816857
41610F1816857J9231739q654981k9330736k1055979K4228515O4690352M7200791
$$ 61816857 81048596 72393615 43062879 22006900 46235415 110925767 158126558
41603A58126558r134352k7413579J1915613L5306470j0809987p3787244p3888053
$$ 158126558 148992206 121578627 133494240 168800710 157990723 84203479 10315426
41596A0315426k0052631J6875575J2255354o8003l572329j4568730k5605309m377503
$$ 10315426 -9737205 7138370 19393724 19325721 15753392 1184662 -24420647 -28798150
41588b8798150L9123483M8542520N957384l6588751l8270702k7010086l7253002
$$ -28798150 10325333 58867853 64825237 28236486 -10034216 -37044302 -74297304
41581g4297304m1762678p52714N7225638O8419570L0992167L675953R023488M067049
$$ -74297304 -116059982 -116812696 -59587058 8832512 39824679 43500632 52524120 56591169
41573E6591169l4985392n9765893k0917933M9395584P5553640L8962863p220409
$$ 56591169 21605777 -38160116 -59078049 -9682465 65871175 104834038 97613629
41566I7613629j7727680l458439P208723J2615315K0983594K1944044O786262
$$ 97613629 79885949 76427510 83636233 96251548 117235142 139179186 145965448
41559A45965448l676113J2134895L2089570J6857147k1005710k3944448J9768481
$$ 145965448 142289335 154424230 186513800 203370947 182365237 158420789 178189270
41552A78189270M4297830K393595n1717214l4879071L5427667N7737009o097195
$$ 178189270 222487100 224880695 173163481 138284410 173712077 231449086 225351891
41545B25351891p5069075o7725721j1595011J4018133l816886j3449642N985428
$$ 225351891 150282816 82557095 70962084 84980217 81163331 67713689 73699117
41538G3699117J7005606p477495m1972749n0263561l1624349p687646R244695
$$ 73699117 90704723 83227228 41254479 -9009082 -40633431 -48321077 -39076382
41531c9076382J7132286J3927888M425792M360619K0748183L4168393J6082324
$$ -39076382 -21944096 -8016208 -3590416 770203 21518386 55686779 71769103
41524G1769103l2833465p0714613n2856900J3630781O5692645N1014320q699951
$$ 71769103 38935638 -31778975 -84635875 -71005094 -5312449 45701871 37001920
41517C7001920m5146237l0241273j430803L920790m621091q358255j6632015l0491798
$$ 37001920 -8144317 -38385590 -39816393 -35895603 -40516694 -48874949 -65506964 -95998762
41509i5998762j3882312M6942635R1047925N5149759k2984859m5174620R632231
$$ -95998762 -109881074 -62938439 28109486 83259245 60274386 15099766 24731997
41502B4731997O1367676M8575727J56524l0441774l3740613j8530817J8038291
$$ 24731997 86099673 134675400 134831924 104390150 70649537 52118720 70157011
41495G0157011N6680140M9625438o817557m3092440r815871M2910493L5504129
$$ 70157011 126837151 176462589 169645032 126552592 116736721 159647214 195151343
41488A95151343k6449522o8470742n5209486k0253702J443748J1466028J5919523
$$ 195151343 168701821 100231079 45021593 24767891 26211639 37677667 53597190
41481E3597190O259281j5659306k8186909j6281759J3938971M5957806N8371613
$$ 53597190 59856471 44197165 16010256 -271503 13667468 59625274 117996887
41474A17996887L1147679k5875467o2993068m3242418L348881J4561821j9848490
$$ 117996887 149144566 123269099 60276031 17033613 20382494 34944315 15095825
41467A5095825m7335266k6681006K4580213O2762103O4134952L0027681k3008566
$$ 15095825 -32239441 -58920447 -34340234 28421869 92556821 122584502 99575936
41460I9575936o5945774p4353033n3574961k9580501j3188438M233786K0130488
$$ 99575936 33630162 -40722871 -94297832 -123878333 -137066771 -132832985 -112702497
41453a12702497J6524380n770193j8256308n110733J1300494M489485j2703606
$$ -112702497 -96178117 -101948310 -120204618 -125315351 -114014857 -109525372 -122228978
41446a22228978j424753M8561535R4827395Q4633965K0209255l4324414k7755795
$$ -122228978 -123653731 -75092196 19735199 104369164 124578419 90254005 62498210
41439F2498210J0461214J2709767k1546145k0475123L9246274P3301554Q183823
$$ 62498210 72959424 85669191 64123046 43647923 82894197 156195751 164379574
41432A64379574r4779074j15725609m6699176Q049128m014159j9637004J7967802
$$ 164379574 69600500 -46125109 -92824285 -84775157 -88789316 -108426320 -90458518
41425i0458518O6360441O1960263J8942640p718257n568459N140633K1603885
$$ -90458518 -24098077 37862186 56804826 49086569 43518110 48658743 70262628
41418G0262628M2040661L4285399j9830651p2763738o1968080J022102M4285211
$$ 70262628 112303289 146588688 126758037 53994299 -7973781 -6951679 37333532
41411C7333532L0473709r458499l3686186l5199638k5717824j1655637L268266
$$ 37333532 67807241 58348742 24662556 -10537082 -36254906 -47910543 -44642277
41404d4642277J4780294K3224498K8368351K4214723J2507468Q351366J4791290
$$ -44642277 -29861983 -6637485 21730866 45945589 58453057 66804423 81595713
41397H1595713Q904105k3483512n6216649n4109343k2908035M61788k136677j5780699
$$ 81595713 90499818 67016306 10799657 -43309686 -66217721 -65755933 -67892610 -83673309
41389h3673309j9026733j949988L1334733N8711954N5048755K9199357K0015536
$$ -83673309 -102700042 -104650030 -73315297 -14603343 40445412 69644769 89660305
41382H9660305L2821148J7488579n1317978j11085159q6463252o42843N3714454
$$ 89660305 122481453 139970032 88652054 -22433105 -108896357 -109539200 -55824746
41375e5824746L9308508J812279j8098063k5001237j8181319J9798376O4740763
$$ -55824746 -16516238 -14703959 -32802022 -57803259 -75984578 -56186202 8554561
41368H554561N5923895q901547n0564484j8926261L4488303L8170257j517780
$$ 8554561 64478456 55576909 5012425 -13913836 20574467 58744724 57226944
41361E7226944l5189652n1886365o4959692n6953422o730661N1478853O0748885
$$ 57226944 22037292 -29849073 -94808765 -151762187 -158492848 -107013995 -46265110
41354d6265110K2196696j2355192j8710004j6859366j6033389j081415K1703713
$$ -46265110 -24068414 -36423606 -55133610 -71992976 -88026365 -89107780 -67404067
41347f7404067J8901768j4923657l9101780k1514503K0809912M9865936M8299080
$$ -67404067 -48502299 -63425956 -102527736 -124042239 -103232327 -53366391 -5067311
41340e067311K3072681o097166j4044828Q025640L1858034K0706267j6367717
$$ -5067311 18005370 11908204 -2136624 5889016 37747050 58453317 42085600
41333D2085600l0603359k697349K8776336K3723071p858624l1797106l6271897
$$ 42085600 11482241 8784892 37561228 61284299 53425675 21628569 -14643328
41326a4643328k5180262O873243N6106305Q3902788N2571230j4568836m7558474
$$ -14643328 -39823590 -32950347 23155958 107058746 159629976 145061140 97502666
41319I7502666j5674911L0638638K2761038m1005586r7623450r7953853n6198706
$$ 97502666 81827755 112466393 135227431 94221845 -3401605 -101355458 -157554164
41312a57554164j6549094K994183J3332392J8371745Q994025p940641q326295
$$ -157554164 -174103258 -171109075 -157776683 -139404938 -130410913 -138351554 -146677849
41305a46677849R703369J6305291j70135n187275K8611424O7655107O0501872
$$ -146677849 -136974480 -120669189 -120839324 -126026599 -97415175 -29760068 30741804
41298C0741804J5973459j3354186j6352193l1500983o4581793o4264131p059622
$$ 30741804 46715263 33361077 17008884 -14492099 -79073892 -143338023 -150397645
41291a50397645N1393315N2374039J7362066P246215L1343922M8526139L6800847
$$ -150397645 -99004330 -46630291 -29268225 -22022010 9321912 57848051 94648898
41284I4648898J0321328j9547347n0714010o5070379m3749884n835762J1021692
$$ 94648898 104970226 85422879 34708869 -30361510 -74111394 -79947156 -68925464
41277f8925464P312961J5814492L9256735M1956346J2649016j1269627r86167
$$ -68925464 -61612503 -45798011 -6541276 35415070 48064086 36794459 35808292
41270C5808292K1664493K2690838N662297j566317J0961192K5532097J5605719
$$ 35808292 57472785 80163623 85825920 84259603 95220795 120752892 136358611
41263A36358611l1732751r3374501j12558030n6199234K7974099N2765043J097687
$$ 136358611 104625860 11251359 -101306671 -157505905 -129531806 -76766763 -75669076
41256g5669076n0004121l5058313J6155236L3780025P779554j1740254P691562
$$ -75669076 -125673197 -160731510 -144576274 -110796249 -103016695 -114756949 -107065387
41249a07065387M4133327N4824252K0975654l2873288n2643193q539809N6691388
$$ -107065387 -62932060 -8107808 12867846 -20005442 -72648635 -81188444 -24497056
41242b4497056O8093597J8979682j8163302m373297N479326l7473848q0663777
$$ -24497056 43596541 62576223 44412921 40039624 45518950 8045102 -72618675
41235g2618675n1310894J4416757J9275355l9900405o6269263j5254863M4601137
$$ -72618675 -123929569 -109512812 -90237457 -130137862 -196407125 -211661988 -167060851
41228a67060851M7188033J8494422J0954830K0598102K0308256K0932312M4200788
$$ -167060851 -119872818 -101378396 -90423566 -69825464 -49517208 -28584896 15615892
41221A5615892O9615214N7997412R968626l3482352l6733453J429539M6987895
$$ 15615892 85231106 143228518 153197144 119714792 82981339 84410878 131398773
41214A31398773N2724563Q315189l2098804j3282344L2379917J9916523n5263256
$$ 131398773 184123336 192438525 160339721 147057377 179437294 199353817 144090561
41207A44090561r5522724m4977585K2861195J9471364k4873453k1584631K9273622
$$ 144090561 48567837 3590252 26451447 45922811 21049358 -535273 28738349
41200B8738349M6018488K141680l4608805j1018311L6252250M1828720N77883
$$ 28738349 74756837 76898517 42289712 31271401 67523651 109352371 109930254
41193A09930254l4987023k2835359K3450790N0754436K4681704k6859673m3384519
$$ 109930254 74943231 52107872 75558662 126313098 150994802 124135129 80750610
41186H0750610j0386214K1060002Q648343k4474481l5403954k4735155j4342198
$$ 80750610 70364396 91424398 100072741 75598260 40194306 15459151 1116953
41179A116953J003742K9267111L9824825N750874l5145165k5774682J6959620
$$ 1116953 2120695 31387806 71212631 76963505 41818340 16043658 33003278
41172C3003278K1797083k5749658n9264471l0904692K3729640M2435339J3367187
$$ 33003278 54800361 29050703 -30213768 -61118460 -37388820 5046519 18413706
41165A8413706k8690342n1028783m6124186k4150305L279697L3940685O1901579
$$ 18413706 -10276636 -61305419 -107429605 -131579910 -128300213 -94359528 -32457949
41158c2457949N5975679j0616026r3165144r4212709O451625R6685974P3305119
$$ -32457949 23517730 12901704 -80263440 -174476149 -168024524 -71338550 1966569
41151A966569j2078919l4219786K0224380N4101823K4639446j0309432j2617706
$$ 1966569 -10112350 -44332136 -24107756 29994067 54633513 44324081 31706375
41144C1706375j4321835k8470184j9941729N783618p563919n2700765m4721348
$$ 31706375 17384540 -11085644 -31027373 -25243755 -32807674 -85508439 -130229787
41137a30229787L1223356P1165588J5748247m7283373k5899025L2740468L9525773
$$ -130229787 -99006431 -27840843 -12092596 -59375969 -85274994 -52534526 -13008753
41130a3008753J2930387J7096947K5849383k1548329p9320072m7178773N6603604
$$ -13008753 -78366 17018581 42867964 21319635 -58000437 -105179210 -48575606
41123d8575606J04081622M4542079l1001427l2339382J8466725M7568674K6268069
$$ -48575606 55506016 100048095 69046668 36707286 55174011 102742685 129010754
41116A29010754k2946819o2681564o2153548k4191030L865106j3976042m4356154
$$ 129010754 106063935 43382371 -18771177 -42962207 -39097101 -53073143 -97429297
41109i7429297k9763064K3417210N8963396N7607041M4805355K4986342j7723995
$$ -97429297 -127192361 -103775151 -44811755 12795286 57600641 82586983 64862988
41102F4862988n7989169m7830068k912697Q089352k5140365l1635607K6507550
$$ 64862988 6873819 -40956249 -43868946 -35779594 -60919959 -92555566 -66048016
41095f6048016Q8581266Q1539052J5959196m1619840m9904491j6512133K3611087
$$ -66048016 22533250 104072302 120031498 78411658 28507167 11995034 35606121
41088C5606121L1206762l902051m0574823l1428233Q120067J9891653q110960
$$ 35606121 66812883 62910832 22336009 -9092224 -972157 18919496 10808536
41081A0808536k7478308j0312807J4048309J6221056M294056j0506679l0565826
$$ 10808536 -16669772 -26982579 -12934270 3286786 7580842 -2925837 -33491663
41074c3491663m0770114j7255469K0355862K5077940J166257l78785K4524249
$$ -33491663 -74261777 -91517246 -71161384 -46083444 -44917187 -45295972 -20771723
41067b0771723K2714675j3981677k4401951J1234279K7627883j1322003m4531954
$$ -20771723 1942952 -12038725 -36440676 -25206397 2421486 -8900517 -53432471
41060e3432471j9962011J7737890J6575805J0029273L6325727M4727598j5786343
$$ -53432471 -73394482 -55656592 -39080787 -29051514 7274213 52001811 36215468
41053C6215468q0833418n8553391J5776269L4529263o210355j4020985K9865129
$$ 36215468 -44617950 -103171341 -87395072 -52865809 -59076164 -73097149 -43232020
41046d3232020M0816500j5556352o3682591m5806776j639862K2619531M5741316
$$ -43232020 -2415520 -17971872 -81654463 -127461239 -129101101 -106481570 -60740254
41039f0740254P7495766O4077541k0094897r6108232p7561353K409248M1501010
$$ -60740254 16755512 80833053 60738156 -35370076 -112931429 -110522181 -69021171
41032f9021171J6581508m11003L1736251O1188581L0211307l3382484n5555460
$$ -69021171 -52439663 -52850666 -21114415 40074166 70285473 36902989 -18652471
41025a8652471k0034830J3848622j385330l6707253l5129861J246804J7268368
$$ -18652471 -38687301 -24838679 -26224009 -62931262 -98061123 -96814319 -79545951
41018g9545951o069133k0761728R892794N0569601M9395069J5621552n660887
$$ -79545951 -85615084 -106376812 -96484018 -45914417 3480652 19102204 13441317
41011A3441317o339290q522750q163396J2514415K9038315j634191o0611018p5782573
$$ 13441317 7102027 -1420723 -9584119 2930296 31968611 30334420 -30276598 -106059171
41003a06059171k3245339L8884657N5042131L5900405J6980005O189145J84410
$$ -106059171 -129304510 -90419853 -35377722 522683 17502688 23691833 23876243
40996B3876243Q092576K8341242L6230880J9504586l345724j6102083k2815671
$$ 23876243 31968819 60310061 96540941 116045527 112699803 96597720 73782049
40989G3782049k2437862o739008O250724j3032061m3144180k3931296M2527240
$$ 73782049 51344187 44605179 50855903 37823842 -5320338 -29251634 13275606
40982A3275606O8503051J906663q7726320j00480484l5872150K8899900N0714386
$$ 13275606 81778657 83685320 -4041000 -104521484 -140393634 -111493734 -60779348
40975f0779348M4856880K7089405J11573j6888155n718156J2806952Q334756o753741
$$ -60779348 -15922468 11166937 11278510 -5609645 -11327801 1479151 9813907 3060166
40967C060166m279432K427711j3161483k6579320L680480N1110804M7178177q826342
$$ 3060166 -1219266 1208445 -11953038 -38532358 -34851878 16258926 63437103 54610761
40959E4610761m4497450k7526342m966714j1136392j6544733L58519P417133j3172513
$$ 54610761 10113311 -17413031 -22379745 -33516137 -50060870 -49702351 -42285218 -55457731
40951e5457731k2225130R76874Q612607k9787045n6167554j5174012L7918564
$$ -55457731 -77682861 -76705987 -68093380 -97880425 -154047979 -169221991 -131303427
40944a31303427J3869299o0176864p0469308J1336893Q8468845Q7222466N0016475
$$ -131303427 -117434128 -177610992 -248080300 -236743407 -148274562 -61052096 -11035621
40937a1035621M3046392N2503216K9605810j8906217m8356572m8963793m3313379
$$ -11035621 32010771 84513987 114119797 95213580 46857008 -2106785 -45420164
40930d5420164l3226273k496023L8404159N6798506M3358503J6772345j0728870
$$ -45420164 -78646437 -81142460 -42738301 14060205 57418708 74191053 63462183
40923F3462183l6378164m2618537j2269738L0288082L5630850j922247l1108975
$$ 63462183 27084019 -15534518 -27804256 2483826 38114676 36192429 5083454
40916E083454j7907867L380633j5980668n9595864o1382483K562596P3101196
$$ 5083454 -12824413 -9443780 -25424448 -85020312 -146402795 -143840199 -70739003
40909g0739003P4342811L311401o5726267o4790028m534940M6452195M4595708
$$ -70739003 3603808 6915209 -58811058 -123601086 -128136026 -81683831 -37088123
40902c7088123J1683169j1222101k0783354l5361460m1458597j660200P7271910
$$ -37088123 -25404954 -36627055 -57410409 -92771869 -134230466 -135890666 -58618756
40895e8618756J26798729R4941173J6934884k5889733p587664J5066144j8794501
$$ -58618756 68179973 163121146 180056030 154166297 146578633 161644777 142850276
40888A42850276r3519611j32328215q6961869L898072N6883891M1072090J1139623
$$ 142850276 49330665 -82997550 -169959419 -166061347 -109177456 -68105366 -56965743
40881e6965743K7293416O5148001M8333845l2247239q8884315n4537590J9676600
$$ -56965743 -29672327 35475674 83809519 51562280 -37322035 -91859625 -72183025
40874g2183025L5474868j5771014n1413651k2758675K7039078M3708856L5715176
$$ -72183025 -36708157 -52479171 -103892822 -126651497 -99612419 -55903563 -20188387
40867b0188387L2130990J9915541k1317609n3550739j7754933O3707605Q7637952
$$ -20188387 11942603 31858144 10540535 -43010204 -60765137 2942468 90580420
40860I0580420K401538j07522354j18171493k4364990N6456425M1329216j7592620
$$ 90580420 92981958 -14540396 -132711889 -157076879 -100620454 -59291238 -76883858
40853g6883858k2313338L0900202O2393577L7456337P670964J3198300J7446237
$$ -76883858 -99197196 -68296994 -5903417 31552920 39223884 52422184 69868421
40846F9868421j9712631o1086223m5648327J0634628L4323032L148804k8060909
$$ 69868421 50155790 -10930433 -56578760 -45944132 -11621100 -8472296 -36533205
40839c6533205j4607574J9901238K8914356M830693k4273617l1949084j2955292
$$ -36533205 -51140779 -31239541 -2325185 2505508 -21768109 -53717193 -66672485
40832f6672485J5556370K8738470K5856128L4978373O0363964N1301620k6133490
$$ -66672485 -51116115 -22377645 3478483 38456856 98820820 150122440 123988950
40825A23988950j07856097r6402617n818677M2214485j0635109p6509215n4199329
$$ 123988950 16132853 -80269764 -86088441 -43873956 -54509065 -131018280 -185217609
40818a85217609L0432003P9425264N9461870J3622304k0417000l3180838j5617772
$$ -185217609 -154785606 -75360342 -15898472 -2276168 -22693168 -55874006 -71491778
40811g1491778K4114812M0198338O673412l0705175k1089436N688147p640947
$$ -71491778 -47376966 -7178628 -505216 -31210391 -52299827 -46611680 -54252627
40804e4252627l8907308k1572529L3701208N2198516K5331636K2064820N7717224
$$ -54252627 -93159935 -114732464 -81031256 -28832740 -3501104 18563716 76280940
40797G6280940O0291550J108039m5543919k4707976J2913112J1110063N359119
$$ 76280940 136572490 137680529 92136610 67428634 80341746 91451809 96810928
40790I6810928L9431073O3824281J6839591n0959982m3592650K2489414L9715338
$$ 96810928 136242001 200066282 216905873 165945891 122353241 144842655 184557993
40783A84557993k1111556p0546569m2213173K1113710N1148712M2606839K0871235
$$ 184557993 163446437 92899868 50686695 71800405 122949117 165555956 186427191
40776A86427191j1115908m8890971o0166795k7553210J6755358L4078733K6851833
$$ 186427191 175311283 126420312 66253517 38700307 55455665 89534398 116386231
40769A16386231J4947759k159023k7663997m1856583k9309676r371129p443320
$$ 116386231 131333990 129174967 101510970 59654387 30344711 20973582 13530262
40762A3530262j5147162r822193L956026M751961o118724o628654J0369759K9296224
$$ 13530262 -1616900 -11439093 -7483067 -2731106 -8849830 -15478484 -5108725 24187499
40754B4187499L5291015K5203946J813492k3584453l0433209j0456347J6484414
$$ 24187499 59478514 84682460 86495952 62911499 32478290 22021943 38506357
40747C8506357K5543094J7247616O555539o456751k9294362m7159756l1016365
$$ 38506357 64049451 81297067 87852606 81395855 52101493 4941737 -26074628
40740b6074628J8407404N8284703M8380840l417001n0455747n7311523l3207016
$$ -26074628 -7667224 50617479 98998319 95581318 45125571 -12185952 -45392968
40733d5392968j4425731j7224054j8644864O966828M4023296N1576725K0445315
$$ -45392968 -59818699 -77042753 -95687617 -88720789 -44697493 6879232 27324547
40726B7324547j5086595k8544595l1248417l6378048k7864431P976101M7032738
$$ 27324547 12237952 -16306643 -47555060 -83933108 -111797539 -103821438 -56788700
40719e6788700N4519621K8329203r767777m2751960n2401294j6068492N3452577
$$ -56788700 -2269079 26060124 16292347 -26459613 -78860907 -94929399 -41476822
40712d1476822R3863733O3586321J812848k6492483j6762495k810550J7094879
$$ -41476822 52386911 115973232 117786080 91293597 74531102 71720552 88815431
40705H8815431N8457221Q0050988K6306331o5317645r5167984m9253620j7678087
$$ 88815431 147272652 227323640 253629971 188312326 93144342 43890722 26212635
40698B6212635m3244592n7913137j4428332K5235198L247580k6206922Q056502
$$ 26212635 -17031957 -74945094 -89373426 -64138228 -60890648 -87097570 -79041068
40691g9041068O6900392O8995389K8876396K0264255M1019733K4468703l4037172
$$ -79041068 -12140676 56854713 85731109 105995364 147015097 171483800 137446628
40684A37446628o6551259m5233762j4140662o799874j2830732k5548973m5798033
$$ 137446628 70895369 25661607 11520945 4721071 -8109661 -33658634 -79456667
40677g9456667m4453179k92859L6440007P108007m2606274j8947974N7202959
$$ -79456667 -123909846 -124202705 -87762698 -80654691 -123260965 -142208939 -85005980
40670h5005980O8916434j495185l3734269L0223509Q5629693M0094648l6956432
$$ -85005980 -16089546 -17584731 -51319000 -21095491 64534202 104628850 67672418
40663F7672418m2083564r836968l4108428r2970994q3924702O567741Q9217707
$$ 67672418 25588854 15751886 -18356542 -111327536 -195252238 -188684497 -99466790
40656i9466790J07080573Q0725351L4323071k5017699o2764630m3794404j339118
$$ -99466790 7613783 88339134 122662205 97644506 34879876 -8914528 -10253646
40649a0253646K238375k3732826j8867885J6778150K3428664p383384j8347186
$$ -10253646 -8015271 -31748097 -50615982 -33837832 -10409168 -17792552 -36139738
40642c6139738O601168J6283672n633979p069019L0221605M4803795q23042n0413931
$$ -36139738 -29538570 -13254898 -18888877 -25957896 4263709 49067504 48244462 -2169469
40634b169469m3780512q106873J895928l654302J3990313L8496495K4798402j5454919
$$ -2169469 -45949981 -54056854 -52160926 -55815228 -41824915 -3328420 21469982 6015063
40626F015063k3204073K0566783P0791913Q1144017M9458439L65822m2772420
$$ 6015063 -17189010 3377773 74169686 155313703 204772142 205137964 162365544
40619A62365544o4437953n9469885l4885552j808094K8285938L8087436J5914799
$$ 162365544 97927591 38457706 3572154 1764060 30049998 68137434 84052233
40612H4052233k0509689l6720030k6865907j7388580j6618328l14739L4391702
$$ 84052233 63542544 26822514 -43393 -17431973 -34050301 -34365040 26662
40605B6662M6365994J4673020j7108413n398261K0882086Q402322k5615698j4619814
$$ 26662 46392656 61065676 43957263 38559002 59441088 67843410 42227712 27607898
40597B7607898M4456242O8338933J367685r7957467j23682219n1999618L4069532
$$ 27607898 72064140 140403073 141770758 43813291 -79868928 -131868546 -97799014
40590i7799014M7538882m922818m4071733k1344902K9019944M9143026L6125644
$$ -97799014 -50260132 -55182950 -99254683 -120599585 -91579641 -42436615 -6310971
40583f310971K7751544L0654319J4883467k0675423l5371403j6717561o865674
$$ -6310971 21440573 52094892 66978359 46302936 10931533 -5786028 -12651702
40576a2651702k8245050l7356000J430786M4621318L2823670j0477400j3894267
$$ -12651702 -40896752 -78252752 -76821966 -32200648 623022 -9854378 -23748645
40569b3748645K6704134M1635603l285949n7503894o1027997j7258130K7627208
$$ -23748645 2955489 44591092 41305143 -16198751 -77226748 -94484878 -66857670
40562f6857670L8807842J2577622k5135838l2443685N575688M7978181M6749305
$$ -66857670 -28049828 -15472206 -40608044 -73051729 -67476041 -19497860 27251445
40555B7251445J7326542J3600401L8020858L7662621k193961k7652502m711305
$$ 27251445 44577987 58178388 96199246 133861867 131667906 104015404 99304099
40548I9304099K4212382J1052197k2620719k6898975k26032K0717105J6619886
$$ 99304099 123516481 134568678 111947959 85048984 84822952 105540057 122159943
40541A22159943q955356m8492809p6703280n3234898J6648352N9770402K5161381
$$ 122159943 113204587 64711778 -11991502 -65226400 -48578048 11192354 36353735
40534C6353735l6199609m0609914Q200307L6087817J5022980j3163500k0840220
$$ 36353735 154126 -40455788 -32255481 3832336 18855316 5691816 -15148404
40527a5148404k3051415j9283648J1509105M3544438J6757820n3924535o7764155
$$ -15148404 -38199819 -57483467 -45974362 -2429924 14327896 -39596639 -107360794
40520a07360794J3301369Q4205846L6818131p9031003j19347332l6454146P7357043
$$ -107360794 -94059425 -9853579 26964552 -52066451 -171413783 -207867929 -130510886
40513a30510886J20215428P8286727j013520o1986147o3385187j0988241K7564000
$$ -130510886 -10295458 67991269 66977749 4991602 -58393585 -69381826 -41817826
40506d1817826j907652n1423799k6171127O7527618J13219362M9493755m0996059
$$ -41817826 -43725478 -95149277 -121320404 -53792786 59426576 108920331 67924272
40499F7924272n8151651k3525537j9271444m6246577l6141915K0943926N6120332
$$ 67924272 9772621 -13752916 -33024360 -79270937 -115412852 -94468926 -38348594
40492c8348594L3695027K286458J0086310L3621928K6629311o935970k9540370
$$ -38348594 -4653567 -2367109 7719201 41341129 67970440 61034470 31494100
40485C1494100k9546511k2875616j0891225K2444709O8699676Q3155226L5748483
$$ 31494100 1947589 -20928027 -31819252 -9374543 59325133 142480359 178228842
40478A78228842l7994244o2485540q573735O2977284O7467460j745468o7954520
$$ 178228842 140234598 77749058 69175323 132152607 199620067 197874599 129920079
40471A29920079o9482685k4751519J5983789M0026869N7564206N3554963P404442
$$ 129920079 60437394 35685875 51669664 91696533 149260739 202815702 210220144
40464B10220144n3713317p2747010l4792089J7631743M0708008K6574234r074674
$$ 210220144 156506827 83759817 48967728 66599471 107307479 133881713 124807039
40457A24807039l7483041k1493057M4717092J02279670Q3228068L398074n1378933
$$ 124807039 87323998 65830941 110548033 212827703 296055771 299453845 248074912
40450B48074912m0686426j5511801k9542329o0463319n4909369r264918L4589963
$$ 248074912 207388486 191876685 162334356 101871037 46961668 37696750 72286713
40443G2286713M7253931L2652170J1115227N145232K1795560L3995134O542948
$$ 72286713 119540644 152192814 163308041 168453273 190248833 224243967 230786915
40436B30786915m6094147o3687933k1054910L2678782L9978494M150895l2973147
$$ 230786915 184692768 121004835 99949925 132628707 172607201 176758096 143784949
40429A43784949m6234569l2287272M039730L8858489L9476988J1948628j177025
$$ 143784949 97550380 65263108 69302838 108161327 147638315 159586943 158409918
40422A58409918N775701j4734207p1023026q9286480k2926117N5209052M9649409
$$ 158409918 164185619 149451412 78428386 -10858094 -33784211 21424841 71074250
40415G1074250j3318288k9481644K2147672O0022684L6467795j728637m294801
$$ 71074250 57755962 28274318 50421990 110444674 146912469 145183832 140889031
40408A40889031J2385047J2632832m386142k3581968l7521183l5069010j2220323
$$ 140889031 153274078 165906910 161520768 137938800 100417617 65348607 53128284
40401E3128284Q06684k3522775m5769587p7158R1055072J19647670L8806426o5264440
$$ 53128284 53934968 30412193 -15357394 -15434552 75620520 195268190 234074616 168810176
40393A68810176q9675753m1325592K816947R698668N825621J2529650K2119099
$$ 168810176 79134423 37808831 40625778 50324446 56150067 68679717 90798816
40386I0798816K4184975J6051000k329528j9981027j9543987p253428j0465989
$$ 90798816 114983791 131034791 128705263 108724236 89180249 81926821 71460832
40379G1460832k8653194k4607601J1629281L2814801L710321l9057350l9933654
$$ 71460832 42807638 18200037 29829318 62644119 66354440 27297090 -12636564
40372a2636564n348597J6130254J0739135O536843J6855785K4042444J6642452
$$ -12636564 -17985161 -1854907 8884228 15421071 32276856 56319300 72961752
40365G2961752N275000P99807K742916N992291O40157k2392483m8183336m1958437
$$ 72961752 78236752 79036559 81779475 87771766 88411923 66019440 17836104 -24122333
40357b4122333O13212L3619459K1572783q107987j1204474L430208O0989j1059017
$$ -24122333 -23509121 10110338 31683121 23575134 12370660 15800868 15861857 4802840
40349D802840R525586M7944562M0777623k3812660p1753007m2998499K2310820
$$ 4802840 14328426 62272988 103050611 79237951 7484944 -35513555 -13202735
40342a3202735M1131809m63259m1511219l9260829j7725394j3864878j6799571
$$ -13202735 27929074 27465815 -14045404 -53306233 -71031627 -84896505 -101696076
40335a01696076Q402731N4994977P0836664K7575862l4578619n1519865r794913
$$ -101696076 -93293345 -38298368 32538296 60114158 25535539 -25984326 -35779239
40328c5779239M4694882O2826587L5077837j3698061m7013121l9123196o15337
$$ -35779239 8915643 71742230 106820067 93122006 46108885 6985689 6370352
40321F370352K3407486P740836j1887511Q892063M2866301K3330259m1115388
$$ 6370352 29777838 37518674 25631163 34523226 77389527 100719786 59604398
40314E9604398n7766605J4843458R3498208Q4363772J3358664k3903315j907637
$$ 59604398 1837793 16681251 110179459 194543231 207901895 183998580 182090943
40307A82090943J9876119J585561l1130550m4011321l4845203j1419406J9202698
$$ 182090943 201967062 203552623 172422073 128410752 93565549 82146143 101348841
40300A01348841L1794685j39864n7466498q3419956m9154001J7369838O9902965
$$ 101348841 133143526 133003662 75537164 -7882792 -57036793 -39666955 30236010
40293C0236010Q2200501N1531237j445990l6819557l1639703r981539p868061
$$ 30236010 112436511 163967748 162521758 125702201 94062498 84080959 76212898
40286G6212898j9459444j4937180K668165O551088J331557J2897882K7557842
$$ 76212898 56753454 41816274 44484439 51035527 52367084 65264966 92822808
40279I2822808N589003l8450974l8556084J8865334O2094831L9502664m848087
$$ 92822808 98411811 59960837 21404753 40270087 102364918 141867582 137019495
40272A37019495p761842J5369661Q975084k5600814l8271390j6573371K66418
$$ 137019495 129257653 144627314 153602398 128001584 89730194 73156823 73423241
40265G3423241q450625j6641501l931516R054040j676884k1799587j9886784M939327
$$ 73423241 64972616 48331115 44399599 53453639 51776755 29977168 10090384 15029711
40257A5029711K0277232M848785k0943311j9791408J1925800L4745574J6008934
$$ 15029711 35306943 40155728 19212417 -578991 11346809 46092383 62101317
40250F2101317k5836761m6144632l3471514j7049140j6258836j2953066J5990238
$$ 62101317 36264556 -9880076 -43351590 -60400730 -76659566 -89612632 -73622394
$$ [...]
##END NTUPLES=NMR SPECTRUM
##END=
