##TITLE=31Pdec_LR-713_CR5
 CDCl3, 124 sc
 8.7.2020
##JCAMPDX= 6.0         $$ Bruker NMR JCAMP-DX V2.0
##DATA TYPE= NMR SPECTRUM
##DATA CLASS= NTUPLES
##ORIGIN= UXNMR, Bruker Analytische Messtechnik GmbH
##OWNER= root
$$ XWIN-NMR		Version 3.5
$$ Wed Jul  8 10:44:01 2020 Russian Standard Time (UT+4h)  she@DPX200
##.OBSERVE FREQUENCY= 81.013821
##.OBSERVE NUCLEUS= ^31P
##.ACQUISITION MODE= SIMULTANEOUS
##.ACQUISITION SCHEME= undefined
##.AVERAGES= 124
##.DIGITISER RES= 17
##SPECTROMETER/DATA SYSTEM= spect
##.PULSE SEQUENCE= zgpg30
##.SOLVENT NAME= CDCl3
##.SHIFT REFERENCE= (INTERNAL, CDCl3, 0, 182.463)
##AUDIT TRAIL= $$ (NUMBER, WHEN, WHO, WHERE, WHAT)
$$ ##TITLE= Audit trail, XWIN-NMR		Version 3.5
$$ ##JCAMPDX= 5.01
$$ ##ORIGIN= Bruker BioSpin GmbH
$$ ##OWNER= she
$$ F:/spectra/data/she/nmr/P31/1/pdata/1/auditp.txt
$$ ##AUDIT TRAIL=  $$ (NUMBER, WHEN, WHO, WHERE, WHAT)
(   1,<2020-07-08 10:43:04.60 +0400>,<she>,<DPX200>,
      <continue with go, POWCHK disabled, PULCHK disabled
       configuration hash MD5:
       00 E9 B6 7A A2 85 ED C7 34 08 36 98 17 FE 4E 26
       data hash MD5: 32K
       95 C9 FC 45 C7 E6 54 F7 FA E9 2D DB E7 7C 5A FB>)
(   2,<2020-07-08 10:43:07.15 +0400>,<she>,<DPX200>,
      <Start of raw data processing
       efp BC_mod = 2 LB = 1 FT_mod = 6 PKNL = 1 PHC0 = -1950.052 PHC1 = -88.39806 SI = 64K 
       data hash MD5: 64K
       69 3A A6 EA A4 86 2A AB 88 72 D5 53 1B 1F 33 A4>)
(   3,<2020-07-08 10:43:12.64 +0400>,<she>,<DPX200>,
      <abs ABSG = 5 
       data hash MD5: 64K
       12 36 63 DB 07 D9 DB 44 28 DE A3 F1 27 EC 96 33>)
(   4,<2020-07-08 10:43:32.21 +0400>,<she>,<DPX200>,
      <pk PHC0 = -155.4924 PHC1 = 0.2000009 
       data hash MD5: 64K
       BD 58 E9 5F 86 A5 94 EE 1E 32 3E 73 E3 16 38 C6>)
(   5,<2020-07-08 10:43:35.29 +0400>,<she>,<DPX200>,
      <abs ABSG = 5 
       data hash MD5: 64K
       CB 62 57 92 65 26 92 BC 78 CA 46 7C 15 B2 1B 96>)
$$ ##END=
$$ 
$$ hash MD5
$$ 00 E1 0E 57 83 0D F3 B1 E2 D9 5C DF A3 69 FA F8
##$RELAX= 
##$RELAX= 
##$RELAX= 
##$RELAX= 
##$RELAX= 
##$RELAX= 
##$RELAX= 
##$RELAX= 
$$ Bruker specific parameters
$$ --------------------------
##$DU= <F:/spectra>
##$EXPNO= 1
##$NAME= <P31>
##$PROCNO= 1
##$TYPE= <nmr>
##$USER= <she>
##$AMP= (0..31)
100 100 100 100 100 100 100 100 100 100 100 100 100 100 100 100 100 100 
100 100 100 100 100 100 100 100 100 100 100 100 100 100 
##$AQSEQ= 0
##$AQ_mod= 1
##$AUNM= <au_zg>
##$AUTOPOS= <>
##$BF1= 81.014009
##$BF2= 200.13
##$BF3= 200.13
##$BF4= 200.13
##$BF5= 200.13
##$BF6= 200.13
##$BF7= 200.13
##$BF8= 200.13
##$BYTORDA= 1
##$CFDGTYP= 0
##$CFRGTYP= 5
##$CHEMSTR= <none>
##$CNST= (0..31)
1 1 145 1 1 1 1 1 1 1 1 1 1 1 1 1 1 1 1 1 1 1 1 1 1 1 1 1 1 1 1 1 
##$CPDPRG= <waltz16>
##$CPDPRG1= <>
##$CPDPRG2= <waltz16>
##$CPDPRG3= <>
##$CPDPRG4= <mlev>
##$CPDPRG5= <mlev>
##$CPDPRG6= <mlev>
##$CPDPRG7= <mlev>
##$CPDPRG8= <mlev>
##$CPDPRGB= <>
##$CPDPRGT= <>
##$D= (0..31)
0 1 0 0 0 0 0 0 0 0 0 0.03 2e-05 3e-06 0 0 0 0 0 0 0 0 0 0 0 0 0 0 0 0 
0 0 
$$ [...]
##$SUBNAM3= <"">
##$SUBNAM4= <"">
##$SUBNAM5= <"">
##$SUBNAM6= <"">
##$SUBNAM7= <"">
##$SUBNAM8= <"">
##$SUBNAM9= <"">
##$SW= 369.568048894756
##$SWIBOX= (0..15)
0 1 3 0 0 0 0 0 0 0 0 0 0 0 0 0 
##$SW_h= 29940.119760479
##$TD= 32768
##$TD0= 1
##$TE= 0
##$TE2= 300
##$TE3= 300
##$TEG= 300
##$TL= (0..7)
0 120 53 12 22 120 120 120 
##$TP= (0..7)
150 150 150 150 150 150 150 150 
##$TP07= 0
##$TPNAME0= <>
##$TPNAME1= <>
##$TPNAME2= <>
##$TPNAME3= <>
##$TPNAME4= <>
##$TPNAME5= <>
##$TPNAME6= <>
##$TPNAME7= <>
##$TPOAL= (0..7)
0.5 0.5 0.5 0.5 0.5 0.5 0.5 0.5 
##$TPOFFS= (0..7)
0 0 0 0 0 0 0 0 
##$TUNHIN= 0
##$TUNHOUT= 0
##$TUNXOUT= 0
##$USERA1= <user>
##$USERA2= <user>
##$USERA3= <user>
##$USERA4= <user>
##$USERA5= <user>
##$V9= 5
##$VALIST= <valist>
##$VCLIST= <CCCCCCCCCCCCCCC>
##$VD= 0
##$VDLIST= <DDDDDDDDDDDDDDD>
##$VPLIST= <PPPPPPPPPPPPPPP>
##$VTLIST= <TTTTTTTTTTTTTTT>
##$WBST= 1024
##$WBSW= 4
##$XGAIN= (0..3)
0 0 0 0 
##$XL= 0
##$YL= 0
##$YMAX_a= 36685
##$YMIN_a= -10203
##$ZGOPTNS= <>
##$ZL1= 120
##$ZL2= 120
##$ZL3= 120
##$ZL4= 120
##$ABSF1= 182.463
##$ABSF2= -187.1042
##$ABSG= 5
##$ABSL= 3
##$ALPHA= 0
##$AQORDER= 0
##$ASSFAC= 0
##$ASSFACI= 0
##$ASSFACX= 0
##$ASSWID= 0
##$AUNMP= <proc_1d>
##$AZFE= 0.1
##$AZFW= 0.5
##$BCFW= 0
##$BC_mod= 2
##$BYTORDP= 0
##$COROFFS= 0
##$CY= -3
##$DATMOD= 1
##$DC= 0
##$DFILT= <>
##$DTYPP= 0
##$F1P= 0
##$F2P= 0
##$FCOR= 1
##$FTSIZE= 65536
##$FT_mod= 6
##$GAMMA= 0
##$GB= 0
##$INTBC= 1
##$INTSCL= 5.30512e-09
##$ISEN= 30
##$LB= 1
##$LEV0= 0
##$LPBIN= 0
##$MAXI= 10000
##$MC2= 0
##$MEAN= 0
##$ME_mod= 0
##$MI= 50
##$NCOEF= 0
##$NC_proc= -9
##$NLEV= 6
##$NOISF1= 182.463
##$NOISF2= 159.3651
##$NSP= 0
##$NTH_PI= 0
##$NZP= 0
##$OFFSET= 182.463
##$PC= 4
##$PHC0= -2105.544
##$PHC1= -88.19806
##$PH_mod= 1
##$PKNL= yes
##$PPARMOD= 0
##$PSCAL= 0
##$PSIGN= 0
##$REVERSE= no
##$SF= 81.0140089999434
##$SI= 65536
##$SIGF1= 159.3651
##$SIGF2= -187.1042
##$SINO= 113.3802
##$SIOLD= 16384
##$SREGLST= <1H.CDCl3>
##$SSB= 0
##$STSI= 65536
##$STSR= 0
##$SW_p= 29940.119760479
##$SYMM= 0
##$S_DEV= 0
##$TDeff= 32768
##$TDoff= 0
##$TI= <>
##$TILT= no
##$TM1= 0
##$TM2= 0
##$TOPLEV= 0
##$USERP1= <user>
##$USERP2= <user>
##$USERP3= <user>
##$USERP4= <user>
##$USERP5= <user>
##$WDW= 1
##$XDIM= 65536
##$YMAX_p= 472284831
##$YMIN_p= -192373858
$$ End of Bruker specific parameters
$$ ---------------------------------
##NTUPLES= NMR SPECTRUM
##VAR_NAME=  FREQUENCY,     SPECTRUM/REAL,   SPECTRUM/IMAG
##SYMBOL=    X,             R,               I
##VAR_TYPE=  INDEPENDENT,   DEPENDENT,       DEPENDENT
##VAR_FORM=  AFFN,          ASDF,            ASDF
##VAR_DIM=   65536,         65536,           65536
##UNITS=     HZ,            ARBITRARY UNITS, ARBITRARY UNITS
##FACTOR=    0.456856943014862, 1,           1
##FIRST=     14782.0589164792, 0,            0
##LAST=      -15158.0608439998, 0,           0
##MIN=       -15158.0608439998, -192373858,  0
##MAX=       14782.0589164792, 472284831,    0
$$ Real data points
##PAGE= N=1
##DATA TABLE= (X++(R..R)), XYDATA
$$ [...]
$$ plain form
3995 52732130 20570041 11785328 21599693 9475730 -23743126 -31080111 -442767 17753172
3987 17753172 -8539530 -36287497 -14458207 32167323 39794190 1542030 -30958986
3980 -30958986 -31494015 -26568548 -34990661 -35421229 -12601663 9113380 4263310 -15545946
3972 -15545946 -27544386 -32190787 -34322961 -17839529 26710180 69803694 75510097 53767475
3964 53767475 43276940 50929291 48030427 24152941 1646856 -9972683 -30455578
3957 -30455578 -63070557 -73626782 -42337611 -2573269 5690210 -5937495 -435909
3950 -435909 21573107 28637149 16529619 13444347 28718927 40411383 39404879 43683123
3942 43683123 57256914 55363479 28538147 4799538 5582685 12542098 3590673 -8993538
$$ packed form
3995E2732130l2162089q784713R814365j2123963l3218856p336985L0637344J8195939
3987A7753172k6292702k7747967K1829290M6625530P626867l8252160l2501016
3980c0958986n35029M925467q422113m30568K2819566K1715043m850070j9809256
3972a5545946j1998440m646401k132174J6483432M4549709M3093514N706403k1742622
3964E3767475j0490535P652351k898864k3877486k2506085j1619539k0482895
3957c0455578l2614979j0556225L1289171L9764342Q263479j1627705N501586
3950d35909K2009016P064042j2107530l085272J5274580J1692456j006504M278244
3942D3683123J3573791j893435k6825332k3738609P83147O959413q951425j2584211
$$ plain form
3934 -8993538 -6430810 -1960592 -17266570 -42255022 -53596788 -54385695 -58243782 -51979482
3926 -51979482 -17595547 20679467 19944933 -13609323 -29482143 -10420981 3669023
3919 3669023 -16979243 -47766935 -56026495 -50412459 -53268437 -56408632 -39850232 -12158047
3911 -12158047 2697535 4062740 8740291 17532831 17713597 11574249 13983895 25014137
3903 25014137 30383189 26700729 22366364 15744702 -1878363 -20545151 -15335013 16898377
3895 16898377 47023144 50253654 34802324 22122826 14562566 -1632877 -30226727
3888 -30226727 -57197860 -66984030 -57180958 -38341332 -25026344 -24978236 -32562985 -35026639
3880 -35026639 -27810793 -18991825 -14600975 -5805776 20672358 61325190 93893041 98451899
$$ packed form
3934h993538K562728M470218j5305978k4988452j1341766p88907l858087O264300
3926e1979482L4383935L8275014p34534l3554256j5872820J9061162J4090004
3919C669023k0648266l0787692q259560N614036k855978l140195J6558400K7692185
3911a2158047J4855582J365205M677551Q792540J80766o139348K409646J1030242
3903B5014137N369052l682460m334365o621662j7623065j8666788N210138L2233390
3895A6898377L0124767L230510j5451330j2679498p560260j6195443k8593850
3888c0226727k6971133r786170R803072J8839626J3314988M8108p584749k463654
3880c5026639P215846Q818968M390850Q795199K6478134M0652832L2567851M558858
$$ plain form
3872 98451899 74090351 33086592 -12421292 -50768719 -65340798 -43478209 6109234
3865 6109234 55171910 81138494 84232934 76439749 64252811 50423458 41956869 42737446
3857 42737446 44550072 39049394 32889387 36067554 41912337 38076386 32097291 40959008
3849 40959008 56197553 49652293 20866911 6575723 26765489 50918414 41180054
3842 41180054 3757260 -29731415 -48197154 -54873419 -36723421 15554600 66853284
3835 66853284 65938445 18838925 -11060114 10601338 43750113 35263896 -10770342 -51651867
3827 -51651867 -64927247 -55644267 -26799894 19677587 61705728 71322769 50826868
3820 50826868 30048462 27365013 33707374 33548101 21850215 2211064 -12189419 630669
$$ packed form
3872I8451899k4361548m1003759m5507884l8347427j4572079K1862589M9587443
3865F109234M9062676K5966584L094440p793185j2186938j3829353q466589P80577
3857D2737446J812626n500678o160007L178167N844783l835951n979095Q861717
3849D0959008J5238545o545260k8785382j4291188K0189766K4152925r738360
3842D1180054l7422794l3488675j8465739o676265J8149998N2278021N1298684
3835F6853284r14839m7099520k9899039K1661452L3148775q486217m6034238m0881525
3827e1651867j3275380R282980K8844373M6477481M2028141R617041k0495901
3820E0826868k0778406k683449O342361j59273j1697886j9639151j4400483J2820088
$$ plain form
3812 630669 46777847 94066957 99554989 62161053 23566604 13380591 20115752 22529658
3804 22529658 18713886 10265433 -11435134 -40986897 -47858318 -17266592 19506055 26531412
3796 26531412 16540257 27470008 60274358 81807931 82938512 87364398 98493870 84881949
3788 84881949 34876826 -15996975 -35164988 -33841344 -31649697 -17352745 18807059
3781 18807059 44432119 22294948 -29629630 -60742405 -59574120 -57803443 -68787763
3774 -68787763 -70593969 -53465970 -37052160 -30009607 -16945669 53339 -7270323 -37821313
3766 -37821313 -41612392 10482883 74330920 89812415 61409801 37906862 34815170
3759 34815170 27551630 10285287 7900839 25418821 33060472 16160284 2007598 17581296
$$ packed form
3812F30669M6147178M7289110N488032l7393936l8594449j0186013O735161K413906
3804B2529658l815772q448453k1700567k9551763o871421L0591726L6772647P025357
3796B6531412r991155J0929751L2804350K1533573J130581M425886J1129472j3611921
3788H4881949n0005123n0873801j9168013J323644K191647J4296952L6159804
3781A8807059K5625060k2137171n1924578l1112775J168285J770677j0984320
3774f8787763j806206J7127999J6413810P042553J3063938J6999008p323662l0550990
3766c7821313l791079N2095275O3848037J5481495k8402614k3502939l091692
3759C4815170p263540j7266343k384448J7517982P641651j6900188j4152686J5573698
$$ plain form
3751 17581296 49044081 63747673 52467169 31774000 18918615 18405983 22195680 14707743
3743 14707743 -9644559 -29361119 -14890840 28085327 56468789 43527230 12870469
3736 12870469 633958 4873199 -610969 -15851094 -11771352 20969322 49253737 37084543
3728 37084543 -8219286 -44094619 -40623117 -8607608 19316029 25631294 19686051 16449323
3720 16449323 15082526 6283480 -5997698 -4429082 17619628 42790039 46435895 20731832
3712 20731832 -20658729 -55008391 -64850274 -47708873 -16734278 11188888 27486374
3705 27486374 28664780 9679881 -25035470 -49748167 -38982898 -3622429 16607324
3698 16607324 3529205 -18537400 -21418196 -8578347 2538345 9314293 14144341 7123745
$$ packed form
3751A7581296L1462785J4703592j1280504k0693169j2855385n12632L789697p487937
3743A4707743k4352302j9716560J4470279M2976167K8383462j2941559l0656761
3736A2870469j2236511M239241n484168j5240125M079742L2740674K8284415j2169194
3728C7084543m5303829l5875333L471502L2015509K7923637O315265n945243l236728
3720A6449323j366797q799046j2281178J568616K2048710K5170411L645856k5704063
3712B0731832m1390561l4349662r841883J7141401L0974595K7923166J6297486
3705B7486374J178406j8984899l4715351k4712697J0765269L5360469K0229753
3698A6607324j3078119k2066605k880796J2839849J1116692O775948M830048p020596
$$ plain form
3690 7123745 -16121437 -36548543 -38510782 -38414905 -56146979 -72696088 -53921550 -8885540
3682 -8885540 16778516 6722135 -7476500 -545718 14217454 21121618 30793419 49053649
3674 49053649 51133159 18411341 -22994034 -33266525 -13080412 4208981 3736260 1467126
3666 1467126 9672105 18698443 15824070 1524202 -15423502 -23515616 -11022199 20394719
3658 20394719 46779712 44678674 22379214 10729801 22673119 40662246 46615467
3651 46615467 44344180 44656409 45558382 39372106 28516251 21873570 20601241 17253570
3643 17253570 7940928 -571042 2213652 16749101 28542934 22496771 3020514 -9587233
3635 -9587233 -7359787 -6263332 -18998945 -30455468 -18940493 8459067 25275359 25012107
$$ packed form
3690G123745k3245182k0427106j962239R5877j7732074j6549109J8774538M5036010
3682h885540K5664056j0056381j4198635O930782J4763172O904164R671801J8260230
3674D9053649K079510l2721818m1405375j0272491K0186113J7289393m72721k269134
3666A467126Q204979R026338k874373j4299868j6947704q092114J2493417L1416918
3658B0394719K6384993k101038k2299460j1649413J1943318J7989127N953221
3651D6615467k271287L12229R01973o186276j0855855o642681j272329l347671
3643A7253570r312642q511970K784694J4535449J1793833o046163j9476257j2607747
3635i587233K227446J096455j2735613j1456523J1514975K7399560J6816292k63252
$$ plain form
3627 25012107 24883625 30980731 28590041 13265967 2801754 5815695 5137078 -9564152
3619 -9564152 -16607625 5879472 40322578 49537895 27007038 635780 -10042287 -14094582
3611 -14094582 -23107539 -28306901 -16257554 5376976 12516082 -4955946 -25592308 -16589590
3603 -16589590 26359048 68179108 74760279 57183233 54857732 75974668 85007319 60858415
3595 60858415 34369435 40868975 61672614 50973662 6617006 -27807488 -28079657 -15179238
3587 -15179238 -10875859 -7407164 4632522 13878321 14660658 26183874 58992699 84391312
3579 84391312 66817726 14476001 -29250694 -38981771 -29051598 -24889709 -33271577 -43165797
3571 -43165797 -41782524 -26378907 -7104048 3031268 4893725 12334238 28170597 32667318
$$ packed form
3627B5012107j28482O097106k390690j5324074j0464213L013941o78617j4701230
3619i564152p043473K2487097L4443106R215317k2530857k6371258j0678067m052295
3611a4094582r012957n199362J2049347K1634530P139106j7472028k0636362R002718
3603a6589590M2948638M1820060O581171j7577046k325501K1116936R032651k4148904
3595F0858415k6488980O499540K0803639j0698952m4356656l4424494k72169J2900419
3587a5179238M303379L468695J2039686R245799P82337J1523216L2808825K5398613
3579H4391312j7573586n2341725m3726695r731077R930173M161889q381868r894220
3571d3165797J383273J5403617J9274859J0135316J862457P440513J5836359M496721
$$ plain form
3563 32667318 8959768 -28577578 -47065776 -32850298 -3553633 15236177 14328507
3556 14328507 4432495 5055458 27640053 62730419 88335977 95288097 93159584 84572153
3548 84572153 53355796 -2856847 -46326363 -36769318 10474373 36337183 12029376
3541 12029376 -28287991 -38418133 -16395777 6726800 12603183 7977576 3348303 851877
3533 851877 544347 3608531 8863369 14042135 18557187 20106734 14121036 2425298
3525 2425298 -4200699 645526 8827941 7831401 -4226327 -19687098 -30714411 -30913740
3517 -30913740 -15789523 8791171 25309300 22884598 11985003 9271348 11935599 1470456
3509 1470456 -26993940 -53819046 -58725569 -44499583 -29000461 -21280277 -16189303 -10293383
$$ packed form
3563C2667318k3707550l7537346j8488198J4215478K9296665J8789810r07670
3556A4328507r896012O22963K2584595L5090366K5605558O952120k128513q587431
3548H4572153l1216357n6212643m3469516R557045M7243691K5862810k4307807
3541A2029376m0317367j0130142K2022356K3122577N876383m625607m629273k496426
3533H51877l07530L064184N254838N178766M515052J549547n985698j1695738
3525B425298o625997M846225Q182415r96540j2057728j5460771j1027313j99329
3517c0913740J5124217K4580694J6518129k424702j0899595k713655K664251j0465143
3509A470456k8464396k6825106m906523J4225986J5499122P720184N090974N895920
$$ plain form
3501 -10293383 -11209314 -24511826 -37225017 -25865053 14853718 59344193 76449753
3494 76449753 64311358 49469981 51786422 63452426 67285080 61762815 56307296 51397637
3486 51397637 39078811 20476333 7845080 6551993 6467475 -3424436 -19065685 -25290760
3478 -25290760 -12293601 14594371 38961311 46598982 38411966 30456936 37321252 55539973
3470 55539973 67668938 61978343 42386020 19292429 -1455587 -17718204 -26853339
3463 -26853339 -28729911 -29309203 -35074651 -44432961 -48372531 -39434812 -17913387 9074995
3455 9074995 30470408 33094174 6897298 -43682797 -92382622 -104733398 -71054949
3448 -71054949 -24847938 -13779482 -45623610 -76779415 -67343816 -33998092 -24801300
$$ packed form
3501a0293383r15931j3302512j2713191J1359964M0718771M4490475J7105560
3494G6449753j2138395j4841377K316441J1666004L832654n522265n455519m909659
3486E1397637j2318826j8602478j2631253j293087q4518r891911j5641249o225075
3478b5290760J2997159K6887972K4366940P637671q187016p955030O864316J8218721
3470E5539973J2128965n690595j9592323k3093591k0748016j6262617r135135
3463b6853339j876572n79292n765448r358310l939570Q937719K1521425K6988382
3455I074995K1395413K623766k6196876n0580095m8699825j2350776L3678449
3448g1054949M6207011J1068456l1844128l1155805R435599L3345724R196792
$$ plain form
3441 -24801300 -47852212 -57895325 -23751213 22533786 29254983 -3436631 -29504694
3434 -29504694 -26016206 -18511841 -31208664 -46521774 -34311424 1909132 32738963
3427 32738963 43119450 39694037 25805665 -2883788 -35362316 -43634563 -17242550
3420 -17242550 16353379 21265456 -4733413 -31570829 -36911059 -30433463 -34456156 -51646814
3412 -51646814 -62925846 -54808613 -36211858 -21751220 -8605005 15088812 41982252
3405 41982252 46074949 19415978 -10489948 -16419995 -10364109 -23845073 -56990991 -74676209
3397 -74676209 -55449608 -18358653 7515538 17230453 21105919 22634714 22877468 30725533
3389 30725533 48658646 59739748 49792762 34853620 44397867 79546602 108556653
$$ packed form
3441b4801300k3050912j0043113L4144112M6284999O721197l2691614k6068063
3434b9504694L488488P504365j2696823j5313110J2210350L6220556L0829831
3427C2738963J0380487l425413j3888372k8689453l2478528q272247K6392013
3420a7242550L3595929M912077k5998869k6837416n340230O477596m022693j7190658
3412e1646814j1279032Q117233J8596755J4460638J3146215K3693817K6893440
3405D1982252M092697k6658971k9905926n930047O055886j3480964l3145918j7685218
3397g4676209J9226601L7090955K5874191R714915L875466J528795K42754P848065
3389C0725533J7933113J1081102r946986j4939142R544247L5148735K9010051
$$ plain form
3382 108556653 105906284 78583647 49595836 30452552 16988338 2503039 -12222992
3375 -12222992 -18724439 -9532112 10286797 24731573 26179928 26613188 39557618 57307960
3367 57307960 60085633 44069443 24831578 14270125 10365294 10750662 19264444 33866995
3359 33866995 42759580 39710048 31827199 25546356 15510117 -4673155 -28251195 -39807024
3351 -39807024 -30873717 -7845499 12986595 18784661 12498484 8729148 12246798 8081804
3343 8081804 -16679454 -49124360 -63728993 -54009481 -34601074 -17468199 -5949488
3336 -5949488 -7349458 -26140451 -45195868 -41290480 -22555633 -21343172 -43397039 -57038520
3328 -57038520 -46117210 -38434753 -57256161 -75805044 -54552834 -3379917 31332749
$$ packed form
3382A08556653k650369k7322637k8987811j9143284j3464214j4485299j4726031
3375a2222992o501447R192327J9818909J4444776J448355M33260J2944430J7750342
3367E7307960K777673j6016190j9237865j0561453l904831L85368Q513782J4602551
3359C3866995Q892585l049532p882849o280843j0036239k0183272k3578040j1555829
3351c9807024Q933307K3028218K0832094N798066o286177l769336L517650m164994
3343H081804k4761258l2444906j4604633R719512J9408407J7132875J1518711
3336e949488j399970j8790993j9055417L905388J8734847J212461k2053867j3641481
3328e7038520J0921310P682457j8821408j8548883K1252210N1172917L4712666
$$ plain form
3321 31332749 32197680 27062938 40066142 58724231 58495307 37484833 14821872 6022608
3313 6022608 8101671 5094149 -12810242 -34644006 -39612086 -24569948 -7595856 1425835
3305 1425835 15761315 45086965 72460046 76481350 60767648 40816733 16952616
3298 16952616 -14790245 -37935270 -31207669 -2526512 20190063 27633767 31465619 32633838
3290 32633838 18284593 -8177312 -23755613 -19258271 -10923925 -11141318 -9673105 7543868
3282 7543868 38640006 70809175 90213469 86361765 63637590 46247346 51701530 63536573
3274 63536573 54462913 30816542 22569649 32304167 32832876 19241258 19676574 40876442
3266 40876442 47601376 20895242 -3666718 10771726 44486742 55695095 46691000
$$ packed form
3321C1332749Q64931n134742J3003204J8658089k28924k1010474k2662961q799264
3313F022608K079063l007522j7904391k1833764m968080J5042138J6974092R021691
3305A425835J4335480K9325650K7373081M021304j5713702j9950915k3864117
3298A6952616l1742861k3145025O727601K8681157K2716575P443704L831852J168219
3290C2633838j4349245k6461905j5578301M497342Q334346k17393J468213J7216973
3282G543868L1096138L2169169J9404294l851704k2724175j7390244N454184J1835043
3274F3536573r073660k3646371q246893R734518N28709j3591618M35316K1199868
3266D0876442O724934k6706134k4561960J4438444L3715016J1208353r004095
$$ plain form
3259 46691000 51216257 72097182 78303950 60493880 46443468 54645301 67412672 61759261
3251 61759261 40711878 21222407 10136995 3520488 -3940203 -16812383 -34475679
3244 -34475679 -44078492 -31007353 -1977258 15393520 4508792 -18315368 -23062073
3237 -23062073 -1474301 24918339 29952409 9560303 -17151537 -29291445 -23428645
3230 -23428645 -12276432 -9063566 -17098764 -31115656 -41788517 -39859803 -23168298 -18126
3222 -18126 19953865 35554771 47372355 47771064 31876240 14446636 16539986 34304789
3214 34304789 40825937 22891443 -3996438 -22019634 -30258030 -30614459 -19706812 -6472871
3206 -6472871 -11637272 -32765203 -35881064 -4387197 28048691 21907845 -11088880 -28483266
$$ packed form
3259D6691000M525257K0880925O206768j7810070j4050412Q201833J2767371n653411
3251F1759261k1047383j9489471j1085412o616507p460691j2872180j7663296
3244c4475679r602813J3071139K9030095J7370778j0884728k2824160m746705
3237b3062073K1587772K6392640N034070k0392106k6711840j2139908N862800
3230b3428645J1152213L212866q035198j4016892j0672861J928714J6691505K3150172
3222a8126J9971991J5600906J1817584L98709j5894824j7429604K093350J7764803
3214C4304789O521148j7934494k6887881j8023196q238396l56429J0907647J3233941
3206f472871n164401k1127931l115861L1493867L2435888o140846l2996725j7394386
$$ plain form
3198 -28483266 -20486236 -16412691 -33340044 -53626157 -56156413 -41135233 -19385264 -1390175
3190 -1390175 -926348 -26403887 -62349264 -78237211 -61133336 -25345917 9659448 33440580
3182 33440580 38820969 24655680 8183880 14275272 45065087 74466512 77105762 51120818
3174 51120818 13063195 -15839938 -20760585 -6782636 1201785 -11448117 -24363623
3167 -24363623 -7477536 34738374 68785533 77578048 72162090 60383537 37710309
3160 37710309 13911805 13204080 34665890 44428534 24564584 700261 20743 8315521
3152 8315521 -4493633 -35195887 -52118839 -39112591 -10796279 11178059 19521061
3145 19521061 23144761 39260767 76306036 116159624 126345421 101075004 74571870
$$ packed form
3198b8483266P997030M073545j6927353k0286113k530256J5021180K1749969J7995089
3190a390175M63827k5477539l5945377j5887947J7103875L5787419L5005365K3781132
3182C3440580N380389j4165289j6471800O091392L0789815K9401425K639250k5984944
3174E1120818l8057623k8903133m920647J3977949P984421j2649902j2915506
3167b4363623J6886087M2215910L4047159Q792515n415958j1778553k2673228
3160C7710309k3798504p07725K1461810R762644j9863950k3864323o79518Q294778
3152H315521j2809154l0702254j6922952J3006248K8316312K1974338Q343002
3145A9521061L623700J6116006L7045269L9853588J0185797k5270417k6503134
$$ plain form
3138 74571870 78302308 100346261 106518020 88172624 65035358 48814289 30859528
3131 30859528 7137043 -7395909 2094391 29693366 54898725 63533496 58737589 53755723
3123 53755723 54720612 51737050 32000990 675342 -21660353 -24939564 -21210864 -25095237
3115 -25095237 -34423415 -37429181 -28722768 -11497244 5795892 10192729 -5192262 -26272898
3107 -26272898 -29680618 -15532256 -9114672 -20948657 -28568922 -13478339 7920132 13225908
3099 13225908 12792349 30290131 59063996 70016439 55763364 35568116 18580926
3092 18580926 -6817721 -42711362 -67938323 -64702674 -40358395 -14169421 3986329
3085 3986329 15604105 24538765 29659310 21588099 -7336556 -41861680 -46375142 -7289591
$$ packed form
3138G4571870L730438K2043953O171759j8345396k3137266j6221069j7954761
3131C0859528k3722485j4532952R490300K7598975K5205359Q634771m795907m981866
3123E3755723R64889k983562j9736060l1325648k2335695l279211L728700l884373
3115b5095237r328178l005766Q706413J7225524J7293136M396837j5384991k1080636
3107b6272898l407720J4148362O417584j1833985p620265J5090583K1398471N305776
3099A3225908m33559J7497782K8773865J0952443j4253075k0195248j6987190
3092A8580926k5398647l5893641k5226961L235649K4344279K6188974J8155750
3085C986329J1617776Q934660N120545q071211k8924655l4525124m513462L9085551
$$ plain form
3077 -7289591 38915035 45518634 16634463 -196855 19788357 51238358 61964604
3070 61964604 52337158 39872753 31179933 24692911 20729884 14303047 -4242490 -28414561
3062 -28414561 -33383835 -8643741 23977454 39377101 39542683 39114402 38049354 29630541
3054 29630541 22427065 29890193 44102143 42910166 22818790 5185374 6309196 16857522
3046 16857522 17153507 2785103 -12030036 -13074554 -3806185 -2145916 -16974628 -31491019
3038 -31491019 -21082213 10861351 30475184 15686045 -13823351 -24113117 -12803868
3031 -12803868 -6582904 -18116522 -29431921 -22767767 -6966717 -881936 -4453851 -2060253
3023 -2060253 11440054 23835261 26014373 26339177 36902349 52307617 52954764 30231193
$$ packed form
3077g289591M6204626O603599k8884171j6831318J9985212L1450001J0726246
3070F1964604r627446j2464405q692820o487022l963027o426837j8545537k4172071
3062b8414561m969274K4740094L2621195J5399647J65582m28281j065048q418813
3054B9630541p203476P463128J4211950j191977k0091376j7633416J123822J0548326
3046A6857522K95985j4368404j4815139j044518R268369J660269j4828712j4516391
3038c1491019J0408806L1943564J9613833j4789139k9509396j0289766J1309249
3031a2803868O220964j1533618j1315399O664154J5801050O084781l571915K393598
3023b060253J3500307J2395207K179112L24804J0563172J5405268O47147k2723571
$$ plain form
3015 30231193 -478416 -17240341 -16103908 -10655510 -10918286 -13256161 -12005072 -10148035
3007 -10148035 -12634746 -16995306 -18658676 -21127196 -32015678 -49498896 -60025426 -51965319
2999 -51965319 -27787914 -729113 17948824 26121183 27703921 27699696 32308052 48251016
2991 48251016 73581819 89886302 74927216 29409499 -17366729 -37648887 -34351516
2984 -34351516 -29069069 -27472319 -13694265 19890010 54047845 61809702 36374773 -6416036
2976 -6416036 -44722716 -63014484 -55581190 -27586811 7488274 34433049 41016486 22128918
2968 22128918 -11869512 -35348089 -31083807 -14403310 -16592480 -40250285 -52101135
2961 -52101135 -31844785 -6447319 -13338610 -44517920 -57497216 -38119494 -19874715
$$ packed form
3015C0231193l0709609j6761925J136433N448398k62776k337875J251089J857037
3007a0148035k486711m360560j663370k468520j0888482j7483218j0526530Q060107
2999e1965319K4177405K7058801J8677937Q172359J582738m225M608356J5942964
2991D8251016K5330803J6304483j4959086m5517717m6776228k0282158L297371
2984c4351516N282447J596750J3778054L3584275L4157835P761857k5434929m2790809
2976f416036l8306680j8291768P433294K7994379L5075085K6944775O583437j8887568
2968B2128918l3998430k3478577M264282J6680497k189170k3657805j1850850
2961e2101135K0256350K5397466o891291l1179310j2979296J9377722J8244779
$$ plain form
2954 -19874715 -31388816 -53639913 -50978706 -25876426 -14055633 -30918462 -52643674
2947 -52643674 -56825558 -54177671 -61665441 -65910078 -42692291 -2646942 17628649 12162159
2939 12162159 15624022 41690035 50089554 8829507 -40018412 -25991872 47756467
2932 47756467 99605989 74651803 9453977 -26110765 -11924043 22808000 48757125
2925 48757125 52168689 26517266 -15261334 -36213435 -17609903 6361163 -9007943
2918 -9007943 -51566881 -66518581 -35422052 821021 6011213 -3716215 5085212 32044810
2910 32044810 52340975 57066000 58625236 66161006 76364187 83270443 81822640 66494907
2902 66494907 38710817 10787834 -7378368 -19017717 -28788350 -30305027 -18587371
$$ packed form
2954a9874715j1514101k2251097K661207K5102280J1820793j6862829k1725212
2947e2643674m181884K647887p487770m244637K3217787M0045349K0275591n466490
2939A2162159L461863K6066013Q399519m1260047m8847919J4026540P3748339
2932D7756467N1849522k4954186o5197826l5564742J4186722L4732043K5949125
2925D8757125L411564k5651423m1778600k0952101J8603532K3971066j5369106
2918i007943m2558938j4951700L1096529L6243073N190192r727428Q801427K6959598
2910C2044810K0296165M725025J559236P535770J0203181O906256j447803j5327733
2902F6494907k7784090k7922983j8166202j1639349r770633j516677J1717656
$$ plain form
2895 -18587371 -5537093 -5026848 -8251232 4364967 26334116 24742103 -12075371 -46909839
2887 -46909839 -34704704 18330608 59784590 55055103 23846979 4903013 5678463 5791489
2879 5791489 -3101641 -6682983 4395234 20478702 32221789 42462133 48980043 36534521
2871 36534521 2813093 -24983228 -21628101 -799246 3495624 -14295445 -27766237
2864 -27766237 -23254532 -19351141 -32545400 -47991892 -41609859 -15836594 4929790 6678795
2856 6678795 -2229823 -7718448 -4771688 4741261 17856557 29345323 29916384 11675632
2848 11675632 -22551844 -57682264 -79186685 -87925436 -94870930 -98938061 -83502866 -45940734
2840 -45940734 -16749489 -27274084 -63485007 -76946088 -45191505 1785034 23011181
$$ packed form
2895a8587371J3050278N10245l224384J2616199K1969149j592013l6817474l4834468
2887d6909839J2205135N3035312M1453982m729487l1208124j8943966P75450J13026
2879E791489q893130l581342J1078217J6083468J1743087J0240344O517910j2445522
2871C6534521l3721428k7796321L355127K0828855M294870j7791069j3470792
2864b7766237M511705L903391j3194259j5446492O382033K5773265K0766384J749005
2856F678795q908618n488625K946760R512949J3115296J1488766N71061j8240752
2848A1675632l4227476l5130420k1504421q738751o945494m067131J5435195L7562132
2840d5940734K9191245j0524595l6210923j3461081L1754583M6976539K1226147
$$ plain form
2833 23011181 13142688 -4130991 -10584356 -5892787 1501028 2011471 -6842267 -10588394
2825 -10588394 10200391 48168003 66961233 45819529 9454589 -5114846 4879235
2818 4879235 16912159 22400305 27407044 25213421 3438908 -23289239 -23602087 1120064
2810 1120064 11049989 -14831125 -45808616 -43702221 -15720063 1769649 -4584446 -16488553
2802 -16488553 -18992945 -16835918 -15294383 -7966260 8165853 20818002 16869947 1974023
2794 1974023 -4594274 5302278 16453855 8520578 -16084609 -32287263 -24609561 -8178789
2786 -8178789 -5528448 -12281449 -6628346 10637596 12634785 -10040330 -29052212 -17854756
2778 -17854756 11130684 30565123 39984040 55116131 68840366 57903789 27412163
$$ packed form
2833B3011181r868493j7273679o453365M691569P393815N10443q853738l746127
2825a0588394K0788785L7967612J8793230k1141704l6364940j4569435R994081
2818D879235J2032924N488146N006739k193623k1774513k6728147l12848K4722151
2810A120064R929925k5881114l0977491K106395K7982158J7489712o354095j1904107
2802a6488553k504392K157027J541535P328123J6132113J2652149l948055j4895924
2794A974023o568297R896552J1151577p933277k4605187j6202654P677702J6430772
2786h178789K650341o753001N653103J7265942J997189k2675115j9011882J1197456
2778a7854756K8985440J9434439R418917J5132091J3724235j0936577l0491626
$$ plain form
2771 27412163 14806607 40152275 78939497 97053829 91067570 78534689 65853537
2764 65853537 44622315 11281190 -24403142 -46486686 -41900908 -11587157 20859434
2757 20859434 25149119 238519 -18510118 -2945012 28605519 35342224 10720469
2750 10720469 -8028881 9786212 47828374 62982791 36180790 -7292674 -26206041
2743 -26206041 -6362562 27013882 40078059 29404463 21702095 34974567 55291022
2736 55291022 61273221 56696719 60782980 74509819 77836806 59277486 28590611 -2677851
2728 -2677851 -35169966 -69823909 -96749397 -104611039 -92255017 -66572098 -38033374
2721 -38033374 -20617063 -23968201 -40654394 -51511093 -47590300 -36548454 -25222354
$$ packed form
2771B7412163j2605556K5345668L8787222J8114332n986259j2532881j2681152
2764F5853537k1231222l3341125l5684332k2083544M585778L0313751L2446591
2757B0859434M289685k4910600j8748637J5565106L1550531O736705k4621755
2750A0720469j8749350J7815093L8042162J5154417k6802001m3473464j8913367
2743b6206041J9843479L3376444J3064177j0673596p702368J3272472K0316455
2736E5291022N982199m576502M086261J3726839L326987j8559320l0686875l1268462
2728b677851l2492115l4653943k6925488p861642J2356022K5682919K8538724
2721c8033374J7416311l351138j6686193j0856699L920793J1041846J1326100
$$ plain form
2714 -25222354 -9782133 11765188 31154776 41170165 43727421 40968253 31010703 18072095
2706 18072095 12219940 12622645 7748704 401391 12502943 50602722 85091444 83087939
2698 83087939 48949861 13778787 -3399289 -6046456 -4778578 -11773327 -37764830 -72074311
2690 -72074311 -78135803 -35511013 23703425 49883751 39123912 27630190 27999365 13369934
2682 13369934 -26828922 -57502488 -47005648 -14580071 -691221 -10323164 -14605296
2675 -14605296 1895340 22407324 25360611 11510809 -85158 5609779 23222790
2668 23222790 31662629 18806884 -993101 -4265956 9740256 21395487 24221271 32899615
2660 32899615 51903269 62137648 53067275 44197831 54007515 66956456 55880807 23544903
$$ packed form
2714b5222354J5440221K1547321J9389588J0015389K557256k759168r957550j2938608
2706A8072095n852155M02705m873941p347313J2101552L8099779L4488722k003505
2698H3087939l4138078l5171074j7178076k647167J267878o994749k5991503l4309481
2690g2074311o061492M2624790N9214438K6180326j0759839j1493722L69175j4629431
2682A3369934m0198856l0673566J0496840L2425577J3888850r631943m282132
2675a4605296J6500636K0511984K953287j3849802j1595967N694937J7613011
2668B3222790Q439839j2855745j9799985l272855J4006212J1655231K825784Q678344
2660C2899615J9003654J0234379r070373q869444R809684J2948941j1075649l2335904
$$ plain form
2652 23544903 -3095532 -10703502 -7780792 -2764796 1607227 -2565894 -19147364 -29738060
2644 -29738060 -10910195 27640771 47583853 32033355 7940395 6248480 19465175
2637 19465175 17136580 -7760020 -28182346 -18817730 11794990 31624312 21856630 -4927973
2629 -4927973 -24551093 -30632258 -34159874 -37903052 -28780955 -2008942 23647802 28523162
2621 28523162 18823224 15460716 24381761 34241987 37511098 36576238 31932917 20713919
2613 20713919 5991564 -5902272 -14550958 -19437682 -11781363 10700406 28525887 22294483
2605 22294483 5061244 6954973 28464692 38021644 20323395 -3554515 -14190068
2598 -14190068 -20287772 -29450739 -22731084 13560047 51803583 51666358 15062126 -17310367
$$ packed form
2652B3544903k6640435p607970K922710N015996M372023m173121j6581470j0590696
2644b9738060J8827865L8550966J9943082j5550498k4092960j691915J3216695
2637A9465175k328595k4896600k0422326R364616L0612720J9829322r767682k6784603
2629d927973j9623120o081165l527616l743178R122097K6772013K5656744M875360
2621B8523162r699938l362508Q921045R860226L269111r34860m643321j1218998
2613B0713919j4722355j1893836q648686m886724P656319K2481769J7825481o231404
2605B2294483j7233239J893729K1509719R556952j7698249k3877910j0635553
2598a4190068o097704r162967O719655L6291131L8243536j37225l6604232l2372493
$$ plain form
2590 -17310367 -20555906 -9165448 -5151152 -8707648 -8770392 -3357929 2014517 5119263
2582 5119263 7409965 10114906 14724800 22221837 30235103 36285395 42475027 49325560
2574 49325560 47884048 29972796 5810977 -3165748 7241258 17305933 12243010 3317064
2566 3317064 8546068 25230792 38376753 46905275 58871770 63058003 32964548 -29679634
2558 -29679634 -78397509 -70622360 -21101289 15878566 11819559 -12241994 -26253736
2551 -26253736 -27544152 -26723730 -22185067 -8849928 2816398 -969402 -12927290 -13123487
2543 -13123487 243965 6956983 -6198614 -27390662 -35165187 -21719156 3001757
2536 3001757 23431980 31939899 33489286 35884780 35707420 23699653 7456863 11612958
$$ packed form
2590a7310367l245539J1390458M014296l556496o2744N412463N372446L104746
2582E119263K290702K704941M609894P497037Q013266O050292O189632O850533
2574D9325560j441512j7911252k4161819q976725J0407006J0064675n062923q925946
2566C317064N229004J6684724J3145961Q528522J1966495M186233l0093455o2644182
2558b9679634m8717875P775149M9521071L6979855m059007k4061553j4011742
2551b6253736j290416Q20422M538663J3335139J1666326l785800j1957888j96197
2543a3123487J3367452O713018j3155597k1192048p774525J3446031K4720913
2536C001757K0430223Q507919J549387K395494j77360j2007767j6242790M156095
$$ plain form
2528 11612958 41783609 64441292 44457938 -7513098 -48432834 -55936206 -43634933
2521 -43634933 -31461573 -30176044 -49449706 -84938854 -96442846 -40750868 60714466
2514 60714466 125998256 106293536 43870093 12722445 31065279 61434457 71851181
2507 71851181 62309498 46952135 42861028 65733927 107638451 129250422 102690817
2500 102690817 52940731 28183864 37442907 47628589 35796552 11842991 -9045603
2493 -9045603 -24970830 -35791908 -40544311 -48661373 -67404418 -76888345 -47060263 14809942
2485 14809942 61970605 62755320 32762290 4072695 -12288700 -21324773 -24792595 -22520822
2477 -22520822 -17372985 -8485094 5534528 11072705 -12396780 -59697101 -95655078 -94491694
$$ packed form
2528A1612958L0170651K2657683j9983354n1971036m0919736p503372J2301273
2521d3634933J2173360J285529j9273662l5489148j1503992N5691978J01465334
2514F0714466O5283790j9704720o2423443l1147648J8342834L0369178J0416724
2507G1851181r541683j5357363m091107K2872899M1904524K1611971k6559605
2500A02690817m9750086k4756867R259043J0185682j1832037k3953561k0888594
2493i045603j5925227j0821078m752403q117062j8743045r483927K9828082O1870205
2485A4809942M7160663P84715k9993030k8689595j6361395r036073l467822K271773
2477b2520822N147837Q887891J4019622N538177k3469485m7300321l5957977J163384
$$ plain form
2469 -94491694 -65921888 -33824847 -9932511 1458509 -3579894 -16073592 -15766917 -228885
2461 -228885 9425410 7041986 18916995 59771971 97190979 91968688 55154422 29206529
2453 29206529 24704944 14745317 -11740738 -31551591 -29682223 -25586364 -40927389 -65432716
2445 -65432716 -72997631 -57155629 -35335572 -26049385 -31917199 -40198254 -35762942 -18447261
2437 -18447261 -5762203 -9030285 -11882874 9966676 48549509 65831960 43180750
2430 43180750 7071446 -8103350 -4335371 -7757047 -25064385 -36448821 -29074631 -14378187
2422 -14378187 -6118089 446910 15354032 31184990 28780044 3177160 -28969878 -49694692
2414 -49694692 -56619215 -55461048 -47357406 -34005854 -26827415 -35372940 -49014242 -47122222
$$ packed form
2469i4491694K8569806L2097041K3892336J1391020n038403j2493698L06675J5538032
2461b28885R654295k383424J1875009M0854976L7419008n222291l6814266k5947893
2453B9206529m501585r959627k6486055j9810853J869368M095859j5341025k4505327
2445f5432716p564915J5842002K1820057R286187n867814q281055M435312J7315681
2437a8447261J2685058l268082k852589K1849550L8582833J7282451k2651210
2430D3180750l6109304j5174796L767979l421676j7307338j1384436P374190J4696444
2422a4378187Q260098O564999J4907122J5830958k404946k5602884l2147038k0724814
2414d9694692o924523J158167Q103642J3351552P178439q545525j3641302J892020
$$ plain form
2406 -47122222 -29834231 -20777109 -31529331 -41536847 -28232994 -2679661 5563267
2399 5563267 -8029366 -16951227 -2052126 23396721 33334463 20222154 -485096 -8824565
2391 -8824565 2032868 21269484 31073710 25270685 14905896 10180490 4335718 -12113549
2383 -12113549 -27457315 -18419427 15136552 44298082 46748706 32560013 25364126 30849303
2375 30849303 34836736 24021258 -665792 -25597887 -34097570 -21111989 -295452
2368 -295452 12757737 23029419 45106872 69101853 63330800 22482162 -13587012 -11210952
2360 -11210952 9002581 4278652 -27319295 -51835229 -57796014 -67316913 -85600382 -82396910
2352 -82396910 -41689641 5484473 23627626 20667959 22531003 21349318 -11698847 -69283292
$$ packed form
2406d7122222J7287991R057122j0752222j0007516J3303853K5553333Q242928
2399E563267j3592633q921861J4899101K5448847R937742j3112309k0707250q339469
2391h824565J0857433J9236616R804226n803025j0364789m725406n844772j6449267
2383a2113549j5343766R037888L3555979K9161530K450624j4188693p195887N485177
2375C0849303L987433j0815478k4687050k4932095q499683J2985581K0816537
2368b95452J3053189J0271682K2077453K3994981n771053m0848638l6069174K376060
2360a1210952K0213533m723929l1597947k4515934n960785r520899j8283469L203472
2352h2396910M0707269M7174114J8143153k959667J863044j181685l3048165n7584445
$$ plain form
2344 -69283292 -104130433 -90679836 -58797489 -49834181 -62478264 -63853955 -40522232
2337 -40522232 -13827727 -6048388 -11811692 -11034791 1552152 11311138 5543183 -9217099
2329 -9217099 -15585149 -5893922 11457378 23779171 24829847 14474864 -2005225 -10912856
2321 -10912856 1473400 28598284 42744366 27904265 4452777 3316141 22206737
2314 22206737 30619215 16992245 3334648 5655135 8149612 -6278474 -24151123 -24273452
2306 -24273452 -14614351 -18232263 -33629120 -38911828 -29674144 -21736634 -16918094 913671
2298 913671 28886720 36707061 10612843 -21373275 -28310368 -18496917 -19473667 -33665804
2290 -33665804 -41922908 -41066749 -47437761 -62816705 -64223000 -37050538 862327 21481944
$$ packed form
2344f9283292l4847141J3450597L1882347Q963308j2644083j375691K3331723
2337d0522232K6694505P779339n763304P76901J2586943R758986n767955j4760282
2329i217099o368050R691227J7351300J2321793J050676j0354983j6480089q907631
2321a0912856J2386256K7124884J4146082j4840101k3451488j136636J8890596
2314B2206737Q412478j3626970j3657597K320487K494477j4428086j7872649j22329
2306b4273452R659101l617912j5396857n282708R237684P937510M818540J7831765
2298I13671K7973049P820341k6094218l1986118o937093R813451r76750j4192137
2290c3665804q257104Q56159o371012j5378944j406295K7172462L7912865K0619617
$$ plain form
2282 21481944 22201460 25607930 46001155 67144922 59489624 17073625 -31140150 -52591664
2274 -52591664 -47137936 -39716385 -41243631 -36905124 -18015328 -2391179 -6667198 -16088821
2266 -16088821 -4792869 23747426 40769714 33093040 16771735 8697465 5653505 -2802748
2258 -2802748 -17117016 -29911239 -33469216 -21520192 4741146 29870576 35116294 18499621
2250 18499621 -6091535 -28166336 -45226030 -50747933 -37356490 -15146769 -7472359
2243 -7472359 -21570318 -39744371 -45837287 -43548845 -42252533 -43366632 -48718633 -61874796
2235 -61874796 -70462503 -50141677 -3304404 27551418 8622516 -38209903 -62060245
2228 -62060245 -45870368 -17199867 -4016815 -7246946 -16007723 -24097144 -26388135 -18702010
$$ packed form
2282B1481944P19516L406470K0393225K1143767p655298m2415999m8213775k1451514
2274e2591664N453728P421551j527246M338507J8889796J5624149m276019r421623
2266a6088821J1295952K8540295J7022288p676674j6321305q074270l043960q456253
2258b802748j4314268j2794223l557977J1949024K6261338K5129430N245718j6616673
2250A8499621k4591156k2074801j7059694n521903J3391443K2209721P674410
2243g472359j4097959j8174053o092916K288442J296312j114099n352001j3156163
2235f1874796q587707K0320826M6837273L0855822j8928902m6832419k3850342
2228f2060245J6189877K8670501J3183052l230131q760777q089421k290991P686125
$$ plain form
2220 -18702010 -7236302 -4296401 -12873976 -27841997 -48342314 -71004786 -75541657 -42704548
2212 -42704548 10723812 40846332 28702173 -255136 -18027488 -28757362 -45046005
2205 -45046005 -55794964 -44916913 -25797945 -26865525 -49160954 -65356684 -59094755
2198 -59094755 -40054297 -18896850 6721730 33639449 43997472 28481793 3220940
2191 3220940 -10239918 -10718648 -11040382 -16040123 -20279605 -20557497 -17485688 -9232189 4086861
2182 4086861 13100262 8012813 -7144724 -19606346 -25272340 -30597331 -39211204 -48122427
2174 -48122427 -56121687 -64233917 -68657999 -65713761 -62602023 -68283035 -74127041 -62432248
2166 -62432248 -36872688 -21903574 -23074238 -12421459 28680178 73004964 79131848
$$ packed form
2220a8702010J1465708K939901q577575j4968021k0500317k2662472m536871L2837109
2212d2704548N3428360L0122520j2144159k8957309j7772352j0729874j6288643
2205d5046005j0748959J0878051J9118968j067580k2295429j6195730O261929
2198e9094755J9040458K1157447K5618580K6917719J0358023j5515679k5260853
2191C220940j3460858m78730l21734m999741m239482k77892L071809Q253499J3319050
2182D086861R013401n087449j5157537j2461622n665994n324991q613873q911223
2174d8122427p999260q112230m424082K944238L111738n681012n844006J1694793
2166f2432248K5559560J4969114j170664J0652779M1101637M4324786O126884
$$ plain form
2159 79131848 46797722 13802253 4562453 8931119 10226608 6224778 -3445831 -26661183
2151 -26661183 -63832897 -98196613 -109971838 -91750457 -49776110 -2882430 22305415
2144 22305415 13957467 -6413240 -7414662 10001550 17192280 6250513 3635008 25260090
2136 25260090 48687185 49215688 38024442 40734128 57882282 71481236 75416676 74987260
2128 74987260 68827956 54821228 43406627 43387065 45641495 41487484 42091701 54385535
2120 54385535 54123052 16672974 -35651265 -55005569 -34949706 -19162298 -38876780
2113 -38876780 -75215780 -91688242 -73775822 -27962412 27360059 58270656 34346897
2106 34346897 -29587087 -75589195 -66089798 -24713098 3767661 11216586 19850519 36423712
$$ packed form
2159G9131848l2334126l2995469r239800M368666J295489m001830r670609k3215352
2151b6661183l7171714l4363716j1775225J8221381M1974347M6893680K5187845
2144B2305415q347948k0370707j001422J7416212P190730j0941767k615505K1625082
2136B5260090K3427095N28503j1191246K709686J7148154J3598954L935440m29416
2128G4987260o159304j4006728j1414601j9562K254430m154011O04217J2293834
2120E4385535k62483l7450078n2324239j9354304K0055863J5787408j9714482
2113c8876780l6339000j6472462J7912420M5813410N5322471L0910597k3923759
2106C4346897o3933984m6002108R499397M1376700K8480759P448925Q633933J6573193
$$ plain form
2098 36423712 42654735 26235985 -2491201 -26156585 -37629582 -40508541 -41421770 -41762552
2090 -41762552 -34492417 -15073165 4247561 4300464 -13879179 -29155793 -33710438 -44550069
2082 -44550069 -68579646 -79462919 -52510648 -6176568 18378222 9885810 -7483876
2075 -7483876 -15215045 -17924592 -18655138 -5917631 23468581 49931894 54037191 40323877
2067 40323877 25444361 13402651 -2861229 -21484189 -29164053 -19691246 -2535567
2060 -2535567 11969504 25584823 40618963 43334527 16758580 -27202454 -47418003
2053 -47418003 -19387368 30712354 55534501 42267662 18795719 9726723 11656209
2046 11656209 14099540 18478022 25619640 24836555 7703843 -22042223 -58793695 -96542030
$$ packed form
2098C6423712O231023j6418750k8727186k3665384j1472997k878959r13229l40782
2090d1762552P270135J9419252J9320726N2903j8179643j5276614m554645j0839631
2082d4550069k4029577j0883273K6952271M6334080K4554790q492412j7369686
2075g483876p731169k709547p30546J2737507K9386212K6463313M105297j3713314
2067D0323877j4879516j2041710j6263880j8622960p679864R472807J7155679
2060b535567J4505071J3615319J5034140K715564k6575947m3961034k0215549
2053d7418003K8030635N0099722K4822147j3266839k3471943r068996J929486
2046A1656209K443331M378482P141618p83085j7132712k9746066l6751472l7748335
$$ plain form
2038 -96542030 -115036709 -91306165 -37762251 -526479 51441 -739073 31315064 69221447
2030 69221447 59643204 2254495 -47791683 -53122167 -31229994 -15113556 -12823132 -17106818
2022 -17106818 -25328385 -32738162 -25620332 2008597 34895810 50414863 40426172 16173293
2014 16173293 -2210195 -2043342 8576046 7999685 -10419219 -26605147 -22903168 -11547105
2006 -11547105 -13376000 -22198236 -17397668 -3236531 -3564397 -19689658 -26784461 -15570073
1998 -15570073 -4959241 -5499919 -1962306 15055190 28621392 22463340 5375336 -6300727
1990 -6300727 -10668089 -12480846 -13071004 -17995615 -33087416 -44547743 -29878429 244958
1982 244958 3121778 -34148680 -66945705 -55348903 -24905614 -27968465 -63895979 -80147702
$$ packed form
2038i6542030j8494679K3730544N3543914L7235772N77920p90514L2054137L7906383
2030F9221447r578243n7388709n0046178n330484K1892173J6116438K290424m283686
2022a7106818q221567p409777P117830K7628929L2887213J5519053r988691k4252879
2014A6173293j8383488J66853J0619388n76361j8418904j6185928L701979J1356063
2006a1547105j828895q822236M800568J4161137l27866j6125261p094803J1214388
1998a5570073J0610832n40678L537613J7017496J3566202o158052j7088004j1676063
1990f300727m367362j812757n90158m924611j5091801j1460327J4669314L0123387
1982B44958K876820l7270458l2797025J1596802L0443289l062851l5927514j6251723
$$ plain form
1974 -80147702 -47685125 2748387 25149122 11342142 -9542392 -7549949 19471767
1967 19471767 45375176 42621154 13056984 -15177585 -23922157 -22016474 -19405009 -7970853
1959 -7970853 15094622 28728247 18053313 3609069 11796318 32581948 38186229 28890262
1951 28890262 23588623 16322522 -14428729 -55548668 -63625060 -28152483 9150263 11783304
1943 11783304 -9033394 -24235402 -27102423 -25555056 -22706862 -24020880 -37945980 -50976552
1935 -50976552 -29737631 28959789 76537658 69645214 26835600 -2899282 -8159003
1928 -8159003 -13019282 -19563910 752743 52830919 95628460 92301380 55535155 24061749
1920 24061749 14731049 18087071 25559170 37058642 48014935 50406271 46729134 46793950
$$ packed form
1974h0147702L2462577N0433512K2400735j3806980k0884534J992443K7021716
1967A9471767K5903409k754022k9564170k8234569q744572J905683K611465J1434156
1959g970853K3065475J3633625j0674934j4444244Q187249K0785630N604281r295967
1951B8890262n301639p266101l0751251m1119939q076392L5472577L7302746K633041
1943A1783304k0816698j5202008k867021J547367K848194j314018j3925100j3030572
1935e0976552K1238921N8697420M7577869o892444m2809614k9734882n259721
1928h159003m860279o544628K0316653N2078176M2797541l327080l6766225l1473406
1920B4061749r330700L356022P472099J1499472J0956293K391336l677137O4816
$$ plain form
1912 46793950 50563200 49968454 48013262 55920093 65230877 46354449 -7284085 -53260672
1904 -53260672 -46544376 -1662256 25279820 15551629 9264560 35585133 63055555 50597851
1896 50597851 15890770 8665251 32654630 42780188 17690980 -12564569 -20555245
1889 -20555245 -19032091 -25283218 -26014727 -5123178 22220926 32823233 31036560 31698810
1881 31698810 26220706 -1499335 -37442539 -49382391 -31760613 -9078772 2665115
1874 2665115 9076603 12960465 7213789 -3577959 -3248249 5742218 -1234979 -32173424
1866 -32173424 -59972164 -58447366 -37042364 -22293582 -21125541 -21542198 -17019675 -9814128
1858 -9814128 2038607 21254949 38444420 39948154 27667173 17374458 18114084 24715901
$$ packed form
1912D6793950L769250n94746j955192P906831R310784j8876428n3638534m5976587
1904e3260672O716296M4882120K6942076r728191o287069K6320573K7470422j2457704
1896E0597851l4707081p225519K3989379J0125558k5089208l0255549p990676
1889b0555245J523154o251127p31509K0891549K7344104J0602307j786673O62250
1881C1698810n478104k7720041l5943204j1939852J7621778K2681841J1743887
1874B665115O411488L883862n746676j0791748L29710Q990467o977197l0938445
1866c2173424k7798740J524798K1405002J4748782J168041m16657M522523P205547
1858i814128J1852735J9216342J7189471J503734j2280981j0292715P39626O601817
$$ plain form
1850 24715901 28414566 23566897 7669742 -12368693 -18695064 -3477570 12569598 3765777
1842 3765777 -17989194 -9600225 44627614 104153321 119471504 90892988 58929000
1835 58929000 48002556 44602665 28082551 -627853 -25855028 -36058994 -30326342
1828 -30326342 -17790712 -13509289 -23587560 -32993405 -21195956 7818651 25513369
1821 25513369 13466500 -15284144 -34795849 -32844698 -13876314 9173699 18342147
1814 18342147 2667375 -21690942 -19633131 19069299 58401899 57161573 19829606
1807 19829606 -14154656 -21918802 -13286988 -1540280 12308067 22283119 12390911 -18247505
1799 -18247505 -44762810 -45835828 -30501600 -22267903 -27133146 -32168810 -29936310 -29134458
$$ packed form
1850B4715901L698665m847669j5897155k0038435o326371J5217494J6047168q803821
1842C765777k1754971Q388969N4227839N9525707J5318183k8578516l1963988
1835E8929000j0926444l399891j6520114k8710404k5227175j0203966N732652
1828c0326342J2535630M281423j0078271r405845J1797449K9014607J7694718
1821B5513369j2046869k8750644j9511705J951151J8968384K3050013R168448
1814A8342147j5674772k4358317K057811L8702430L9332600j240326l7331967
1807A9829606l3984262p764146Q631814J1746708J3848347R975052r892208l0638416
1799a8247505k6515305j073018J5334228Q233697m865243n035664K232500Q01852
$$ plain form
1791 -29134458 -39456020 -55616229 -61927443 -50721207 -31597561 -18401001 -9219210
1784 -9219210 10629092 41855018 60699284 47301038 13550331 -14255975 -30788137
1777 -30788137 -46839404 -56115801 -38141070 2089318 29355520 25680138 13792696
1770 13792696 15976541 18178754 1053321 -17639226 -6556387 27012651 45439959
1763 45439959 37302912 30163569 43218474 59859382 57771544 38924908 16428341 -4309205
1755 -4309205 -15830883 -2874397 32773239 59033200 48521028 15010565 -8092395
1748 -8092395 -15368800 -27905254 -48741170 -51412646 -20116325 25113624 55833681 66637929
1740 66637929 65618609 53939069 33482934 18298715 17097693 16875972 5145771 -5025078
$$ packed form
1791b9134458j0321562j6160209o311214J1206236J9123646J3196560R181791
1784i219210J9848302L1225926J8844266j3398246l3750707k7806306j6532162
1777c0788137j6051267r276397J7974731M0230388K7266202l675382j1887442
1770A3792696K183845K202213j7125433j8692547J1082839L3569038J8427308
1763D5439959q137047p139343J3054905J6640908k087838j8846636k2496567k0737546
1755d309205j1521678J2956486L5647636K6259961j0512172l3510463k3102960
1748h092395p276405j2536454k0835916k671476L1296321M5229949L0720057J0804248
1740F6637929j019320j1679540k0456135j5184219j201022k21721j1730201j0170849
$$ plain form
1732 -5025078 1767937 7851243 -14918552 -52529643 -59040086 -24312758 9164981 10334708
1724 10334708 -162842 4517981 11449738 291249 -11869046 594427 21801534
1717 21801534 17941953 -3870407 -5602094 19733129 39530545 34051313 17511152 4719805
1709 4719805 -6352504 -14876131 -13654799 -8405502 -10003738 -9423476 6737316 21984621
1701 21984621 10128198 -17810654 -31543774 -35688116 -50920335 -54161823 -11410042
1694 -11410042 37609007 26441354 5199138 111584168 341059102 472284831 333098345
1687 333098345 49405701 -107190731 -62408645 19881310 13022420 -24256834 -4088774
1680 -4088774 38963527 31040409 -11902052 -27452337 -12546987 -6043622 -12164418 -11769794
$$ packed form
1732e025078O793015O083306k2769795l7611091o510443L4727328L3477739J169727
1724A0334708j0497550M680823O931757j1158489j2160295J2463473K1207107
1717B1801534l859581k1812360j731687K5335223J9797416n479232j6540161j2791347
1709D719805j1072309q523627J221332N249297j598236N80262J6160792J5247305
1701B1984621j1856423k7938852j3733120m144342j5232219l241488M2751781
1694a1410042M9019049j1167653k1242216J06385030K29474934J31225729j39186486
1687C33098345k83692644j56596432M4782086Q2289955o858890l7279254K0168060
1680d088774M3052301p923118m2942461j5550285J4905350O503365o120796L94624
$$ plain form
1672 -11769794 -14613493 -36902416 -55345336 -42439438 -23124583 -38261141 -70990280
1665 -70990280 -69182055 -31439748 -12073069 -38237312 -73616273 -75177654 -44217116
1658 -44217116 -6781980 22106421 36470601 27525183 -4280198 -37413422 -46812320
1651 -46812320 -31324769 -14646394 -16723468 -27772715 -18876714 16067121 41215794
1644 41215794 21158944 -25431823 -45560502 -26642567 -12474683 -30113699 -43299375
1637 -43299375 -10925690 42887012 61656852 38304853 15751376 15042578 12210232 -9016638
1629 -9016638 -26235767 -16346127 8343085 21583906 18579482 12296260 10672183 13842421
1621 13842421 23271477 38971928 52416741 52483650 37846492 19643721 12279817 20692236
$$ packed form
1672a1769794k843699k2288923j8442920J2905898J9314855j5136558l2729139
1665g0990280J808225L7742307J9366679k6164243l5378961j561381L0960538
1658d4217116L7435136K8888401J4364180q945418l1805381l3133224r398898
1651d6812320J5487551J6678375k077074j1049247Q896001L4943835K5148673
1644D1215794k0056850m6590767k0128679J8917935J4167884j7639016j3185676
1637d3299375L2373685N3812702J8769840k3351999k2553477p08798k832346k1226870
1629i016638j7219129R889640K4689212J3240821l004424o283222j624077L170238
1621A3842421R429056J5700451J3444813O6909j4637158j8202771p363904Q412419
$$ plain form
1613 20692236 34966905 40945226 37906996 38574715 48510790 56802819 54183631 47209336
1605 47209336 42841011 31739548 3045386 -33175624 -55062188 -55100567 -43460526 -31766433
1597 -31766433 -26401658 -29724131 -34403138 -25703545 -2816470 14082871 13215947 11999489
1589 11999489 27804835 44079167 33088702 289343 -24692451 -32594316 -36844785
1582 -36844785 -37483007 -20579471 5286619 10647430 -8479252 -22053889 -16639638 -19317095
1574 -19317095 -51042820 -86470509 -86578294 -50831532 -11423385 10212381 17634139 20004085
1566 20004085 20725332 21996395 24131666 21308800 8772879 -7398853 -15135740 -8997765
1558 -8997765 5708651 17684369 17157842 4087172 -11090687 -19982868 -25009877 -28044127
$$ packed form
1613B0692236J4274669N978321l038230O67719R936075Q292029k619188o974295
1605D7209336m368325j1101463k8694162l6221010k1886564l8379J1640041J1694093
1597c1766433N364775l322473m679007Q699593K2887075J6899341q66924j216458
1589A1999489J5805346J6274332j0990465l2799359k4981794p901865m250469
1582c6844785o38222J6903536K5866090N360811j9126682j3574637N414251k677457
1574a9317095l1725725l5427689j07785L5746762L9408147K1635766P421758K369946
1566B0004085P21247J271063K135271k822866j2535921j6171732p736887O137975
1558h997765J4706416J1975718n26527j3070670j5177859q892181n027009l034250
$$ plain form
1550 -28044127 -20136786 2234459 20919829 18144100 6397125 8492815 14208235 -7082905
1542 -7082905 -49512667 -67824959 -42898646 -9122673 3640476 15175443 51548746
1535 51548746 91089986 93441621 60650596 29951964 19487655 17766864 17246827 22495869
1527 22495869 29246524 26811620 18626001 13530332 3633108 -19511972 -35411574 -18257453
1519 -18257453 13180890 10777507 -31436223 -61301857 -39099106 11231335 41431431
1512 41431431 38495483 19993704 -4132263 -33622374 -56338373 -55568231 -35452260 -16663037
1504 -16663037 -8199510 -1009820 12045624 25807781 32171148 27108549 9476635 -15442199
1496 -15442199 -32793040 -30652444 -15622540 -5742646 -8961792 -19058205 -30628409 -44345616
$$ packed form
1550b8044127P907341K2371245J8685370k775729j1746975K095690N715420k1291140
1542g082905m2429762j8312292K4926313L3775973J2763149J1534967L6373303
1535E1548746L9541240K351635l2791025l0698632j0464309j720791n20037N249042
1527B2495869O750655k434904q185619n095669r897224k3145080j5899602J7154121
1519a8257453L1438343k403383m2213730k9865634K2202751N0330441L0200096
1512D1431431k935948j8501779k4125967k9490111k2715999P70142K0115971J8789223
1504a6663037Q463527P189690J3055444J3762157O363367n062599j7631914k4918834
1496a5442199j7350841K140596J5029904R879894l219146j0096413j1570204j3717207
$$ plain form
1488 -44345616 -56405390 -57164593 -45093132 -30296482 -19424359 -9420346 -1965582 -8645361
1480 -8645361 -29414198 -39661917 -17966654 20085903 36907533 20880303 -1835719
1473 -1835719 -7398646 -4173856 -11075165 -25042261 -28838668 -20455050 -14636310 -18189867
1465 -18189867 -20552437 -10134999 11326712 31334384 35831942 19060159 -7375360
1458 -7375360 -20649364 -11942591 1413388 980661 -5283019 1609016 17685334 21895030
1450 21895030 12468818 9678419 19800030 25062686 17505408 13675356 21259784 19333412
1442 19333412 -5637016 -26585491 -7107758 45921566 87160895 85073039 48906357
1435 48906357 8510136 -13351705 -11650164 382198 2457992 -8508273 -10626688 13200942
$$ packed form
1488d4345616j2059774p59203J2071461J4796650J0872123J0004013P454764o679779
1480h645361k0768837j0247719K1695263L8052557J6821630j6027230k2716022
1473a835719n562927L224790o901309j3967096l796407Q383618N818740l553557
1465a8189867k362570J0417438K1461711K0007672M497558j6771783k6435519
1458g375360j3274004Q706773J3355979m32727o263680O892035J6076318M209696
1450B1895030r426212k790399J0121611N262656p557278l830052P584428j926372
1442A9333412k4970428k0948475J9477733N3029324M1239329k087856l6166682
1435D8906357m0396221k1861841J701541J2032362K075794j0966265k118415K3827630
$$ plain form
1427 13200942 46125774 56134309 37836650 14614025 1921483 -8089774 -21693652
1420 -21693652 -26162013 -9907269 13484254 16000423 -12853350 -53025606 -73271770
1413 -73271770 -60389271 -28009599 2211687 21723595 31151975 23497279 -9817553
1406 -9817553 -54333961 -75763557 -59103934 -27505938 -10175711 -9413712 -13585696 -21274304
1398 -21274304 -30307396 -21957689 14552634 53642579 59681579 35126436 14058958 13096215
1390 13096215 17698859 13635324 1984023 -15999486 -39084280 -51632703 -40123007
1383 -40123007 -24220875 -36398869 -66645219 -66071381 -17258092 36583903 51029533
1376 51029533 35144821 24134784 27520720 32129036 33386687 34470265 29544904 13085470
$$ packed form
1427A3200942L2924832J0008535j8297659k3222625j2692542j0011257j3603878
1420b1693652m468361J6254744K3391523K516169k8853773m0172256k0246164
1413g3271770J2882499L2379672L0221286J9511908R428380p654696l3314832
1406i817553m4516408k1429596J6659623L1597996J7330227P61999m171984p688608
1398b1274304r033092Q349707L6510323L9089945O039000k4555143k1067478r62743
1390A3096215M602644m063535j1651301j7983509k3084794j2548423J1509696
1383d0123007J5902132j2177994l0246350N73838M8813289N3841995J4445630
1376E1029533j5884712j1010037L385936M608316J257651J083578m925361j6459434
$$ plain form
1368 13085470 -5249119 -14156098 -16223217 -14243482 -304666 22544858 28453610 3870260
1360 3870260 -22900545 -15965992 17014610 37566882 31635409 22088665 29713166 49809897
1352 49809897 68163837 76167628 67860955 42145928 10520148 -12328128 -23639078
1345 -23639078 -24833799 -7873222 29805133 64564817 66858824 40460914 17255920
1338 17255920 14137537 20349500 27314874 41677759 62307655 72285246 65709455 59206233
1330 59206233 62942110 59834865 29178139 -23016683 -70098232 -89787160 -74762833
1323 -74762833 -33016580 11646024 32918024 27555592 17751636 20883649 30352326 33784187
1315 33784187 32571288 30735135 21160016 -533145 -21789166 -29764504 -29987651 -30930560
$$ packed form
1368A3085470j8334589q906979k067119J979735J3938816K2849524N908752k4583350
1360C870260k6770805O934553L2980602K0552272n931473r546744P624501K0096731
1352D9809897J8353940Q003791q306673k5715027l1625780k2848276j1310950
1345b3639078j194721J6960577L7678355L4759684K294007k6397910k3204994
1338A7255920l118383O211963O965374J4362885K0629896R977591o575791o503222
1330E9206233L735877l107245l0656726n2194822m7081549j9688928J5024327
1323g4762833M1746253M4662604K1272000n362432r803956L132013R468677L431861
1315C3784187j212899j836153r575119k1693161k1256021p975338k23147r42909
$$ plain form
1307 -30930560 -23413729 1826514 26294349 21051945 -10785242 -35435007 -33993107 -20834068
1299 -20834068 -11838332 -1987269 12963213 17872297 1221781 -21841330 -31907903 -36568835
1291 -36568835 -53488547 -71353298 -58423121 -12003793 28788518 30011777 1461606
1284 1461606 -23194910 -25963764 -10869816 11053855 25326773 17075365 -9680018 -27332281
1276 -27332281 -19338410 -7010009 -16993855 -34522644 -23147273 14032743 32962254
1269 32962254 14139489 -11130245 -14829096 -12494634 -25036288 -37782073 -31963080 -25562493
1261 -25562493 -40365142 -52178320 -23300942 28841252 48441198 24558655 5280668
1254 5280668 21267050 45791333 47934894 38932488 39937980 43087295 35101979 27680852
$$ packed form
1307c0930560P516831K5240243K4467835n242404l1837187k4649765J441900J3159039
1299b0834068Q995736R851063J4950482M909084j6650516k3063111j0066573m660932
1291c6568835j6919712j7864751J2930177M6419328M0792311J223259k8550171
1284A461606k4656516k768854J5093948K1923671J4272918q251408k6755383j7652263
1276b7332281P993871J2328401r983846j7528789J1375371L7180016J8929511
1269C2962254j8822765k5269734l698851K334462j2541654j2745785N818993O400587
1261b5562493j4802649j1813178K8877378N2142194J9599946k3882543j9277987
1254E280668J5986382K4524283K143561r002406J005492L149315p985316p421127
$$ plain form
1246 27680852 32721434 34390807 18270653 4134419 15168827 35347827 34394935 18513591
1238 18513591 17401600 33143243 42622267 42947491 51712296 63479337 49595983 8511559
1230 8511559 -23025547 -21343799 -5142651 -707636 -8190546 -15234403 -15093010 731236
1222 731236 36523159 64989227 40827571 -36382175 -104829039 -112249417 -75872582 -42243260
1214 -42243260 -18727597 15273906 53529708 68242274 60207947 57529820 65332605 58411815
1206 58411815 27210631 -7739053 -33573780 -60070273 -87382157 -94779853 -75382385
1199 -75382385 -49917195 -31883650 -11656773 9040178 3564543 -33260811 -58090255
1192 -58090255 -32205405 21299886 47393862 28947558 -5478954 -27451512 -27451189 -1251253
$$ packed form
1246B7680852N040582J669373j6120154j4136234J1034408K0179000r52892j5881344
1238A8513591j111991J5741643R479024L25224Q764805J1767041j3883354m1084424
1230H511559l1537106J681748J6201148M435015p482910p043857J41393J5824246
1222G31236L5791923K8466068k4161656p7209746o8446864p420378L6376835L3629322
1214d2243260K3515663L4001503L8255802J4712566q034327k678127P802785o920790
1206E8411815l1201184l4949684k5834727k6496493k7311884p397696J9397468
1199g5382385K5465190J8033545K0226877K0696951n475635l6825354k4829444
1192e8090255K5884850N3505291K6093976j8446304l4426512k1972558L23K6199936
$$ plain form
1184 -1251253 43453961 72847166 57952245 19293558 4584380 21230013 29800945
1177 29800945 10318355 -6742871 8277058 39323569 54485950 50948469 44086873
1170 44086873 35894304 22317190 13765242 20057115 27831832 19010207 863600 -7574384
1162 -7574384 -8629868 -17986740 -31473786 -30475386 -18219742 -18644278 -33850343 -33154918
1154 -33154918 1989227 46260163 61536662 43366283 18269872 5816692 2367030
1147 2367030 -2028701 -8412220 -13529159 -18118452 -24812855 -32456727 -36678696 -35082828
1139 -35082828 -30005163 -25784937 -23849880 -21824841 -17885145 -13410989 -9276778 -2717847
1131 -2717847 7634995 15674545 13156552 2177253 -3442304 6589348 24846723 32302289
$$ packed form
1184a251253M4705214K9393205j4894921l8658687j4709178J6645633Q570932
1177B9800945j9482590j7061226J5019929L1046511J5162381l537481o861596
1170D4086873q192569j3577114q551948O291873P774717q821625j8146607q437984
1162g574384j055484r356872j3487046R98400J2255644m24536j5206065O95425
1154c3154918L5144145M4270936J5276499j8170379k5096411j2453180l449662
1147B367030m395731o383519n116939m589293o694403p643872m221969J595868
1139c5082828N077665M220226J935057K025039L939696M474156M134211O558931
1131b717847J0352842Q039550k517993j0979299n619557J0031652J8257375P455566
$$ plain form
1123 32302289 20083681 1019531 -5777489 270613 1911774 -7089521 -7742129 16005271
1115 16005271 46148053 50261707 28373846 12375693 13894038 4049287 -38210237 -86460517
1107 -86460517 -102420065 -89220600 -76165262 -66244938 -38931721 -181004 13536024
1100 13536024 -9806698 -35424037 -30391005 -5113094 12288751 17036553 20607371 22938283
1092 22938283 16761344 6863094 2283096 -1650822 -13298988 -24787000 -22182599 -9843581
1084 -9843581 -5412534 -13998939 -23982158 -24095603 -8310752 29522012 84708418 129194294
1076 129194294 134370951 108273222 86687634 83205170 74270514 44157167 16604168
1069 16604168 19121779 36803770 32951220 6746124 -3960153 18014734 38746996
$$ packed form
1123C2302289j2218608j9064150o797020O048102J641161r001295o52608K3747400
1115A6005271L0142782M113654k1887861j5998153J518345r844751m2259524m8250280
1107h6460517j5959548J3199465J3055338R920324K7313217L8750717J3717028
1100A3536024k3342722k5617339N033032K5277911J7401845M747802L570818K330912
1092B2938283o176939r898250m579998l933918j1648166j1488012K604401J2339018
1084i843581M431047q586405r983219j13445J5784851L7832764N5186406M4485876
1076A29194294N176657k6097729k1585588l482464q934656l0113347k7552999
1069A6604168K517611J7681991l852550k6205096j0706277K1974887K0732262
$$ plain form
1062 38746996 19929916 -25898344 -52236283 -40891144 -20339673 -20881848 -37204236
1055 -37204236 -47286911 -48124897 -51843759 -56682595 -46604696 -21153901 -3265692 -6581383
1047 -6581383 -11295408 10532312 53459774 81413280 73125924 48132206 38856110 48671234
1039 48671234 52128269 32797095 4039602 -13386713 -20396884 -32883872 -53190036
1032 -53190036 -65820966 -63259015 -59406275 -68078060 -79538040 -71097781 -36406724 5781817
1024 5781817 29389838 20938276 -12657959 -47426936 -58627039 -43624919 -24535991
1017 -24535991 -19451008 -18594648 -2444571 23748602 33222866 14726440 -13594404 -31355604
1009 -31355604 -38318684 -41590377 -37138979 -17299810 12310275 34676719 36489021 16951167
$$ packed form
1062C8746996j8817080m5828260k6337939J1345139K0551471n42175j6322388
1055c7204236j0082675q37986l718862m838836J0077899K5450795J7888209l315691
1047f581383m714025K1827720M2927462K7953506q287356k4993718r276096R815124
1039D8671234L457035j9331174k8757493j7426315p010171j2486988k0306164
1032e3190036j2630930K561951L852740q671785j1459980Q440259L4691057M2188541
1024E781817K3608021q451562l3596235l4768977j1200103J5002120J9088928
1017b4535991N084983Q56360J6150077K6193173R474264j8496426k8320844j7761200
1009c1355604o963080l271693M451398J9839169K9610085K2366444J812302j9537854
$$ plain form
1001 16951167 -12009940 -31471374 -30421461 -18754209 -16497286 -27638412 -36272386 -32315999
993 -32315999 -26476878 -31071630 -38339562 -29581954 563153 36997551 56267459 42993694
985 42993694 3883907 -31014126 -32765005 -4758153 21043298 21929521 4654990 -14391188
977 -14391188 -29430705 -38546534 -38017185 -34772970 -43242983 -56076944 -41704749 9208980
969 9208980 57994716 64552749 40059120 23205251 20800034 8625092 -17231921 -28891362
961 -28891362 -8895939 27636191 57071878 66679622 49125645 7401583 -30782967
954 -30782967 -33726053 -8429838 5255820 -9793101 -28596758 -30173901 -29111666 -42194814
946 -42194814 -54564722 -46342670 -30160911 -31735095 -47023683 -48314751 -26381456 -349727
$$ packed form
1001A6951167k8961107j9461434J049913J1667252K256923j1141126q633974L956387
993c2315999N839121m594752p267932Q757608L0145107L6434398J9269908j3273765
985D2993694l9109787l4898033j750879K8006852K5801451Q86223j7274531j9046178
977a4391188j5039517r115829N29349L244215q470013j2833961J4372195N0913729
969I208980M8785736O558033k4493629j6853869k405217j2174942k5857013j1659441
961b8891362J9995423L6532130K9435687R607744j7553977m1724062l8184550
954c0782967k943086K5296215J3685658j5048921j8803657j577143J062235j3083148
946d2194814j2369908Q222052J6181759j574184j5288588j291068K1933295K6031729
$$ plain form
938 -349727 13203166 19542758 32036749 54307680 78221263 90123290 80587472 55905140
930 55905140 35405793 29199121 25132296 7277522 -20318855 -39847775 -42700664 -33840220
922 -33840220 -19775197 -5930046 -802970 -7889194 -16117766 -11986761 1108242 9250673
914 9250673 11060091 18184380 31943703 36218929 19654279 -7854356 -28354475 -35922680
906 -35922680 -35686508 -30329588 -17703984 -224493 11794777 10463837 2361459 5392873
898 5392873 28623636 56418814 61140196 35580940 4235329 -5426766 5041158 13311783
890 13311783 10092066 7900443 16375626 27159465 30448844 31172537 36721356 39764873
882 39764873 28513480 8402098 -2163377 3561991 15140444 24991259 37233257 50014240
$$ packed form
938c49727J3552893O339592J2493991K2270931K3913583J1902027r535818k4682332
930E5905140k0499347o206672m066825j7854774k7596377j9528920k852889Q860444
922c3840220J4065023J3845151N127076p086224q228572M131005J3095003Q142431
914I250673J809418P124289J3759323M275226j6564650k7508635k0500119p568205
906c5922680K36172N356920J2625604J7479491J2019270j330940q102378L031414
898E392873K3230763K7795178M721382k5559256l1345611r662095J0467924Q270625
890A3311783l219717k191623Q475183J0783839L289379P23693N548819L043517
882C9764873j1251393k0111382j0565475N725368J1578453R850815J2241998J2780983
$$ plain form
874 50014240 45593935 12562154 -31739883 -56848124 -52428403 -32218627 -11404074 1542547
866 1542547 -4214806 -32780875 -59892661 -49401178 -5300927 19379478 -11608448 -64372648
858 -64372648 -76366140 -36631267 8502460 22236745 13324640 3845124 -2063090 -4878729
850 -4878729 3900908 23182302 32870129 22818138 13876125 30317472 64208948 86220454
842 86220454 82672811 64444065 45757093 30620762 17812496 6916886 -654342 -1825603
834 -1825603 2931906 3597430 -9786183 -29818335 -39043343 -37696716 -43811534 -58164084
826 -58164084 -54734186 -23288881 3374672 -8063158 -39150256 -42065524 -6259325 29134368
818 29134368 29177346 1068114 -26233806 -35645122 -26548044 -5003233 18919240 34142526
$$ packed form
874E0014240m420305l3031781m4302037k5108241M419721K0209776K0814553J2946621
866A542547n757353k8566069k7111786J0491483M4100251K4680405l0987926n2764200
858f4372648j1993492L9734873M5133727J3734285q912105r479516n908214k815639
850d878729Q779637J9281394R687827j0051991q942013J6441347L3891476K2011506
842H6220454l547643j8228746j8686972j5136331j2808266j0895610p571228j171261
834a825603M757509O65524j3383613k0032152r225008J346627o114818j4352550
826e8164084L429898L1445305K6663553j1437830l1087098k915268L5806199L5393693
818B9134368M2978k8109232k7301920r411316R097078K1544811K3922473J5223286
$$ plain form
810 34142526 36640247 30230303 19896262 10560394 8146498 12604524 14235173 5493819
802 5493819 -10446612 -30558921 -57678181 -82607356 -79061547 -39139607 2660535 10541039
794 10541039 -949824 7313846 31416359 28900453 -6928143 -28016641 -5213942 24752734
786 24752734 16060381 -18905237 -36035636 -26690255 -17492147 -19114373 -17273893 -9870774
778 -9870774 -14316501 -33279679 -44676736 -35060508 -18742884 -13470623 -16415078 -15017579
770 -15017579 -6657485 2474162 6269497 -1471701 -24024340 -49511650 -53464343 -26270365
762 -26270365 9299021 21143883 4692197 -15589652 -18897451 -7373444 8826714
755 8826714 27978498 48003483 56616421 48540462 42895613 59237705 79056126 61069317
$$ packed form
810C4142526K497721o409944j0334041r335868k413896M458026J630649q741354
802E493819j5940431k0112309k7119260k4929175L545809L9921940M1800142P880504
794A0541039j1490863Q263670K4102513k515906l5828596k1088498K2802699K9966676
786B4752734q692353l4965618j7130399R345381R198108j622226J840480P403119
778i870774m445727j8963178j1397057R616228J6317624N272261k944455J397499
770a5017579Q360094R131647L795335p741198k2552639k5487310l952693K7193978
762b6270365L5569386J1844862j6451686k0281849l307799J1524007J6200158
755H826714J9151784K0024985Q612938q075959n644849J6342092J9818421j7986809
$$ plain form
747 61069317 3123600 -42400725 -35325568 -2351755 5047279 -14813915 -21780485 -4365440
739 -4365440 5588439 -7789488 -17116068 -243585 23783259 30538301 28141211 31620936
731 31620936 28851554 5903639 -15374846 -2387888 37240377 63663915 57058278 31475242
723 31475242 2624393 -26127769 -46743518 -46675577 -30925106 -19183487 -17055726 -12478699
715 -12478699 -2453336 1043519 -5193956 -11324509 -18189368 -37454556 -59981851 -54622938
707 -54622938 -15372946 17396279 6550149 -31107264 -50416588 -40021478 -28997926
700 -28997926 -36737262 -47088708 -39149219 -19565513 -9483097 -13329169 -17449078 -15053194
692 -15053194 -16052714 -27319057 -35112529 -19584635 16420048 46952240 54664811 49235029
$$ packed form
747F1069317n7945717m5524325P075157L2973813P399034j9861194o966570J7415045
739d365440R953879j3377927r326580J6872483K4026844O755042k397090L479725
731C1620936k769382k2947915k1278485J2986958L9628265K6423538o605637k5583036
723C1475242k8850849k8752162k0615749O7941J5750471J1741619K127761M577027
715a2478699J0025363L496855o237475o130553o864859j9265188k2527295N358913
707e4622938L9249992L2769225j0846130l7657413j9309324J0395110J1023552
700b8997926p739336j0351446P939489J9583706J0082416l846072m119909K395884
692a5053194r99520j1266343p793472J5527894L6004683L0532192P712571n429782
$$ plain form
684 49235029 46107302 42056272 28456009 16581330 24345846 41058697 33882816 -3659108
676 -3659108 -35583966 -29657911 1780929 24761432 29055040 28393435 28503071 21131318
668 21131318 6044120 -4436980 -4478938 -272476 4569844 11904086 16142824 7653465
660 7653465 -5890496 -850819 29207430 57557211 55568085 29008834 8485546 11408943
652 11408943 29068058 46610042 57700813 57867325 40730549 9538080 -18910643 -31895665
644 -31895665 -34989521 -39298676 -42226819 -34868883 -24580874 -31632233 -58462210 -79210466
636 -79210466 -71771775 -47631255 -33696521 -33438753 -27433155 -10172591 -972368 -9756086
628 -9756086 -15199260 4518150 34587735 40641175 16432726 -9491163 -15357806 -10912786
$$ packed form
684D9235029l127727m051030j3600263j1874679P764516J6712851p175881l7541924
676c659108l1924858N926055L1438840K2980503M293608o61605J09636p371753
668B1131318j5087198j0481100m1958M206462M842320P334242M238738q489359
660G653465j3543961N039677L0058249K8349781j989126k6559251k0523288K923397
652A1408943J7659115J7541984J1090771J66512j7136776l1192469k8448723j2985022
644c1895665l093856m309155k928143P357936J0288009p051359k6829977k0748256
636g9210466P438691K4140520J3934734K57768O005598J7260564R200223q783718
628i756086n443174J9717410L0069585O053440k4208449k5923889n866643M445020
$$ plain form
620 -10912786 -12541258 -14387058 -693451 24699129 39245759 29423250 4545270 -16551505
612 -16551505 -22518803 -13760527 207956 5844646 -4082968 -22524064 -35230934 -35820561
604 -35820561 -28533363 -18318773 -7474325 -1827266 -8081748 -20503222 -21571225 -4249634
596 -4249634 14823781 14365739 -4809630 -21866643 -20836118 -4012888 15650039 24749038
588 24749038 14891138 -9331423 -27710258 -22143597 1361780 20516418 27826633 37494187
580 37494187 54859589 57735402 25446176 -24426881 -49678714 -33092197 -734477
573 -734477 12980039 3375087 -9178347 -10403378 -5994000 -7543586 -15365541 -18721771
565 -18721771 -8959039 10868810 28904402 35325564 29852771 19960998 14017772 16319667
$$ packed form
620a0912786j628472j845800J3693607K5392580J4546630r822509k4877980k1096775
612a6551505n967298Q758276J3968483N636690r927614j8441096j2706870n89627
604c5820561P287198J0214590J0844448N647059o254482j2421474j068003J7321591
596d249634J9073415m58042j9175369j7057013J030525J6823230J9662927R098999
588B4749038r857900k4222561j8378835N566661K3505377J9154638P310215R667554
580C7494187J7365402K875813l2289226m9873057k5251833J6586517L2357720
573g34477J3714516r604952j2553434j225031M409378j549586p821955l356230
565a8721771R762732J9827849J8035592O421162n472793r891773n943226K301895
$$ plain form
557 16319667 25719418 36623655 42662693 41676438 36973526 32847120 29219977 20670786
549 20670786 756972 -29666671 -56082522 -58120769 -32497347 -4783062 -4997927 -30004247
541 -30004247 -45311450 -30383649 -5461147 -434057 -12530047 -15947527 -4638809 289340
533 289340 -13579410 -31576494 -37586077 -36747827 -38580833 -34106372 -9232456 27015394
525 27015394 47098858 37596961 12304482 -9340116 -23239647 -34081980 -39532318 -33231473
517 -33231473 -20128512 -16465328 -30278977 -49337817 -54929007 -43726660 -29122771 -23403454
509 -23403454 -26794286 -32906454 -34673503 -24058273 860563 23120964 15807243 -24081786
501 -24081786 -61645267 -59412588 -20087127 20813227 37949193 33384814 16660400 -7038007
$$ packed form
557A6319667R399751J0904237O039038r86255m702912m126406l627143q549191
549B0670786j9913814l0423643k6415851k038247K5623422K7714285k14865k5006320
541c0004247j5307203J4927801K4922502N027090j2095990l417480J1308718M928149
533B89340j3868750j7997084o009583Q38250j833006M474461K4873916L6247850
525B7015394K0083464r501897k5292479k1644598j3899531j0842333n450338O300845
517c3231473J3102961L663184j3813649j9058840n591190J1202347J4603889N719317
509b3403454l390832o112168j767049J0615230K4918836K2260401p313721l9889029
501b4081786l7563481K232679L9325461M0900354J7135966m564379j6724414k3698407
$$ plain form
493 -7038007 -25416562 -21008872 2928960 17327108 3752330 -17593126 -13131623 19950624
485 19950624 52269241 60465163 49486476 35498803 22183062 3082102 -19429298
478 -19429298 -29105140 -14480371 12150727 24181783 12264081 -3835143 -3889694 2935975
470 2935975 -6185702 -28740083 -36999395 -19085418 3902793 10361018 6071831 6868616
462 6868616 12905334 16719732 21076082 30553060 37605023 34509026 28091712 25508659
454 25508659 17567668 -3889224 -23093911 -17967663 6416061 24574140 25289271 17057734
446 17057734 4532133 -15016562 -34154795 -40451395 -39427055 -46136511 -52747798 -34070151
438 -34070151 8363654 37914530 30764050 5240524 -11211838 -17888989 -24913210 -26380379
$$ packed form
493g038007j8378555M407690K3937832J4398148j3574778k1345456M461503L3082247
485A9950624L2318617Q195922j0978687j3987673j3315741j9100960k2511400
478a9429298r675842J4624769K6631098J2031056j1917702j6099224n4551O825669
470B935975r121677k2554381q259312J7913977K2988211O458225m289187P96785
462F868616O036718L814398M356350R476978P051963l095997o417314k583053
454B5508659p940991k1456892j9204687N126248K4383724J8158079P15131q231537
446A7057734j2525601j9548695j9138233o296600J024340o709456o611287J8677647
438c4070151M2433805K9550876p150480k5523526j6452362o677151p024221j467169
$$ plain form
430 -26380379 -14331677 -1241865 -2245177 -7790394 345689 15600579 15356624 -2681755
422 -2681755 -18223421 -20060290 -16095050 -12258040 -5256186 1208225 -3522398 -14609344
414 -14609344 -11270727 11058037 26999586 13251189 -19261219 -38852618 -28967352 1462959
406 1462959 34522311 56376440 59241025 44402244 23668803 9536464 4583022 5779100
398 5779100 13849371 28823084 40648835 37537068 24244216 19112300 28626833 36681698
390 36681698 26649074 3834305 -15164817 -27639138 -43731262 -62316262 -65943534
383 -65943534 -46510711 -21498459 -12479209 -16596992 -13802188 2217787 16514197 17435694
375 17435694 13481226 18729153 32271007 41364636 38846268 28719951 17899291 10297935
$$ packed form
430b6380379J2048702J3089812j003312n545217Q136083J5254890k43955j8038379
422b681755j5541666j836869L965240L837010P001854O464411m730623j1086946
414a4609344L338617K2328764J5941549j3748397l2512408j9591399R885266L0430311
406A462959L3059352K1854129K864585j4838781k0733441j4132339m953442J196078
398E779100Q070271J4973713J1825751l111767j3292852n131916R514533Q054865
390C6681698j0032624k2814769j8999122j2474321j6092124j8585000l627272
383f5943534J9432823K5012252R019250m117783K794804J6019975J4296410R21497
375A7435694l954468N247927J3541854R093629k518368j0126317j0820660p601356
$$ plain form
367 10297935 7896140 10885433 15526936 15663574 8119522 -3764810 -11784453 -9466479
359 -9466479 -20527 3544476 -8630872 -30261455 -44614543 -43066515 -30772403 -14607487
351 -14607487 2603410 12753448 2604626 -25622709 -45763386 -36064410 -10037285
344 -10037285 -1589636 -20418727 -39833391 -33685781 -10117854 1711338 -10478443 -29057554
336 -29057554 -29223448 -6383196 20926165 31659123 22979112 9601843 4061548 2736490
328 2736490 -5272871 -20753374 -33665115 -37742945 -36820843 -35520831 -32167513 -24748196
320 -24748196 -17459046 -16318872 -21940560 -30267010 -36833466 -36363784 -21772385 9616752
312 9616752 47424156 70556443 63927605 34637236 7827855 1944427 9983993 11051002
$$ packed form
367A0297935k401795K989293M641503J36638p544052j1884332q019643K317974
359i466479R445952L565003j2175348k1630583j4353088J548028J2294112J6164916
351a4607487J7210897J0150038j0148822k8227335k0140677R698976K6027125
344a0037285Q447649j8829091j9414664O147610K3567927J1829192j2189781j8579111
336b9057554j65894K2840252K7309361J0732958q680011j3377269n540295j325058
328B736490q009361j5480503j2911741m077830R22102J300012L353318P419317
320b4748196P289150J140174n621688q326450o566456M69682J4591399L1389137
312I616752L7807404K3132287o628838k9290369k6809381n883428Q039566J067009
$$ plain form
304 11051002 -1936765 -16756190 -24543809 -32085364 -43023665 -43035562 -20920158 6829314
296 6829314 14489540 4296555 497591 7232066 713326 -28934445 -55934993 -55260736
288 -55260736 -37899288 -28826039 -28587730 -22550900 -14853426 -22428129 -39442932 -38452700
280 -38452700 -11711371 14919773 18604760 7723662 1273768 105188 -4393310 -8041133
272 -8041133 -728618 12457700 16802888 11434407 8110123 6146680 -10757905 -44009403
264 -44009403 -63973024 -41833914 9397708 44001084 35330354 3472222 -14730673
257 -14730673 -8859482 5033848 17091552 34606480 58328769 68880650 50414919
250 50414919 16022271 -5969688 -5306135 5040730 13038483 20073545 28199910 31624610
$$ packed form
304A1051002j2987767j4819425p787619p541555j0938301j1897K2115404K7749472
296F829314P660226j0192985l798964O734475o518740k9647771k7000548O74257
288e5260736J7361448R073249K38309O036830P697474p574703j7014803R90232
280c8452700K6741329K6631144L684987j0881098o449894j168580m498498l647823
272h041133P312515J3186318M345188n368481l324284j963443j6904585l3251498
264d4009403j9963621K2139110N1231622L4603376q670730l1858132j8202895
257a4730673N871191J3893330J2057704J7514928K3722289J0551881j8465731
250E0414919l4392648k1991959O63553J0346865P997753P035062Q126365L424700
$$ plain form
242 31624610 27559156 22743200 21047096 15422971 1747844 -8976380 -4834536 6464780
234 6464780 4918026 -15443828 -39848965 -53100002 -54775866 -50743267 -40985128 -24461528
226 -24461528 -9572049 -9099694 -24186640 -40221555 -41923574 -29758641 -18336813 -18849420
218 -18849420 -25729809 -23103377 -4221872 18671071 26268211 12261996 -11469203 -28157092
210 -28157092 -29847767 -17959854 2607594 24598043 37845612 35569387 21929536 7302397
202 7302397 -5543634 -24100900 -51139856 -73730322 -75437035 -56854747 -35360555 -24776955
194 -24776955 -24301401 -28735879 -38174134 -50832380 -55905287 -44654881 -24003014 -8470404
186 -8470404 -1634269 2858913 3523287 -10875752 -40840090 -66604466 -68491001 -49168920
$$ packed form
242C1624610m065454m815956j696104n624125j3675127j0724224M141844J1299316
234F464780j546754k0361854k4405137j3251037j675864M032599R758139J6523600
226b4461528J4889479M72355j5086946j6034915j702019J2164933J1421828n12607
218a8849420o880389K626432J8881505K2892943P597140j4006215k3731199j6687889
210b8157092j690675J1887913K0567448K1990449J3247569k276225j3639851j4627139
202G302397j2846031j8557266k7038956k2590466j706713J8582288K1494192J0583600
194b4776955M75554m434478r438255j2658246n072907J1250406K0651867J5532610
186h470404O836135M493182O64374j4399039k9964338k5764376j886535J9322081
$$ plain form
178 -49168920 -26410337 -9570198 5806144 22701703 34627955 36669180 35488507 40768497
170 40768497 50213556 51099195 38196379 23567312 22636521 33590880 39269119 30997111
162 30997111 20964004 24382142 37546914 44314291 39116977 30379335 23451822 15380339
154 15380339 7664591 7535086 11448267 4552150 -13609541 -19400475 3559174 36018932
146 36018932 45042397 27077436 9502908 12033357 26059893 34192869 32661339 28020911
138 28020911 24280376 20468851 13993187 3269526 -7714304 -9841328 -2598885 -2438703
130 -2438703 -22867108 -49131483 -51648257 -26244591 -809869 3509888 -3422213 -4882102
122 -4882102 -4180986 -11692832 -22984929 -29010709 -34138707 -44020624 -47954521 -35909018
$$ packed form
178d9168920K2758583J6840139J5376342J6895559J1926252K041225j180673N279990
170D0768497R445059Q85639j2902816j4629067r30791J0954359N678239q272008
162C0997111j0033107L418138J3164772O767377n197314q737642o927513q071483
154A5380339p715748j29505L913181o896117j8161691n790934K2959649L2459758
146C6018932R023465j7964961j7574528K530449J4026536Q132976j531530m640428
138B8020911l740535l811525o475664j0723661j0983830k127024P242443J60182
130b438703k0428405k6264375k516774K5403666K5434722M319757o932101j459889
122d882102P01116p511846j1292097o025780n127998r881917l933897J2045503
$$ plain form
114 -35909018 -22909638 -30640934 -51084572 -56710638 -44762148 -40213358 -50191904 -48391432
106 -48391432 -18940092 13808162 21276787 13164239 16963079 31429915 31315988 10800792
98 10800792 -9116412 -16869692 -24221516 -36658305 -37200688 -14936722 11018837 15626974
90 15626974 2833984 -3760463 2547469 5072521 -7767064 -26861914 -39548868 -46559749
82 -46559749 -53665333 -57378857 -49115025 -28489850 -4705470 12470621 17706703 9583511
74 9583511 -8313779 -26588354 -35546933 -32752037 -23543535 -14908657 -9952824 -6422730
66 -6422730 631588 12458965 22451938 22637944 15294586 11589744 15254022 15174216 1256538
57 1256538 -18620762 -27393476 -21274756 -12802860 -12174388 -16230058 -17699421 -15152920 -9504842
$$ packed form
114c5909018J2999380p731296k0443638n626066J1948490M548790r978546J800472
106d8391432K9451340L2748254P468625q112548L798840J4466836j13927k0515196
98A0800792j9917204p753280p351824j2436789n42383K2263966K5955559M608137
90A5626974j2792990o594447O307932K525052j2839585j9094850j2686954p010881
82d6559749p105584l713524Q263832K0625175K3784380J7176091N236082q123192
74I583511j7897290j8274575q958579K794896R208502Q634878M955833L530094
66f422730P054318J1827377R992973J86006p343358l704842L664278p9806j3917678
57A256538j9877300q772714O118720Q471896O28472m055670j469363K546501N648078
$$ plain form
48 -9504842 874625 15501989 27823593 31602084 27829307 21472297 15216961 10208718
40 10208718 8846266 11746033 14145534 9788560 -2368802 -17836700 -31318655 -38977414
32 -38977414 -37294996 -23386735 1449584 28626652 44944680 42008490 23724326 975246
24 975246 -21128305 -43810450 -61213492 -58955439 -35281786 -11985735 -8807887 -15356298
16 -15356298 -7953346 11302626 17384712 4866702 -1054253 13780488 26935227 14252062
8 14252062 -11205892 -19080715 -6319251 3688879 -1257501 -10400803 -13758545 -15136524
0 -15136524
$$ packed form
48i504842J0379467J4627364J2321604L778491l772777o357010o255336n008243
40A0208718j362452K899767K399501m356974j2157362j5467898j3481955p658759
32c8977414J682418J3908261K4836319K7177068J6318028k936190j8284164k2749080
24I75246k2103551k2682145j7403042K258053K3673653K3296051L177848o548411
16a5356298P402952J9255972O082086j2518010n920955J4834741J3154739j2683165
8A4252062k5457954p874823J2761464J0008130m946380r143302l357742j377979
0a5136524
$$ Imaginary data points
##PAGE= N=2
##DATA TABLE= (X++(I..I)), XYDATA
$$ plain form
65535 -1294324 -3612606 -9519889 -17880966 -30406336 -44494311 -50947670 -46703961 -39812474
65527 -39812474 -34291848 -22154874 -113009 18139658 18733580 7063008 -1428435 -1078428
65519 -1078428 4455756 12653445 19487208 15513821 -1428347 -16947123 -16924133 -6795198
65511 -6795198 -1388296 -3668518 -7779523 -14635228 -27335908 -37601971 -35367115 -27822314
65503 -27822314 -30137888 -39614087 -38441248 -22268572 -7057779 -5131406 -11825338 -18893572
65495 -18893572 -23961896 -22807017 -10038151 6237253 7554439 -8478611 -20676009
65488 -20676009 -13892760 -1484551 -3971790 -16833189 -17843574 -2212540 8339683
65481 8339683 -3528912 -24019835 -23703391 3562216 29271173 24305286 -3158005 -16925385
$$ packed form
65535a294324k318282n907283q361077j2525370j4087975o453359M243709O891487
65527c9812474N520626J2136974K2041865J8252667N93922j1670572q491443L50007
65519a078428N534184Q197689O833763l973387j6942168j5518776K2990J0128935
65511f795198N406902k280222m111005o855705j2700680j0266063K234856P544801
65503b7822314k315574r476199J172839J6172676J5210793J926373o693932p068234
65495a8893572n068324J154879J2768866J6275404J317186j6033050j2197398
65488b0676009O783249J2408209k487239j2861399j010385J5631034J0552223
65481H339683j1868595k0490923L16444K7265607K5708957m965887k7463291j3767380
$$ plain form
65473 -16925385 591023 27719172 36804826 30384258 27269750 26561277 11183991 -16671610
65465 -16671610 -30891358 -17941758 4357194 13819768 10536057 5221150 -1505216 -12747046
65457 -12747046 -21147591 -18524598 -12681737 -18396464 -34328681 -42910754 -34014870 -17981458
65449 -17981458 -11943444 -19718468 -29048871 -26532890 -12536216 -14688 478115 -9998983
65441 -9998983 -26240835 -47228607 -69231887 -79307614 -70293452 -57450440 -61661633
65434 -61661633 -76285738 -71801913 -39237075 -7846245 -7147754 -28533029 -40549989
65427 -40549989 -29667257 -8622995 6725328 10476581 1080634 -19179668 -37513785
65420 -37513785 -37090837 -15100452 12229752 25086933 17527893 958267 -6636041 2280483
$$ packed form
65473a6925385J7516408K7128149R085654o420568l114508p08473j5377286k7855601
65465a6671610j4219748J2949600K2298952R462574l283711n314907o726366j1241830
65457a2747046q400545K622993N842861n714727j5932217q582073Q895884J6033412
65449a7981458O038014p775024r330403K515981J3996674J2521528M92803j0477098
65441i998983j6241852k0987772k2003280j0075727R014162J2843012m211193
65434f1661633j4624105M483825L2564838L1390830O98491k1385275j2016960
65427d0549989J0882732K1044262J5348323L751253r395947k0260302j8334117
65420c7513785M22948K1990385K7330204J2857181p559040j6569626p594308Q916524
$$ plain form
65412 2280483 15797882 14512294 -5993674 -31096391 -46719516 -52419128 -51175507 -40158580
65404 -40158580 -21671484 -10820117 -17549728 -29050816 -25787535 -10160614 -2715209
65397 -2715209 -11231743 -20400326 -15748496 -3372837 1975750 -1234544 -1550059 6536630
65389 6536630 13111757 5464402 -14458766 -31518547 -36398901 -35187285 -34880126 -28439622
65381 -28439622 -7162355 16755702 17707638 -10142871 -42571851 -54308425 -45298158
65374 -45298158 -31795822 -24665556 -24695800 -27609328 -25558276 -14472245 -5810846 -17151327
65366 -17151327 -44471800 -60795879 -52057000 -35934161 -32485488 -36002986 -33049004 -28268066
65358 -28268066 -29522474 -24671037 -240954 28951563 36548518 22346883 6691791
$$ packed form
65412B280483J3517399j285588k0505968k5102717j5623125n699612J243621J1016927
65404d0158580J8487096J0851367o729611j1501088L263281J5626921P445405
65397b715209q516534r168583M651830J2375659N348587l210294l15515Q086689
65389F536630O575127p647355j9923168j7059781m880354J211616L07159O440504
65381b8439622K1277267K3918057R51936k7850509l2428980j1736574R010267
65374d5298158J3502336P130266l0244k913528K051052J1086031Q661399j1340481
65366a7151327k7320473j6324079Q738879J6122839L448673l517498K953982M780938
65358b8268066j254408M851437K4430083K9192517P596955j4201635j5655092
$$ plain form
65351 6691791 -3884546 -16155333 -22778114 -9141007 13648077 16556862 -2739073
65344 -2739073 -15284624 -7624199 -1032958 -12960377 -30149265 -36333824 -39340662 -50391799
65336 -50391799 -58585429 -48360048 -26729895 -12471748 -9865350 -11331964 -15958121 -27616472
65328 -27616472 -41724983 -49340565 -49263838 -43704153 -27936137 2796352 39261963 61842519
65320 61842519 58091112 32847582 4529314 -7289714 1732538 14783936 13197458
65313 13197458 1811171 1946025 18009157 29104010 20210080 2813741 -6999003 -13640613
65305 -13640613 -28764514 -45270869 -43427463 -18747919 10340721 22126844 11946192
65298 11946192 -4353297 -4448038 16679251 36912192 32555581 13308809 12786242 39428545
$$ packed form
65351F691791j0576337j2270787o622781J3637107K2789084K908785j9295935
65344b739073j2545551P660425O591241j1927419j7188888o184559l006838j1051137
65336e0391799q193630J0225381K1630153J4258147K606398j466614m626157j1658351
65328b7616472j4108511p615582P6727N559685J5768016L0732489L6465611K2580556
65320F1842519l751407k5243530k8318268j1819028R022252J3051398j586478
65313A3197458j1386287J34854J6063132J1094853q893930j7396339r812744o641610
65305a3640613j5123901j6506355J843406K4679544K9088640J1786123j0180652
65298A1946192j6299489r4741K1127289K0232941m356611j9246772n22567K6642303
$$ plain form
65290 39428545 60080128 45446665 9867658 -13853441 -20944841 -30795458 -47860334
65283 -47860334 -53858986 -37447787 -9491462 13911138 27409563 32624945 31198642
65276 31198642 25360537 17893174 9670503 128599 -12594212 -32804980 -60183012 -80205699
65268 -80205699 -75559945 -52139171 -36755719 -40076093 -41065533 -22279979 -397218 -604147
65260 -604147 -17201512 -24962532 -18044184 -10847076 -7756097 72938 10361247 9241469
65252 9241469 -2378285 -5505147 8216982 22886193 19525035 -2156125 -26180800
65245 -26180800 -34282246 -18745524 8385790 23004346 16084500 5316565 8238714
65238 8238714 16636215 14176092 4193244 -2946243 -14981442 -41042156 -62662173 -56389503
$$ packed form
65290C9428545K0651583j4633463l5579007k3721099p091400r850617j7064876
65283d7860334n998652J6411199K7956325K3402600J3498425N215382j426303
65276C1198642n838105p467363q222671r541904j2722811k0210768k7378032k0022687
65268h0205699M645754K3420774J5383452l320374r89440J8785554K1882761k06929
65260f04147j6597365p761020O918348P197108L090979P829035J0288309j119778
65252I241469j1619754l126862J3722129J4669211l361158k1681160k4024675
65245b6180800q101446J5536722K7131314J4618556o919846j0767935K922149
65238H238714Q397501k460123r982848p139487j2035199k6060714k1620017O272670
$$ plain form
65230 -56389503 -36743627 -37629048 -55139242 -52169968 -21961771 -441065 -5172545 -9249686
65222 -9249686 5782351 17309942 8719816 6052209 32117243 60035921 54066218 29245579
65214 29245579 25886450 43878865 48039744 28310692 10665915 11329383 20113138 30200201
65206 30200201 47314551 64347109 60704335 35314269 11479427 889902 -9935065
65199 -9935065 -29063695 -42857907 -41920551 -37131287 -35038086 -21814601 8927301 32871059
65191 32871059 23290128 -9844072 -31832500 -27745790 -14945930 -14566824 -28942770 -47705133
65183 -47705133 -60436603 -59938916 -45254072 -26343848 -17514356 -22457093 -32504877 -41924173
65175 -41924173 -56010466 -78019612 -95723991 -91924040 -67501696 -43989367 -39273795
$$ packed form
65230e6389503J9645876q85421j7510194K969274L0208197K1520706m731480m077141
65222i249686J5032037J1527591q590126k667607K6065034K7918678n969703k4820639
65214B9245579l359129J7992415M160879j9729052j7644777O63468Q783755J0087063
65206C0200201J7114350J7032558l642774k5390066k3834842j0589525j0824967
65199i935065j9128630j3794212R37356M789264K093201J3223485L0741902K3943758
65191C2871059r580931l3134200k1988428M086710J2799860L79106j4375946j8762363
65183d7705133j2731470M97687J4684844J8910224Q829492m942737j0047784r419296
65175d1924173j4086293k2009146j7704379L799951K4422344K3512329M715572
$$ plain form
65168 -39273795 -47872007 -51168131 -41299661 -26014536 -13503847 -4860442 -2896017 -14447850
65160 -14447850 -35734534 -46575209 -32283767 -5407268 8910239 7402370 12396438
65153 12396438 37015450 62233233 60442339 32925042 9316184 11673018 32244673
65146 32244673 49170754 51946540 44501688 33143134 22767199 19505259 24035357 23686958
65138 23686958 4621316 -26752178 -48456376 -52402125 -53081745 -59989002 -60774985 -46617772
65130 -46617772 -35230608 -44368573 -55976084 -37990677 2954501 24827221 10144913
65123 10144913 -11960906 -16137073 -19526553 -46769486 -83144097 -93910786 -75462446
65116 -75462446 -56230872 -53015820 -54328405 -46685212 -33867753 -26547657 -29661445 -41758337
$$ packed form
65168c9273795q598212l296124R868470J5285125J2510689Q643405J964425j1551833
65160a4447850k1286684j0840675J4291442K6876499J4317507j507869M994068
65153A2396438K4619012K5217783j790894k7517297k3608858K356834K0571655
65146C2244673J6926081K775786p444852j1358554j0375935l261940M530098l48399
65138B3686958j9065642l1373494k1704198l945749o79620o907257p85983J4157213
65130d6617772J1387164r137965j1607511J7985407M0945178K1872720j4682308
65123A0144913k2105819m176167l389480k7242933l6374611j0766689J8448340
65116g5462446J9231574L215052j312585P643193J2817459P320096l113788j2096892
$$ plain form
65108 -41758337 -52902824 -44958655 -10128793 31355336 48483925 35426127 15190376
65101 15190376 6948588 6100256 -642534 -16762693 -38000199 -59101432 -72195128 -69574040
65093 -69574040 -53974861 -37321348 -25661855 -14522141 -2047906 3644675 -4551099
65086 -4551099 -21379147 -32250503 -23146842 10255407 54409751 80890927 69656479
65079 69656479 30986662 -4917288 -19653404 -18348734 -12941946 -7949423 -3053196 3592098
65071 3592098 15690918 31192192 37250727 26988278 15945072 21606357 30780684 14597626
65063 14597626 -22255581 -38671578 -14324989 19742848 24879941 3364203 -17418023
65056 -17418023 -26016310 -27326497 -21034990 -7528099 -2389485 -18063149 -40407107 -48302312
$$ packed form
65108d1758337j1144487P944169L4829862M1484129J7128589j3057798k0235751
65101A5190376q241788q48332o742790j6120159k1237506k1101233j3093696K621088
65093f9574040J5599179J6653513J1659493J1139714J2474235N692581q195774
65086d551099j6828048j0871356R103661L3402249M4154344K6481176j1234448
65079F9656479l8669817l5903950j4736116J304670N406788M992523M896227O645294
65071C592098J2098820J5501274O058535j0262449j1043206N661285R174327j6183058
65063A4597626l6853207j6415997K4346589L4067837N137093k1515738k0782226
65056a7418023q598287j310187O291507J3506891N138614j5673664k2343958p895205
$$ plain form
65048 -48302312 -46944037 -55294741 -69316768 -67671364 -49665324 -36681362 -35782307 -32072768
65040 -32072768 -20381784 -14265970 -16604379 -11241204 4566723 7724422 -14419385 -39854271
65032 -39854271 -43090938 -30183576 -22388747 -22680379 -20786756 -16936554 -16374302 -11022417
65024 -11022417 7644841 23834335 12603196 -20368806 -39932641 -27952357 -5979884
65017 -5979884 -1730969 -12724553 -18333363 -13538737 -11006301 -15048785 -13471053 542593
65009 542593 13706966 10817573 -174967 4129481 28557774 46735470 31945511 -7932087
65001 -7932087 -39854749 -46179434 -39285134 -34381640 -27661826 -12596451 -854749 -7337141
64993 -7337141 -23007242 -24566331 -10028013 -2941718 -15352080 -26058097 -8992739
$$ packed form
65048d8302312J358275q350704j4022027J645404J8006040J2983962Q99055L709539
65040c2072768J1690984O115814k338409N363175J5807927L157699k2143807k5434886
65032c9854271l236667J2907362P794829k91632J893623L850202N62252N351885
65024a1022417J8667258J6189494j1231139l2972002j9563835J1980284K1972473
65017e979884M248915j0993584n608810M794626K532436m042484J577732J4013646
65009E42593J3164373k889393j0992540M304448K4428293J8177696j4789959l9877598
65001g932087l1922662o324685O894300M903494O719814J5065375J1741702o482392
64993g337141j5670101j559089J4538318P086295j2410362j0706017J7065358
$$ plain form
64986 -8992739 29299235 56811670 56144792 42607266 40714079 53762734 62679833 49836582
64978 49836582 17707294 -15768322 -35874276 -42086925 -41798140 -38584180 -31259089 -22210095
64970 -22210095 -19072320 -24384514 -28070740 -16652011 9356370 31795758 32288458 12299762
64962 12299762 -7944874 -11380109 -540896 10727515 15662807 16046338 9755929 -8062636
64954 -8062636 -28828027 -32821675 -18571746 -14799893 -44859777 -88710400 -102486349
64947 -102486349 -73192235 -31207701 -6553300 2994922 11801286 18698799 17333429
64940 17333429 17203001 31643186 51506460 51186505 21479085 -17251352 -36434817 -25592645
64932 -25592645 1630451 20557906 16489028 -2109545 -14948584 -16684395 -22053578
$$ packed form
64986h992739L8291974K7512435o66878j3537526j893187J3048655Q917099j2843251
64978D9836582l2129288l3475616k0105954o212649K88785L213960P325091R048994
64970b2210095L137775n312194l686226J1418729K6008381K2439388M92700j9988696
64962A2299762k0244636l435235J0839213J1268411M935292L83531o290409j7818565
64954h062636k0765391l993648J4249929L771853l0059884m3850623j3775949
64947a02486349K9294114M1984534K4654401R548222Q806364O897513j365370
64940A7333429j30428J4440185J9863274l19955k9707420l8730437j9183465J0842172
64932b5592645K7223096J8927455m068878j8598573j2839039j735811n369183
$$ plain form
64925 -22053578 -38765792 -50780841 -42648935 -26765487 -25911501 -37274602 -37263200 -19031735
64917 -19031735 -1227444 2770420 1866693 7248540 14516165 14252677 5715795 -6829189
64909 -6829189 -18221402 -18473745 -90706 25104887 32292114 14080068 -9611928 -18042651
$$ packed form
64925b2053578j6712214j2015049Q131906J5883448Q53986j1363101J1402J8231465
64917a9031735J7804291L997864r03727N381847P267625k63488q536882j2544984
64909f829189j1392213k52343J8383039K5195593P187227j8212046k3691996q430723
$$ [...]
##END NTUPLES=NMR SPECTRUM
##END=
