##TITLE=31Pdec_LR-713_CR4
 CDCl3, 124 sc
 8.7.2020
##JCAMPDX= 6.0         $$ Bruker NMR JCAMP-DX V2.0
##DATA TYPE= NMR SPECTRUM
##DATA CLASS= NTUPLES
##ORIGIN= UXNMR, Bruker Analytische Messtechnik GmbH
##OWNER= root
$$ XWIN-NMR		Version 3.5
$$ Wed Jul  8 10:31:02 2020 Russian Standard Time (UT+4h)  she@DPX200
##.OBSERVE FREQUENCY= 81.013821
##.OBSERVE NUCLEUS= ^31P
##.ACQUISITION MODE= SIMULTANEOUS
##.ACQUISITION SCHEME= undefined
##.AVERAGES= 124
##.DIGITISER RES= 17
##SPECTROMETER/DATA SYSTEM= spect
##.PULSE SEQUENCE= zgpg30
##.SOLVENT NAME= CDCl3
##.SHIFT REFERENCE= (INTERNAL, CDCl3, 0, 182.463)
##AUDIT TRAIL= $$ (NUMBER, WHEN, WHO, WHERE, WHAT)
$$ ##TITLE= Audit trail, XWIN-NMR		Version 3.5
$$ ##JCAMPDX= 5.01
$$ ##ORIGIN= Bruker BioSpin GmbH
$$ ##OWNER= she
$$ F:/spectra/data/she/nmr/P31/1/pdata/1/auditp.txt
$$ ##AUDIT TRAIL=  $$ (NUMBER, WHEN, WHO, WHERE, WHAT)
(   1,<2020-07-08 10:29:18.14 +0400>,<she>,<DPX200>,
      <continue with go, POWCHK disabled, PULCHK disabled
       configuration hash MD5:
       00 E9 B6 7A A2 85 ED C7 34 08 36 98 17 FE 4E 26
       data hash MD5: 32K
       DB 9A 2D FB 0A 18 17 2A 53 F4 2C 09 B1 0A 4A B4>)
(   2,<2020-07-08 10:30:06.46 +0400>,<she>,<DPX200>,
      <Start of raw data processing
       efp BC_mod = 2 LB = 1 FT_mod = 6 PKNL = 1 PHC0 = -1726.527 PHC1 = -18.59804 SI = 64K 
       data hash MD5: 64K
       F5 0B E7 85 B8 F9 46 4B 77 BE 54 5A 53 02 2B 3E>)
(   3,<2020-07-08 10:30:29.56 +0400>,<she>,<DPX200>,
      <pk PHC0 = -146.2236 PHC1 = 53.39999 
       data hash MD5: 64K
       C7 76 1C C6 DF 2A 2F 61 13 A0 1E 12 43 D3 83 33>)
(   4,<2020-07-08 10:30:33.29 +0400>,<she>,<DPX200>,
      <abs ABSG = 5 
       data hash MD5: 64K
       F2 9E C4 F5 84 C6 5B 24 80 23 AD FE 45 78 F5 6B>)
$$ ##END=
$$ 
$$ hash MD5
$$ 64 8F D2 DB 1E AC 65 9A 52 BD 22 78 08 B3 B3 AB
##$RELAX= 
##$RELAX= 
##$RELAX= 
##$RELAX= 
##$RELAX= 
##$RELAX= 
##$RELAX= 
##$RELAX= 
$$ Bruker specific parameters
$$ --------------------------
##$DU= <F:/spectra>
##$EXPNO= 1
##$NAME= <P31>
##$PROCNO= 1
##$TYPE= <nmr>
##$USER= <she>
##$AMP= (0..31)
100 100 100 100 100 100 100 100 100 100 100 100 100 100 100 100 100 100 
100 100 100 100 100 100 100 100 100 100 100 100 100 100 
##$AQSEQ= 0
##$AQ_mod= 1
##$AUNM= <au_zg>
##$AUTOPOS= <>
##$BF1= 81.014009
##$BF2= 200.13
##$BF3= 200.13
##$BF4= 200.13
##$BF5= 200.13
##$BF6= 200.13
##$BF7= 200.13
##$BF8= 200.13
##$BYTORDA= 1
##$CFDGTYP= 0
##$CFRGTYP= 5
##$CHEMSTR= <none>
##$CNST= (0..31)
1 1 145 1 1 1 1 1 1 1 1 1 1 1 1 1 1 1 1 1 1 1 1 1 1 1 1 1 1 1 1 1 
##$CPDPRG= <waltz16>
##$CPDPRG1= <>
##$CPDPRG2= <waltz16>
##$CPDPRG3= <>
##$CPDPRG4= <mlev>
##$CPDPRG5= <mlev>
##$CPDPRG6= <mlev>
##$CPDPRG7= <mlev>
##$CPDPRG8= <mlev>
##$CPDPRGB= <>
##$CPDPRGT= <>
##$D= (0..31)
0 1 0 0 0 0 0 0 0 0 0 0.03 2e-05 3e-06 0 0 0 0 0 0 0 0 0 0 0 0 0 0 0 0 
0 0 
##$DATE= 1594189581
##$DBL= (0..7)
120 120 120 11 120 120 24 19 
##$DBP= (0..7)
150 150 150 150 150 150 150 150 
##$DBP07= 0
##$DBPNAM0= <>
##$DBPNAM1= <>
$$ [...]
##$SUBNAM3= <"">
##$SUBNAM4= <"">
##$SUBNAM5= <"">
##$SUBNAM6= <"">
##$SUBNAM7= <"">
##$SUBNAM8= <"">
##$SUBNAM9= <"">
##$SW= 369.568048894756
##$SWIBOX= (0..15)
0 1 3 0 0 0 0 0 0 0 0 0 0 0 0 0 
##$SW_h= 29940.119760479
##$TD= 32768
##$TD0= 1
##$TE= 0
##$TE2= 300
##$TE3= 300
##$TEG= 300
##$TL= (0..7)
0 120 53 12 22 120 120 120 
##$TP= (0..7)
150 150 150 150 150 150 150 150 
##$TP07= 0
##$TPNAME0= <>
##$TPNAME1= <>
##$TPNAME2= <>
##$TPNAME3= <>
##$TPNAME4= <>
##$TPNAME5= <>
##$TPNAME6= <>
##$TPNAME7= <>
##$TPOAL= (0..7)
0.5 0.5 0.5 0.5 0.5 0.5 0.5 0.5 
##$TPOFFS= (0..7)
0 0 0 0 0 0 0 0 
##$TUNHIN= 0
##$TUNHOUT= 0
##$TUNXOUT= 0
##$USERA1= <user>
##$USERA2= <user>
##$USERA3= <user>
##$USERA4= <user>
##$USERA5= <user>
##$V9= 5
##$VALIST= <valist>
##$VCLIST= <CCCCCCCCCCCCCCC>
##$VD= 0
##$VDLIST= <DDDDDDDDDDDDDDD>
##$VPLIST= <PPPPPPPPPPPPPPP>
##$VTLIST= <TTTTTTTTTTTTTTT>
##$WBST= 1024
##$WBSW= 4
##$XGAIN= (0..3)
0 0 0 0 
##$XL= 0
##$YL= 0
##$YMAX_a= 12733
##$YMIN_a= -45178
##$ZGOPTNS= <>
##$ZL1= 120
##$ZL2= 120
##$ZL3= 120
##$ZL4= 120
##$ABSF1= 182.463
##$ABSF2= -187.1042
##$ABSG= 5
##$ABSL= 3
##$ALPHA= 0
##$AQORDER= 0
##$ASSFAC= 0
##$ASSFACI= 0
##$ASSFACX= 0
##$ASSWID= 0
##$AUNMP= <proc_1d>
##$AZFE= 0.1
##$AZFW= 0.5
##$BCFW= 0
##$BC_mod= 2
##$BYTORDP= 0
##$COROFFS= 0
##$CY= -3
##$DATMOD= 1
##$DC= 0
##$DFILT= <>
##$DTYPP= 0
##$F1P= 0
##$F2P= 0
##$FCOR= 1
##$FTSIZE= 65536
##$FT_mod= 6
##$GAMMA= 0
##$GB= 0
##$INTBC= 1
##$INTSCL= 5.30512e-09
##$ISEN= 30
##$LB= 1
##$LEV0= 0
##$LPBIN= 0
##$MAXI= 10000
##$MC2= 0
##$MEAN= 0
##$ME_mod= 0
##$MI= 50
##$NCOEF= 0
##$NC_proc= -8
##$NLEV= 6
##$NOISF1= 182.463
##$NOISF2= 159.3651
##$NSP= 0
##$NTH_PI= 0
##$NZP= 0
##$OFFSET= 182.463
##$PC= 4
##$PHC0= -1872.751
##$PHC1= 34.80195
##$PH_mod= 1
##$PKNL= yes
##$PPARMOD= 0
##$PSCAL= 0
##$PSIGN= 0
##$REVERSE= no
##$SF= 81.0140089999434
##$SI= 65536
##$SIGF1= 159.3651
##$SIGF2= -187.1042
##$SINO= 113.3802
##$SIOLD= 16384
##$SREGLST= <1H.CDCl3>
##$SSB= 0
##$STSI= 65536
##$STSR= 0
##$SW_p= 29940.119760479
##$SYMM= 0
##$S_DEV= 0
##$TDeff= 32768
##$TDoff= 0
##$TI= <>
##$TILT= no
##$TM1= 0
##$TM2= 0
##$TOPLEV= 0
##$USERP1= <user>
##$USERP2= <user>
##$USERP3= <user>
##$USERP4= <user>
##$USERP5= <user>
##$WDW= 1
##$XDIM= 65536
##$YMAX_p= 347382250
##$YMIN_p= -82818153
$$ End of Bruker specific parameters
$$ ---------------------------------
##NTUPLES= NMR SPECTRUM
##VAR_NAME=  FREQUENCY,     SPECTRUM/REAL,   SPECTRUM/IMAG
##SYMBOL=    X,             R,               I
##VAR_TYPE=  INDEPENDENT,   DEPENDENT,       DEPENDENT
##VAR_FORM=  AFFN,          ASDF,            ASDF
##VAR_DIM=   65536,         65536,           65536
##UNITS=     HZ,            ARBITRARY UNITS, ARBITRARY UNITS
##FACTOR=    0.456856943014862, 1,           1
##FIRST=     14782.0589164792, 0,            0
##LAST=      -15158.0608439998, 0,           0
##MIN=       -15158.0608439998, -82818153,   0
##MAX=       14782.0589164792, 347382250,    0
$$ Real data points
##PAGE= N=1
##DATA TABLE= (X++(R..R)), XYDATA
$$ [...]
##PAGE= N=2
##DATA TABLE= (X++(I..I)), XYDATA
4843b5869346n370526N855132J2843119R072845N816007P612074K659649j0571493
4835B047461j3138953K166145J3500656L962285j0631146r827520k359132o378571
4827b0658775j4602615p708787J0569095J9821820J5665752J0215002O720405
4820B0021897j515064j1462608j2527434n623104l88046K842421R544704J4475222
4812A5367988Q498561j746202p91432J0731674J5937176N768913j1422868k2588489
4804A9755321k0485673o432819O954255M731223q215259q374521R722899J8272030
4796A5927456j481791k3821524j5668432J0038462J5858456J246300r79455J6145229
4788A7264701K4222517J2292936L856925J0609615J1535808n527254j9717985
$$ y = [-25869346, -31239872, -25384740, -12541621, -3468776, 2347231, 9959305, 12618954, 2047461, -11091492, -8925347, 4575309, 8537594, -2093552, -11921072, -14280204, -20658775, -35261390, -42970177, -32401082, -12579262, 3086490, 13301492, 20021897, 18506833, 7044225, -5483209, -11106313, -11494359, -8651938, 892766, 15367988, 23866549, 22120347, 21328915, 32060589, 47997765, 53766678, 42343810, 19755321, -730352, -7163171, -208916, 4522307, -3692952, -12067473, -2344574, 15927456, 14445665, -9375859, -25044291, -15005829, 852627, 2098927, 1119472, 17264701, 41487218, 53780154, 57637079, 68246694, 79782502, 74255248, 54537263]
4781E4537263j4513790n244938p377093q401481M288844J5020204N703185j2486853
4773C1525341j8666461j3831257r202298k384457J0383906J6230814N205363q058847
4765A1202104o742263k4102l600640q437759K055204J7245626J3323641o534028
4757A8487783j7184321j1476766n162984m858144r27509P282073P294176k234515
4749h780207p920588n482057m248117n902837k111816M805362L548308j313667
4741b7405619O843833K3026132K0264784o444357k4862201j0849566J6234178
4734c192816K3804518J0591814j953871n789937q438996j0027090l539336O836440
4726H290726R549058N511050N013645P057632J100017j0796118j3194378j951706
$$ y = [54537263, 40023473, 34778535, 27401442, 18999961, 23288805, 38309009, 44012194, 31525341, 12858880, -972377, -10174675, -12559132, -2175226, 14055588, 19260951, 11202104, 4459841, 4435739, 835099, -7602660, -5547456, 11698170, 25021811, 18487783, 1303462, -10173304, -15336288, -20194432, -21121941, -13839868, -6545692, -8780207, -16700795, -22182852, -26430969, -32333806, -34445622, -29640260, -26091952, -27405619, -20561786, 2464346, 22729130, 16284773, -8577428, -19426994, -3192816, 20611702, 31203516, 29249645, 23459708, 15020712, 4993622, 1454286, 8290726, 17839784, 23350834, 28364479, 35422111, 36522128, 25726010, 12531632, 10579926]
4718A0579926Q420515P971152N289970R374919J2047572J311650j7075098k5274392
4710A2646214j6823145k799976M304488L158440k66147m96837N305820J5594743
4702B0623600K1865882J4523364m009803j7355712j2818537J874211O629859o363198
4694B4969666k2921447k4269639q821052P655698J0591088P17602r502596r593955
4686c1174635l25588Q609361Q954019K137603k958268l06458O692119R754313
4678A382466N233373k659682p376197o674729l086759Q40186N317890R924952
4670B901500R790490L27630j3027897j5969000j557729J8604825K6036201J5716728
4662D2822748j964146j6317196k3637315k1327120q154323O669473Q053230m291028
$$ y = [10579926, 19000441, 26971593, 32261563, 41636482, 53684054, 54995704, 37920606, 12646214, -4176931, -6976907, -2672419, 486021, 219874, -276963, 5028857, 20623600, 42489482, 57012846, 53003043, 35647331, 22828794, 24703005, 31332864, 24969666, 2048219, -22221420, -31042472, -23386774, -12795686, -12078084, -21580680, -31174635, -31500223, -22890862, -13936843, -11799240, -14757508, -15063966, -8371847, 1382466, 6615839, 3956157, -3420040, -10094769, -13181528, -12341342, -7023452, 2901500, 12691990, 13019620, -8277, -15977277, -17535006, 1069819, 27106020, 42822748, 40858602, 24541406, 904091, -20423029, -28577352, -21907879, -13854649, -18145677]
4654a8145677j1196972P77730J9750075K5476430J7003113Q900749N860872j468877
4646D6957443j5444296k3411993j6698564m816363k130948q429940j1373173l778657
4638c9126491Q956821J6481490J2905872L48659j1609077j1061930N364842K4895338
4630G155524K7288346O351592j9742910k6452352j1389079L466044J587718o433209
4622a8168326j124749J4706828J9881678P300384o957186j0349362r647474j1270064
4614a5628271n945700J1535206K4137317J4774952m734319r262299K348133Q954246
4606B6179265K234271m666730m293296n507061j1170692r003674M747683J3249235
4598A1769001M467594q411913p403640L291133P397663K863852K01738J670916
$$ y = [-18145677, -29342649, -28564919, -8814844, 16661586, 33664699, 42565448, 48426320, 46957443, 31513147, 8101154, -8597410, -13413773, -15544721, -23974661, -35347834, -39126491, -30169670, -13688180, -782308, -433649, -12042726, -23104656, -17739814, 7155524, 34443870, 40795462, 21052552, -5399800, -16788879, -13322835, -11735117, -18168326, -19293075, -4586247, 15295431, 22595815, 15638629, 5289267, -4358207, -15628271, -21573971, -10038765, 14098552, 28873504, 24139185, 14876886, 17225019, 26179265, 28413536, 23746806, 19453510, 13946449, 2775757, -6227917, -1480234, 11769001, 16236595, 7824682, 421042, 3712175, 11109838, 13973690, 14175428, 15846344]
4590A5846344K81609l562394j773266M493953L181479r380742j9970458j5546122
4582b6429597l12456J0862112J0585651M134085m31348r99732j11068K79612O4383
4573b358358q81741k481861k564063J258954O628508P215419J221017m441161
4565C596714k372518N718787J1709502J0625234L634177n023662r855600p138979
4557A0893655n49911J873446O25047M991493J3396453P590753j8649950l8724987
4549a8554001k4230745J1471464K8070428J3996742k546171q12692O446649L917859
4541A7759533j065062o74482m945144j7021692j6733322N655278K3258307J0417028
4533A6650444j3079775j0276741J4459191K3005432L043626j7905821j8735120
$$ y = [15846344, 16127953, 12565559, 10792293, 15286246, 18467725, 9086983, -10883475, -26429597, -26742053, -15879941, -5294290, -1160205, -1591553, -2591285, -2702353, -2422741, -2358358, -3240099, -5721960, -8286023, -7027069, -398561, 6816858, 8037875, 3596714, 1224196, 6942983, 18652485, 29277719, 32911896, 27888234, 18032634, 10893655, 10343744, 12217190, 12842237, 17833730, 31230183, 38820936, 20170986, -18554001, -42784746, -31313282, -3242854, 10753888, 8207717, 7395025, 13841674, 17759533, 16694471, 16019989, 11074845, -5946847, -22680169, -17024891, 6233416, 16650444, 3570669, -6706072, 7753119, 30758551, 33802177, 15896356, -2838764]
4526b838764r393839k929046M804618J6233366J9678155R121169m258313j0845725
4518A9571621j3979116j4364721l736680J5878733K6538654J9586336Q222648
4511E7717475L616411k498000j7558566k8677860k0885644j680533R546767P119554
4503F699604j48156n162583o628302m196539o7216J310864J655414O994678J2806800
4494A3264564O412177q959631j1930662L778567J4893905L894957j2076411r361563
4486h4097M130154N705308k519842j525949P134789M726442p737661q792814N615190
4477F651520J4375882O768769k719563l114859l565089j0324889j1958494j524603
4469e411326P609423L402682m943275l704187L681715N861177J386838n438946
$$ y = [-2838764, -12232603, -15161649, -10357031, 5876335, 25554490, 34675659, 30417346, 19571621, 5592505, -8772216, -12508896, 3369837, 29908491, 49494827, 57717475, 61333886, 58835886, 41277320, 12599460, -8286184, -9966717, -419950, 6699604, 6551448, 1388865, -5239437, -9435976, -9503192, -8192328, -6536914, 457764, 13264564, 19676741, 10717110, -1213552, 2565015, 17458920, 21353877, 9277466, -84097, 4046057, 9751365, 7231523, 5705574, 12840363, 17566805, 9829144, 1036330, 6651520, 21027402, 27796171, 25076608, 21961749, 18396660, 8071771, -3886723, -5411326, 2198097, 5600779, 657504, -3046683, 635032, 6496209, 7883047, 2444101]
4461B444101j3596550j8328905r218853J1468370K2673582J1736211n545215q038416
4453f405675O63388L692582L87807K500095Q904868P104106l157044q836828n347326
4444d94027m37971L027129R192194J3708818N841895j0712829j7733614q351498
4436e959903L908424P506261P254668R002099O940889l132307j2086944j0886450
4428B546737m297257L7375M877367J3093421J4902345J364498j6275852j7782301
4420a533667k102476J1152738Q752908j711742p041660n303401k046582L87252
4412E53370K437017K257084j825323o593602p091450l215109Q59249L158818N954463
4403c505483J0236313J1284983L642037r302698j5446510q064033L306354L486431
$$ y = [2444101, -11152449, -29481354, -38700207, -27231837, -4558255, 7177956, 1632741, -6405675, -5742287, -2049705, -1661898, 838197, 9743065, 16847171, 13690127, 4853299, -494027, -931998, 2095131, 11287325, 24996143, 30838038, 20125209, 2391595, -5959903, -2051479, 5454782, 12709450, 21711549, 28652438, 25520131, 13433187, 2546737, -1750520, -1713145, 3164222, 16257643, 31159988, 32524486, 16248634, -1533667, -3636143, 7516595, 16269503, 14557761, 7516101, 2212700, 166118, 553370, 2990387, 5247471, 3422148, -3171454, -10262904, -13478013, -12618764, -9459946, -3505483, 6730830, 18015813, 21657850, 12355152, -3091358, -11155391, -7849037, -4362606]
4395d362606p001229j0759463K037826J7465734J5422695k510107j4659563p551996
4387a1918709Q930586J7262833J3113290M610064k244964r109090j7482116k1706230
4379a8544336j3310102P284105K5203964K2347091j828791k4777076k3722332
4372b7347477k655330J2722852P871802m178655m790056L401624L538182p954375
4364a9391433j6032009r845349K725722R035030R639571J2896528J7714484J3623079
4356B0365623j261974j2444795n543188J3850974K4214229J2609952j0488220
4349D1302601k4152166k0522090r295888p04461O280822J4411974J6193556L165012
4341B6679360j5732643j9167711j295131J7048685J3911684n469295j7507118
$$ y = [-4362606, -11363835, -22123298, -20085472, -2619738, 12802957, 10292850, -4366713, -11918709, -2988123, 14274710, 27388000, 31998064, 29753100, 20644010, 3161894, -18544336, -31854438, -24570333, 633631, 22980722, 21151931, -3625145, -27347477, -30002807, -17279955, -9408153, -13586808, -18376864, -14975240, -11437058, -19391433, -35423442, -45268791, -42543069, -33508039, -23868468, -10971940, 6742544, 20365623, 19103649, 6658854, 1115666, 14966640, 39180869, 51790821, 41302601, 17150435, -3371655, -12667543, -13372004, -7091182, 7320792, 23514348, 26679360, 10946717, -8220994, -9516125, 7532560, 21444244, 15974949, -1532169]
4334a532169j1944341l89585N665554R060667J3772806J2295061j913495j8235156
4326F779342j9077604l520673J1114612J1445359J822976n536384n469565j687747
4318d129684J56648j931007m130487M4721J0499135J6670317R901618k433620
4310B4647641n294223J816829L678992o414799j5196478j0203113M87131J435432
4302e042588o158698p753619K038573J4009303J9404379J7738876J0152007k608670
4294D1779563j4078174j5229119o899088j09282j294331n340397n413907j365509
4286g950244L887210P961948O864703j742186j0700874q863623K018773O938903
4278a585390m91974p649650k746171O392853N630674k179322k447779O700973
$$ y = [-1532169, -13476510, -13866095, -8200541, 860126, 14632932, 26927993, 25014498, 6779342, -12298262, -15818935, -4704323, 6741036, 8564012, 3027628, -2441937, -4129684, -3973036, -5904043, -10034530, -9989809, 509326, 17179643, 27081261, 24647641, 19353418, 21170247, 24849239, 18434440, 3237962, -6965151, -6478020, -5042588, -11201286, -18954905, -16916332, -2907029, 16497350, 34236226, 44388233, 41779563, 27701389, 12472270, 5573182, 5463900, 4169569, -1170828, -6584735, -7950244, -4063034, 3898914, 10763617, 9021431, -1679443, -10543066, -8524293, -1585390, -2077364, -9727014, -12473185, -6080332, -449658, -2628980, -5076759, 1624214]
4270A624214J1253376L803249m779653j700655R477583J4285490O337163n562488
4262C4738279q561158n22726P599747M282022q774018j8459401j6180525o742437
4254a2620217J074009N925201R956699R980035K354741o642350o374419K189307
4246E843006O496681P69616n098658L26289J4006668K2099394J5685807j142368
4238E8986435j6125384j9468022j2364582n776713p589012j2163926q522456K345157
4230b0678503P688631K174887l903663j028171N063212M091034j599606j938225
4222a0130404L530677N529401J116373j797375K236447Q255637R625987O729792
4214B5096535K966434j283840o370539j0298798j1773008j1592989q160475K076051
$$ y = [1624214, 12877590, 16680839, 11901186, 10200531, 19678114, 33963604, 40300767, 34738279, 26177121, 25654395, 33254142, 37536164, 28762146, 10302745, -5877780, -12620217, -11546208, -5621007, 4335692, 14315727, 16670468, 10028118, 3653699, 5843006, 12339687, 13109303, 8010645, 8336934, 22343602, 44442996, 60128803, 58986435, 42861051, 23393029, 11028447, 5251734, -2337278, -14501204, -23023660, -20678503, -12989872, -10814985, -14718648, -15746819, -10683607, -6592573, -8192179, -10130404, -6599727, -1070326, 46047, -1751328, 485119, 8740756, 18366743, 25096535, 28062969, 26779129, 20408590, 10109792, -1663216, -13256205, -21416680, -19340629]
4206a9340629J5421650J9541749Q848309m399375m141407P484588J3099920M510911
4198D1025716p560695j1017952q100902o780552o048078k01742P508609P083397
4190A5907801k935435j1944115j0916495k519525M595951N866286K803960m07998
4182D50430j09561L405631M808956L93117m335014m61247R682405J2339221J424433
4173B7598371j0561981q699317L488783R644796M025778k142061J147012Q691749
4165C3193130R209804J080564p569573j0542263q873870n768295j974627K446749
4157A1201619N373979M326989J25838l036222j806242K651638N809103M376746
4149B9023448o92545n337549n918929k485509N07848j707083p483422q431352
$$ y = [-19340629, -3918979, 15622770, 24471079, 20071704, 15930297, 23414885, 36514805, 41025716, 33465021, 22447069, 14346167, 7565615, 1517537, 1315795, 8824404, 15907801, 12972366, 1028251, -9888244, -12407769, -7811818, -1945532, 858428, 450430, 340869, 3746500, 8555456, 8948573, 4613559, 4152312, 13834717, 26173938, 27598371, 17036390, 8337073, 11825856, 21470652, 25496430, 23354369, 24501381, 33193130, 42402934, 43483498, 35913925, 25371662, 16497792, 10729497, 8754870, 11201619, 16575598, 20902587, 21028425, 17992203, 16185961, 18837599, 24646702, 29023448, 28330903, 22993354, 17074425, 14588916, 15096764, 13389681, 5906259, -2525093]
4141b525093J25952J0183884R019804l385926j2379804p359016M579802R355653
4133G615256M546485l07373J135192M825490M391883n6163l204134j553009K059135
4124A9452762Q18536p208711j3180207o584326Q033038J2444113j160670j6723182
4116d108647j5209859j288962M765708k540292p925530k59080J2134576J5591290
4108A159204P883877m333581j3739218j2846400K263929K1690020K5511537O542861
4100C4132229j8331014k7272988j7009147m62361J0942564J3888053R014700J09406
4092E011442o312396p729768p599205n894707L652354J9192397K4120766P542980
4084C1983863j6406165k4549067j4788408m471717k273812l8274O652712Q750314
$$ y = [-2525093, -2399141, 7784743, 16804547, 13418621, 1038817, -6320199, -1740397, 7615256, 12161741, 11854368, 12989560, 17815050, 22206933, 22150770, 18946636, 17393627, 19452762, 20271298, 13062587, -117620, -6701946, 1331092, 13775205, 12614535, -4108647, -19318506, -20607468, -15841760, -18382052, -26307582, -26566662, -14432086, 1159204, 9043081, 4709500, -9029718, -21876118, -19612189, 2077831, 27589368, 34132229, 15801215, -11471773, -28480920, -28943281, -18000717, -4112664, 4902036, 5011442, -1300954, -9030722, -16629927, -22524634, -18872280, 320117, 24440883, 31983863, 15577698, -8971369, -23759777, -28231494, -30505306, -30543580, -23890868, -15140554]
4076a5140554R20693p034774m854208L583323Q938527R909886R323281N489633
4068A1135807k620095q010662l621345O020753R708625L830057m983005r236603
4060B223532p146788k358727j206492o418223j0504287k545750J3723624J8952916
4052D719805M719477r984349m307124J1103704Q057474j4377437k4956575p122257
4044c2147282J4433994J0399901j0041886j5751476p41545J1748478Q143917Q30852
4036a3125047J858922M389408L74325k611284M051706J2507556J0091728q12495
4028A6724819p956941p179816k994862K273099P616432P267983j700954j0047733
4020D002027p219487K231630N700768K005672j37212L99584k773112p440385l980393
$$ y = [-15140554, -14219861, -21254635, -26108843, -22525520, -13586993, -3677107, 5646174, 11135807, 8515712, 505050, -3116295, 2904458, 12613083, 16443140, 11460135, 2223532, -4923256, -7281983, -8488475, -14906698, -25410985, -27956735, -14233111, 4719805, 9439282, -545067, -4852191, 6251513, 14308987, -68450, -25025025, -32147282, -17713288, -7313387, -17355273, -33106749, -33848294, -22099816, -13955899, -13125047, -11266125, -6876717, -6502392, -9113676, -5061970, 7445586, 17537314, 16724819, 8767878, 1588062, -1406800, 866299, 8482731, 15750714, 14049760, 4002027, -3217460, -985830, 4714938, 6720610, 6583398, 6982982, 4209870, -3230515, -7210908]
4011g210908O018946R383507K884726j337349L554817R190383Q274088M507870
4003C5266080k197r804938k0389399j6008792N046790K0663084J4680600J19863
3995B9571091l196994K006158K166830j517852j335414l480962j5039483k1490878
3987a2317504n713819J7786061J8851467r19207j0067425J227413P333365n377183
3979A0803168j3557286Q57522J5404876K823147k1315334k0537934N945390K3347313
3971C770862J4663754Q53420K030862P752253O89187j1308078p567925J0780071
3963B1664406J9311152M265624j7729049k1364428m896086J0091695Q428543j275868
3955A8495989l173709K638035M001321k124127n931885k029385K630410J874792
$$ y = [-7210908, -1191962, 8191545, 11076271, 9738922, 13293739, 22484122, 30758210, 35266080, 35263883, 25458945, 5069546, -10939246, -5892456, 14770628, 29451228, 29571091, 26374097, 28380255, 30547085, 29029233, 27693819, 24212857, 9173374, -12317504, -18031323, -245262, 18606205, 17686998, 7619573, 8846986, 16180351, 10803168, -2754118, -1896596, 13508280, 16331427, -4983907, -25521841, -19576451, 3770862, 18434616, 19288036, 21318898, 29071151, 29760338, 18452260, 10884335, 21664406, 40975558, 45241182, 27512133, 6147705, 1251619, 11343314, 19771857, 18495989, 15322280, 17960315, 21961636, 19837509, 13905624, 11876239, 14506649, 16381441]
3947A6381441K39339L612991Q587486Q169587K094434m638552q741444r438560
3939A6266722o921719l570000j898019N26312P333523J3418317Q796360m580310
3931B9371186j1787508o385579k72546l819060r279235n877444N82710j499399
3923h966875q293521p202786J333748O257837O079305Q311570J0765341L390651
3915A1675270r528807r793308N265278J3036995k427069k3776073k2013938L371817
3907c4189835K2998214J5536418o920364j6293874k857839J5722587J8212298
3900A2207605N313931m015834J104262J0190963Q326468k324152p233851r86758
3892B2582634O913711O511978k312667j3892837k1483344j7973842k670342J1385817
$$ y = [16381441, 16620780, 20233771, 28821257, 36990844, 39085278, 34446726, 25705282, 16266722, 9345003, 5775003, 3876984, 4403296, 11736819, 25155136, 33951496, 29371186, 17583678, 11198099, 10925553, 7106493, -2172742, -8050186, -7467476, -8966875, -17260396, -24463182, -23129434, -16871597, -10792292, -2480722, 8284619, 11675270, 2146463, -7646845, -2381567, 10655428, 8228359, -15547714, -37561652, -34189835, -11191621, 4344797, -2575567, -18869441, -21727280, -6004693, 12207605, 17521536, 13505702, 14609964, 24800927, 33127395, 30803243, 23569392, 22582634, 29496345, 36008323, 33695656, 19802819, -1680525, -19654367, -22324709, -10938892]
3884a0938892Q582688p455375j5088887l254147J2750072J2552225j949943j1565350
3876a6367609o067166O007624J1678457P953033J374390n07982L652032P120213
3868A4842992J743950j0906747j8445134j1841369K561101J0331175O089542j854017
3860g478507l141179K892259P820858M424014m317221p770783j297030N642700
3852c224889J533675q999669r786626K410576J1166074M987979m399060n56631
3844f868571J1208497J2281706J57272q674480m953599J850401K353474J480689
3836H835389N679223Q956336L086405o569689p600642Q32028O720542K191902
3828B2131494o787526r611825m343421J219817j79982o041697o386704L590856
$$ y = [-10938892, -2356204, -9811579, -24900466, -28154613, -15404541, -2852316, -4802259, -16367609, -22434775, -16427151, -4748694, 3204339, 4578729, 4070747, 7722779, 14842992, 16586942, 5680195, -12764939, -24606308, -22045207, -11714032, -5624490, -7478507, -10619686, -7727427, 93431, 4517445, 200224, -7570559, -8867589, -3224889, -1691214, -10690883, -20477509, -18066933, -6900859, -1912880, -6311940, -6868571, 4339926, 16621632, 16778904, 8104424, 3150825, 5001226, 7354700, 8835389, 14514612, 23470948, 26557353, 19987664, 12387022, 13219050, 19939592, 22131494, 15343968, 5732143, 1388722, 2608539, 2428557, -3613140, -9999844, -6408988]
3820f408988J4923351J3522982k008325j6729314j6307429k824027R967257J2508329
3812F643836N788133l834200r605968o713244L160708J0092633N470339n945907
3804E056330r983799j220047R095047P726929k656221p094661J281371J1790317
3796A3995266J0507096j023314q232563l882364K380732m95405o941664k427112
3788C880672J2684609J9548969O140345j4247796j9430051o977942N253518N142524
3780A1994848K28123K423786R414018R280363j202180j1296552r879021R00108
3772A1863493Q562834N429095k788887n512137j466563J152273j919259n375032
3764I945817m846896m033982n081927j265380J0190316J6281340M339939j4673848
$$ y = [-6408988, 8514363, 22037345, 20029020, 3299706, -13007723, -15831750, -5864493, 6643836, 12431969, 8597769, -1008199, -7721443, -4560735, 5531898, 11002237, 5056330, -4927469, -6147516, 2947531, 10674460, 8018239, 923578, 2204949, 13995266, 24502362, 23479048, 15246485, 11364121, 13744853, 13249448, 6307784, 3880672, 16565281, 36114250, 42254595, 28006799, 8576748, 1598806, 6852324, 11994848, 12222971, 14646757, 24060775, 33341138, 32138958, 20842406, 10963385, 11863493, 20426327, 25855422, 23066535, 17554398, 16087835, 17240108, 15320849, 9945817, 5098921, 1064939, -4016988, -5282368, 4907948, 21189288, 25529227, 10855379]
3756A0855379j6860059O84267J5033727J0400410k215882n841698j033966K197786
3748A3219964J611472k45411m238369q251216m343698O277072Q735705j989052
3740A0776467q210824K776724J4053760N032191j1665896q319098J1061965J5114830
3732C0620119l990166j7715392o890101J0391610J0408285k036009q053733l808717
3724H925896J729101L544866P90303p163223j3828612q434454N008039P954035
3716a474049l335447q226099N306162J9233705J4740253K297146M58799L626160
3708C2626630k679697j0485408l620847Q457037M234209r119866l877790J9433905
3700C4968173K6946440K949027k5565740k9203433j3788910q51294O497089J6816710
$$ y = [10855379, -6004680, -5320413, 9713314, 20113724, 17897842, 12056144, 11022178, 13219964, 14831436, 14586025, 10347656, 2096440, -2247258, 4029814, 12765519, 10776467, 2565643, 5342367, 19396127, 24428318, 12762422, 4443324, 15505289, 30620119, 26629953, 8914561, 2024460, 12416070, 22824355, 20788346, 12734613, 8925896, 10654997, 14199863, 14990166, 7826943, -6001669, -14436123, -9428084, -1474049, -4809496, -13035595, -7729433, 11504272, 26244525, 28541671, 29000470, 32626630, 29946933, 19461525, 15840678, 24297715, 28531924, 19412058, 15534268, 34968173, 61914613, 64863640, 39297900, 10094467, -3694443, -4545737, 1951352, 18768062]
3692A8768062K4876828J6145648q106363k7883332k7554354j1712176L346616
3685a2119071Q057741P040962Q939271J1841539N847063q055229j3714829l709719
3677D127728N179151l488356j6618637r168827J5222533K6925944J3335235o567853
3669B8946918j4106882j1841562o299449M199289J3950384O997560j5464073k6430923
3661b0048738q661588J8934063K7056328J2544401o531517j7152148j6690724
3654a0549923o056180O512549P447672k578340n571827M484109Q608261l935572
3646a639251j1774591M285658K3472180J4133064j3147867j8686701M873097K1997744
3638B3513333R536410j1769880j3212812J976387J1274578O397446k766020o690674
$$ y = [18768062, 43644890, 59790538, 51684175, 23800843, -3753511, -15465687, -12119071, -4061330, 2979632, 11918903, 23760442, 29607505, 21552276, 7837447, 4127728, 9306879, 5818523, -10800114, -19968941, -4746408, 22179536, 35514771, 28946918, 14840036, 2998474, -3300975, 898314, 14848698, 21846258, 6382185, -20048738, -28710326, -9776263, 17280065, 29824466, 23292949, 6140801, -10549923, -16606103, -10093554, -2645882, -5224222, -10796049, -6311940, 2296321, -1639251, -13413842, -9128184, 14343996, 28477060, 15329193, -3357508, 1515589, 23513333, 33049743, 21279863, 8067051, 10043438, 21318016, 27715462, 24949442, 18258768]
3630A8258768n091563k720057m210809r714489j3448791j1034619o465561m987626
3622c9414747l426475K488609O643164J665623n431122k710096N422913M953426
3614b9808705j546266L408124K1784080L2253545J9761788m739369k1788145k5013049
3606e687997j7773922l749082R686961J1864252K534805m997159k214593L252159
3598g084576J490333n124081q883083q582696o464622j388131P510276J6111001
3590a2415579J9133364J4159427J713545j1526955j2559349K780561J7069042
3583A8354056R964233j0882111j6845802J214559K0605890K0835128Q090722l703220
3575D7633455j3990728k3675498k2395748n704888J0591440J1085894K797223
$$ y = [18258768, 13167205, 10447148, 6236339, -3478150, -16926941, -27961560, -34427121, -39414747, -42841222, -40352613, -33709449, -32043826, -37474948, -40185044, -34762131, -29808705, -31354971, -27946847, -6162767, 26090778, 45852566, 41113197, 19325052, -5687997, -23461919, -27211001, -17524040, -5659788, -3124983, -8122142, -10336735, -7084576, -5594243, -10718324, -19601407, -28184103, -34648725, -36036856, -28526580, -12415579, 6717785, 20877212, 22590757, 11063802, -1495547, 1285014, 18354056, 28318289, 17436178, 590376, 1804935, 22410825, 43245953, 51336675, 47633455, 33642727, 9967229, -12428519, -18133407, -7541967, 3543927, 6341150]
3568F341150J21304J152478l067541q017716m055352M257792O210990M029583
3560F972688N558739O334345j514683r931265n378178O674707Q842430J02798
3552A7661581m130924R87668L517856k917840r631596r332911n969915m214912
3544a4030993k606967l10276N90923Q58742K281883J731180k714430m295438J313592
3535a7181784L970112n879950j6946036j1779535L615885Q109054O67603J092014
3527c4332637J4102226K0337568R804812k230413l040794j229812m734860l694910
3519e018820Q053672J4980065K752548j6709884k2053057j1748938P11749Q996065
3511b0036600J4049964J2666612L349379m563167k741274L208777N158668N595335
$$ y = [6341150, 6462454, 7614932, 4547391, -3470325, -7525677, -3267885, 2943105, 6972688, 12531427, 18865772, 17351089, 7419824, 2041646, 8716353, 17558783, 17661581, 13530657, 14518325, 18036181, 15118341, 5486745, -3846166, -9816081, -14030993, -16637960, -16948236, -16357313, -15498571, -13216688, -11485508, -14199938, -18495376, -17181784, -13211672, -19091622, -36037658, -47817193, -44201308, -36092254, -35424651, -34332637, -20230411, 107157, 9911969, 7681556, 4640762, 3410950, -1323910, -5018820, 3034852, 18014917, 20767465, 4057581, -17995476, -29744414, -29032665, -20036600, -5986636, 6679976, 10029355, 5466188, 2724914, 5933691, 11092359, 16687694]
3503A6687694O306290j252792j7223210k1152955j107703J9745795J3399295p673506
3495G728908q169256J3249265K1848644L836588j2532815m970887Q225484J957175
3487C1173106j4637198j5940524J62967J4920688J8495528J4199944L050108j3177346
3479C8247273k0757597r067031O867854J916171k0907496l0298900r686358J9827570
3471b3858514K8701541J4908659j085502n456227j755823J260374L15086k775321
3463A0254273m552294l126396j291745l594481p732149m794928O762444J4039084
3455E963808N536204j0094712j2497911L176633J8751455J6643918J577888q221364
3447B0835919m888061K922198M812662M33483m412949o174271m948864k112618
$$ y = [16687694, 22993984, 21741192, 4517982, -16634973, -17742676, 2003119, 15402414, 7728908, -440348, 12808917, 34657561, 38494149, 25961334, 20990447, 29215931, 31173106, 16535908, 595384, 758351, 15679039, 34174567, 48374511, 51424619, 38247273, 17489676, 8422645, 15290499, 17206670, -3700826, -33999726, -43686084, -23858514, 4843027, 19751686, 18666184, 13209957, 11454134, 12714508, 13029594, 10254273, 5701979, 2575583, 1283838, -2310643, -10042792, -14837720, -8075276, 5963808, 11500012, 1405300, -11092611, -7915978, 10835477, 27479395, 29057283, 20835919, 15947858, 18870056, 23682718, 24116201, 19703252, 13528981, 8580117, 6467499]
3439F467499J56082k17194k259352k186307J495209N547847O397154M002716o24063
3430A8779591p659927j4461703j3548531j115540J4254606J8627800R037403l550919
3422B0362780q631169o615022k520105K931533R962415J3333443P533690l618851
3414C2738714r754231o243223J589848O030263L671018m401384j2987330j3828939
3406c185264l402073R589486J1947148K739010n966647p527698r092510j5190997
3398b0089545j4771978K227600K2868481K3184621J851549j5079903q472346R335164
3390A053643J3651219J08345j3963944j4349629l515337P991719J2229961O309683
3382I515660n529251j1315344k441586J2644491J5395886J320848j2362359r101857
$$ y = [6467499, 6623581, 6406387, 4147035, 1960728, 3455937, 9003784, 15400938, 19403654, 18779591, 11119664, -3342039, -16890570, -18006110, -3751504, 14876296, 23913699, 20362780, 11731611, 5116589, 2596484, 5528017, 15490432, 28823875, 36357565, 32738714, 22984483, 16741260, 18331108, 24361371, 28032389, 23631005, 10643675, -3185264, -6587337, 3002149, 14949297, 17688307, 11721660, 4193962, -4898548, -20089545, -34861523, -32633923, -9765442, 13419179, 15270728, 190825, -8281521, 1053643, 14704862, 14813207, 849263, -13500366, -17015703, -9023984, 3205977, 9515660, 3986409, -7328935, -9770521, 2873970, 18269856, 19590704, 7228345, -1873512]
3374a873512N557777J3280498P128495l758219r801634r948108n672093K417411
3366b669385R113889N968991o339122j4966789j0913657j488203R55080l263742
3358b3602938m952575l392832o303246j2016945o950773J1884222K4965349J4251319
3350f118419q372201j3257471O836188K5459614J8073741m767387j2820484K443971
3342G477552J7939746J1864661p743315j6103587n101097Q588201P794120m166185
3334B0550096j1724135q218659l64877M708246P053473P787353M410383l500954
3326B0700926j0395935j1666003r540013p271687l155087L100463M074803n225080
3318a9377613j4648512q827015R967772K1515221J3744027k471568j0426621q447315
$$ y = [-1873512, 3684265, 16964763, 24093258, 20335039, 10533405, 585297, -5086796, -2669385, 6444504, 12413495, 6074373, -8892416, -19806073, -21294276, -20339196, -23602938, -28555513, -31948345, -38251591, -50268536, -57219309, -45335087, -20369738, -6118419, -14490620, -27748091, -20911903, 4547711, 22621452, 17854065, 5033581, 7477552, 25417298, 37281959, 29538644, 13435057, 8333960, 16922161, 24716281, 20550096, 8825961, 607302, 242425, 4950671, 12004144, 19791497, 24201880, 20700926, 10304991, -1361012, -10901025, -18172712, -21327799, -18227336, -14152533, -19377613, -34026125, -42853140, -32885368, -11370147, 2373880, -97688, -10524309, -18971624]
3310a8971624m694909m55825Q541760J8222483J6991917K396100j2462523j3436381
3302c869002j396606R718157Q807301q09831o191278j081102N281838L26326j2576017
3293a790214j6301061m283710Q241632N566413n362454o078088M690040R377789
3285e939653q52107j2221814q117662Q395210K0203678J7449028M924733p870836
3277A5970577j5738898j7098469j1228057L112R975484J1609352O057800L801379
3269C352280J1723149K0801176J5385700l706811j6520099j0736549L39271j985071
3261A8653046j3428366j4898908l131849O156530M973807K798098N509833M140340
3253A0772531o158860j2704437l899830J0726500J3072761J563568q829344p068998
$$ y = [-18971624, -23666533, -24122358, -15580598, 2641885, 19633802, 22029902, 9567379, -3869002, -5265608, 4452549, 13259850, 12450019, 6258741, 5177639, 10459477, 10785803, -1790214, -18091275, -22374985, -14133353, -8566940, -13929394, -20007482, -15317442, -5939653, -6791760, -19013574, -27131236, -18736026, 1467652, 18916680, 23841413, 15970577, 231679, -16866790, -28094847, -28091735, -18116251, -6506899, -449099, 3352280, 15075429, 35876605, 51262305, 47555494, 31035395, 20298846, 20638117, 18653046, 5224680, -9674228, -12806077, -6649547, -1675740, 1122358, 6632191, 10772531, 4613671, -8090766, -11990596, -1264096, 11808665, 13372233, 4542889, -2526109]
3245b526109L428225J1251924O925815q925691k2022833j6365700M532624J8038357
3237e663388J1572079k93001J043963J0252156R265501k964062j1123121q985350
3229C104777m716646k625364J162286M508960J32453o761726j349447J4880872
3221H336165K0548221N665110j1563287j1278925N37925N590391P90303m535203
3213A4090700q372022j3984187j4882676k231582J4655480J5531412k20913r256644
3205d670432J982362J5855980Q473191j5456595k8462999j6587610N213376J5306911
3197a8345816J0557371L389820K246635M182390M336899L707510M785251N426025
3189B0286085K152412l263265o043286o210194p872123r839282m571094Q690494
$$ y = [-2526109, 902116, 12154040, 19079855, 10154164, -11868669, -28234369, -23701745, -5663388, 5908691, 5615690, 6659653, 16911809, 26177310, 23213248, 12090127, 3104777, -1611869, -4237233, -3074947, 1434013, 1566466, -5195260, -6544707, 8336165, 28884386, 34549496, 22986209, 11707284, 12245209, 17835600, 18625903, 14090700, 5718678, -8265509, -23148185, -25379767, -10724287, 4807125, 4586212, -4670432, -2688070, 13167910, 21641101, 6184506, -22278493, -38866103, -33652727, -18345816, -7788445, -4398625, -2151990, 2030400, 6367299, 10074809, 14860060, 20286085, 22438497, 19175232, 13131946, 6921752, -950371, -10789653, -15360747, -6670253]
3181f670253J6575057O676740j2761924j9488770n669903J1055079J1169275j311405
3173d26104p427596j371829L859351j228217q807191p767833q2660N819387R542385
3164g890307J5332668J9405477J3503393K58396p074157k736364L445741j10148
3156C4134699j2561621k3994957k6149092j6473647J455290J7528354K1642356
3149d418618J4844258Q069688O944353N775189K47690m159172l147894k691386
3141B1464108p691473j0899514m787274L651488L481325j570458m51911M565299
3133G761590K363845m463373j471589J1400048J5570555K181819j3367507j4459754
3125E515634n094803J877942L943558M047857m53114r633359j2374413j175063
$$ y = [-6670253, 9904804, 16581544, 3819620, -15669150, -21339053, -10283974, 885301, -426104, -7853700, -9225529, -5366178, -6594395, -15401586, -23169419, -23252079, -17432692, -7890307, 7442361, 26847838, 40351231, 40609627, 33535470, 30799106, 34244847, 34134699, 21573078, -2421879, -28570971, -45044618, -43589328, -26060974, -4418618, 10425640, 18495328, 25439681, 31214870, 31462560, 27303388, 24155494, 21464108, 13772635, 2873121, -1914153, 1737335, 5218660, 3648202, 3196291, 7761590, 10125435, 5662062, 4190473, 15590521, 31161076, 33342895, 19975388, 5515634, 420831, 2298773, 6242331, 10290188, 9837074, 203715, -12170698, -13345761]
3117a3345761J2844370J5040979R373766Q451352Q777379l022952k2086082k6642576
3109a0609525j1177862L244152L09828q629188n111945Q429494J6484213J5183609
3101H122776J2309652R213164M19701j0273661j0241783J861433J0314528L663035
3093B5388845q256011p814078N683880J4926791P561996q449926j6124275j0885998
3085B031224m261280o369055j1497606o709879Q214469J8099669J2177351j153131
3077A0531762n853998P25880P100809N334957o95481n142674p544865o822472
3069b366082J371008J4173661J7699255M165104j3501206j6264169m384358N062094
3061E955307M169230J775732K855443j628095j5052286k1580415q112208J1187409
$$ y = [-13345761, -501391, 14539588, 23913354, 32364706, 41142085, 38119133, 16033051, -10609525, -21787387, -18543235, -18233407, -26862595, -31974540, -23545046, -7060833, 8122776, 20432428, 29645592, 30065293, 19791632, 9549849, 11411282, 21725810, 25388845, 17132834, 9318756, 15002636, 29929427, 37491423, 29041497, 12917222, 2031224, -2230056, -8599111, -20096717, -26806596, -18592127, -492458, 11684893, 10531762, 4677764, 5403644, 12504453, 17839410, 17143929, 12001255, 4456390, -2366082, -995074, 13178587, 30877842, 35042946, 21541740, 5277571, 893213, 5955307, 10124537, 11900269, 14755712, 13127617, -1924669, -23505084, -31617292, -20429883]
3053b0429883J1927054l815977r339846O277251K1222849J4075636m367141q974077
3045F575866J567549N303673o810660j6200723n198442J5339078K0205259M164806
3037B4946406j2357971j1582284M11568N941163k76363q542213j0787126q775341
3029b1022161n489245R73033J0007419J3222536M325477j0175272j7741661j4551702
3021d0451576o395112K278556J1212920J7210063J4418241M354383k900450j450979
3013a723954L372251M453038K351161P06935q42459l007125k164431L306481O795072
3004A3246969J860109o348907p000262L45058M552683j264157j0875030j4551207
2996b0034744j0660834l522860M898765J5137778K4074502K4567948J3183123
$$ y = [-20429883, -8502829, -12318806, -21658652, -15381401, 5841448, 19917084, 15549943, 6575866, 8143415, 13447088, 6636428, -9564295, -14762737, 576341, 20781600, 24946406, 12588435, 1006151, 1417719, 7358882, 7082519, -1459694, -12246820, -21022161, -26511406, -25538373, -15530954, -2308418, 2017059, -8158213, -25899874, -40451576, -46846688, -44568132, -33355212, -16145149, -1726908, 2627475, -272975, -1723954, 1648297, 6101335, 8452496, 9159431, 8316972, 5309847, 3145416, 6451897, 13246969, 15107078, 8758171, 1757909, 2102967, 6655650, 5391493, -5483537, -20034744, -30695578, -34218438, -29319673, -14181895, 9892607, 34460555, 47643678]
2989D7643678m263507j7382816k1137042j8967550j5570139j0028872L34159J2011404
2981b7360685J7588836J5775293J1969925P540225k473352j6502644k1082531
2974a4544933p587413J2490453K0176683J2818470L681134R38082Q19855J051593
2966B9843924N230930R895277K981819j6163395k8586047j9423740J87589Q267494
2958g766149J678107m059828K5071P429562J1450142J3047106J0760095j443257
2950C1120849j9592944k6660394j3769554N888339J4716627J3296191J3194073
2943A8193187J4783274P996760p068130j6312367j1522345j398194K297281o27826
2935F341640l695294m463280l740050j110191K299889K514414k44648J52274M591872
$$ y = [47643678, 43380171, 25997355, 4860313, -14107237, -29677376, -39706248, -39372089, -27360685, -9771849, 6003444, 17973369, 25513594, 23040242, 6537598, -14544933, -22132346, -9641893, 10534790, 23353260, 27034394, 27972476, 28792331, 29843924, 35074854, 44970131, 47951950, 31788555, 3202508, -16221232, -16033643, -7766149, -6088042, -10147870, -10122799, -2693237, 8756905, 21804011, 32564106, 31120849, 11527905, -15132489, -28902043, -23013704, -8297077, 4999114, 18193187, 32976461, 40973221, 33905091, 17592724, 6070379, 4672185, 6969466, 6341640, 2646346, -1816934, -5556984, -6667175, -4367286, -1852872, -2097520, -1945246, 2646626]
2926B646626M232595m476957r357135L52928J3589626J0722814n752314j2472895
2918e14712M60523J5094063J3321497K260520o62658M727796M591446n222864
2910C4055611j4709614j6626716j3831266r434183k018140O897013J0804821P224201
2902B361727J278677k282720l687139k881390K334896R404394R720511m31182
2894A5817774j2875812j6672326j0487603j548259M191530O294877O850473P439208
2886i90138P775526N204437k057904r866621j0835425m658360j99969k865717
2878a8494171n817992p31226P772502Q066979m84798o232752k570115L928367
2870a4563206N687730M617678N383937O932325P153040Q172265R603227M516488
$$ y = [2646626, 6879221, 2402264, -6954871, -6601943, 6987683, 17710497, 11958183, -514712, -54189, 15039874, 28361371, 30621891, 29959233, 34687029, 39278475, 34055611, 19345997, 2719281, -11111985, -20546168, -22564308, -15667295, -4862474, 2361727, 3640404, 1357684, -2329455, -5210845, -2875949, 6528445, 16248956, 15817774, 2941962, -13730364, -24217967, -25766226, -21574696, -15279819, -8429346, -990138, 6785388, 11989825, 9931921, 65300, -10770125, -15428485, -15628454, -18494171, -24312163, -25043389, -17270887, -9203908, -9688706, -15921458, -18491573, -14563206, -8875476, -4257798, 1126139, 8058464, 15211504, 23383769, 32986996, 37503484]
2862C7503484q114073j4572032l475377J3209694J2616724o214380j9571041j2824611
2854a441612Q83657M055188k01548k02127J712686l102300q734479k365255J1151863
2845A756073J3392930J721332n821039M13853P229975K103125o370880m784399
2837I640970J852251o12018j0954900j3804808k830991J1069969J5257549Q717597
2829A8335619r89004o039221k849888N007053P983447M12985j1078806j4591446
2821c809261p618106J315769M988153M453045K888225k41770n258569p551403
2813a0833917k131368Q134826J3122929O452103n594945r694608j322283Q967372
2805G100109Q874407j34123p277393q799357r785066j1097914p245844P41653
$$ y = [37503484, 29389411, 14817379, 11342002, 24551696, 37168420, 30954040, 11382999, -1441612, -557955, 3497233, 3295685, 3093558, 4806244, 1703944, -7030535, -9395790, 1756073, 15149003, 16870335, 11049296, 11463149, 18693124, 20796249, 14425369, 9640970, 11493221, 10881203, -73697, -13878505, -16709496, -5639527, 9618022, 18335619, 17346615, 11307394, 8457506, 13464559, 21448006, 21860991, 10782185, -3809261, -11427367, -10111598, -5123445, -670400, 2217825, 1976055, -3282514, -10833917, -12965285, -4830459, 8292470, 14744573, 9149628, -544980, -1867263, 7100109, 15974516, 15840393, 8563000, -236357, -10021423, -21119337, -28365181, -27623528]
2797b7623528L920980J586167M442306J4223094J5675763Q82983j3054125p209206
2789g155566R823575J5106559N690251j488482N38469J646776k616083l184177
2781A8361322L342695P129616L057004p90981M71475m50293p596834j1993196
2773A1530808o498308K208616N478115N035449M981176K908548k036847l312639
2765B0294918J401640L411888k576403q223049o268257m049135r501280j4345474
2757a9855152o753967P444091J3264324J0629725J1537759J5556695Q156582j2705110
2749B7274947k6385019j5859467P547837J7663456O223118r159286r669589J620624
2741g43379P012813k04514p025288n51343J2252290J4157705K675464p084875
$$ y = [-27623528, -23702548, -22116381, -17674075, -3450981, 12224782, 13107765, 53640, -7155566, 2668009, 17774568, 23464819, 21976337, 22514806, 24161582, 21545499, 18361322, 21704017, 28833633, 31890637, 31099656, 31571131, 31120838, 23524004, 11530808, 5032500, 7241116, 12719231, 17754680, 22735856, 25644404, 23607557, 20294918, 21696558, 25108446, 22532043, 14308994, 8040737, 3991602, -5509678, -19855152, -26609119, -19165028, -5900704, 4729021, 16266780, 31823475, 39980057, 27274947, 889928, -14969539, -7421702, 10241754, 16464872, 7305586, -2364003, -743379, 6269434, 6064920, -960368, -1511711, 10740579, 24898284, 27573748, 20488873]
2733B0488873n081381Q64037o36252q422317j3325161j0274076k99734J1538972
2725e147039J6063101P455793n201527n904266M032169N216150q335719j5523707
2717g345045n29249J8878086J6400260k777336j1711159l146668N200551L591029
2709A8560469J531708L907347J329807q703896j3010269m475749N728875P318061
2701A2186353N701052P360206N876268n068846j6790990j6352924m237476Q299019
2693c027338J2462965N924086p433804j5481838o269553J3832575K1529105N556921
2685B7093119j6240469j9644329m505372R645602J0703630L353576l978157q377809
2677a950209r403329o560731r07406N405134J0082544R949724M526914Q55122
$$ y = [20488873, 15407492, 16271529, 15635277, 7212960, -6112201, -16386277, -16686011, -5147039, 10916062, 18371855, 13170328, 7266062, 11298231, 16514381, 8178662, -7345045, -7874294, 11003792, 27404052, 24626716, 12915557, 9768889, 14969440, 18560469, 20092177, 23999524, 25329331, 16625435, 3615166, -860583, 4868292, 12186353, 17887405, 25247611, 31123879, 26055033, 9264043, -7088881, -11326357, -3027338, 9435627, 15359713, 7925909, -7555929, -13825482, 7093, 21536198, 27093119, 10852650, -8791679, -13297051, -3651449, 7052181, 10405757, 6427600, -1950209, -11353538, -17914269, -18821675, -13416541, -3333997, 6615727, 11142641, 11997763]
2669A1997763N388361R938905j93039j9791014k3602720l002627J6288197R920442
2661F944268r019912j2160754r1213L285187p252793j2262805k846397P568973
2653b5835446J0691353J4595432J9852591J1887429j0244213k2343612q922680
2646a0319146J2273558J7539515J0352858P310610P617833M9946j1451321j3469470
2638A9904383p334450n018767o046409q18875O774499L439284p637379q404195
2630e141909M176129J2295385O075342l254787n560111o264190r665476p886992
2622a5226609J832610O983634L03738n892929k45493Q248885P211391K477899
2614E693126M453266O385146k248840j1304915l416114J3915819J5172673m412546
$$ y = [11997763, 17386124, 27325029, 27131990, 7340976, -16261744, -19264371, -2976174, 6944268, -2075644, -14236398, -14327611, -11042424, -18295217, -30558022, -33404419, -25835446, -15144093, -548661, 19303930, 31191359, 20947146, -1396466, -10319146, 1954412, 19493927, 29846785, 37157395, 44775228, 44825174, 33373853, 19904383, 12569933, 7551166, 1504757, 685882, 7460381, 10899665, 3262286, -5141909, -965780, 11329605, 17404947, 14150160, 8590049, 2325859, -7339617, -15226609, -13393999, -6410365, -6106627, -11999556, -12245049, -3996164, 3215227, 5693126, 10146392, 16531538, 14282698, 2977783, -438331, 13477488, 28650161, 24237615]
2606B4237615k0701989j5344787J840167J1349645P662877k387242j0613139j0648777
2598a4605630k031819N079616R23864p274299m377390O773443P641085m580960
2590a2452090r763164K580895J5377115J1883915J818156K647831J0980580J1723013
2582C4796251L653185l301582p184112j2101816j4573977r319059k505190k488748
2574a3025048l396119M798397J5263818J1987346m382597j6181139j3187631j609999
2566a9732972R762211J6490148J3175828k006822j7348351j7856261n918956K792060
2558b0643115K963583L122799O428732O090530J505688J150209O089799P052154
2550A3760379J248343l665151m873715p182377q747582k555960N442298O65130
$$ y = [24237615, 3535626, -11809161, -9968994, 1380651, 9043528, 6656286, -3956853, -14605630, -16637449, -11557833, -10633969, -17908268, -22285658, -15512215, -7871130, -12452090, -22215254, -19634359, -4257244, 7626671, 9444827, 12092658, 23073238, 34796251, 38449436, 35147854, 27963742, 15861926, 1287949, -8031110, -10536300, -13025048, -16421167, -11622770, 3641048, 15628394, 11245797, -4935342, -18122973, -19732972, -9970761, 6519387, 19695215, 17688393, 340042, -17516219, -23435175, -20643115, -17679532, -14556733, -8128001, -2037471, -531783, 618426, 6708225, 13760379, 15008722, 11343571, 6469856, -712521, -9460103, -12016063, -6573765, -5908635]
2542e908635j3085231j3825466L592459J6441027R579619j876982r04302L628070
2534b359441j799198o691247N063852K2531172K1478001L115734q102308k998729
2526C0237836J768427n517383j3392660q356860K718469L262358q392023j5826753
2518a3498589n438482J4804308K1953668O094528j3265385r531681J3552902K3329569
2510C8000838K562324k5736975l0206544j1876969M117839N240695o98k708900
2502b0608390k650143N0524N137085O504979P48486k755508N032672J5183668
2494F643373J2607989q2547q183012q649444q636701o035664N452243J5478826
2486H595063P444258j0343525j1828441M683966J1072168m987094j8954718r756401
$$ y = [-5908635, -18993866, -32819332, -29226873, -12785846, -3206227, -5083209, -5987511, -2359441, -4158639, -10849886, -5786034, 16745138, 38223139, 41338873, 33236565, 30237836, 32006263, 26488880, 13096220, 4739360, 7457829, 10720187, 2328164, -13498589, -18937071, -4132763, 17820905, 23915433, 10650048, 1118367, 14671269, 38000838, 40563162, 14826187, -15380357, -27257326, -23139487, -17898792, -17899490, -20608390, -23258533, -23208009, -18070924, -11565945, -10817459, -13572967, -8540295, 6643373, 19251362, 19168815, 10985803, 2336359, -6300342, -12336006, -6883763, 8595063, 16039321, 5695796, -6132645, -1448679, 9623489, 4636395, -14318323, -24074724]
2478b4074724O346649M476436q374439q333895M691359R799140J589161l177461
2470a7057774M489104J2222008P735107l444723q805262n575656K95616M117088
2462f024492N250023M132621J225482j974744k857367K94163N105999N759340
2454A0911025P50689k307744K943308Q209772n39850j8804774k2972863k171266
2446b3981703K2487902K3260682J220223j7833931j7042873l264728R142600J4306616
2438H294788J2759201N608261m097551j0800323j0990304n681608J186973M072175
2430C51612r09565r198559q795044M952467J9616652J9128839L915354j1025995
2422A8035761j5132936r771074P1334R501362J0460273j288481j3919721q579606
$$ y = [-24074724, -17728075, -13251639, -21626078, -29959973, -25268614, -15469474, -13880313, -17057774, -12568670, -346662, 7388445, 3943722, -4861540, -10437196, -10141580, -6024492, -774469, 3358152, 4583634, 2608890, -248477, 45686, 5151685, 10911025, 11661714, 9353970, 12297278, 20507050, 19967200, 1162426, -21810437, -23981703, -1493801, 21766881, 22987104, 5153173, -11889700, -15154428, -6011828, 8294788, 21053989, 26662250, 22564699, 11764376, 774072, -4907536, -3720563, 351612, -557953, -9756512, -18551556, -13599089, 6017563, 25146402, 29061756, 18035761, 2902825, -6868249, -6796915, 2704447, 13164720, 11876239, -2043482, -10623088]
2414a0623088J3805427K8103472J6393375p355698j6201125o152129J613286p612255
2406A1971265k3133066k6023932j4103954r88388M394414O986146J3106963J7397586
2398a0392966R758558o994610j5668521n503849J1789105J5288105K072722r003315
2390h654771l215631J0571214J3887215M452989l756775l569938l934118j2146698
2382f366513j8854070j0984955O647876J4871945N085313r796533j2732270k695173
2374c4824380Q364012J2807143J3329158J3355512J0108431J059136p767332o758368
2366I673312L437048R148916J98422j4033704j4102370K521207J5021030P212371
2358A9076232q710347j0264719J068399L547300q286467j4246769k373088J1247125
$$ y = [-10623088, 3182339, 31285811, 47679186, 40323488, 24122363, 17970234, 19583520, 11971265, -11161801, -37185733, -51289687, -52278075, -47883661, -40897515, -27790552, -10392966, -634408, -7629018, -23297539, -28801388, -17012283, -1724178, 348544, -8654771, -11870402, -1299188, 12588027, 17041016, 13284241, 9714303, 5780185, -6366513, -25220583, -36205538, -29557662, -14685717, -9600404, -19396937, -32129207, -34824380, -26460368, -13653225, -324067, 13031445, 23139876, 24199012, 16431680, 9673312, 13110360, 22259276, 22457698, 8423994, -5678376, -3157169, 11863861, 19076232, 10365885, 101166, 1169565, 4716865, -3569602, -17816371, -20189459, -8942334]
2350h942334J0538327N976971J2475996J8551691M700858j8653234k2502281n005960
2342b859966N598943l231986j1006679k214583Q020786K891468o658997k953970
2334a2414984P259240O622685j534081p04063Q153264Q169906m029795j2969448
2326a447276r396789j209902L670343P707593J1828487Q799071l362116j3190593
2318C398818j0351580p61888J844709m733787q641492o81205J2558299J6110923
2310H742797N855491m921970k375797Q418845R710833l541833j6003870j3849348
2302g964852k749873L859643M032315M086747M562002K016689p61423J058988
2294H140236L815094R41245m186696k933388L709771O826761M101887R45337q97555
$$ y = [-8942334, 1595993, 7572964, 20048960, 38600651, 43301509, 24648275, 2145994, -2859966, 2738977, -493009, -11499688, -13714271, -5693485, -2802017, -9461014, -12414984, -5155744, 1466941, -67140, -771203, 7382061, 15551967, 11522172, -1447276, -10844065, -12053967, -8383624, -676031, 11152456, 19951527, 16589411, 3398818, -6952762, -7714650, -5869941, -10603728, -19245220, -19926425, -7368126, 8742797, 14598288, 9676318, 7300521, 15719366, 25430199, 21888366, 5884496, -7964852, -10714725, -6855082, -2822767, 1263980, 5825982, 7842671, 7081248, 8140236, 11955330, 12896575, 8709879, 5776491, 9486262, 16313023, 20414910, 21360247, 20462692]
2285B0462692l818341n173458k66962O530028O472453J665318K248123Q128603
2277C6248456P384470n135122k0187720k7073531k2769897q241304J0965445K0668476
2269h140727J0536632p670547j1069779K436931J1598633N548524j003176M458943
2261F695434J0581157L448073p970737o472579N345805J0651859M340839l690775
2253B2929076o170802m594265j834111q53526n571500j1937100o212967J4360307
2245A15112K8310548J5117179j2854893k3914312r746140O801162P721103J678810
2237A3228569L098052Q839551P468777j620136j0519132j5372035j5985659r696506
2229b0558519L948834J6295720J6609214N113010p010702j0266948n776939k174853
$$ y = [20462692, 16644351, 11470893, 11203931, 17733959, 24206412, 25871730, 28119853, 36248456, 43632926, 38497804, 18310084, -8763447, -31533344, -39774648, -28809203, -8140727, 2395905, -5274642, -16344421, -13907490, -2308857, 3239667, 2236491, 6695434, 17276591, 20724664, 12753927, 6281348, 11627153, 22279012, 26619851, 22929076, 16758274, 12164009, 10329898, 9476372, 3904872, -8032228, -14245195, 115112, 28425660, 43542839, 30687946, 6773634, -2972506, 3828656, 11549759, 13228569, 16326621, 25166172, 32634949, 31014813, 20495681, 5123646, -10862013, -20558519, -16609685, -313965, 16295249, 21408259, 14397557, 4130609, -1646330, -3821183]
2221c821183n857911j3903589j6524496p896622O846612J7997937K1864105K0416694
2213A9121547J4132394L224061o012576o109322k76254O71363m922353o593928
2205A3234932O30824O917467K995365m767945m276367L763312P553269J547982
2197B7598839o822379p431084J319752J1340678J2081077J108327j1029911j1390544
2189A6774755j643103L411965k496228p955114l494110K262813j177191n388891
2181B94896K814876J4114234P325202j3613194j9482483L2348J7246672P056638
2173A5789189j4663117j5931456K306778R717424n049017j7623174o033086J7169376
2165a4317083K4471277J0767689m382118n337435K895312O299356L30196o653738
$$ y = [-3821183, -9679094, -23582683, -40107179, -48003801, -41157189, -23159252, -1295147, 19121547, 33253941, 36478002, 30465426, 24356104, 24079850, 24751213, 19828860, 13234932, 13865756, 20783223, 23778588, 19010643, 14734276, 18497588, 26050857, 27598839, 20776460, 13345376, 14665128, 26005806, 38086883, 39195210, 28165299, 16774755, 15131652, 18543617, 16047389, 8092275, 4598165, 6860978, 5683787, 294896, 3109772, 17224006, 24549208, 10936014, -8546469, -8514121, 8732551, 15789189, 1126072, -14805384, -12498606, -2781182, -7830199, -25453373, -31486459, -14317083, 10154194, 20921883, 16539765, 11202330, 14097642, 20396998, 20727194, 14073456]
2157A4073456m515103O923860J7641569J8852037J2342370N405753m23074q453901
2149F1846967j5716875j3151871j056313N251627o040635k4393276k6617238m938166
2141b4815780K2386655L0569825J4041344r445264j8517242j0111618m58617l714153
2133f4850j3721470j3361384K25449J0919689P297658j122531k02305O422938
2125c606806M874282m834044q283241j50075P278247L775025l567273k812051
2117g325936M247067N778509k315480j1147775j0530024p6485J1573087J5330291
2109E533254R530565Q06031l608332m136044o349887j0564531r930123j426562
2101b0145629P530886Q731822M484672K478975L061383M62189m610338m085773
$$ y = [14073456, 9558353, 16482213, 34123782, 52975819, 65318189, 70723942, 70300868, 61846967, 46130092, 32978221, 31921908, 37173535, 31132900, 6739624, -19877614, -24815780, -2429125, 28140700, 42182044, 32736780, 14219538, 4107920, 3649303, -64850, -13786320, -27147704, -26922255, -16002566, -8704908, -9827439, -10029744, -3606806, 1267476, -3566568, -11849809, -11999884, -4721637, -946612, -4513885, -7325936, -3078869, 2699640, 384160, -10763615, -21293639, -21370124, -9797037, 5533254, 15063819, 15869850, 12261518, 8125474, 1775587, -8788944, -18719067, -20145629, -12614743, -3882921, 601751, 3080726, 6142109, 6604298, 1993960, -2091813]
2093b091813L224418O896282Q77936n000253l4178P680224J639795j4891484j9323659
2084b1022732l665974J0272550K382522j4425319j3599198M420417J4555413O873434
2076a4208887j226563L609007J1284826R625346L753105J358817k461718j0717159
2068A016774j2216461r71463P881980J044612q293709p39549J6492704K1210294
2060B5425182J0991102P61405o046373j5650836j9430054l431507J8774241J6612500
2052B8005660r791931k5907878j4899653O54440J763915K340426J5006061K0667446
2044A7838486J318103k2130618j7813721P988526K1978937J3281414J086148p88233
2036B2759042J950986L324425N056520N037672p85317n324564J303825J1790296
$$ y = [-2091813, 1132605, 8028887, 8906823, 3906570, 3872392, 11552616, 13192411, -1699073, -21022732, -24688706, -14416156, -12033634, -26458953, -40058151, -35637734, -21082321, -14208887, -15435450, -11826443, -541617, 9083729, 12836834, 14195651, 11733933, 1016774, -11199687, -12171150, -4289170, -3244558, -11538267, -12277816, 4214888, 25425182, 36416284, 37177689, 31131316, 15480480, -3949574, -7381081, 11393160, 28005660, 18213729, -7694149, -22593802, -21939362, -20175447, -17835021, -2828960, 17838486, 19156589, -2974029, -20787750, -12799224, 9179713, 22461127, 23547275, 22759042, 24710028, 28034453, 33090973, 38128645, 37343328, 32018764, 33322589, 45112885]
2028D5112885R537761m929845j5091155j4289502j0012334m212393P303989J5290544
2020B8709950K858276k3145687l1778181j0105832J6421702J9927321P205288
2013A0092837L026540J1064816J2835445o79800j6056239j7142032m155951J0355008
2005I340624J5994633J1065783o0978j1192404j6513071j2452734j148627Q405118
1997C438344P829696p5239l866836O57752M788290K030486r11222K692988N361238
1988B1945497k231269j2342527j0010367K571108Q821138L250031l109585k965978
1980E928048j229810j155611J353379O173964P106638M759698N883198P434654
1972C6254158j032299j5299615j6725368j845497Q372313k84968j3760620j3180661
$$ y = [45112885, 54650646, 49720801, 34629646, 20340144, 10327810, 6115417, 13419406, 28709950, 31568226, 8422539, -23355642, -33461474, -17039772, 2887549, 10092837, 13119377, 24184193, 37019638, 36339838, 20283599, 3141567, -1014384, 9340624, 25335257, 36401040, 36340062, 25147658, 8634587, -3818147, -4966774, 3438344, 11268040, 11192801, 7325965, 7983717, 12772007, 14802493, 13891271, 16584259, 21945497, 19714228, 7371701, -2638666, -67558, 8753580, 12003611, 8894026, 5928048, 4698238, 3542627, 4896006, 11069970, 18176608, 22936306, 28819504, 36254158, 35221859, 19922244, 3196876, 1351379, 9723692, 9438724, -4321896, -17502557]
1964a7502557k704271K547784K051128M897974R850494R110546M993784N435267
1956A8680149P911075M090173l322316m085072J555177L078609k958658q960365
1948A5988772r232699n041296K247648J0943560J2782210K98731j7992706k2762476
1940a2768256q377279Q601468J0746841M82926p002303m375272K445671O096542
1932d149662O824074Q514308J0823749R296976K697472l540009l955547j254995
1924B5256366l285434j1307433j6047864q534994P605656J8059620J2446873l730648
1916B0462142j3051266m615059J1835652J5867730K324004j1132826q441000K674970
1908A5924347M323667m033401p718651k042575K788793J435557j21729J92119
$$ y = [-17502557, -20206828, -17659044, -15607916, -10709942, -859448, 8251098, 13244882, 18680149, 26591224, 30681397, 27359081, 23274009, 24829186, 27907795, 24949137, 15988772, 6756073, 1714777, 3962425, 14905985, 27688195, 27986926, 9994220, -12768256, -21145535, -12544067, -1797226, -1314300, -8316603, -12691875, -10246204, -4149662, 2674412, 11188720, 22012469, 31309445, 34006917, 30466908, 26511361, 25256366, 21970932, 10663499, -5384365, -13919359, -6313703, 11745917, 24192790, 20462142, 7410876, 2795817, 14631469, 30499199, 32823203, 21690377, 13249377, 15924347, 20248014, 16214613, 8495962, 6453387, 9242180, 10677737, 10556008, 10748127]
1900A0748127l074354p751320l516931Q350081J2860529N060226k609104l154002
1892A6913252m866140j0326344q383192J633067K251837j0039401j0805471J2623178
1884a0999214L2236652J8620660j1249678j8881083k312979P239284j317332p391455
1876E944855l82649M044104l130038p391953Q71370P634120j50724j1962266j1288711
1867a5811892n92226N693791K700910k295450k452828J536716L490207j328707
1859i059479p884129l969226J1663844K1342217J1071711o976005j1331649l112081
1851A745203k53941n687191o048470l3133r86036q908814p035882P693304J6652425
1842b862535J0029603O24628j548804l336186o947458o41443J5545607K0428012
$$ y = [10748127, 7673773, -77547, -3594478, 4755603, 17616132, 22676358, 20067254, 16913252, 12047112, 1720768, -6662424, -5029357, -2777520, -12816921, -23622392, -10999214, 21237438, 39858098, 28608420, 9727337, 7414358, 14653642, 13336310, 5944855, 5562206, 9606310, 6476272, -915681, -44311, 7589809, 7439085, -4523181, -15811892, -16404118, -10710327, -8009417, -10304867, -12757695, -11220979, -7730772, -9059479, -16943608, -20912834, -9248990, 12093227, 23164938, 16188933, 4857284, 1745203, 1491262, -4195929, -10244399, -10277532, -11263568, -20172382, -27208264, -19514960, -2862535, 7167068, 7791696, 6242892, 2906706, -4040752, -4682195, 10863412, 31291424]
1834C1291424M829722r746398m575704O484704K072654j1725764j4998913o322732
1826b691007J934653O906634J1323323Q927340l946389j3858634r069513r47130
1818a420723m396549j0080834j792534J0647210N900765r372849q213169J1092655
1810g636028J9700217L377630j6185625j5063633J502060J2919365J0294406j112023
1802G796369j2268422j4222303l045532J2351894J7006263Q227722k260899n248064
1794H337028k035642L675022Q591422N507802q489445j9945007j2463603O934853
1786i887570J3924196K204231p794285j501481R538732R989953L716051J004406
1778B1194233n72880o923195j2047400q021503p52500m73017m055844j402588
$$ y = [31291424, 36121146, 26374748, 21799044, 28283748, 30356402, 18630638, 3631725, -2691007, -756354, 6150280, 17473603, 26400943, 22454554, 8595920, -473593, -1420723, -5817272, -15898106, -17690640, -7043430, -1142665, -10515514, -18728683, -7636028, 12064189, 15441819, -743806, -15807439, -14305379, -1386014, 8908392, 7796369, -4472053, -18694356, -21739888, -9387994, 7618269, 15845991, 13585092, 8337028, 6301386, 9976408, 18567830, 24075632, 15586187, -4358820, -16822423, -9887570, 4036626, 6240857, -1553428, -3054909, 6483823, 16473776, 20189827, 21194233, 20621353, 13698158, 1650758, -6370745, -7123245, -7596262, -11652106, -13054694]
1770a3054694O588332J0750338R896250J0237627J0991740M357011r417823j8384880
1762A1963901j3307451J493908J3635599J4113928L157035j0655365j7060140
1755C341415j3188109n116595J215963O386362J1410497J1444361L051713o047715
1747A2497892l914294Q825051J7283456J0027707p189561j8664825j5829302l626403
1739e90279P418993J0824540O078569l917765j3677838j6136506q560299K131043
1731a6429542N568096J414861N31047Q829899J6713662J1815738k592957j1085447
1723A4765357o040433M574635R120895M345427m747690j0282579o478757M680962
1715I937817J2959708J0719896K977729L27355L806677M588233k111908j0485765
$$ y = [-13054694, -6466362, 4283976, 14180226, 24417853, 35409593, 39766604, 30348781, 11963901, -1343550, 150358, 13785957, 27899885, 31056920, 20401555, 3341415, -9846694, -14963289, -13747326, -7360964, 4049533, 15493894, 18545607, 12497892, 8583598, 17408649, 34692105, 44719812, 37530251, 18865426, 3036124, -590279, 6828714, 17653254, 23731823, 19814058, 6136220, -10000286, -18560585, -16429542, -10861446, -9446585, -8915538, -85639, 16628023, 28443761, 25850804, 14765357, 8724924, 13299559, 22420454, 26765881, 22018191, 11735612, 5256855, 9937817, 22897525, 33617421, 36595150, 36922505, 40729182, 45317415, 43205507, 32719742]
1707C2719742j1779556l176551R683102J5593873Q275440k475902j24186J2309579
1699F1025541J1336455r393321k1172905k396115K2791738K2677164J5906155
1692A00774712M0143658O9393776K8920205q6629755j73295928j41137196l1983515
1685a93814043M0305077L5162236R232785J2474821K9066409K8842168J7808356
1678b0922191J3090778R187297l457488j4071715r790031J684784O977738P734931
1670i565897R932012Q114047l415212j6011487j7677351r212670Q97452P940348
1662b8998758R711977N077041P5114K908562Q395300L314940q605459p956440
1654a6077723O736093J1398703m364879j6506571n142515J0811449M834027j1989247
$$ y = [32719742, 20940186, 17763635, 27446737, 43040610, 51316050, 48840148, 48715962, 61025541, 72361996, 62968675, 41795770, 39399655, 62191393, 84868557, 100774712, 140918370, 210312146, 239232351, 152602596, -20693332, -161830528, -193814043, -153508966, -118346730, -109113945, -96639124, -67572715, -38730547, -20922191, -7831413, 1355884, -2101604, -16173319, -25963350, -24278566, -17300828, -9565897, 366115, 8480162, 5064950, -10946537, -28623888, -37836558, -36939106, -28998758, -19286781, -14209740, -14134626, -11226064, -2830764, 484176, -8121283, -16077723, -9341630, 2057073, -2307806, -18814377, -23956892, -13145443, -8311416, -20300663]
1646b0300663j0275428P068319J0868634l237788q090569P269970J9208177R848145
1638A2358797n340197o368837O33937Q73656j565904M723974J3818594J1289168
1630C0423188r66359q623142q342064q922492j1839422q404158K555804R598361
1622d520284N478351k510370m256425o25089P908n795782j2031587r698880L164250
1613c0787908J6775432J7427260L408478j0449010r856445Q71508O074501J524431
1605e011753j340565M844915J1582757Q452268r16870n507853l025657J16049
1597I193291Q99233K024087L715017K642572l50584R8358M243594M486710m034263
1588B2918015j5230937j8357481r739562L862194J1215295N812724p115944j3365758
$$ y = [-20300663, -30576091, -23507772, -12639138, -15876926, -23967495, -16697525, 2510652, 12358797, 7018600, 649763, 1283700, 2157356, 591452, 5315426, 19134020, 30423188, 29456829, 20833687, 12491623, 3569131, -8270291, -16674449, -14118645, -4520284, 958067, -1552303, -5808728, -6433817, -6425909, -12221691, -24253278, -33952158, -30787908, -14012476, 3414784, 6823262, -3625748, -13482193, -12610685, -6536184, -5011753, -6352318, -1507403, 10075354, 18527622, 17610752, 12102899, 9077242, 9193291, 10092524, 12116611, 15831628, 18474200, 18123616, 18221974, 22465568, 26952278, 22918015, 7687078, -10670403, -20409965, -16547771, -5332476, 480248, -6635696, -20001454]
1580b0001454m987265P982210Q882112k198671p207838L972639J8328316J8478597
1572B3248646N881979o159004j3668409k1148438k4963155j5136294N629926K0302575
1564b6012174J8747487Q198549j010377p443073j1139425p198580M318590J1944174
1556i594829O593301m464840o947228J360278R684375J0034963N737157L860349
1548A6263526M806652K128313p832106j7765146j5418457q88493Q747978P81827
1540i175906j3101358j1800458L764666J2153575M851577k637502J136076O215321
1532h594009L027340N92991P277001J2138277M400472n116406l131180J193503
1524A1787989n317325j1207090P32500J7323758J1533889j0519618j5591260K777918
$$ y = [-20001454, -24988719, -17006509, -8124397, -10323068, -17530906, -13558267, 4770049, 23248646, 29130625, 22971621, 9303212, -11845226, -36808381, -51944675, -46314749, -26012174, -7264687, 933862, -76515, -7519588, -18659013, -25857593, -21539003, -9594829, -3001528, -7466368, -14413596, -13053318, -3368943, 6666020, 12403177, 16263526, 21070178, 23198491, 15366385, -2398761, -17817218, -18705711, -9957733, -9175906, -22277264, -34077722, -30313056, -18159481, -13307904, -15945406, -14809330, -8594009, -5566669, -4973678, 2303323, 14441600, 18842072, 13725666, 10594486, 11787989, 6470664, -4736426, -4003926, 13319832, 24853721, 14334103, -1257157, 1520761]
1516A520761J3760431M41633j4797201j0503657J290643K132454j982655Q03068
1508g334523L446150k153600m208652O622595J3478256k94539j7708037j1808005
1500a9960355R697654J6140389K822302n250072L132676J0834427N430114k677797
1492B0169338l266344k131167m293503l271116K959478N023208P78586J579717
1484A7548197R734321R780299m571331j4459391m434969R745003L623699j7008562
1476I957266k3675005p241507J0960813J1954606K357184k644721k954705p611869
1468h897938j4791381j2641912Q70955J1415345P086812l871188l388188J0525134
1460a3692361J9169305Q480324j0814706j7396567p199075M737034P188476M142780
$$ y = [1520761, 15281192, 15722825, 925624, -9578033, -8287390, -6154936, -8137591, -7334523, -3888373, -6041973, -10250625, -3628030, 9850226, 9555687, -8152350, -19960355, -10262701, 5877688, 8699990, 3449918, 6582594, 17417021, 22847135, 20169338, 16902994, 14771827, 10478324, 7207208, 10166686, 15189894, 15968480, 17548197, 27282518, 37062817, 32491486, 18032095, 13597126, 23342129, 26965828, 9957266, -13717739, -20959246, -9998433, 1956173, 4313357, 1668636, -1286069, -8897938, -23689319, -36331231, -35460276, -24044931, -16958119, -20829307, -24217495, -13692361, 5476944, 13957268, 3142562, -14254005, -21453080, -16716046, -9527570, -5384790]
1452e384790K460348J553199l9001P56011L902893K743112m796316j0016637o304838
1443a5126019l14137j266277o023202n392987Q2089K767749L116659Q353990J5580108
1434A777973J1109773p070936j9074398p422797J5614336K0229857j285146k2241741
1426h363079j6088107R143472K4256762J9037678J0310482J0150023P783679o568480
1418D9662430j8684214j0281468R147501J3098080k709606j4567369p183501N441080
1410B3922933M294806p056483j2019374o151652Q74456J777118j565037m530711
1402d53944m762655l170345m194248j0362683j4196335m467776J4929665K3624611
1394c053710J0796071p974260j1324998o07604O338378L475598J956616Q579310
$$ y = [-5384790, -2924442, -1371243, -1410244, -654233, 3248660, 5991772, 1195456, -8821181, -15126019, -15440156, -16706433, -22729635, -28122622, -28040533, -25272784, -22156125, -13802135, 1777973, 12887746, 5816810, -13257588, -20680385, -5066049, 15163808, 13878662, -8363079, -24451186, -15307714, 8949048, 27986726, 38297208, 48447231, 56230910, 49662430, 30978216, 20696748, 29844249, 42942329, 40232723, 25665354, 18481853, 23922933, 28217739, 21161256, 9141882, 2990230, 3864686, 5641804, 4076767, -453944, -5216599, -8386944, -12581192, -22943875, -37140210, -41607986, -26678321, -3053710, 7742361, -231899, -11556897, -12164501, -5826123, -2350525, -393909, 8185401]
1386H185401J5074529J2535211L824617m094003j0491409j6502666j7156163o315979
1378a4940462J1965886K3807127J9669470N412113m186836k810964Q15345l341767
1370C6389912j1146821j0059627J632974J1211901Q978424K1613n310518m373919
1362B7343939r92375R60566k226291j2355554k2166932j8373863P28344J8063468
1354i018698J6543782m70217j4759387j3989954n95497J3853909J6989929N494303
1346A4048170p295767k627025J7605101K7331662R694505j7447486k4430989r175469
1338G702702M558390L320864j672173K371447J0198510Q782316l919937j7493271
1330A3848848k1042684j2788269j35480Q848354J3662920J7535449J7292757P377056
$$ y = [8185401, 23259930, 35795141, 39619758, 35525755, 25034346, 8531680, -8624483, -14940462, -2974576, 20832551, 40502021, 45914134, 41727298, 38916334, 39731679, 36389912, 25243091, 15183464, 16816438, 28028339, 37006763, 37028376, 31717858, 27343939, 26351564, 27312130, 25085839, 12730285, -9436647, -27810510, -27082166, -9018698, 7525084, 7054867, -7704520, -21694474, -22289971, -8436062, 8553867, 14048170, 6752403, 4125378, 21730479, 49062141, 58756646, 41309160, 16878171, 7702702, 12261092, 15581956, 13909783, 16281230, 26479740, 35262056, 31342119, 13848848, -7193836, -19982105, -20117585, -11269231, 2393689, 19929138, 37221895, 44598951]
1322D4598951n317509n941284L711689L205320j3995914k6128586j6846289k567656
1314a9281278m220916j1138375j617682J5982288J6028467m38082r625399o786081
1306b1097058p132269p980870R005082L4257652L2125898j684337k5448663j2614654
1298e69219J0254993J0262977k246974r35977Q884443M930594r611088j3205459
1290G764290l585989K885417J681711K286251N361229K672602l620839l408262
1282A2036410K324112L736866K13520q79273M07100j492357m579901l023915Q51399
1273I593961J827708K508036N632316M482344m611788j0372173l574861M694826
1265A0180369K77877r031902o490189M820253Q672824L401350n78558m022461
$$ y = [44598951, 39281442, 33340158, 37051847, 40257167, 26261253, 132667, -16713622, -19281278, -23502194, -34640569, -36258251, -20275963, -4247496, -4685578, -14310977, -21097058, -28229327, -36210197, -27205115, 7052537, 39178435, 37494098, 12045435, -569219, 9685774, 19948751, 17701777, 16765800, 25650243, 30580837, 20969749, 7764290, 4178301, 7063718, 8745429, 11031680, 16392909, 19065511, 15444672, 12036410, 14360522, 18097388, 18310908, 17431635, 17838735, 16346378, 11766477, 8742562, 9593961, 11421669, 13929705, 19562021, 24044365, 19432577, 9060404, 5485543, 10180369, 10458246, 1426344, -5063845, -243592, 8429232, 11830582, 11252024, 7229563]
1257G229563j4040580k1130195r196096J2473454J6058897k497905j5684527o076731
1249c2864120J0076073J1903385L631930M25408K061541k164828j1855356j3694797
1241c2480764P67530K2733237L1897954J5904677j3076092k7319646j5925584
1234a7498688Q07699L26595j0507607j0228537J358497N905930n51468l627617
1226c4015196J191028K343739l017436k809064O317707J1959142Q383395M630509
1218e016176N190660L952911J535195N752486J0797017J333969j7303723k0755511
1210a4513172n019452N582047J35360j546596J1399431J7600408K033316j3553060
1202B118282o554000P754120M934404n124199R80127J4720877R930284r108081
$$ y = [7229563, -6811017, -27941212, -37137308, -24663854, -8604957, -11102862, -26787389, -32864120, -22788047, -10884662, -7252732, -6827324, -4765783, -6930611, -18785967, -32480764, -31713234, -8979997, 22917957, 38822634, 25746542, -1573104, -17498688, -16690989, -16364394, -26872001, -37100538, -35742041, -29836111, -30387579, -34015196, -32824168, -30480429, -33497865, -36306929, -29989222, -18030080, -9646685, -5016176, 174484, 4127395, 5662590, 11415076, 22212093, 23546062, 6242339, -14513172, -19532624, -13950577, -13815217, -15361813, -3962382, 13638026, 15671342, 2118282, -4435718, 3318402, 8252806, 3128607, 4108734, 18829611, 28759895, 19651814]
1194A9651814j3212378K417441J1482269N81514j2920573j2165456k287085N232534
1186a219920O375713j271080j6285673k3187669p589738J6267930J8409849k106273
1178a0606861j2525478M542228K4549303J8555528o014431k1501489j9040639
1171b2041839j0067549j048074J0714733K0949037J8446424L064460j0172365
1164I844827q606440M448564J5377263J3701513m32099j6626370k1514130j0609481
1156a4416353N733558J1933016M414445m053594j63691J2547792J7914069Q788301
1148D2697543l868370q602127j0852742k0709464l0009808k0519644M676094J9275296
1140b7913222J0697764j819078J149689R668230N602189m114874o86896J1352947
$$ y = [19651814, 6439436, 8856877, 20339146, 20920660, 8000087, -4165369, -6452454, -1219920, 5155793, 3884713, -12400960, -35588629, -43178367, -26910437, -8500588, -10606861, -23132339, -18590111, 5959192, 24514720, 18500289, -3001200, -22041839, -32109388, -33157462, -22442729, -1493692, 16952732, 20017192, 9844827, 1238387, 5686951, 21064214, 34765727, 34333628, 17707258, -3806872, -14416353, -8682795, 3250221, 7664666, 3611072, 3447381, 15995173, 33909242, 42697543, 38829173, 30227046, 19374304, -1335160, -31344968, -51864612, -47188518, -27913222, -17215458, -19034536, -17884847, -8216617, -2614428, -6729302, -7416198, 3936749]
1132C936749J0328566n792349j6548403j3019798q013347q614273m576440Q177265
1124c4122030J6342653J2257749P141205R340807Q933168j909179j1041698n626418
1116A316257N074196M234663n775978r199847k251183M603828N552404M720943
1108H275283M062612q1848p263423j0354429m880306N377811J2658284J1503600
1100A9297584K984914m497329l072978L375800K951569n925080j0110280k378815
1092B625385M840640k367009j6617772j8633050m073189J2751888J8773561J3041819
1084A0342273O73375j0688912j0266858N586899K2007322J8530122m090754k2769232
1076I324235k0910554n623450P775552J4249371J4422701N156886j2437201k4206156
$$ y = [3936749, 14265315, 8472966, -8075437, -21095235, -29108582, -37722855, -42299295, -34122030, -17779377, -5521628, 1619577, 10960384, 19893552, 17984373, 6942675, 1316257, 6390453, 10625116, 4849138, -4350709, -6601892, -1998064, 3554340, 8275283, 12337895, 12256047, 4992624, -5361805, -10242111, -4864300, 7793984, 19297584, 22282498, 17785169, 14712191, 18087991, 21039560, 15114480, 5004200, 2625385, 7466025, 5099016, -11518756, -30151806, -34224995, -21473107, -2699546, 10342273, 11015648, 326736, -9940122, -4353223, 17654099, 36184221, 32093467, 9324235, -11586319, -17209769, -9434217, 4815154, 19237855, 24394741, 11957540, -12248616]
1068a2248616j6698499L136141J4289001P471766n966280j1868521r518944n913825
1060c7317777k697426L277161J0399365J1665688M341805n283734r142667n991917
1052c0749502k54625M799804Q646199R769705N992199m4493j303546L551226N054495
1043E461462n144771j9502244k0754004m559226J2916145J5113636N141392j982753
1035a3310363q72972J457482J428930M212491J1000668J3250963N626156m996479
1027A7796876j0392341j2008108j3097035r130572K707548J2305223Q964682l86599
1019c240326j005652N311278M129084m082214k048773J3367406K0578887N655887
1011C8665577j4003511j5025536j754914M801282J75472k977720l76111J06884
$$ y = [-12248616, -28947115, -25810974, -11521973, -4050207, -10016487, -21885008, -31403952, -37317777, -40015203, -36738042, -26338677, -14672989, -10331184, -15614918, -24757585, -30749502, -31004127, -26204323, -17558124, -7788419, -1796220, -1840713, -3144259, 406967, 5461462, 316691, -19185553, -39939557, -44498783, -31582638, -16469002, -11327610, -13310363, -14183335, -12725853, -11296923, -7084432, 3916236, 17167199, 22793355, 17796876, 7404535, -4603573, -17700608, -26831180, -24123632, -11818409, -2853727, -3240326, -4245978, 1065300, 5194384, 1112170, -936603, 12430803, 33009690, 38665577, 24662066, 9636530, 7881616, 12682898, 12858370, 9880650, 9504539, 9611423]
1003I611423k621884j455899J603712k557355r374844l499325J2869989J7143309
995B1719126J497639j0843448l3939J7951139J4413904q152866j9458966n841454
987A1251135J1767719R525619p916344j8342264j2624981j331142M595279O807730
979C732751J1117021J5503927J3127923L521941n771785q381767m853045J104134
971B9101100O961364J0541342R695630N003359r66700p636953j4432676j5527177
963B2739289n726309P262293Q494026k151949p440968N06426O879735p24736j0769702
954A9068105q662035k960387p525318j1627061K444896K1357426J5506498j0588855
946A7013269k0920593o028284J951170j3763289k3074636L80050L2025572L3408068
$$ y = [9611423, 6989539, 5533640, 7137352, 4579997, -4794847, -8294172, 4575817, 21719126, 23216765, 12373317, 12339378, 30290517, 44704421, 36551555, 17092589, 11251135, 23018854, 32544473, 24628129, 6285865, -6339116, -7670258, -3074979, 3732751, 14849772, 30353699, 43481622, 47003563, 41231778, 32850011, 27996966, 29101100, 36062464, 46603806, 56299436, 61302795, 60336095, 52699142, 38266466, 22739289, 17012980, 24275273, 32769299, 30617350, 23176382, 23682808, 30562543, 29837807, 19068105, 10406070, 7445683, -79635, -11706696, -9261800, 12095626, 27602124, 17013269, -3907324, -9935608, -7984438, -21747727, -44822363, -44442313, -12416741, 20991327]
938B0991327J0315906l488862j983545o259165j8703007j8861500l791517N333492
930a6446871J648338L145764J5800823J8311029j528921k2363410j9935473j452836
922b2821557J0219799J0437829J0299386J1832640P009260l412182q572475m544251
914A0448449J217629K747941J610541l19899l834519o784216m693505N22234M62105
905A376760p472490j4382200j1301105j195981O250236Q079230Q970126J0343051
897F67627P554585K13863l556582P86118N082700M06800o966862l150153J1429199
888A2467295K0337559J3443552p48141r127197r451414o199354j269985L574555
880B3026870L286896l360108r421688r005521m624989k76340M712843R274479
$$ y = [20991327, 31307233, 27818371, 25834826, 19575661, 872654, -17988846, -21780363, -16446871, -14798533, -11652769, 4148054, 22459083, 20930162, -1433248, -21368721, -22821557, -12601758, -2163929, 8135457, 19968097, 26977357, 23565175, 14992700, 10448449, 11666078, 14414019, 16024560, 15704661, 11870142, 5085926, 392421, 914655, 1376760, -6095730, -20477930, -31779035, -32975016, -26724780, -18645550, -9675424, 667627, 8222212, 8436075, 4879493, 5665611, 10748311, 11155111, 4188249, 1038096, 12467295, 32804854, 46248406, 45500265, 36373068, 26921654, 20722300, 19452315, 23026870, 26313766, 22953658, 13531970, 4526449, -98540, -374880, 4337963, 13612442]
872A3612442P615817j15084l983670P20458M872979R91874l903095j716153K249175
863B0344743J076825L30197N129242N553518o374054j6439317p143380J1861274
855A4339048J6681559O345488M74266L263054p72585j3527854j6298663l546381
847F957932M982087k236614q909979J159J2696199J1828573K106675k166348j114369
838B4145315k203959l167662n83004k523902j3220407j7301336j359590J8246035
830B031490J3744055j2123767k7101422j3573191J0463450J9865717J2682167
823E988499L144995r67397k354623l621635l328458o15949K383729L101786J596290
814E327237O33864J805493K053139j998475o033704j757873Q468163J0405268
$$ y = [13612442, 21228259, 21113175, 17129505, 17849963, 22722942, 23714816, 19811721, 18095568, 20344743, 21421568, 21751765, 26881007, 32434525, 26060471, 9621154, 2477774, 14339048, 31020607, 37366095, 37840361, 41103415, 40330830, 26802976, 10504313, 6957932, 11940019, 9703405, 793426, 794585, 13490784, 25319357, 27426032, 25259684, 24145315, 21941356, 18773694, 18190690, 15666788, 2446381, -14854955, -16214545, 2031490, 15775545, 3651778, -23449644, -37022835, -26559385, -6693668, 5988499, 9133494, 8166097, 5811474, 2189839, -1138619, -1754568, 629161, 3730947, 5327237, 5961101, 7766594, 9819733, 7821258, 1787554, 29681, 8497844, 18903112]
806A8903112j602030j2839881q131293M892974P530669l09125o24525J2234134
798B0054035K0751082J0540039q460268j7557701j4161387q865368o450172l879786
790h029526k576250p610002j4355184j0002313O937811K0124209J5882970J455151
782A826866o451901m282865q87181J281565Q692279J9408289J9698418N423354
774D4708824p243548m138476N005497J908319j0944455j4425284l385371N990580
766A7476086K383702m479580j331948Q454079J1736835L609800r972065k0748834
758G128075k2234235j1524958N780430J6903158J4074048K643428n804282m679633
750B286031L952351J1108452O621093q728242j7925161o422566J3910827J5623571
$$ y = [18903112, 17301082, 4461201, -3670092, 1222882, 8753551, 8444426, 7819901, 20054035, 40805117, 51345156, 42884888, 25327187, 11165800, 2300432, -4149740, -8029526, -10605776, -18215778, -32570962, -42573275, -35635464, -15511255, 371715, 1826866, -4625035, -8907900, -9795081, -8513516, 178763, 19587052, 39285470, 44708824, 37465276, 33326800, 38332297, 40240616, 29296161, 14870877, 11485506, 17476086, 19859788, 15380208, 14048260, 22502339, 34239174, 37848974, 27876909, 7128075, -15106160, -26631118, -20850688, -3947530, 10126518, 12769946, 6965664, 2286031, 6238382, 17346834, 23967927, 15239685, -2685476, -9108042, 4802785, 20426356]
742B0426356n575612k1459636j0420838J2095136J7730116M897370n332044l110767
734I250081K078644L069218L873094O048232L985260k762790o724282n618957
726A3198500n787711r305933r857951n604808m280998r399381j1882766l531016
718d6452064Q979406J2581776N548826k150237l970675l244694l414856l45148
710c2467666R814186K0226641J9771194R358730J937589K886135J683604q282477
702B4927936j3304500J045909K1400618J9665954n491379k3667429j5724393J058026
694I910742L116431n051425m726806M959187R887933N758576o4919m736707r719062
685I333950j0187485k150752N171563J501227n209027l4280J2803756J4952170
$$ y = [20426356, 14850744, -6608892, -17029730, -4934594, 12795522, 17692892, 12360848, 9250081, 11328725, 14397943, 18271037, 24319269, 28304529, 25541739, 18817457, 13198500, 7410789, -1895144, -11753095, -17357903, -21638901, -31038282, -42921048, -46452064, -37472658, -24890882, -19342056, -21492293, -25462968, -28707662, -32122518, -32467666, -22653480, -2426839, 17344355, 26703085, 28640674, 31526809, 33210413, 24927936, 11623436, 12669345, 34069963, 53735917, 48244538, 24577109, 8852716, 9910742, 13027173, 7975748, 3248942, 8208129, 18096062, 23854638, 23789719, 19053012, 9333950, -853535, -3004287, 2167276, 3668503, -1540524, -1574804, 11228952, 26181122]
677B6181122K964536p652652p530754l425205j611008L40689K296241j056409
669A0506560q117670j0582512p784470o225549m576067M262818J5793972J7002434
661A0279516Q236393K856682L372271p98398q836760n966043Q088793J3267720
653C0500174K108966o666024j145106K870808p436817j5172760k744799J3153330
645A5467772O055105j4782925j6748405M371116J8402158Q228242p664552q428752
637D899759j49123J595248k288915k578542j472736o160190j0776808k560637
629a9491944J5711944K4721642J3464116n839574j3713733p108610O81488J17207
621H542536m102827l984389n94640O67727R38493N019753J0268402Q412998m42765
$$ y = [26181122, 29145658, 21493006, 13962252, 10537047, 8926039, 9266728, 11562969, 10506560, 2388890, -8193622, -15978092, -22203641, -26779708, -22516890, -6722918, 10279516, 18515909, 21372591, 24744862, 23946464, 15109704, 9143661, 17232454, 30500174, 32609140, 25943116, 24798010, 27668818, 20232001, 5059241, 2314442, 15467772, 21522877, 6739952, -10008453, -5637337, 12764821, 20993063, 13328511, 4899759, 4750636, 6345884, 4056969, 1478427, 5691, -6154499, -16931307, -19491944, -3780000, 20941642, 34405758, 28566184, 14852451, 7743841, 8425329, 8542536, 4439709, 455320, -139320, 528407, 1466900, 6486653, 16755055, 25168053, 24725288]
612B4725288m941550K230368J2952426J3069037m02726j6054364k0756844j2916153
604b094518l090026j568644o197135o286838R36305N590855J324893l360114O90601
595a4054621O944777M651558r09228K958868J2187407J0511960k730322j0569395
587H991004o364037k084029l779435j327622Q827756J2860543L473952n680649
579A4917483l253011J313555k315273n975874j171749J559727p933514j6755201
571a9613857q565814P744351J3011500R472405J1609171J5420103N716964j1569697
563B3225126j4266344k37178R772248P327605O027325J1208817Q452986p619855
555D3890730j8902373j2264474j104421k697772j1567104j2086070l625980L735584
$$ y = [24725288, 19783738, 22014106, 34966532, 48035569, 47632843, 31578479, 10821635, -2094518, -5184544, -6753188, -12950323, -19237161, -18300856, -12710001, -11385108, -14745222, -14054621, -7109844, -2458286, -3367514, -408646, 11778761, 22290721, 19560399, 8991004, 2626967, 542938, -3236497, -4564119, 4263637, 17124180, 20598132, 14917483, 11664472, 12978027, 10662754, 4686880, 3515131, 5074858, -2858656, -19613857, -28179671, -20435320, -7423820, 2048585, 13657756, 29077859, 34794823, 23225126, 8958782, 8721604, 18493852, 25821457, 31848782, 43057599, 51510585, 43890730, 24988357, 12723883, 11619462, 8921690, -2645414, -14731484, -18357464, -14621880]
547a4621880P679636J0982423Q546762n469450k1216027k0026185R65665K2697657
539a0461399K5661949J0195294p116863j2083139m998107L565489N953785M339262
531A5056271M241153N186116K587967l074674n420363j227238M857653O136742
523B8343627R59154o421290r406176m476437M236169P925545L260236m090546
515B0330282q574410j0916952j0946484l417642J0754399J8223486R883147l594691
507B1741135o058785Q83855L643640m47632l070765l173511o267524q056130O12407
498a93310J2615637J0208003n576487j3498898n463329J415384n090323j2321545
490a7904868n789619O917895J0547645N283502N74645j241288j368081L271916
$$ y = [-14621880, -6942244, 4040179, 12586941, 7117491, -14098536, -34124721, -33159056, -10461399, 15200550, 25395844, 18278981, 6195842, 1197735, 4763224, 10717009, 15056271, 19297424, 24483540, 27071507, 23996833, 18576470, 17349232, 22206885, 28343627, 29302781, 22881491, 13475315, 8998878, 13235047, 21160592, 24420828, 20330282, 11755872, 838920, -10107564, -13525206, -2770807, 15452679, 25335826, 21741135, 15682350, 16566205, 20209845, 19762213, 16691448, 13517937, 7250413, -805717, -193310, 12422327, 22630330, 17053843, 3554945, -1908384, -493000, -5583323, -17904868, -23694487, -16776592, -6228947, -945445, -370800, -1612088, -2980169, 291747]
482B91747J1129180J1290463N52113p342524k994703J824452n468833j4639855
474e357960q724234O978627J3028631N590647k759870o479418j0011508j0580316
466a8315401j30304J4891803J6332116P38196j4476379j5695591q274824k325361
458b7255745J600329N889186P628780M946670K615477M652277P933597P787399
450A5797970M244438j06309l083798k590860R24858J915123l773708j0940829
442B386885j1082794m618260J558581O041941J1442363J3377601M957873p519381
434A6544809q707242K701171J0274295M899061j767490K066926Q387024L157283
426C7555837j0091125j5567191r057301j936066k070340l359302K320426J1419723
$$ y = [291747, 11420927, 22711390, 23263503, 15920979, 12926276, 14750728, 9281895, -5357960, -14082194, -7103567, 5925064, 11515711, 8755841, 2276423, -7735085, -18315401, -18445705, -3553902, 12778214, 13516410, -959969, -16655560, -24930384, -27255745, -25655416, -19766230, -12137450, -7190780, -4575303, 76974, 8010571, 15797970, 20042408, 19936099, 16852301, 14261441, 15186299, 17101422, 13327714, 2386885, -8695909, -13314169, -11755588, -5713647, 5728716, 19106317, 24064190, 16544809, 7837567, 10538738, 20813033, 25712094, 23944604, 26011530, 34398554, 37555837, 27464712, 11897521, 2840220, 904154, -1166186, -4525488, -2205062, 9214661]
418I214661J2717391K080395j1208639j4261355n622626K879327J648553l686068
410f238361j482820O767446P327287m432749j5222612j1991926R33566J0501896
402a3838273J2355227J0404740O062441p88752m413444Q49121Q364018M931602
394B3926680r333331j7742153q553047Q651282J5059864O115522m755437m709662
386H659718L111892N684977j838719r400355n320611P167747J2460053K457072
378B2981774j2227496j5375033m973631O618522R728264O374754K022718k668926
370A2480946p692699q500740j954613O299974P595625J926544k825117k916629
362D413291k628183m565205m034097J860750O008208L62447r924032j0973599
$$ y = [9214661, 21932052, 24012447, 12803808, -1457547, -7080173, -4200846, -2552293, -6238361, -7721181, -953735, 6373552, 1940803, -13281809, -25273735, -24340169, -13838273, -1483046, 8921694, 14984135, 14195383, 9781939, 10631060, 18995078, 23926680, 14593349, -3148804, -11701851, -3050569, 12009295, 18124817, 13369380, 8659718, 11771610, 17456587, 15617868, 6217513, 896902, 8064649, 20524702, 22981774, 10754278, -4620755, -9594386, -2975864, 6752400, 13127154, 15149872, 12480946, 4788247, -3712493, -5667106, 632868, 8228493, 10155037, 7329920, 4413291, 1785108, -2780097, -6814194, -4953444, 1054764, 1417211, -8506821, -19480420]
354a9480420M91359J1293139R172640j379149o886999l169470K186945L205624
346d566331K550607M003281N484636L575821K11645k861K884819L821653k49254
337A7714016n837468o610650j023344M812872L226578n572165j2285896r066987
329a4643044O55368O716318N260513J703710N38420n69237l363128l087793L431558
320c357315R476457P160770J026354K061467Q873423P576459n886108j6141037
312A0790470r587621N354997J1105549O235414L128293M685681R40616r832971
304B2820428j4297324n120998O039427O413515O72178J222K994057J199256l792814
295A6928947l619093J133427K897520J572305K448751K242673o594459j7875491
$$ y = [-19480420, -18989061, -7695922, 1476718, 97569, -6789430, -9958900, -7771955, -4566331, -2015724, 1987557, 7472193, 11048014, 11259659, 11256798, 14141617, 17963270, 17714016, 11876548, 5265898, 4242554, 9055426, 12282004, 6709839, -5576057, -14643044, -13987676, -7271358, -2010845, -307135, 231285, -337952, -3701080, -6788873, -3357315, 6119142, 13279912, 14306266, 16367733, 25241156, 32817615, 26931507, 10790470, 1202849, 6557846, 17663395, 23898809, 27027102, 31712783, 32653399, 22820428, 8523104, 3402106, 9441533, 15855048, 16527226, 16528448, 19522505, 20721761, 16928947, 13309854, 14443281, 17340801, 18913106, 21361857, 23604530, 17010071, -865420]
287h65420j5381759K120655J6004633J3605996L796119k70149P82752R47419J675741
278B2415987M801693L808232n270501j2915854q671492K002797N302245j703510
270I769597j0088584j2414291p316146L746102J4414181J3964399M36721j2551757
262c9778j2830558o692816o374939q061598P20616J5920227J8646753L893943
254E181850r813658n455478J0853617K0128850J3187767k951610j4977046j5223582
246I30710p562095k515629l821711l599710L823698J0167821N375759m867303
238b068460p389203k558440j125212l130628J492057J1200490J1663912K43476
230H327992p634021l285884K328900o42652m766548j253565L600872J252860k994076
$$ y = [-865420, -16247179, -14126524, 1878109, 15484105, 19280224, 19010075, 19792827, 20740246, 22415987, 27217680, 31025912, 25755411, 12839557, 4168065, 6170862, 11473107, 9769597, -318987, -12733278, -20049424, -16303322, -1889141, 12075258, 12511979, -39778, -12870336, -19563152, -25938091, -33999689, -33279073, -17358846, 1287907, 5181850, -4631808, -10087286, 766331, 20895181, 34082948, 31131338, 16154292, 930710, -6631385, -9147014, -12968725, -16568435, -12744737, -2576916, 2798843, -2068460, -9457663, -12016103, -13141315, -16271943, -14779886, -3579396, 8084516, 8327992, 693971, -2591913, -263013, -905665, -5672213, -6925778, -3324906, -2072046, -5066122]
221e066122q50738L123532J061268k299835J663308Q286664O563361j783543n036178
212E661717m93692K876457j58445m812276n625121k726246J410470M176792K664262
203B973918k507077n159958j131266M873561N468081K94641n412575p762043n227956
194a3590674J721448P669131O005178j2943O13911Q190202Q594145l530459j2352707
185C307232m852858O882057N073531m353144l614881M873136L675461o865570
177D124964q329644K259259O046587m157241j0155184L84378J2290858Q344346
169A0808323k747239k685452O089040O755096l347434j0082716n673063J965663
161A082218L778837R91667m03944J648066M176594K459345n066508j2328056r643804
$$ y = [-5066122, -5916860, -2793328, -1732060, -4031895, -2368587, 5918077, 12481438, 10697895, 5661717, 5168025, 8044482, 7886037, 3073761, -2551360, -5277606, -3867136, 309656, 2973918, 466841, -4693117, -5824383, -950822, 4517259, 4811900, -600675, -8362718, -13590674, -11869226, -4200095, 1805083, 1792140, 2406051, 10596253, 19190398, 15659939, 3307232, -1545626, 5336431, 10409962, 6056818, 2441937, 7315073, 10990534, 4124964, -4204680, -1945421, 4101166, -56075, -10211259, -9826881, 2463977, 10808323, 8061084, 5375632, 11464672, 18219768, 14872334, 4789618, -883445, 1082218, 4861055, 5852722, 5448778, 7096844, 11273438, 13732783, 8666275, -3661781, -13305585]
152a3305585L741359J5621233J4455757K889318p368242r496197m876180K408143
144D069606P488440N290242l512323j0053368p181998J257868O866191Q014507
136A2239165P641185M587126l265083j0169919p609990K058435P077885K676807
128A5235611l217744k960234Q32390K112730P78457J50860L79986o14090k945063
119I752903n121519n782192l061815L570759Q738433M393677p987325j4505271
111a0002350n393949R695533J2252677m47836j1410276o975114N844736J1102437
103D665858N481509q00699o92357K268583L319945L826244N796885O121654J357699
94C1345321o022347j0721949j0889799p637808j738432M901507P525480L322535
$$ y = [-13305585, -9564226, 6057007, 20512764, 23402082, 16033840, 6537643, 1661463, 4069606, 11558046, 16848288, 13335965, 3282597, -3899401, -2641533, 4224658, 12239165, 19880350, 24467476, 21202393, 11032474, 3422484, 5480919, 12558804, 15235611, 12017867, 9057633, 9890023, 12002753, 12781210, 12932070, 13312056, 12697966, 9752903, 4631384, -1150808, -4212623, -641864, 8096569, 12490246, 4502921, -10002350, -15396299, -5700766, 6551911, 6104075, -5306201, -12281315, -6436579, 4665858, 10147367, 9346668, 8654311, 10922894, 14242839, 18069083, 23865968, 29987622, 31345321, 25322974, 14601025, 3711226, -3926582, -5665014, -763507, 6761973, 10084508]
86A0084508l784420p418521o121223k634391J576830O106527Q088960M734108
78A0632378j434374m933633m081575r70608L166122O880856N359032l848126j3008579
69b238507j0895720J822967J2157015J1405277M029313k194006n830092p425212
61H31035m202348M125942J0282269P358087j465047o755642m170711K057622M941674
52A3002881J477075m236216l990739M584376J1844334O916230n368551q548085
44A5681305J533284Q736847j87584j5317195j7405416m358671Q448440R958228
36G089238L536498k859147n764033n202716k819222j330591m36494M160998J2002477
27H377008J3500145L021372r072227q936962K30306L564688j883825m292521J461847
$$ y = [10084508, 6300088, -1118433, -7239656, -9874047, -8297217, -2190690, 5898270, 10632378, 9198004, 4264371, 182796, -787812, 2378310, 9259166, 14618198, 10770072, -2238507, -13134227, -11311260, 845755, 12251032, 16280345, 14086339, 8256247, 831035, -3371313, 754629, 11036898, 18394985, 16929938, 10174296, 6003585, 8061207, 13002881, 14479956, 10243740, 6253001, 10837377, 22681711, 29597941, 24229390, 15681305, 17214589, 25951436, 25763852, 10446657, -6958759, -11317430, -2868990, 7089238, 10625736, 7766589, 2002556, -3200160, -6019382, -7349973, -7786467, -3625469, 8377008, 21877153, 24898525, 15826298, 6889336, 7119642, 10684330, 8800505, 4507984, 5969831]
18E969831N621736J400624l899950k952576n91772k812004m678702N5130N955637
9D067954M155052k400089l466441K347575O705516N031928J186925r44594k075431
0A4608395
$$ y = [5969831, 11591567, 12992191, 9092241, 6139665, 5547893, 2735889, -1942813, -1887683, 4067954, 8223006, 5822917, 2356476, 4704051, 11409567, 16441495, 17628420, 16683826, 14608395]
##END NTUPLES=NMR SPECTRUM
##END=
