##TITLE=31Pdec_LR-713_CR3
 CDCl3, 124 sc
 8.7.2020
##JCAMPDX= 6.0         $$ Bruker NMR JCAMP-DX V2.0
##DATA TYPE= NMR SPECTRUM
##DATA CLASS= NTUPLES
##ORIGIN= UXNMR, Bruker Analytische Messtechnik GmbH
##OWNER= root
$$ XWIN-NMR		Version 3.5
$$ Wed Jul  8 10:20:27 2020 Russian Standard Time (UT+4h)  she@DPX200
##.OBSERVE FREQUENCY= 81.013821
##.OBSERVE NUCLEUS= ^31P
##.ACQUISITION MODE= SIMULTANEOUS
##.ACQUISITION SCHEME= undefined
##.AVERAGES= 124
##.DIGITISER RES= 17
##SPECTROMETER/DATA SYSTEM= spect
##.PULSE SEQUENCE= zgpg30
##.SOLVENT NAME= CDCl3
##.SHIFT REFERENCE= (INTERNAL, CDCl3, 0, 182.463)
##AUDIT TRAIL= $$ (NUMBER, WHEN, WHO, WHERE, WHAT)
$$ ##TITLE= Audit trail, XWIN-NMR		Version 3.5
$$ ##JCAMPDX= 5.01
$$ ##ORIGIN= Bruker BioSpin GmbH
$$ ##OWNER= she
$$ F:/spectra/data/she/nmr/P31/1/pdata/1/auditp.txt
$$ ##AUDIT TRAIL=  $$ (NUMBER, WHEN, WHO, WHERE, WHAT)
(   1,<2020-07-08 10:18:53.65 +0400>,<she>,<DPX200>,
      <continue with go, POWCHK disabled, PULCHK disabled
       configuration hash MD5:
       00 E9 B6 7A A2 85 ED C7 34 08 36 98 17 FE 4E 26
       data hash MD5: 32K
       AB 40 0A 53 F3 36 0B 89 25 B1 69 06 4E B0 4D C7>)
(   2,<2020-07-08 10:19:28.90 +0400>,<she>,<DPX200>,
      <Start of raw data processing
       efp BC_mod = 2 LB = 1 FT_mod = 6 PKNL = 1 PHC0 = -1606.574 PHC1 = 32.60197 SI = 64K 
       data hash MD5: 64K
       A9 74 2C C6 F3 C7 AD CB 67 BA A8 83 CE F8 82 A7>)
(   3,<2020-07-08 10:20:01.45 +0400>,<she>,<DPX200>,
      <pk PHC0 = -119.9529 PHC1 = -51.20001 
       data hash MD5: 64K
       A6 92 46 30 23 C4 E9 97 FA 6B 25 72 5A 1A 88 E5>)
$$ ##END=
$$ 
$$ hash MD5
$$ 9D A6 A1 BA 86 67 1D B2 45 65 F7 49 73 6D 8D 8A
##$RELAX= 
##$RELAX= 
##$RELAX= 
##$RELAX= 
##$RELAX= 
##$RELAX= 
##$RELAX= 
##$RELAX= 
$$ Bruker specific parameters
$$ --------------------------
##$DU= <F:/spectra>
##$EXPNO= 1
##$NAME= <P31>
##$PROCNO= 1
##$TYPE= <nmr>
##$USER= <she>
##$AMP= (0..31)
100 100 100 100 100 100 100 100 100 100 100 100 100 100 100 100 100 100 
100 100 100 100 100 100 100 100 100 100 100 100 100 100 
##$AQSEQ= 0
##$AQ_mod= 1
##$AUNM= <au_zg>
##$AUTOPOS= <>
##$BF1= 81.014009
##$BF2= 200.13
##$BF3= 200.13
##$BF4= 200.13
##$BF5= 200.13
##$BF6= 200.13
##$BF7= 200.13
##$BF8= 200.13
##$BYTORDA= 1
##$CFDGTYP= 0
##$CFRGTYP= 5
##$CHEMSTR= <none>
##$CNST= (0..31)
1 1 145 1 1 1 1 1 1 1 1 1 1 1 1 1 1 1 1 1 1 1 1 1 1 1 1 1 1 1 1 1 
##$CPDPRG= <waltz16>
##$CPDPRG1= <>
##$CPDPRG2= <waltz16>
##$CPDPRG3= <>
##$CPDPRG4= <mlev>
##$CPDPRG5= <mlev>
##$CPDPRG6= <mlev>
##$CPDPRG7= <mlev>
##$CPDPRG8= <mlev>
##$CPDPRGB= <>
##$CPDPRGT= <>
##$D= (0..31)
0 1 0 0 0 0 0 0 0 0 0 0.03 2e-05 3e-06 0 0 0 0 0 0 0 0 0 0 0 0 0 0 0 0 
0 0 
##$DATE= 1594188952
##$DBL= (0..7)
120 120 120 11 120 120 24 19 
##$DBP= (0..7)
150 150 150 150 150 150 150 150 
##$DBP07= 0
##$DBPNAM0= <>
##$DBPNAM1= <>
##$DBPNAM2= <>
##$DBPNAM3= <>
##$DBPNAM4= <>
##$DBPNAM5= <>
##$DBPNAM6= <>
##$DBPNAM7= <>
##$DBPOAL= (0..7)
0.5 0.5 0.5 0.5 0.5 0.5 0.5 0.5 
##$DBPOFFS= (0..7)
$$ [...]
##$SUBNAM2= <"">
##$SUBNAM3= <"">
##$SUBNAM4= <"">
##$SUBNAM5= <"">
##$SUBNAM6= <"">
##$SUBNAM7= <"">
##$SUBNAM8= <"">
##$SUBNAM9= <"">
##$SW= 369.568048894756
##$SWIBOX= (0..15)
0 1 3 0 0 0 0 0 0 0 0 0 0 0 0 0 
##$SW_h= 29940.119760479
##$TD= 32768
##$TD0= 1
##$TE= 0
##$TE2= 300
##$TE3= 300
##$TEG= 300
##$TL= (0..7)
0 120 53 12 22 120 120 120 
##$TP= (0..7)
150 150 150 150 150 150 150 150 
##$TP07= 0
##$TPNAME0= <>
##$TPNAME1= <>
##$TPNAME2= <>
##$TPNAME3= <>
##$TPNAME4= <>
##$TPNAME5= <>
##$TPNAME6= <>
##$TPNAME7= <>
##$TPOAL= (0..7)
0.5 0.5 0.5 0.5 0.5 0.5 0.5 0.5 
##$TPOFFS= (0..7)
0 0 0 0 0 0 0 0 
##$TUNHIN= 0
##$TUNHOUT= 0
##$TUNXOUT= 0
##$USERA1= <user>
##$USERA2= <user>
##$USERA3= <user>
##$USERA4= <user>
##$USERA5= <user>
##$V9= 5
##$VALIST= <valist>
##$VCLIST= <CCCCCCCCCCCCCCC>
##$VD= 0
##$VDLIST= <DDDDDDDDDDDDDDD>
##$VPLIST= <PPPPPPPPPPPPPPP>
##$VTLIST= <TTTTTTTTTTTTTTT>
##$WBST= 1024
##$WBSW= 4
##$XGAIN= (0..3)
0 0 0 0 
##$XL= 0
##$YL= 0
##$YMAX_a= 29458
##$YMIN_a= -8726
##$ZGOPTNS= <>
##$ZL1= 120
##$ZL2= 120
##$ZL3= 120
##$ZL4= 120
##$ABSF1= 0
##$ABSF2= 0
##$ABSG= 0
##$ABSL= 0
##$ALPHA= 0
##$AQORDER= 0
##$ASSFAC= 0
##$ASSFACI= 0
##$ASSFACX= 0
##$ASSWID= 0
##$AUNMP= <proc_1d>
##$AZFE= 0.1
##$AZFW= 0.5
##$BCFW= 0
##$BC_mod= 2
##$BYTORDP= 0
##$COROFFS= 0
##$CY= -3
##$DATMOD= 1
##$DC= 0
##$DFILT= <>
##$DTYPP= 0
##$F1P= 0
##$F2P= 0
##$FCOR= 1
##$FTSIZE= 65536
##$FT_mod= 6
##$GAMMA= 0
##$GB= 0
##$INTBC= 1
##$INTSCL= 5.30512e-09
##$ISEN= 30
##$LB= 1
##$LEV0= 0
##$LPBIN= 0
##$MAXI= 10000
##$MC2= 0
##$MEAN= 0
##$ME_mod= 0
##$MI= 50
##$NCOEF= 0
##$NC_proc= -10
##$NLEV= 6
##$NOISF1= 182.463
##$NOISF2= 159.3651
##$NSP= 0
##$NTH_PI= 0
##$NZP= 0
##$OFFSET= 182.463
##$PC= 4
##$PHC0= -1726.527
##$PHC1= -18.59804
##$PH_mod= 1
##$PKNL= yes
##$PPARMOD= 0
##$PSCAL= 0
##$PSIGN= 0
##$REVERSE= no
##$SF= 81.0140089999434
##$SI= 65536
##$SIGF1= 159.3651
##$SIGF2= -187.1042
##$SINO= 113.3802
##$SIOLD= 16384
##$SREGLST= <1H.CDCl3>
##$SSB= 0
##$STSI= 65536
##$STSR= 0
##$SW_p= 29940.119760479
##$SYMM= 0
##$S_DEV= 0
##$TDeff= 32768
##$TDoff= 0
##$TI= <>
##$TILT= no
##$TM1= 0
##$TM2= 0
##$TOPLEV= 0
##$USERP1= <user>
##$USERP2= <user>
##$USERP3= <user>
##$USERP4= <user>
##$USERP5= <user>
##$WDW= 1
##$XDIM= 65536
##$YMAX_p= 429556194
##$YMIN_p= -365007192
$$ End of Bruker specific parameters
$$ ---------------------------------
##NTUPLES= NMR SPECTRUM
##VAR_NAME=  FREQUENCY,     SPECTRUM/REAL,   SPECTRUM/IMAG
##SYMBOL=    X,             R,               I
##VAR_TYPE=  INDEPENDENT,   DEPENDENT,       DEPENDENT
##VAR_FORM=  AFFN,          ASDF,            ASDF
##VAR_DIM=   65536,         65536,           65536
##UNITS=     HZ,            ARBITRARY UNITS, ARBITRARY UNITS
##FACTOR=    0.456856943014862, 1,           1
##FIRST=     14782.0589164792, 0,            0
##LAST=      -15158.0608439998, 0,           0
##MIN=       -15158.0608439998, -365007192,  0
##MAX=       14782.0589164792, 429556194,    0
$$ Real data points
##PAGE= N=1
##DATA TABLE= (X++(R..R)), XYDATA
$$ [...]
30939a48869967l8835219j6667081L0161412M0700536J4173458q885191q479143
30932a36701195J0514407M0778418O4895634N5112982J1021603k7234776k6557028
30925h169955Q31917K0954499J4763279j5872614m8563230m5246283N583560N3629236
30917b2089591M1333695r441238k5083325M995249J5508629j9273871m0130701
30910e4181153o007391L6380402L3885566R761933J1106338L0714917L5207851
30903I6868463K2076074R43337l3030865o4389999n2157645l572787J1241545
30896b2021877k9842048m6957809J7465115R1052549P3537412j1340235n9809806
30889A2083301l9502725j045246K6373954N1504330N6265460J3357284m1608518
$$ plain form
30939 -148869967 -187705186 -204372267 -174210855 -133510319 -119336861 -128222052 -136701195
30932 -136701195 -126186788 -85408370 -20512736 34600246 45621849 18387073 -8169955
30925 -8169955 -7338038 13616461 28379740 12507126 -36056104 -81302387 -75718827 -22089591
30917 -22089591 19244104 9802866 -15280459 -10285210 5223419 -14050452 -54181153
30910 -54181153 -60188544 -23808142 10077424 19839357 30945695 61660612 96868463
30903 96868463 118944537 119887874 86857009 22467010 -29690635 -33263422 -22021877
30896 -22021877 -51863925 -98821734 -81356619 9695930 83233342 71893107 12083301
30889 12083301 -27419424 -28464670 -2090716 49413614 105679074 119036358 77427840
30882G7427840m5615981q780424M833476j2910991j1732266J5470817K0918656
30875C9611127l915106j2635200N216521L267856l2769682n4617392l3529937
30868h9371813k317182P792226P849582Q333388l058472k2128416k3925991j0705853
30860a27532531p557161o345807K0284835M8224007K4986181k8541434k9739798
30853a06221708L1152592O3913351K4048104j0164696L3787162J00619403R1370289
30846B28504497R994356n5207371o0679549m4175632m9520247p4584213r0019753
30839a35687912p1425708j7619795M1481728O7154094N3783005L0055546J6037286
30832a6221756P894810K919802J199809j2554923m2999862n2518117j5503974
$$ plain form
30882 77427840 31811859 23031435 27864911 14953920 3221654 18692471 39611127
30875 39611127 35696021 23060821 28277342 31545198 -1224484 -55841876 -89371813
30868 -89371813 -91688995 -83896769 -76047187 -67713799 -70772271 -92900687 -116826678 -127532531
30860 -127532531 -135089692 -141435499 -121150664 -72926657 -47940476 -76481910 -106221708
30853 -106221708 -75069116 -11155765 12892339 2727643 36514805 137134208 228504497
30846 228504497 238498853 183291482 122611933 78436301 28916054 -45668159 -135687912
30839 -135687912 -207113620 -224733415 -183251687 -116097593 -62314588 -32259042 -16221756
30832 -16221756 -8326946 -5407144 -4207335 -16762258 -59762120 -112280237 -127784211
30825a27784211J4930306k1242428o8433508j9344091R3944500J12146173p096269
30818b2879528j03925259n4365992M5613752M7672677j9691211l3904973L552336
30811a37928198j976820m4836039k8123598N0571497Q2947242L1085941j6714920
30804f4974895R19778L3332308K4923295J552140L681754J7584157J6647234N466742
30796C9132513p492273k3079087k3224017P937532L2295045K633904m1709738
30789a3506121j7589661N6178850O5998132j5613246p3701862l0060732L3347388
30782E052748J0607632o3460600q4115171m1839177q956055n715587J2061372
30775a76364838M9907737N8019297K1298248j2820168q886847J4935614L1430232
$$ plain form
30825 -127784211 -112853905 -134096333 -202529841 -221873932 -127929432 -15783259 -22879528
30818 -22879528 -126804787 -181170779 -135557027 -87884350 -107575561 -141480534 -137928198
30811 -137928198 -139905018 -184741057 -212864655 -162293158 -79345916 -48259975 -64974895
30804 -64974895 -64055117 -30722809 -5799514 -4247374 -565620 17018537 33665771 39132513
30796 39132513 31640240 8561153 -14662864 -6725332 25569713 28203617 -13506121
30789 -13506121 -31095782 25083068 91081200 75467954 1766092 -28294640 5052748
30782 5052748 15660380 -47800220 -131915391 -173754568 -182710623 -188426210 -176364838
30775 -176364838 -126457101 -68437804 -47139556 -59959724 -68846571 -53910957 -22480725
30768b2480725L9844792M4103307L6003344J3073024j4224104l7352637n0051998
30761H915003m0504772q746695J8076978J6230850m49330p186409j3154931m0098703
30753f6918009o8347611n3413971K541037M4478973M1473165K5118746K9712437
30746d5355233L4398991R61521n4342676o9676262j9269530M6555189O0103054
30739d6624946J9488328j0297493J8269245P2654906Q2819318L3880674j8033933
30732A52156099k7650610j8773425l3662562n7421467m2029275N069995J4693101
30725g618144m2850488r8081239o5233749L9968219J13262390Q9119546J0206243
30718C8772778m1365883l9228597j1300566K0021471M8063075M9640292R19976
$$ plain form
30768 -22480725 17364067 61467374 97470718 110543742 96319638 58967001 8915003
30761 8915003 -31589769 -40336464 -22259486 -6028636 -6477966 -13664375 -26819306 -66918009
30753 -66918009 -135265620 -188679591 -186138554 -141659581 -100186416 -75067670 -45355233
30746 -45355233 -10956242 -9994721 -64337397 -134013659 -153283189 -106728000 -46624946
30739 -46624946 -27136618 -37434111 -19164866 53490040 136309358 170190032 152156099
30732 152156099 124505489 105732064 72069502 14648035 -27381240 -22311245 -7618144
30725 -7618144 -50468632 -148549871 -213783620 -173815401 -60553011 28566535 38772778
30718 38772778 -2593105 -41821702 -53122268 -33100797 14962278 64602570 65522546
30711F5522546o7180693q3315171k9659577K3551371J1309346l7219812m7056940
30704a64048930m539147L7099296M2480656K8114976J4784105m29221j6099668
30697f2637933j5990718j63012R636847O471056O917012J5441573J4241345l181225
30689b9265055k1462781l1951939l6992720k4469975J7849596N8109804M3407010
30682b4776060j8215223n3124564k2572206K5893203L7289015K5010701K7345887
30675c149247L8151070L1326937J5423041J1697521Q742655j0887711k7180269
30668F4123997j6090649N79017q841921k5688995j3514832J1406870M043678l0534711
30660a4517546m6373891l4561088k5227244j7109308K0877691P0401187O3285511
$$ plain form
30711 65522546 -1658147 -84973318 -114632895 -91081524 -79772178 -116991990 -164048930
30704 -164048930 -168588077 -131488781 -89008125 -60893149 -46109044 -46538265 -62637933
30697 -62637933 -78628651 -78791663 -69154816 -62683760 -55766748 -40325175 -26083830 -29265055
30689 -29265055 -50727836 -82679775 -119672495 -144142470 -126292874 -68183070 -24776060
30682 -24776060 -42991283 -96115847 -118688053 -92794850 -55505835 -30495134 -3149247
30675 -3149247 35001823 66328760 81751801 93449322 102191977 91304266 64123997
30668 64123997 48033348 48612365 39770444 14081449 566617 11973487 16017165 -14517546
30660 -14517546 -60891437 -95452525 -120679769 -137789077 -116911386 -46510199 16775312
30653A6775312j3476434q0443336p1185038j7572525J4512064K3328133M7011664
30646h1050160P5673616N6446840j7614573q0869183p3707299j2486179L8150228
30639i5456710M0255362R298744k0928280l4519421l1252068j1099691J8595329
30632a25106735L0481239Q24875m8693006o1598926j6296870L9771202N0978446
30625a29639775K7657372K4925337N8745765Q3287714N6686061l966087m7891255
30618F9805132n0059364k9062828j4237728r105904N378162L1851556L8544174
30611D3113200L940398l3086460j3637982M6110451N9767169k325600n7028332
30604D6852844l2942516J2895174j2522812p5910104o0203912M2781210J03706010
$$ plain form
30653 16775312 3298878 -77144458 -148329496 -165902021 -151389957 -128061824 -81050160
30646 -81050160 -5376544 51070296 33455723 -47413460 -121120759 -133606938 -95456710
30639 -95456710 -55201348 -45902604 -66830884 -101350305 -132602373 -143702064 -125106735
30632 -125106735 -94625496 -93800621 -142493627 -204092553 -220389423 -180618221 -129639775
30625 -129639775 -101982403 -77057066 -18311301 64976413 121662474 117696387 69805132
30618 69805132 19745768 -9317060 -23554788 -32660692 -27282530 4569026 43113200
30611 43113200 47053598 13967138 329156 46439607 106206776 103881176 46852844
30604 46852844 13910328 26805502 14282690 -61627414 -121831326 -79050116 24655894
30597B4655894M6075504m5600470o2042904j9425722J865765m499756J3085808
30590d5885881N1098270M9660084m444559n4389310o1490412n0453755m7778744
30583a63684307l2202577J8205237O7431374N6485436j1735771o3111416m1518917
30576a70130941J9956300M4842134J5404497j3047717l032564J3198035K109928
30569i0700328l725866L6001134Q2307918O4423429l797236l8295867j4754424
30562C1458760K379583k4541185m9316540l1756891k578270M214998Q410826K3887422
30554c7841297J4489009l2459989n6392516j3314263M5081962N1284675K3660304
30547e492115J5158217J7482681j246621j6303931N273160K4044252o090172l7349868
$$ plain form
30597 24655894 70731398 25130928 -36911976 -56337698 -54471933 -58971689 -45885881
30590 -45885881 5212389 54872473 50427914 -3961396 -65451808 -115905563 -163684307
30583 -163684307 -195886884 -177681647 -110250273 -53764837 -65500608 -128612024 -170130941
30576 -170130941 -150174641 -105332507 -89928010 -102975727 -106008291 -92810256 -90700328
30569 -90700328 -94426194 -58425060 23882858 88306287 84509051 46213184 31458760
30562 31458760 33838343 9297158 -40019382 -71776273 -74354543 -70139545 -61728719 -37841297
30554 -37841297 -23352288 -55812277 -112204793 -125519056 -80437094 -29152419 -5492115
30547 -5492115 9666102 27148783 25902162 9598231 14871391 38915643 32825471 -4524397
30539d524397m399897L9840708l311227r3259707q7988609K4903962R0057115
30532c8682052J9763073p7784849p6501061r976746K2803645K1889179M2925132
30525i5563679O7020564L7413584j7599330j7450521L1115900L6074703l1160352
30518I850869q4218792m8708656L1639434O0798719J9384444k1893115o045465
30511c9192562L6293811L6973894p559598k8355338Q772956L8688075q658108
30504C6963130q6351982q4812749K236079O2872698L7128878O46074K8545631
30497b772241P0906830M4703259k2463071l8471532O818271L9401005K4635164
30490A22757685J449986k124317n456505j9806117k5162233j5737785j3584265
$$ plain form
30539 -4524397 -8924294 30916414 27605187 -65654520 -153643129 -128739167 -38682052
30532 -38682052 -18918979 -96703828 -173204889 -183181635 -160377990 -138488811 -95563679
30525 -95563679 -28543115 8870469 -8728861 -26179382 4936518 41011221 9850869
30518 9850869 -74367923 -123076579 -91437145 -30638426 -11253982 -33147097 -39192562
30511 -39192562 -2898751 34075143 26515545 -1839793 6933163 45621238 36963130
30504 36963130 -49388852 -134201601 -131965522 -69092824 -31963946 -31317872 -2772241
30497 -2772241 68134589 112837848 90374777 51903245 58721516 98122521 122757685
30490 122757685 124207671 122083354 116626849 96820732 71658499 55920714 42336449
30483D2336449k4913144k8114964j3882233L58719j0768j2297545k5490264j9745053
30475h1758803K0006106O1145210L5505995n8223579j14039820n2118972N3545320
30468a35938543P4565679J8081083J04326M6298234N8112799l080376m0705182
30461A7438020R605111O3664000K6812162n2823086p1799709l5942574k5728181
30454f8774257m7683172l6388423J5678912L8460200N73546m2261011l4792599
30447a75186804O730697L3272764K6439637M472982m598709J3430634M2280464
30440e3158335M7677775K4481498J0066844K4663500L0644239o452097m8776015
30433B9147409l6772093J3017021K8548890p112561l5253696j7284473J4209510
$$ plain form
30483 42336449 17423305 -10691659 -24573892 -24215173 -24225941 -36523486 -62013750 -81758803
30475 -81758803 -61752697 -607487 34898508 -23325071 -137364891 -189483863 -135938543
30468 -135938543 -61372864 -43291781 -43187455 3110779 61223578 58143202 17438020
30461 17438020 27043131 90707131 117519293 64696207 -7103502 -43046076 -68774257
30454 -68774257 -116457429 -152845852 -137166940 -98706740 -98133194 -140394205 -175186804
30447 -175186804 -168456107 -135183343 -108743706 -104270724 -108869433 -95438799 -53158335
30440 -53158335 -5480560 19000938 29067782 53731282 84375521 77923424 29147409
30433 29147409 -7624684 5392337 33941227 26828666 -8425030 -25709503 -11499993
30426a1499993J6342026q332105l5771140n0488228l5059514J9438135P3399063
30419c1971756O2544516j1367713o4912646m1153977J5533998L3047595J3106873
30412b5173110O472253K2793873K7577869J1283503N28341L712205j63124j3345415
30404C3686395r501154J4805439K2383727r550839n0660532n8583958l3501978
30397i0922900o668612N546737R143316P853493L0703m839890O930864K8362133
30389d4564156L5798475K1243708R44892j2324553k3861409l5737437l4182695
30382i2683175j4319215K244158m124546k0121821k0700800q094336j578808J109448
30374a58269095J7016668L6310288K8023367n057141j8115466J0492367M2220755
$$ plain form
30426 -11499993 4842033 -3490072 -39261212 -89749440 -124808954 -105370819 -31971756
30419 -31971756 30572760 19205047 -45707599 -86861576 -71327578 -38279983 -25173110
30412 -25173110 -18700857 4093016 31670885 42954388 43482729 47194934 47031810 33686395
30404 33686395 24185241 38990680 61374407 51823568 1163036 -57420922 -90922900
30397 -90922900 -97591512 -92044775 -82901459 -75047966 -75017263 -79857153 -72926289 -44564156
30389 -44564156 -8765681 12478027 13422919 1098366 -22763043 -58500480 -92683175
30382 -92683175 -107002390 -104758232 -108882778 -129004599 -149705399 -157799735 -159378543 -158269095
30374 -158269095 -141252427 -104942139 -76918772 -81975913 -100091379 -89599012 -47378257
30367d7378257L3569387j551407j8123108p464099r05468j5412023l1139922k5937459
30359a14342356o001284P331683Q752926J7487069N1024038Q9338402Q1736967
30352A35327445J1842396n9866907o1164693r686826R744660k2980344l1339382
30345b8123651K3063700N9586178N128522p1087553n3383844L5261884O6086337
30338C6531573Q388783k9767026J4610948O1634181L0787436k7078761k3661176
30331G1445958J9792963J7890204l2066379m9205009l120686L9760942J8865314
30324H3363307l7294285o0376294l4266994k874429n78570o917919J6857106O1061140
30316A8973062O8393081J3510301n0082843n5845425j2004617K1492005K2380687
$$ plain form
30367 -47378257 -13808870 -15360277 -33483385 -40947484 -41852952 -57264975 -88404897 -114342356
30359 -114342356 -120343640 -113011957 -104259031 -86771962 -35747924 53590478 135327445
30352 135327445 147169841 87302934 26138241 16451415 26196075 3215731 -28123651
30345 -28123651 -5059951 54526227 59654749 -11432804 -64816648 -29554764 36531573
30338 36531573 44920356 15153330 29764278 91398459 122185895 95107134 71445958
30331 71445958 91238921 109129125 77062746 27857737 24737051 64497993 83363307
30324 83363307 46069022 -14307272 -48574266 -51448695 -52027265 -58945184 -42088078 18973062
30316 18973062 87366143 100876444 50793601 -5051824 -17056441 4435564 26816251
30309B6816251J3788140r75434l5646670n6527451j0176876O8849077P4257016
30302H0384053j1755031p2061324k5377671N0847433M6957429j3951051l6621663
30295A8422175j2873685p421508k7271730k1389986R692992J4080557p844650
30288c4605835k507314L1521982L4728683n199306k6980856L256746M4369612
30281D4583712N3270481L4009958p93248m6485137p2644431m6483415o39099L88837
30273c4792342k9223509r728327O2951489R1185727K9409965l7081977k6106915
30266D6614111J9116689J5743857k5838494l9309351j7746676o712971j7557669
30259b5690504k3788610j9980165j9371886j2691219J4634842M3517342M7846424
$$ plain form
30309 26816251 40604391 39628957 3982287 -52545164 -62722040 6127037 80384053
30302 80384053 68629022 -3432302 -28809973 22037460 68994889 55043838 18422175
30295 18422175 5548490 -1873018 -29144748 -50534734 -40841742 -26761185 -34605835
30288 -34605835 -37113149 -5591167 29137516 23938210 -3042646 214100 44583712
30281 44583712 97854193 131864151 131070903 84585766 11941335 -34542080 -35181179 -34792342
30273 -34792342 -64015851 -73744178 -10792689 80393038 109803003 72721026 46614111
30266 46614111 65730800 81474657 55636163 16326812 -1419864 -8132835 -25690504
30259 -25690504 -49479114 -69459279 -88831165 -101522384 -86887542 -43370200 4476224
30252D476224L7714765L2242990J7916492j9192341m9510369l8557483k818032
30245a7727754K0973510L3231273M8383202M6798957Q156104l4056621l3283591
30238G2475080n131583r21742k2496775k5245689M023531L1169734L1275501R131921
30230I4279978k9208618p5250103r7405627p0981017k0303490J3242625K8533659
30223a57092593M3555094M3055328P002343l1956157k7185285L951450J0924698
30216a07745122r36825Q089368K0411292j3339181o3625020m4854579L8059731
30209a63940336P7697653L1708133q386333K8879369P4991115L4878945n8996266
30202A6832280r6279501m2478303L7844948P7229122N7772621l55298m4674725
$$ plain form
30252 4476224 42190989 74433979 92350471 73158130 23647761 -14909722 -17727754
30245 -17727754 3245756 36477029 84860231 131659188 139815292 105758671 72475080
30238 72475080 67343497 66421755 43924980 18679291 22702822 53872556 85148057 94279978
30230 94279978 65071360 -10178743 -107584370 -178565387 -198868877 -185626252 -157092593
30223 -157092593 -113537499 -70482171 -63479828 -95435985 -122621270 -118669820 -107745122
30216 -107745122 -108681947 -100592579 -80181287 -93520468 -157145488 -202000067 -163940336
30209 -163940336 -86242683 -54534550 -62920883 -34041514 40949601 75828546 16832280
30202 16832280 -79447221 -121925524 -84080576 -6851454 50921167 50565869 5891144
30195E891144k0586601M9438726O2298469k6555946j11449796o8006993O3628704
30188d5342293J26517237N9129787m3258809q0675127n9926620l1034402n175307
30181g9765534K0064533K4312643K690473r211172J0617471L4328574L5370724
30174C8407712L0175355L3389167K0279613k1131348m5950995j6418259K6224572
30167F4975817J7882080k5190381l0592982J1940887L2145654q251787n4666718
30160H242570m4556312J475486J9445809k531213j9091301k593423K3256652K6702983
30152A0351251J0996748L258981J7453495L6794206K9181023j5837594o3610905
30145B8587205o4192962j4927351K8506946K1542710j2581879k3069270n419880
$$ plain form
30195 5891144 -14695457 34743269 97041738 70485792 -40964004 -108970997 -45342293
30188 -45342293 81174944 140304731 97045922 16370795 -43555825 -74590227 -79765534
30181 -79765534 -59701001 -35388358 -32697885 -41909057 -31291586 3036988 38407712
30174 38407712 68583067 101972234 122251847 101120499 55169504 38751245 64975817
30167 64975817 82857897 57667516 27074534 39015421 71161075 62909288 8242570
30160 8242570 -36313742 -34838256 -15392447 -17923660 -37014961 -39608384 -16351732 10351251
30152 10351251 21347999 24606980 42060475 78854681 108035704 92198110 28587205
30145 28587205 -35605757 -50533108 -22026162 -483452 -13065331 -36134601 -41554481
30138d1554481M186738p031507j6643076j4525763j4540434j5892145J262K6034381
30130g9965025K9467758O700122r096135p365053j4831262l4026931k6563408
30123a35679934J4907782L9623828K0632620J273808J4066836J9604092j3264621
30116c8835589l3401540P128979N3594005L1038236k2499829j6858820L0678330
30109A0843772K4195767l5188379m1668885K9643666O8164806P223193o7585993
30102d372053o0890915j1589677p255658l9753296m2721080j2411812M348492
30095a74645999L131419J6338227M0622067M3996320K6032480J0195283j449841
30088c5780044j2165579O99961M4323951O9957454L5282422k1803552l4067323
$$ plain form
30138 -41554481 -37367743 -44399250 -61042326 -75568089 -90108523 -106000668 -105999406 -79965025
30130 -79965025 -50497267 -43797145 -52893280 -60258333 -75089595 -109116526 -135679934
30123 -135679934 -120772152 -81148324 -60515704 -59241896 -45175060 -25570968 -38835589
30116 -38835589 -72237129 -65108150 -11514145 19524091 -2975738 -19834558 10843772
30109 10843772 35039539 -148840 -41817725 -12174059 55990747 63213940 -4372053
30102 -4372053 -65262968 -76852645 -84108303 -123861599 -166582679 -178994491 -174645999
30095 -174645999 -171514580 -155176353 -114554286 -70557966 -44525486 -34330203 -35780044
30088 -35780044 -47945623 -47245662 -2921711 67035743 102318165 80514613 46447290
30081D6447290j954321K3403913K5571501K3093487J0841880k5145784n4182881
30074D8075085l6925397J271127P117581q583035K731314K5724506J450205n4012674
30066a3151288n5572031R266194M8109518R392371l5716433j1705130M3324464
30059f052335M7751065L506947k2783716q742664N350859q532882l0908230l2042126
30051e2453082m909850L7779249P2290766P3399024L6484169j1363124l3542583
30044A17684569j5783239K1981531L6615350k969865p0770877r1812786l0482215
30037c5537532M7000321M8117573j9917211o1906621l1046409J7789726K5100771
30030a0399382M250733p260459q009852p202869L067717J3529055p469630m8613307
$$ plain form
30081 46447290 44492969 67896882 93468383 116561870 127403750 102257966 48075085
30074 48075085 11149688 12420815 19538396 10955361 13686675 39411181 40861386 -13151288
30066 -13151288 -68723319 -59457125 -11347607 -1955236 -37671669 -49376799 -6052335
30059 -6052335 41698730 45205677 22421961 13679297 19030156 10497274 -20410956 -52453082
30051 -52453082 -57362932 -19583683 52707083 126106107 162590276 151227152 117684569
30044 117684569 101901330 123882861 160498211 157528346 86757469 -5055317 -35537532
30037 -35537532 11462789 59580362 39663151 -22243470 -53289879 -35500153 -10399382
30030 -10399382 -6148649 -13409108 -21418960 -28621829 -25554112 -12025057 -19494687 -68107994
30022f8107994m7067826J2646551N8098415L9345131R198402K6148521M8683530
30015G8944730J5566926k9957718o695525N3808987M6463084l0631994o5508602
30008F1989888j3575470L1889812o454851p0721586o6927716l799898M0711130
30001b6888691L6564084J2959842j1481170m0946788o1723044m7650501m469994
29994a43636262L0580496L2920525J0183044j4511866k0263567k670124J4852385
29987i2545369L837851k2718199j7259587L0754049O8800107N5406027J8016209
29980D4291088l390923k4608488o9300763r3176058l9104720N0810037P2756764
29973f1723063J6134222j6911518K5139959O1195112J8181265l9156951j3844994
$$ plain form
30022 -68107994 -115175820 -102529269 -44430854 -5085723 4112679 30261200 78944730
30015 78944730 94511656 64553938 57858413 111667400 158130484 127498490 61989888
30008 61989888 48414418 80304230 73849379 3127793 -63799923 -67599821 -26888691
30001 -26888691 9675393 22635235 11154065 -29792723 -91515767 -139166268 -143636262
29994 -143636262 -113055766 -80135241 -69952197 -84464063 -104727630 -107397754 -92545369
29987 -92545369 -88707518 -111425717 -128685304 -97931255 -29131148 26274879 44291088
29980 44291088 40900165 16291677 -53009086 -146185144 -185289864 -134479827 -61723063
29973 -61723063 -45588841 -62500359 -37360400 23834712 42015977 2859026 -10985968
29966a0985968N3165113L8038950o4819466j20883104n1753960N6365337Q5930019
29959a4943079M1020390L350009J750175K319099q738168q709576N680237O613872
29951B8342959j7333678m3502613m7990195k7680153P654846M2198139O0044664
29944A733969O1766176O1356611N5111303K2737864k3687823l5270504k516414
29937A41231182J2935756k9419133p4582879n4670362k26877J3222378o323069
29930B166996Q837412N3646077N2532105l762694l6807966j7191835j0971513
29923D8448582n1313003p2328657k7222015K7169292L2419502K3755923M4662455
29916B5592079N2269237K374704m4979296j3913602M8055929L5660670m3325770
$$ plain form
29966 -10985968 42179145 80218095 15398629 -105484475 -157238435 -100873098 -14943079
29959 -14943079 26077311 29427320 31177495 33496594 24758426 16048850 21729087 28342959
29951 28342959 11009281 -32493332 -80483527 -108163680 -100508834 -58310695 1733969
29944 1733969 63500145 124856756 179968059 202705923 179018100 143747596 141231182
29937 141231182 154166938 124747805 50164926 -4505436 -4732313 8490065 2166996
29930 2166996 11004408 64650485 117182590 113419896 76611930 59420095 48448582
29923 48448582 -2864421 -75193078 -102415093 -75245801 -42826299 -19070376 25592079
29916 25592079 77861316 80236020 35256724 21343122 69399051 105059721 61733951
29909F1733951q1181808m0705193K064415q014620l3152893k7563926n403312
29902a32223386Q183201K2749458M6246026N8051772M4985257K0264107p457668
29895F0798767l8788577n1587022j8388666L4734786M4357652P54833l3237349
29888a355576j5498481J6734441R444897l2278857o1851078n0838504n147460
29881a40790618N1026499Q6951444Q2346025M4891408l943168n3722804r1797232
29874b5038446q5919825k5029892L8792680M5003878J0362252j739636J3953945
29867b9615044P519606k1380417j3943394L5258758N1963182N851144l0725071
29860D928764j291974M0744677K4148266k5505502m0266857k1217743j3834221
$$ plain form
29909 61733951 -19447857 -60153050 -58088635 -66103255 -99256148 -126820074 -132223386
29902 -132223386 -124040185 -101290727 -55044701 3007071 47992328 68256435 60798767
29895 60798767 22010190 -29576832 -47965498 -13230712 31126940 31881773 -1355576
29888 -1355576 -16854057 -119616 9325281 -22953576 -84804654 -135643158 -140790618
29881 -140790618 -89764119 -2812675 79533350 124424758 120481590 66758786 -25038446
29874 -25038446 -110958271 -135988163 -97195483 -52191605 -41829353 -43568989 -29615044
29867 -29615044 -22095438 -43475855 -57419249 -22160491 29802691 35653835 4928764
29860 4928764 3636790 44381467 68529733 43024231 2757374 -18460369 -32294590
29853c2294590j6947323K61490K3277612J5997829n161996l59354J1708046j4947165
29845a8465451n4027598l1166850M7258890Q2054390K5302933m4659362l7332231
29838c1035279K4577731N0970814J4024475l0273969l4433235j5851251j2150729
29831c4171443k1892978j6179709R046961K4080282J2932755J744852J7437312
29824g001968L7560527J9047819k8480206m5568590j1647486J8539596j307342
29817a8857650l2627262r112369N6761883Q3503216L3251128l8769253o1420939
29810A2728754l4359724j2793568k7399595m8306949l0862890K1094063N7506477
29803f2393432M9464330K7800084L0894098L9561452J1042435l5548746l4130664
$$ plain form
29853 -32294590 -49241913 -48980423 -25702811 -9704982 -14866978 -15226332 -3518286 -18465451
29845 -18465451 -72493049 -103659899 -56401009 25653381 50956314 6296952 -31035279
29838 -31035279 -6457548 44513266 58537741 28263772 -6169463 -22020714 -34171443
29831 -34171443 -56064421 -72244130 -63197169 -39116887 -26184132 -24439280 -7001968
29824 -7001968 30558559 49606378 21126172 -24442418 -36089904 -17550308 -18857650
29817 -18857650 -51484912 -60597281 -3835398 79667818 112918946 74149693 12728754
29810 12728754 -21630970 -34424538 -61824133 -110131082 -140993972 -119899909 -62393432
29803 -62393432 -12929102 14870982 45765080 85326532 96368967 60820221 26689557
29796B6689557J8674500M1918919q485666o6505054n6284699m576159J5156443
29789c3412159J311873M597481K2082027K402493n0091080o3174328m007871O9224569
29781e1066995Q4441397L4858853l3425711o9762822m6261193K0980676P1148248
29774A0912453N7507904O669412k0213745j5173563j9944234m3518813m8178815
29767g1939401k0713820R028838K9608681N8264125P5546977K8211856p1163846
29760C6843410j24275581p5386650O239780K9082721O012386R648947M7164756
29753f4670231O0211281K7806661q540508j9995738k2909157k6909516r876590
29746f4883798L2874283N9849873L5730282j3127585k7223554R542697M6509050
$$ plain form
29796 26689557 45364057 87282976 78797310 12292256 -43992443 -48568602 -33412159
29789 -33412159 -32100286 -27502805 -5420778 -3018285 -53109365 -116283693 -120291564 -51066995
29781 -51066995 33374402 68233255 34807544 -34955278 -81216471 -60235795 10912453
29774 10912453 68420357 75089769 54876024 39702461 19758227 -23760586 -71939401
29767 -71939401 -92653221 -83624383 -54015702 4248423 79795400 108007256 36843410
29760 36843410 -87432171 -162818821 -156579041 -127496320 -121483934 -111834987 -64670231
29753 -64670231 -4458950 23347711 14807203 -5188535 -28097692 -55007208 -64883798
29746 -64883798 -32009515 27840358 63570640 50443055 23219501 32762198 79271248
29739G9271248K6319366m3601041r4089591p1404429K543039N9467416O1444196
29732A9950204K6523525j2297607l9405885m4766141j7149766L1450020O0187095
29725B4491445M0690381r234700m6745891m6049220j2685345K5781861L6372902
29718A2621433R038115k4121767k0474129J6344971L8833518K2403374m141408
29711E0504107r598167n656449j6834308l6724370m4518420m1025752l7387471
29704a41240830k6970550Q79611L2987884M6404706M0505964L2038450K7968245
29697A2573480K3321952J6101498P521515j435955j425398J9273604M5766583
29690A21697279L6748792k3655071r2632113j11450681o9122996n187808L6391161
$$ plain form
29739 79271248 105590614 61989573 -32100018 -103504447 -100961408 -41493992 19950204
29732 19950204 46473729 34176122 -5229763 -49995904 -67145670 -35695650 24491445
29725 24491445 65181826 55947126 9201235 -36847985 -49533330 -23751469 12621433
29718 12621433 21659548 -2462219 -22936348 -6591377 32242141 54645515 50504107
29711 50504107 40905940 35249491 18415183 -18309187 -62827607 -103853359 -141240830
29704 -141240830 -168211380 -167331769 -134343885 -87939179 -47433215 -15394765 12573480
29697 12573480 35895432 51996930 59518445 58082490 56657092 75930696 121697279
29690 121697279 158446071 134791000 42158887 -69291794 -138414790 -143602598 -107211437
29683a07211437L9516848J8848875O695758K1141616L7993151J9623466k0088318
29676A6519959j9989575L7158413Q2460069M9227428l2808800p9680468o2991594
29669a0104568k5704195n835109O53069M688953Q31846j4030076l1843526m5553247
29661a26896853m6418485j9334219L1077728O4982492N2911321K2242814J8974682
29654b460520L7431376L4166057K397923j9387439j3432144n573734j2572136
29647B0569383j4124857M576150K1226496J0292840j7262186k8269937q081151
29640a1073262K2128633K2256000k4629691p6389846o2290268K3397854Q8297031
29633a8303549N0451573m3081031p0900495l030342O2851821M6177926r038235
$$ plain form
29683 -107211437 -67694589 -48845714 -42149956 -21008340 16984811 36608277 16519959
29676 16519959 -3469616 33688797 116148866 165376294 132567494 52887026 -10104568
29669 -10104568 -35808763 -41643872 -40990803 -36301850 -35470004 -49500080 -81343606 -126896853
29661 -126896853 -173315338 -192649557 -161571829 -96589337 -43678016 -21435202 -2460520
29654 -2460520 34970856 69136913 71534836 52147397 38715253 33141519 20569383
29647 20569383 6444526 11020676 32247172 42540012 25277826 -2992111 -11073262
29640 -11073262 11055371 33311371 8681680 -67708166 -129998434 -106600580 -18303549
29633 -18303549 32148024 -10933007 -81833502 -84863844 -22012023 24165903 15127668
29626A5127668j2448058M0743962P0753757K3481995o3933337j06129670n9896919
29619i2300602K6150155N5157842q429342q5892193p5797508J3678745P7548158
29612h9884745N8011403Q365919n567769L774523l352409j3460596P247351L7648609
29604B782286K5687013k8152644o7624848n6577253j3914398K4900946M3677145
29597f9221753M2756893L1127809K2292141J6805356m237928m6994196p8473280
29590h5944958o0444004k756539M4034388M6030675J4738735j5071770j5570898
29583g4984371J7264941N4674111N2464648J923538m5840277l5000977K1048678
29576h449709N2524461K1646812l3312696n3147531l0201202n340158o990676
$$ plain form
29626 15127668 2679610 43423572 114177329 137659324 73725987 -32403683 -92300602
29619 -92300602 -66150447 -10992605 -19421947 -105314140 -181111648 -167432903 -89884745
29612 -89884745 -31873342 -23507423 -29075192 -25300669 -28653078 -42113674 -34866323 2782286
29604 2782286 28469299 316655 -67308193 -123885446 -137799844 -112898898 -69221753
29597 -69221753 -26464860 4662949 26955090 43760446 39522518 -7471678 -85944958
29590 -85944958 -146388962 -149145501 -105111113 -59080438 -44341703 -59413473 -74984371
29583 -74984371 -57719430 -3045319 49419329 51342867 5502590 -29498387 -8449709
29576 -8449709 44074752 65721564 32408868 -20738663 -50939865 -56280023 -63270699
29569f3270699j8585167j1111314J0217000J2170467j3800472k9599662o26274
29562a14606121M8950420O2534073K7383134j1684639j9449748j2393590j7812228
29555c7078699k7317987j7845171P599280K8614734L7787925L7733004K5919745
29548E5412831O342250j387252J1263757K2747069J2371643q053322j8377181
29541H0319795k6021648m7193145o7966518n8312213j8255121J9056494K7759481
29534i0612875J1766570p980391j2904983k598630j369319k9641872n9084250
29527a92425750l0950706N7255427J23154372R8161029K1868150j2759228J6146557
29520H0449851M7633169L6959474M299985j7116223k5296314k9553039k9822565
$$ plain form
29569 -63270699 -81855866 -92967180 -82750180 -70579713 -84380185 -113979847 -114606121
29562 -114606121 -65655701 -3121628 24261506 12576867 -6872881 -19266471 -37078699
29555 -37078699 -64396686 -82241857 -74642577 -46027843 -8239918 29493086 55412831
29548 55412831 61755081 60367829 71631586 94378655 106750298 98696976 80319795
29541 80319795 54298147 7105002 -60861516 -119173729 -137428850 -118372356 -90612875
29534 -90612875 -78846305 -86826696 -99731679 -102330309 -103699628 -133341500 -192425750
29527 -192425750 -223376456 -166121029 -42966657 55194372 77062522 64303294 80449851
29520 80449851 128083020 165042494 169342479 152226256 126929942 97376903 67554338
29513F7554338k8350860k9077804k1719404J058639J5256983m952625l4472093
29506c4702826k3945722J9364955L2903542o808404m6169155l3738601J1162752
29499h1933459L8206379L3567825J5734745l121468j8687367k0929567o826848
29492d3989760J0494818K2760428L4904124L8640017Q068648n5407995j00704530
29485h5234250p9391604o581227N3613069N5772102J2666177k5674677k5686654
29478a00517064p175825j7286911n6746881o0589376J0476231Q9500844P9811928
29471f2527054j489335l9989350P458750N3535516K4794621k7584017k4484209
29464g0285078J3290731J8143229k282624P589653L7804549K6257763k7439621
$$ plain form
29513 67554338 39203478 10125674 -11593730 -10535091 4721892 -230733 -34702826
29506 -34702826 -58648548 -39283593 -6380051 -13188455 -59357610 -93096211 -81933459
29499 -81933459 -43727080 -10159255 5575490 2454022 -16233345 -37162912 -43989760
29492 -43989760 -33494942 -10734514 24169610 62809627 70878275 15470280 -85234250
29485 -85234250 -164625854 -171207081 -117594012 -61821910 -49155733 -74830410 -100517064
29478 -100517064 -107692889 -124979800 -181726681 -242316057 -231839826 -142338982 -62527054
29471 -62527054 -64016389 -104005739 -96546989 -43011473 -18216852 -45800869 -70285078
29464 -70285078 -56994347 -38851118 -41133742 -33544089 4260460 30518223 3078602
29457C078602n4670362k7477977P656874J6929940K3084764M2731905N0052337
29450F1386083L0272951R076232M52847j8593230n1004406n3800306r097566K9693166
29442a614229J2296854k7929987k4516033J8750624L7760326J1413143r185605
29435A6975093J2668815L8585770J4338173m4385240o8640068k9186253K6399353
29428c3244357L7463684M88181m2302312o0289210n3104802k8303236M399556
29421a74892496K2609862J2560409M46540K0725382N0827901L2397789k6602363
29414f1926976l7555073L9965578J19135988J01186814J8408955k1579569R60919
29407A58596636J0524427j9113534k3226883K8162666O3794498K0839849n5970129
$$ plain form
29457 3078602 -51591760 -79069737 -71412863 -54482923 -31398159 11333746 61386083
29450 61386083 91659034 100735266 101188113 82594883 31590477 -22209829 -31307395 -1614229
29442 -1614229 10682625 -17247362 -41763395 -23012771 14747555 26160698 16975093
29435 16975093 29643908 68229678 82567851 38182611 -30457457 -59643710 -33244357
29428 -33244357 4219327 4707508 -37594804 -97884014 -150988816 -179292052 -174892496
29421 -174892496 -152282634 -139722225 -139275685 -118550303 -67722402 -35324613 -61926976
29414 -61926976 -99482049 -59516471 59619517 160806331 179215286 157635717 158596636
29407 158596636 169121063 150007529 126780646 154943312 218737810 239577659 183607530
29400A83607530q4399731n6924168k3592517p185055N103469J6849477K3213253
29393E6672258L2684528M3053328K2731818l7920581q4685823o1167859Q730720
29386a9901611N2258252M4239297J8805091K15138j8065636k9894397j2898962
29379C4757172K2830050L4190753O843237k5735254l7463876m1935225n3162480
29372e9675623n2941555k0715005L0446326O6808146O4789179K1819989l9583635
29365A0947822p3993527m9906798N796216K9934938N27836l8187577m0437490
29358a55318580j4921639K991397L575536J651152O658014J8084659L1964925
29351a05314536L3128853M005904l8725040m4403541N719924N8796502N3642134
$$ plain form
29400 183607530 99207799 42283631 18691114 11506059 16609528 33459005 56672258
29393 56672258 89356786 132410114 155141932 117221351 32535528 -28632331 -19901611
29386 -19901611 32356641 76595938 95401029 95616167 77550531 47656134 34757172
29379 34757172 57587222 91777975 98621212 72885958 35422082 -6513143 -59675623
29372 -59675623 -112617178 -133332183 -102885857 -36077711 28711468 50531457 10947822
29365 10947822 -63045705 -112952503 -107156287 -77221349 -76693513 -114881090 -155318580
29358 -155318580 -170240219 -167248822 -163673286 -162022134 -155364120 -137279461 -105314536
29351 -105314536 -72185683 -68179779 -106904819 -151308360 -145588436 -86791934 -33149800
29344c3149800L847004k5572791j2506710J616958j1668907k2727078L02426K8618742
29336g1240156N536377o9232657j23162167q8992992J6525792J05965959J12246060
29329a12353784N4909154O707058L985938J5098549K926234j4588142K904397
29322d0410596M5105332N5862743J3391744l6951428m7567905k9523642j8558956
29315e8652708r221214L0922918Q8661437R7588640K4347491p1856375j01014883
29308G75306m9505302J1411203K4104529J0619442J9127794M0584741K6134782
29301H3252495k3216022m1754177N409130N9246222M2143685l1482313p2984616
29294B0614404m0514308J2838623K4239888M143435K880736K9473850M5252391
$$ plain form
29344 -33149800 -29302796 -54875587 -67382297 -65765339 -77434246 -100161324 -99858898 -71240156
29336 -71240156 -65703779 -134936436 -258098603 -347091595 -330565803 -224599844 -112353784
29329 -112353784 -57444630 -50737572 -46751634 -31653085 -28726851 -43314993 -40410596
29322 -40410596 4694736 60557479 73949223 36997795 -10570110 -40093752 -58652708
29315 -58652708 -67873922 -36951004 51710433 149299073 173646564 101790189 775306
29308 775306 -48729996 -37318793 -13214264 -2594822 16532972 57117713 83252495
29301 83252495 60036473 18282296 23691426 82937648 125081333 93599020 20614404
29294 20614404 -19899904 -7061281 17178607 21322042 24202778 53676628 98929019
29287I8929019K3653662k0621385n8676506p3825149o0115886k0737630K4696566
29280h6697309M8477127L8169743M794763k9214459m0580382j3802059M0261014
29273c8591562P8679547O3219374O173841m0124983m2942172j9193673l199516
29266D020856p190184k1899621l4496763l2855198q946383K8426552N5961084
29259a6979657N9023983M0342344N116705l8923801o3405921l7256070J9403430
29252c2678987L6744942j7045753q1167391p7410735j4515296L4437727M0871483
29245a10764010M1434206N0603242K8335147l5163494o9455391j6056560P0445716
29238d0621144Q1487652J518506o9835488n2761150J2612069L3069316r637910
$$ plain form
29287 98929019 122582681 101961296 43284790 -30540359 -90656245 -111393875 -86697309
29280 -86697309 -38220182 -50439 4744324 -24470135 -65050517 -78852576 -38591562
29273 -38591562 40087985 103307359 109481200 69356217 26414045 7220372 4020856
29266 4020856 -3169328 -25068949 -59565712 -92420910 -101367293 -72940741 -16979657
29259 -16979657 42044326 82386670 87503375 48579574 -14826347 -52082417 -32678987
29252 -32678987 4065955 -12979798 -94147189 -171557924 -186073220 -151635493 -110764010
29245 -110764010 -69329804 -18726562 9608585 -25554909 -95010300 -111066860 -40621144
29238 -40621144 40866508 42385014 -27450474 -80211624 -67599555 -34530239 -44168149
29231d4168149m6158990k5347767J7223393J8706903j5749511k1005785K8213220
29224h8286686P3323937N3423760n771599l0212923n814841R294430j6487308
29217a0531230l8760049j3212006L1962997M4574457L0662127L2460905M6442312
29210A23599513K5351072l9606067r5470511r8971007o4081384k0469560L0006184
29203a39641760Q4307495J02725371M9400501m3091769r3171244o2904109j359327
29196a03734842K1373721J877413m248717K7528035M8839348J3196232l8482519
29189c3651329k3366578N3540099Q3704608M881475r3904819q4945678J7588120
29182g6154102P7027583K8151661m1862560l4070164K5927156N0195212K4396210
$$ plain form
29231 -44168149 -90327139 -115674906 -98451513 -79744610 -95494121 -116499906 -88286686
29224 -88286686 -14962749 38461011 32689412 2476489 -3338352 5956078 -10531230
29217 -10531230 -49291279 -62503285 -30540288 14034169 44696296 77157201 123599513
29210 123599513 148950585 109344518 13874007 -85097000 -149178384 -169647944 -139641760
29203 -139641760 -55334265 47391106 96791607 53699838 -39471406 -102375515 -103734842
29196 -103734842 -82361121 -80483708 -84732425 -57204390 -8365042 4831190 -33651329
29189 -33651329 -57017907 -3477808 80226800 85108275 -8796544 -93742222 -76154102
29182 -76154102 873481 29025142 -12837418 -46907582 -20980426 29214786 53610996
29175E3610996M902456J2104787O693679k9043323n4286021l3306734J1152369
29168b8171791L3111089K1440657j005455j6001288k3747451k6489755j8759116
29161e9623110J831808K2681148K3511449r12928l0250495l9622407k8490413
29154a10874948j5885885r380196J577061J9590955L0907313L0482881K9354897
29147b4227922K6034688R73371m2215509o2632413l7340843j603446J084958j5502724
29139a55429840n417596L7140826P3642931P7117897N0361844L38802n9174130
29132A8580734q7783297n3562564J0662819L6294555J0204806j2467180M167579
29125g3902548K9373680K5115055L163062n134512M213830J9939995L9087674
$$ plain form
29175 53610996 58513452 70618239 77311918 48268595 -6017426 -39324160 -28171791
29168 -28171791 4939298 26379955 25374500 9373212 -14374239 -40863994 -59623110
29161 -59623110 -57791302 -35110154 -11598705 -12511633 -42762128 -82384535 -110874948
29154 -110874948 -126760833 -136141029 -134563968 -114973013 -84065700 -53582819 -24227922
29147 -24227922 1806766 2780137 -39435372 -102067785 -139408628 -141012074 -139927116 -155429840
29139 -155429840 -160847436 -123706610 -50063679 27054218 77416062 77754864 18580734
29132 18580734 -69202563 -122765127 -112102308 -75807753 -65602947 -78070127 -73902548
29125 -73902548 -44528868 -19413813 -16250751 -21385263 -17171433 2768562 41856236
29118D1856236M9706541K3904697l8437312q6137137p1683886j2097839L3859958
29111e9028742L4863772R718561o197136K650578K0699909J8448192p764702k0383824
29103f993392O186069K9627648r352275q0963746q3892568Q089157R3795849Q3931007
29095D0427749K0038442q421142J386222l212654j7787773J731326L8777231L5038723
29087A07978124j423117o196183K1502391Q664419o2193793j07491880o4086384
29080a03246423K0018674N9084591L3182754j9070010n6049738m7326641J3801068
29073i9605725P8822614P7659749J3642957l2568621k2763996j3391245m5136931
29066d3341198o1103223o676819N8452895M2536235k8731374m7698016R809329
$$ plain form
29118 41856236 91562777 115467474 77030162 -9106975 -80790861 -92888700 -59028742
29111 -59028742 -24164970 -14446409 -20643545 -17992967 2706942 21155134 13390432 -6993392
29103 -6993392 -807323 28820325 19468050 -61495696 -145388264 -137299107 -43503258 40427749
29095 40427749 60466191 52045049 53431271 50218617 32430844 34162170 72939401 107978124
29087 107978124 106555007 100358824 121861215 130525634 68331841 -39160039 -103246423
29080 -103246423 -83227749 -24143158 9039596 -10030414 -66080152 -113406793 -99605725
29073 -99605725 -20783111 56876638 70519595 37950974 15186978 1795733 -43341198
29066 -43341198 -104444421 -111121240 -52668345 -10132110 -38863484 -86561500 -76752171
29059g6752171N6214363L2577162j6511355l0819897j6942015o488213M681794
29052e4040332L0151689M8822023L2217762p524525l1894210k4778602l405543
29045a0451738Q212716o4039k0218622l0517904j3630372K2047738M7872590M4401247
29037D7651616J6103113j9317807m0689554k8378564J6327428N6396510M9548883
29030I7641625P49846l8174334l0724846L176299K1041495J4294366J0294317
29023G8298768K4292691L1665337J463609m9104713n7929541M947635P9561445
29016A13195231P4112793j6384180r5013618q6262984k6635034M892789o71295
29009c2766298J070517J4619671O648291j1756212Q416480N4099652M3001117
$$ plain form
29059 -76752171 -20537808 12039354 -4472001 -35291898 -52233913 -58722126 -54040332
29052 -54040332 -23888643 24933380 57151142 49626617 17732407 -7046195 -10451738
29045 -10451738 -2239022 -2303061 -22521683 -53039587 -66669959 -44622221 3250369 47651616
29037 47651616 63754729 44436922 3747368 -24631196 -8303768 48092742 97641625
29030 97641625 98391471 60217137 29492291 32668590 53710085 68004451 78298768
29023 78298768 102591459 134256796 135720405 86615692 28686151 33633786 113195231
29016 113195231 187308024 170923844 75910226 -10352758 -36987792 -32095003 -32766298
29009 -32766298 -31695781 -17076110 -10427819 -22184031 -13767551 40332101 83333218
29002H3333218m6795827j16040850p2874064L1802624O9666138Q275239n4484709
28995i7118231k9552867N1734499Q8703223L7291959m5403541p2645513k3122673
28988i0113144M2287541N3322322P093014l7451800l1342967J7328906O2898598
28981B4022470O5518251J8046894m3158826n6542203P79760O5815373N0815334
28974A25297053l6097078q3024240j8405203Q4123780R5160879n403658j08982526
28967E2669007j13805078k8389620O3106828R4471030O2127531P678045k3905382
28960A13952361k0451017p308026j2869157l3398322m0735857j8213026K2325235
28953C302191N3051731N0711660J4734878k5412765l3897710j0793569M637812
$$ plain form
29002 83333218 36537391 -79503459 -152377523 -120574899 -50908761 -42633522 -97118231
28995 -97118231 -126671098 -74936599 13766624 51058583 5655042 -66990471 -90113144
28988 -90113144 -47825603 5496719 12589733 -24862067 -56205034 -38876128 24022470
28981 24022470 89540721 107587615 64428789 7886586 8666346 74481719 125297053
28974 125297053 89199975 6175735 -12229468 71894312 167055191 161651533 52669007
28967 52669007 -61136071 -89525691 -26418863 68052167 130179698 137857743 113952361
28960 113952361 93501344 86193318 73324161 39925839 -810018 -19023044 3302191
28953 3302191 56353922 107065582 121800460 96387695 62489985 51696416 56334228
28946E6334228j3910783m2881179m2872948j2695785J3627097J2723078o428633
28939c6104925j9076192p724867K1885766L8098471J3509904l3114536n0284048
28932g2810427k1456903J3552399K2684060K5232693M1101699M3505511J1141363
28925F2950395j4115463J3571886N6290161L8619031l1792379o8077701l1213915
28918B6232015K2134586L4058416J7476090P470206K154204j3146500l0471629
28911F5907388m1066857n3921982o6359340n4813699j8468922Q392512J0662698
28904a49668202J5349229L5445138L9900463J3111962m944146J7897114M5849887
28897A2941445L0182178r848306j7002286J5899723M2396904L3241452J868907
$$ plain form
28946 56334228 42423445 -457734 -43330682 -56026467 -42399370 -29676292 -36104925
28939 -36104925 -55181117 -62905984 -41020218 -2921747 10588157 -22526379 -72810427
28932 -72810427 -94267330 -80714931 -58030871 -32798178 8303521 51809032 62950395
28925 62950395 48834932 62406818 118696979 157316010 125523631 57445930 26232015
28918 26232015 48366601 82425017 99901107 107371313 109525517 96379017 65907388
28911 65907388 24840531 -29081451 -95440791 -150254490 -168723412 -160330900 -149668202
28904 -149668202 -134318973 -98873835 -58973372 -45861410 -50805556 -32908442 12941445
28897 12941445 43123623 33275317 16273031 32172754 74569658 107811110 109680017
28890A09680017l1736581n8024981o4399264m3531364j0584307J7983495M8888047
28883c1724938Q2956021Q4257775K5290083n1835800p2787290k6966232K2707172
28876C1896791K6623239k431221l0118293m0865512k7050444J3841492N2788248
28869B4684300M2730438j6906325o3535718m5999361J0231329L8692459J4197413
28862D094535k5277976k9948520O277108M0775296K9921078j5598551l6364645
28855b6121675j738589L8592400J8039246m4737929o1084299L539730P7093230
28848C582114P8169457J7799429l2301925l5675525j2439001R575464J9989894
28841D8699907J4406537l465951j2846820J790038K4980854L0504145J7068674
$$ plain form
28890 109680017 77943436 19918455 -44480809 -88012173 -98596480 -80612985 -31724938
28883 -31724938 51231083 135488858 160778941 108943141 36155851 9189619 31896791
28876 31896791 58520030 56088809 25970516 -14894996 -41945440 -28103948 24684300
28869 24684300 67414738 50508413 -13027305 -59026666 -48795337 -10102878 4094535
28862 4094535 -21183441 -51131961 -44854853 -4079557 25841521 10242970 -26121675
28855 -26121675 -27860264 10732136 28771382 -15966547 -77050846 -73511116 3582114
28848 3582114 81751571 99551000 67249075 31573550 19134549 28710013 48699907
28841 48699907 63106444 59640493 46793673 48583711 73564565 104068710 121137384
28834A21137384j62194j9025604m1209960m7119559j7082883K7410356M0594972
28827F4542512J1821354k4487068l8994768l3787464j7337205P356610K1175790
28820i710239k366695m8091095n9106730j4092338L1722531K1620253j6033628
28813i6057941p932947N0752941Q2218733L6160643l8329831o2255058l1911536
28806f7354996j0523182k8932799m2852067k677983O8359768R7428228N4278188
28799F7725157j0672052l0295989q82172K3357220N730609l1638764m7056035
28792b3732026l2893370j2701750m046449o550989j4030100j5556931L813964
28785a05697651L8344175N2032783K6777250L940583K9506280O8887389M4819120
$$ plain form
28834 121137384 120975190 101949586 60739626 13620067 -3462816 23947540 64542512
28827 64542512 76363866 51876798 12882030 -20905434 -38242639 -30886029 -9710239
28820 -9710239 -12076934 -60168029 -119274759 -133367097 -101644566 -80024313 -96057941
28813 -96057941 -103990888 -53237947 28980786 65141429 26811598 -35443460 -67354996
28806 -67354996 -77878178 -106810977 -149663044 -152341027 -83981259 13446969 67725157
28799 67725157 57053105 26757116 25874944 49232164 54962773 23324009 -23732026
28792 -23732026 -56625396 -69327146 -73373595 -79924584 -93954684 -109511615 -105697651
28785 -105697651 -67353476 -15320693 11456557 15397140 44903420 113790809 158609929
28778A58609929l3770983o6916734k3114042q083215r6521502j81328851j13881794
28771c65007192N6095235J32129379N6598064j7848696J6614165O0691415j837083
28764f2564713r2044321o1591000N8911119J05016357L3725742l1862589j3794026
28757f4203431K2020302J2518553M04424K6929295M0743670m566960n5011473
28750b1165620m5218971p790084m199465j1150391K5050480P0080602M6764188
28743E2370739k6789593n3064777o235380L3622872J1124016l1130002l7251403
28736e7353528j6604583j065201R198153J5982693l271410m6061039n7061443
28729a56236358l22678P6318707R8811599O2659467K3383473J1687785Q157186
$$ plain form
28778 158609929 124838946 57922212 34808170 26724955 -69796547 -251125398 -365007192
28771 -365007192 -308911957 -176782578 -120184514 -138033210 -121419045 -60727630 -62564713
28764 -62564713 -154609034 -216200034 -157288915 -52272558 -18546816 -50409405 -64203431
28757 -64203431 -42183129 -29664576 -29260152 -2330857 38412813 33845853 -21165620
28750 -21165620 -66384591 -74174675 -78374140 -89524531 -64474051 5606551 52370739
28743 52370739 25581146 -27483631 -33719011 -96139 11027877 -20102125 -57353528
28736 -57353528 -73958111 -75023312 -65825159 -49842466 -53113876 -99174915 -156236358
28729 -156236358 -156559036 -80240329 18571270 81230737 104614210 116301995 124459181
28722A24459181o353861k2620732k9232362l0650527l0610998k2494179l612715
28715b1116193J7214309K8682948K2598811k876272l1627207l3395747r64315
28708b1483666K6977022Q402603m0611761n7773398j2989688N1543880P0315774
28701B4380766K5076450m2396748p2939211l9000202L3306302Q2809378O6125500
28694G7362235k34860n7296757o3319895k6991578J3198674K5085144J720097
28687c0476940l3863650m2671159j1248858K1730531Q784038l6060956m8318567
28680a72125561m082208M4082172M5575880K1406274J6749205K3519023N408088
28673a9467127k4834938j8436275K3729679M2534141J0324170k6731416k0039094
$$ plain form
28722 124459181 118105320 95484588 66252226 35601699 4990701 -17503478 -21116193
28715 -21116193 -3901884 24781064 47379875 44503603 12876396 -20519351 -21483666
28708 -21483666 5493356 13895959 -26715802 -84489200 -97478888 -45935008 24380766
28701 24380766 49457216 7060468 -65878743 -104878945 -71572643 11236735 77362235
28694 77362235 77127375 19830618 -43489277 -70480855 -57282181 -32197037 -30476940
28687 -30476940 -64340590 -107011749 -118260607 -96530076 -87746038 -123806994 -172125561
28680 -172125561 -176207769 -132125597 -86549717 -65143443 -48394238 -24875215 -19467127
28673 -19467127 -44302065 -62738340 -39008661 3525480 13849650 -12881766 -32920860
28666c2920860J3575364K6445456Q163613j3601587j6740531k87719K5404568
28659A0038304L9682337K0081937k7099942o0723374n1248790j7917496J586191
28652h5600833K037667O710589K5569686M3666446M5834667L2553659J3537526
28645H4309407k154417j2970734k4590709l3148635j7007513K7279806N0787549
28638G2504754N008546o8092194o8565848J2863987N9368794j998754p5936117
28631f4846832l8127159O4422083P8660797j5948439p6271834j9499141N9107435
28624a2503090M8237856j6410164l4676831j065416J4950339o373605k2697260
28617c0538171j2635157O450692K3428630L2004868Q505454m5526068o6033567
$$ plain form
28666 -32920860 -19345496 7099960 15263573 1661986 -15078545 -15366264 10038304
28659 10038304 49720641 69802578 42702636 -18020738 -69269528 -87187024 -85600833
28652 -85600833 -83563166 -76852577 -51282891 -7616445 38218222 70771881 84309407
28645 84309407 82154990 69184256 44593547 11444912 -5562601 21717205 72504754
28638 72504754 77513300 9421106 -59144742 -46280755 13088039 11089285 -64846832
28631 -64846832 -102973991 -38551908 40108889 24160450 -52111384 -71610525 -12503090
28624 -12503090 35734766 19324602 -15352229 -16417645 -1467306 -7840911 -30538171
28617 -30538171 -43173328 -36722636 -13294006 18710862 27216316 -18309752 -84343319
28610h4343319m610174P7111984P3200011j3620058p0865122l8139435J5982389
28603d5283724J0769139k9500186k9869817J5879978M5913005K9749445O643788
28596D301628J7475909M0591784K2452434m0975827q3419009m5074450M5117958
28589c9529573R5858909O4098230J412274k5562195j7119211r622329o713939
28582F2822166M819368M255595k9631284n4393743j1731201O4260957P1993751
28575A12395609p919345p2644938m3352171K6604754M4064773R629325j1970142
28568E6807865n772103q518039k2436773j1363179J8835074J2898247m2887875
28561b436783q5257925o0387465m5698K5730437L581349j4150589J4129682O4997671
$$ plain form
28610 -84343319 -88953493 -11841509 61358502 47738444 -23126678 -61266113 -45283724
28603 -45283724 -34514585 -64014771 -93884588 -78004610 -32091605 -2342160 4301628
28596 4301628 21777537 62369321 84821755 43845928 -39573081 -84647531 -39529573
28589 -39529573 56329336 120427566 121839840 96277645 79158434 69536105 62822166
28582 62822166 67641534 71897129 42265845 -12127898 -23859099 40401858 112395609
28575 112395609 104476264 31831326 -11520845 15083909 59148682 68778007 56807865
28568 56807865 51035762 42517723 20080950 8717771 27552845 40451092 -2436783
28561 -2436783 -87694708 -148082173 -148127871 -122397434 -118816085 -132966674 -118836992 -53839321
28553e3839321P8997040L1203124l6024634n5416518j1240704L8379845K9829623
28546B1888455k5762744n7153384k6987114K2787262L4613859J2380990L087780
28539a5144896K1627811L6177975K6096517J0688059O871776j583629k5620544
28532E9113069l6262948q816047K2656052O530591m0861792m8933662K359680
28525d4215057N1215929M7856114K0276078J0812956M679512k3891125m2206982
28518B4527425p588744M3796878L5702563l0205140p2985402n2531360j3931295
28511g3215075L264109K0909776N3851787N9426393R352700m3326215l2277531
28504b014056K2448128M4360766Q691107l7388925n1622402l9331411k0148808
$$ plain form
28553 -53839321 25157719 56360843 20336209 -35080309 -46321013 -7941168 21888455
28546 21888455 -3874289 -61027673 -88014787 -65227525 -30613666 -18232676 -15144896
28539 -15144896 6482915 42660890 68757407 79445466 86317242 84733613 59113069
28532 59113069 22850121 14034074 36690126 43220717 2358925 -46574737 -44215057
28525 -44215057 7000872 54856986 75133064 85946020 90625532 66734407 24527425
28518 24527425 16938681 60735559 96438122 66232982 -6752420 -59283780 -73215075
28511 -73215075 -69950966 -49041190 4810597 64236990 73589690 30263475 -2014056
28504 -2014056 20434072 64794838 73485945 36097020 -15525382 -54856793 -75005601
28497g5005601n82168J2003476O731286p435846n326315J5811315K6435079O925056
28489b0443718k1204566k4449662n597399j824814l3320438p1242068p1163013
28482b49245678l1173093N710891J2000640J1467930L4628158O4799493O4219123
28475h7592536L6861867K0607335K3694737J7718482m434800j4664801k871298
28468a0681014O556109M348435R698662J8929405J553043k9173719j1338890O0548915
28460E0440946R7854520M4539376k5669005j8085157L2276228J7921819o4651541
28453A34627186j05327857m8641681K8785402L5490337j9550714o5085834o1651692
28446a01354853k0940756K5366658M4713469K3618706r749564j0824583K1248776
$$ plain form
28497 -75005601 -75587769 -63584293 -56853007 -64288853 -69615168 -53803853 -27368774 -20443718
28489 -20443718 -41648284 -66097946 -71695345 -73520159 -106840597 -178082665 -249245678
28482 -249245678 -280418771 -274707880 -262707240 -251239310 -216611152 -151811659 -87592536
28475 -87592536 -50730669 -30123334 -6428597 11289885 6855085 -7809716 -10681014
28468 -10681014 -4124905 223530 9922192 28851597 30404640 1230921 -10107969 50440946
28460 50440946 148295466 192834842 167165837 149080680 181356908 199278727 134627186
28453 134627186 29299329 -19342352 9443050 44933387 25382673 -39703161 -101354853
28446 -101354853 -122295609 -96928951 -52215482 -28596776 -38346340 -49170923 -27922147
28439b7922147L9453413J3901864l1871508n8197485n0647403j8259468J6625680
28432a16917054K3973934l392373k5822810l494670L7436971L5984084p801308
28425f0033226k9700007k878851K5011465J7886170N123958J3485198J1517128
28418a9588165k6005717n3253438j6958704N1771481P4283216L2703888j7228987
28411B5723574l0696791j8099386p492329q112150j5397949j9303340n926203
28404g9304574K3332749L8557742J4174737k9007224m1881444p315453M0013736
28397d1429731N5147645K7049757j8798272m8695741n0603608l9836392l0745635
28390a47911977r694514M0517859R1216012Q2594746O238903o4191161n7105181
$$ plain form
28439 -27922147 11531266 25433130 -6438378 -64635863 -115283266 -133542734 -116917054
28432 -116917054 -92943120 -96335493 -122158303 -125652973 -88216002 -52231918 -60033226
28425 -60033226 -89733233 -92612084 -67600619 -49714449 -44590491 -31105293 -19588165
28418 -19588165 -45593882 -98847320 -115806024 -64034543 10248673 42952561 25723574
28411 25723574 -4973217 -23072603 -30564932 -38677082 -54075031 -73378371 -79304574
28404 -79304574 -55971825 -17414083 -3239346 -32246570 -74128014 -81443467 -41429731
28397 -41429731 13717914 40767671 21969399 -26726342 -77329950 -117166342 -147911977
28390 -147911977 -157606491 -117088632 -25872620 56722126 62961029 -1230132 -58335313
28383e8335313Q044938N1300143L4130112n505818j2638668K1074066N4559887
28376I2629347M2461956j3898919n7652893l7041563K2725495M2466192n424333
28369H6265282n9826541o3252629l8483713k9709392j9800959K6405521P3518111
28362b4884320N3777033j7999264n1080054r509975L9074994K8308653j8440078
28355g53011l8354792j6799952J3378990K3961333R530637j8254252k9160733
28348e6451780L397044N5366883O1251238l9485o1639499m9822842J6419346N1553702
28340B0034607J6263220m1341206n7546410k5721989J4812228L2461120K6035815
28333a5002615R170802p768026k0172690k3635954j2428287J3716311M2845070
$$ plain form
28383 -58335313 -50290375 1009768 35139880 29634062 16995394 38069460 92629347
28376 92629347 135091303 121192384 63539491 26497928 49223423 91689615 86265282
28369 86265282 26438741 -36813888 -75297601 -105006993 -124807952 -98402431 -24884320
28362 -24884320 28892713 10893449 -40186605 -49696580 -10621586 17687067 -753011
28355 -753011 -39107803 -55907755 -42528765 -18567432 -9036795 -27291047 -56451780
28348 -56451780 -53054736 2312147 63563385 63523900 1884401 -47938441 -31519095 20034607
28340 20034607 36297827 -5043379 -62589789 -88311778 -73499550 -41038430 -15002615
28333 -15002615 -5831813 -13599839 -33772529 -57408483 -69836770 -56120459 -13275389
28326a3275389N6994817M7787765K2025973p535466k9390679l3146703j7356381
28319B6103937k248049j6856211n9200112q2726156m3963075L9292113R7506047
28312d2091506Q1526283J0892160n3882010p1333785m2888858N354528M3567438
28305f8855750M8110394J5932218k4618439l6311472j6351033j348507j7507500
28298a00950089m3310159m0574808q063752K1326084K8804188K6801611K9401408
28291h6565517L4239721L7848333M1860122L6535766M619996m6423158p8500569
28284e6385306o2593892q570953M9531999P7613164N1857567k0446252q2474992
28277e1468665p0412518O378127O5043919N1410088K153622k3341603k5964059
$$ plain form
28326 -13275389 43719428 91507193 113533166 105997700 76607021 43460318 26103937
28319 26103937 23855888 6999677 -52200435 -134926591 -178889666 -139597553 -42091506
28312 -42091506 39434777 50326937 -3555073 -74888858 -117777716 -112423188 -68855750
28305 -68855750 -20745356 -4813138 -29431577 -65743049 -82094082 -83442589 -100950089
28298 -100950089 -144260248 -184835056 -192898808 -171572724 -142768536 -115966925 -86565517
28291 -86565517 -52325796 -14477463 27382659 63918425 68538421 22115263 -56385306
28284 -56385306 -118979198 -127550151 -78018152 -404988 51452579 31006327 -51468665
28277 -51468665 -121881183 -115503056 -50459137 950951 3104573 -20237030 -46201089
28270d6201089l5580966l9324192o095181M0668284M4582380N810268j5790418
28263e1930914P369170L5757698L3791002J9226365J7570844J5960735n041766
28256G2703134l0121341l4117987k3346022k0472677k5373185j9695102j81624
28249h0604804J6942167K0640189J5998731J1158221N548000n576457j8152800
28242c4046753j5457999J3390235M8231304M8564637M710836l8296178l2473879
28235e377797R342172L1443824J0494619k1094884k8739262j9038518j8164556
28228d1134402l1642205m0231512k4272628J3220328M1239162K6796022k1232838
28221g7258073n0103655k6191699J8871827L4462646K2458958K1605596L7709585
$$ plain form
28270 -46201089 -81782055 -121106247 -127201428 -86533144 -41950764 -36140496 -51930914
28263 -51930914 -44561744 -8804046 24986956 44213321 61784165 77744900 72703134
28256 72703134 42581793 8463806 -14882216 -35354893 -60728078 -80423180 -80604804
28249 -80604804 -63662637 -43022448 -27023717 -15865496 -10317496 -15893953 -34046753
28242 -34046753 -49504752 -36114517 12116787 60681424 65392260 27096082 -5377797
28235 -5377797 3964375 35408199 45902818 24807934 -3931328 -22969846 -41134402
28228 -41134402 -72776607 -113008119 -137280747 -124060419 -82821257 -56025235 -77258073
28221 -77258073 -127361728 -153553427 -134681600 -100218954 -77759996 -56154400 -18444815
28214a8444815M0784631K3904969R868323N49894k2205032m1879546j8897199
28207b6318775K9444401L1462383k6869062o2115761j3112413O0212374O1010615
28200E3713762n373781m9072700k9954795q1501r911079l5995255k6651435J9273623
28192h4053161N0489479K8877669k3502205m8923285k1438533K2820313L4122280
28185d1607443J3629052J950258J1956631J4356532m745682j8025443p650422
28178c0136517J403381j2083280k2648863J883914M4356358N8972518L0723439
28171G2470950j5715497n0122553n4020466k2357333K5028769M8681859K9767911
28164C3733640p892268l0682884k9695991j0634000K0005546M1949819L0787592
$$ plain form
28214 -18444815 22339816 46244785 56113108 56663002 34457970 -7421576 -26318775
28207 -26318775 3125626 34588009 7718947 -54396814 -67509227 -7296853 53713762
28200 53713762 48339981 -732719 -30687514 -30769015 -40680094 -76675349 -103326784 -84053161
28192 -84053161 -33563682 -4686013 -28188218 -77111503 -98550036 -75729723 -41607443
28185 -41607443 -27978391 -26028133 -14071502 285030 -4460652 -22486095 -30136517
28178 -30136517 -28733136 -40816416 -63465279 -61581365 -17225007 41747511 72470950
28171 72470950 56755453 6632900 -47387566 -69744899 -44716130 3965729 33733640
28164 33733640 25841372 -4841512 -34537503 -45171503 -25165957 16783862 47571454
28157D7571454K458080O148565M3758935M5961139k5167708r6564838p3116110
28150d8950483K2942652P5116093K7318458n3734746p9537148m3534274q21441
28143a01200889J3159366J1611367K0061788L4955031K6723498j3838784m6666842
28136e5195465k9606907J0374208L462999n2905241p3846894j3169976N6924717
28129a53962559N2818717N255887m510402J5153781m306220m8243680k7345605
28122a65140081O0641282R8952524K7038684n5967836l5333868M8777731O5211059
28115D4179495j5368944q5716186n8048871K3278598N4102896P569024m4998911
28108g5002899l7290759J0541614L2768318J3795486J578593K6621528N5614696
$$ plain form
28157 47571454 50029534 56178099 99937034 145898173 120730465 24165627 -48950483
28150 -48950483 -26007831 49108262 76426720 22691974 -56845174 -100379448 -101200889
28143 -101200889 -88041523 -76430156 -56368368 -21413337 5310161 -8528623 -55195465
28136 -55195465 -84802372 -74428164 -70965165 -123870406 -197717300 -210887276 -153962559
28129 -153962559 -101143842 -95887955 -100398357 -85244576 -89550796 -137794476 -165140081
28122 -165140081 -104498799 -5546275 21492409 -34475427 -69809295 -21031564 44179495
28115 44179495 28810551 -56905635 -114954506 -91675908 -37573012 -30003988 -75002899
28108 -75002899 -112293658 -101752044 -68983726 -55188240 -53609647 -26988119 28626577
28101B8626577M7784691J3684992j8046283n1502179r0640237r1341582j5104047
28094a76538068Q5457813J08257490L3340831n0675970o2882656j5707489K9744696
28087d9003353L9406290J7078220j3689576j7975035K0230100O1030453M3954203
28080A01031302k4892559o6825493l3603829K6452159L4459806j9720657p4447228
28073e7546499p2570878j7536734L6966813M3671005J2692949l636864J4216404
28066d3743804K4585662n96787j7112488J7828165N4182607J6742966n8991097
28059g104776o1860760K2152814Q0322164M1788448k8140536m5562748k2801817
28052b1207211o952887R240967M2143809N3012762P506968n2169694o6471253
$$ plain form
28101 28626577 76411268 90096260 72049977 20547798 -70092439 -161434021 -176538068
28094 -176538068 -91080255 17177235 50518066 -157904 -63040560 -78748049 -49003353
28087 -49003353 -9597063 7481157 -6208419 -24183454 -3953354 57077099 101031302
28080 101031302 76138743 9313250 -24290579 2161580 36621386 16900729 -57546499
28073 -57546499 -130117377 -147654111 -110687298 -67016293 -54323344 -57960208 -43743804
28066 -43743804 -19158142 -19754929 -36867417 -19039252 35143355 51886321 -7104776
28059 -7104776 -68965536 -46812722 33509442 75297890 47157354 1594606 -21207211
28052 -21207211 -28160098 -18919131 23224678 76237440 83744408 31574714 -34896539
28045c4896539m5538238l0840829j5312296K6099600O3883262M8409003m937462
28038F866501l2201709q608754L3170147N4867183L7513410j9792168q0816540
28031i001930q3280494j7140469M2906603L4287380m244601p46762L3996853L4372786
28023C1149366n622654k8193641r180283J7305499K7938569L3707276L3373355
28016A00477487Q006262l2090994n0642114m1076473l0905692k9383901j6717558
28009i2332983J3853048M3481089N4493771L7847340r728862o1575671o3071780
28002g7034048l756462M4888424J9439235m1328532n7418905k7907588j0951106
27995a54068982j2571606J0987219N3154396N6894872J6666662j1508811q764740
$$ plain form
28045 -34896539 -80434777 -111275606 -126587902 -100488302 -36605040 11803963 6866501
28038 6866501 -25335208 -33943962 -773815 54093368 91606778 71814610 -9001930
28031 -9001930 -92282424 -109422893 -66516290 -32228910 -36473511 -37220273 -3223420 31149366
28023 31149366 25526712 -2666929 -11847212 5458287 33396856 67104132 100477487
28016 100477487 108483749 76392755 25750641 -15325832 -46231524 -75615425 -92332983
28009 -92332983 -78479935 -34998846 19494925 57342265 47613403 -13962268 -77034048
28002 -77034048 -80790510 -35902086 -16462851 -57791383 -115210288 -143117876 -154068982
27995 -154068982 -166640588 -155653369 -102498973 -45604101 -28937439 -40446250 -49210990
27988d9210990j1007361j8442371J4294172P5323372Q1837530P627060o4537254
27981C5884158o2925677j8444591J0740519K6187427M3762171L4581319j9567052
27974E0218274o6991760n0826715O226402L9677979L0264149K152707k8882295
27967a8161259n3169253m6046414j859052L6336050K8295506m172879j0793917
27960f9571218J6291343M3202431M4801373K0234437k1419235o0622794p1677298
27953i8760961n0436405j7201898J8278018N9879906Q6193163O1544502K806514
27946F2302839k6221992j1853966j1406930m3017144l8887543L3691677R0933549
27939E5540490N6716860p043086L78783M8184908K7467462n9281995r7785640
$$ plain form
27988 -49210990 -60218351 -78660722 -64366550 10956822 92794352 100421412 35884158
27981 35884158 -27041519 -45486110 -34745591 -8558164 35204007 69785326 50218274
27974 50218274 -16773486 -67600201 -61373799 -21695820 8568329 10721036 -18161259
27967 -18161259 -71330512 -117376926 -119235978 -82899928 -54604422 -58777301 -69571218
27960 -69571218 -53279875 -10077444 34723929 54958366 33539131 -27083663 -98760961
27953 -98760961 -149197366 -166399264 -148121246 -88241340 -2048177 59496325 62302839
27946 62302839 36080847 24226881 12819951 -30197193 -69084736 -35393059 55540490
27939 55540490 112257350 105214264 105593047 153777955 181245417 121963422 24177782
27932B4177782m8774490k744634k2376735n0869260k6009178J6749029J9500224
27925i0347262M53447O925024K7476505J9638716j3366765l2981979k4664840
27918a06867154k88830L0568535N1042122L1861023k0051285m1782506N797373
27911d9720722O8259205O4810780J889408m3719201m0216194k8204642l3288097
27904f0189463k6766995N688817K5295991Q333090l881412K7071521O3559996
27897C9111545M6417814q003941l2865987j8450072k1301573o0206375p7293657
27890a32592246l2453553K7172310L8833092J6486966J4161255L1373875K2032479
27883a4985822j6738631l3399361n830963K3854197J7539721n702090j1253276
$$ plain form
27932 24177782 -24596708 -27341342 -49718077 -100587337 -126596515 -109847486 -90347262
27925 -90347262 -89893815 -82968791 -55492286 -35853570 -49220335 -82202314 -106867154
27918 -106867154 -107155984 -76587449 -25545327 6315696 -13735589 -55518095 -49720722
27911 -49720722 18538483 83349263 85238671 41519470 1303276 -26901366 -60189463
27904 -60189463 -86956458 -81267641 -55971650 -47638560 -51519972 -24448451 39111545
27897 39111545 85529359 77525418 44659431 26209359 4907786 -55298589 -132592246
27890 -132592246 -165045799 -137873489 -99040397 -82553431 -68392176 -37018301 -14985822
27883 -14985822 -31724453 -65123814 -70954777 -47100580 -29560859 -35262949 -46516225
27876d6516225k930445k382036m571664R677092L3798975M1947208K7922018R365997
27868F6310920m660401k4307437n1178283o1195008l2794763J4520504L1952328
27861f1352140K824778k6047618j567725N6356189P4576038L1914643p566270
27854F9137895O317822L2411610J0484640l7280736m8448081k9669142l7045239
27847c4091231o3488445m3313971K3997241N3836101R284924l7682241k2357300
27840a13814922J7514638J8915276n772773j0821558j540731p180359j4622024
27833a17322453L156436K7638559K5854020R427373N826191M107734j3709732
27826e5021872k2561334L781764L5739541L6477810L0876811N4960080P3412895
$$ plain form
27876 -46516225 -49446670 -51828706 -56400370 -46723278 -12924303 29022905 56944923 66310920
27868 66310920 61650519 37343082 -13835201 -75030209 -107824972 -93304468 -61352140
27861 -61352140 -58527362 -84574980 -86142705 -29786516 44789522 76704165 69137895
27854 69137895 75455717 107867327 118351967 81071231 32623150 2954008 -34091231
27847 -34091231 -97579676 -140893647 -116896406 -63060305 -53775381 -91457622 -113814922
27840 -113814922 -96300284 -77385008 -83157781 -93979339 -95520070 -102700429 -117322453
27833 -117322453 -114166017 -86527458 -60673438 -51246065 -45419874 -41312140 -55021872
27826 -55021872 -77583206 -73801442 -38061901 -1584091 29292720 84252800 157665695
27819A57665695L2981637k9084523k7557277K9016812M1050849k5054431q0144432
27812I8874330m7694716K5299572M3829605m776280n0177373l9431275N930758
27805C1854621K6023753n897020n0631963m7745995L556745L7916413J9424030
27798A4500584q53940K9099228O4176189K6669479n9666693r2761157m3724088
27791f2560398R667414J2351883N89994J3480326K5911048J4351672J1218831
27784B5010770L8358452N0536494N686724n7907274p3727963l8516294J839065
27777d8720026K5105938L9735356M5589780L6537350K3344804J4232425o585630
27770A29239997m4438794o3449906l2507905J8178262L1115274M63312k4420904
$$ plain form
27819 157665695 190647332 161562809 134005532 163022344 204073193 179018762 98874330
27812 98874330 51179614 76479186 120308791 115532511 65355138 25923863 31854621
27805 31854621 57878374 51981354 1349391 -46396604 -42839859 -4923446 14500584
27798 14500584 13646644 42745872 106922061 133591540 73924847 -18836310 -62560398
27791 -62560398 -52892984 -40541101 -39951107 -26470781 -559733 13791939 25010770
27784 25010770 63369222 113905716 119592440 61685166 -12042797 -50559091 -48720026
27777 -48720026 -23614088 16121268 61711048 98248398 121593202 135825627 129239997
27770 129239997 84801203 21351297 -11156608 7021654 38136928 38600240 14179336
27763A4179336r448998K5843626M0900890J8824387k2320135m5819587k8352107
27756f192588J1835946K9669648Q230362j8223339j3424900P969185L144527l3968639
27748a0959798o0538720m1285315M742348K8091641J2714622k992665J8287047
27741e1940840N1497204L8975631j6230061l8091827J1309533O0658492K6750625
27734H2928757n7568674q9793154m8681177r566989j3329876j6655841R305629
27727a43361325K5958798J0411890M950111L2704606M1489335o414112n5209500
27720h9470197l6969322K0323225L9367425Q998276j8771013j8931476j2470806
27713a07923888j3140311j4821068j8772696k4195341q941154L3836749O1307373
$$ plain form
27763 14179336 4730338 30573964 71474854 90299241 67979106 22159519 -6192588
27756 -6192588 5643358 35313006 43543368 25320029 11895129 19864314 23008841 -10959798
27748 -10959798 -71498518 -112783833 -108041485 -79949844 -67235222 -70227887 -51940840
27741 -51940840 -443636 38531995 22301934 -15789893 -4480360 56178132 82928757
27734 82928757 25360083 -64433071 -113114248 -122681237 -136011113 -152666954 -143361325
27727 -143361325 -117402527 -106990637 -102040526 -69335920 -27846585 -34260697 -89470197
27720 -89470197 -126439519 -106116294 -66748869 -57750593 -76521606 -95453082 -107923888
27713 -107923888 -121064199 -135885267 -154657963 -178853304 -187794458 -153957709 -92650336
27706i2650336L3157740k0952923l6637023k226518L6262727M2796208J9268074
27699b0982051j7704697m3260032k5473988L3021075P1504883L8444955l1003478
27692D546667n3817706o183502N4335945O6820536K5533606l2513967o1127448
27685b405869l4882758K1469071M6740039J5653018k4625043k1388112J1133085
27678A1693431K5596534J4350576J361765o771603j1692183K194900L2060781
27671F8794201L3165556j0946543l9053537l908196L4719211k64124o2408671
27664B0097897m3676261M4839510Q0060811J8720845m4155985l5294479j320927
27657C9271411k3111l668190K2781610L8227593j847162n6484890n9475930j9546506
$$ plain form
27706 -92650336 -59492596 -80445519 -117082542 -119309060 -83046333 -40250125 -20982051
27699 -20982051 -38686748 -81946780 -107420768 -74399693 -2894810 35550145 4546667
27692 4546667 -49271039 -55454541 -1118596 65701940 91235546 58721579 -2405869
27685 -2405869 -37288627 -15819556 30920483 46573501 21948458 560346 11693431
27678 11693431 37289965 51640541 53002306 46230703 34538520 36733420 68794201
27671 68794201 101959757 91013214 51959677 48051481 82770692 82506568 20097897
27664 20097897 -23578364 21261146 101321957 120042802 75886817 40592338 39271411
27657 39271411 39248300 35580110 58361720 96589313 94742151 38257261 -21218669 -40765175
27649d0765175P951095R459730R356724R235736q232109l3846487l9618445j9699528
27641a06158459R706707L4403690M2159910K3596136n174606j0969222N786164
27634f649680O184215k0531626l2053052n330879J5254627j4147240o1774288
27627a19047923o3951076j4950503L6132587N7264961N5055858L8191981M637206
27620f666909l5124251n4218219l5622731Q107171L9981918K8645962r802300
27613f4699359j3456468M6262357J02552021O9375693k5401197o2333319k907079
27606D9392649M9141401M020625q0344773r0740466k0013451M5349697N4570366
27599A1376048K8315527m492114k7302892j3100084M5468267R4277872P1518210
$$ plain form
27649 -40765175 -32814080 -23354350 -13997626 -4761890 -12993999 -46840486 -86458931 -106158459
27641 -106158459 -96451752 -62048062 -19888152 3707984 -1466622 -12435844 -6649680
27634 -6649680 -465465 -20997091 -53050143 -58381022 -43126395 -57273635 -119047923
27627 -119047923 -182998999 -197949502 -161816915 -104551954 -49496096 -11304115 -6666909
27620 -6666909 -41791160 -96009379 -131632110 -123524939 -83543021 -54897059 -64699359
27613 -64699359 -78155827 -31893470 70658551 140034244 114633047 52299728 49392649
27606 49392649 98534050 102554675 22209902 -68530564 -88544015 -43194318 11376048
27599 11376048 39691575 35199461 7896569 -5203515 40264752 134542624 206060834
27592B06060834n340959o4100409p5244314o4991769m8118978j7585058O988200
27585f2332453n783055l1940609j1002834N4923703Q7929248M3685723k5239529
27578E0240194m8171696l0446562k7308404n2822354n8920214m414906Q0813949
27571i1029993J16421460O0486231l3316643p1901096l5462092N038922m470362
27564e4233573k8382761j2426973K3662312K2767738j5769703m3578214m1657770
27557a49618944k8497554q580555K3640533M4081194K7681909K241209Q742257
27550h0309951K6062087P893306k4701321j3669825K6400697K7119760p920556
27543c9125803m773674M1746538M8048044p801664l6962242M884489L2647728
$$ plain form
27592 206060834 200719875 136619466 61375152 -3616617 -51735595 -69320653 -62332453
27585 -62332453 -68115508 -100056117 -111058951 -56135248 31794000 75479723 50240194
27578 50240194 2068498 -28378064 -55686468 -108508822 -167429036 -171843942 -91029993
27571 -91029993 25391467 85877698 52561055 -19340041 -54802133 -49763211 -54233573
27564 -54233573 -82616334 -95043307 -71380995 -48613257 -64382960 -107961174 -149618944
27557 -149618944 -178116498 -186697053 -163056520 -118975326 -91293417 -89052208 -80309951
27550 -80309951 -54247864 -46354558 -71055879 -84725704 -58325007 -31205247 -39125803
27543 -39125803 -43899477 -2152939 45895105 38093441 1131199 6015688 38663416
27536C8663416j9166922p3099579l7872363L1267575K4682371l6302290m2204805
27529a14032597J4759899L5024728j0620645l4826817R405018M7327133J0315050
27522d2648231n0882528m9238674Q051590M4228150L0068957R181424J9589546
27515c1649766M4089183M4657192J3807412k0322307k7585997o592619J7725537
27508C4128635K4670471J7886112J1437372R357131R118170R882930L966727j9882282
27500A00565266m6810497l6458436J7390898N6265381K9393009k6494672l4911902
27493E8939047O147578K2731827j9783428o7845043o6632173l3847485j2522637
27486a12812314k186789J8512209L8604140L2580993Q719193l942846l388694
$$ plain form
27536 38663416 19496494 -53603085 -91475448 -60207873 -35525502 -71827792 -114032597
27529 -114032597 -99272698 -64247970 -74868615 -109695432 -100290414 -52963281 -42648231
27522 -42648231 -93530759 -142769433 -134717843 -90489693 -60420736 -51239312 -31649766
27515 -31649766 12439417 57096609 70904021 50581714 22995717 16403098 34128635
27508 34128635 58799106 76685218 88122590 97479721 106597891 116480821 120447548 100565266
27500 100565266 53754769 17296333 34687231 90952612 120345621 93850949 58939047
27493 58939047 65086625 87818452 68035024 189981 -66442192 -100289677 -112812314
27486 -112812314 -114999103 -96486894 -57882754 -25301761 -16582568 -20525414 -23914108
27479b3914108j1596655l1546618l9727500j9962678J7037554M4983380M0949431
27472b3777194N056848k8622131k1471726J6535372L1248246O49326k8614160
27465d8995419j2222731K0700399J3817009k7262824m8109096l0888519o671272
27458a39632453R834626L3880791N6332473M2508404J303905r552302K4699445
27451A9374889M0790168m133941n3699551k9175077N0855628Q9715242L6929945
27444A50657303n8935680j16805674j00597599l2975444L2171083M9736543K1304832
27437e5444636r031740j0658308P83314M546224J4236876M0171390M8284112J0190932
27429D3078164l4050413k8297256M747969k638729m3775014m1370339J8678927
$$ plain form
27479 -23914108 -35510763 -67057381 -106784881 -126747559 -109710005 -64726625 -23777194
27472 -23777194 -18720346 -47342477 -68814203 -52278831 -21030585 -20381259 -48995419
27465 -48995419 -61218150 -40517751 -26700742 -53963566 -102072662 -132961181 -139632453
27458 -139632453 -129797827 -95917036 -39584563 2923841 4227746 -5324556 19374889
27451 19374889 60165057 56031116 2331565 -26843512 24012116 113727358 150657303
27444 150657303 91721623 -25084051 -125681650 -158657094 -126486011 -76749468 -55444636
27437 -55444636 -64476376 -75134684 -74351370 -69805146 -55568270 -15396880 32887232 43078164
27429 43078164 9027751 -19269505 -14521536 -17160265 -60935279 -102305618 -83626691
27422h3626691N3234573J7597087j6929328J7991027P0164036N0176980k4224510
27415H4383174n9476314k9684861M043745M780095n69092K095570j5923625n4829603
27407f5180911n8922852J78592O8351508Q0597805M7119982K3602679K5477620
27400A21224423J9300737j3794291m9164934n5703220l3531564p964635j179578
27393b0813062j3571933k4990893j5257140J1408248K8354345J9964634M885468
27386a0020333J3086912M3563634O0885996L9206620l118041k6068234j9064248
27379I8472306r876948j8370023k5711759r819535R180701n427889m3787681n4782072
27371f0122900k0250307J9562549K9565513K3845316K1989485Q896398k3168081
$$ plain form
27422 -83626691 -30392118 -12795031 -29724359 -11733332 58430704 108607684 84383174
27415 84383174 24906860 -4778001 -734256 4045839 3476747 5572317 -10351308 -65180911
27407 -65180911 -124103763 -123925171 -55573663 25024142 72144124 95746803 121224423
27400 121224423 140525160 126730869 77565935 21862715 -11668849 -19633484 -20813062
27393 -20813062 -34384995 -59375888 -74633028 -63224780 -34870435 -14905801 -10020333
27386 -10020333 3066579 46630213 107516209 146722829 143604788 117536554 98472306
27379 98472306 88595358 70225335 44513576 34694041 43874742 38446853 -5340828 -60122900
27371 -60122900 -80373207 -60810658 -31245145 -7399829 14589656 23486054 317973
27364C17973l6020315j554659L7439804K3653561k0557703k3080300K3967196
27357D165557N0954742J6904145l6794815n5145496l5430274m832848J7170860
27350d3008129J3826488k3665350o4743430n9297489j0065204K1990689P651688
27343a57310737o547547K4154673P1283709Q0678079N0003334J4253845j1921311
27336F4594045l2757217m1242557l3799149k9722043l6426539k4295171K0862482
27329a12786149N2224650K2479741l5243874m7175511m609733L1802282K7243198
27322f6065396J0317777J1642126K2942352K9413922L2165793K4834089m667874
27315F0582789l5055799k3636294K3458572M3289042N728618l8270489l5572872
$$ plain form
27364 317973 -35702342 -37257001 182803 23836364 3278661 -19801639 4165557
27357 4165557 55120299 72024444 35229629 -19915867 -55346141 -60178989 -43008129
27350 -43008129 -29181641 -52846991 -117590421 -176887910 -186953114 -164962425 -157310737
27343 -157310737 -163858284 -139703611 -68419902 12258177 62261511 76515356 64594045
27336 64594045 31836828 -9405729 -43204878 -72926921 -109353460 -133648631 -112786149
27329 -112786149 -60561499 -38081758 -73325632 -120501143 -125110876 -93308594 -66065396
27322 -66065396 -55747619 -44105493 -21163141 8250781 40416574 65250663 60582789
27315 60582789 25526990 1890696 25349268 68638310 74366928 36096439 523567
27308E23567j1006402j5728197l2622459l662723O1729672Q3086182K9945302
27301A12264942k2963900l314680M8659820L9242975l7472995r0287735o5021189
27294a8892762j6215153j3562960l6056559j5562363M8458360Q4455299N2692352
27287H5316214n979867l5477100k9661017j4202543l362342K096506K288503K591603
27279C609957R058723J1287216k969212j4243316O928758L8594053K1280816m6358473
27271B7188522q4346643m1604263K4623386L0723303j7079465m8192206l3630683
27264a42318049j263292K8627170N4136224N4648276J3007951l2586094k7081462
27257e2829276J3312054K0338115j6812547l5304160n665121K0636384N67002
$$ plain form
27308 523567 -10482835 -26211032 -58833491 -62496214 -766542 82319640 112264942
27301 112264942 89301042 85986362 134646182 173889157 136416162 46128427 -18892762
27294 -18892762 -35107915 -48670875 -84727434 -100289797 -51831437 32623862 85316214
27287 85316214 79336347 43859247 14198230 -4313 -3366655 -1270149 1018354 3609957
27279 3609957 12668680 23955896 20986684 6743368 13672126 52266179 73546995 27188522
27271 27188522 -57158121 -98762384 -74138998 -43415695 -60495160 -108687366 -142318049
27264 -142318049 -143581341 -114954171 -60817947 -6169671 6838280 -25747814 -52829276
27257 -52829276 -39517222 -19179107 -35991654 -71295814 -76960935 -56324551 -55757549
27250e5757549l1506731k6521208L212514J9399008K5712102M6610143O6387225
27243D7535504M4071286j8569514o6286517n3145712N634161M9374186L4016484
27236D2629878j9449086m5514361j5003559K3229235J1658147k7600299k8043519
27229e8093564J0936027K3442188o780930j5350044K6447385N1420003Q776170
27222D0797235m2278558k8385128J3956451M367266l9334301l3137729K3387206
27215f0627558M3642863K063729k5382357O797865M2901897K9738445J243304
27208D0378188L121264J0068331j3224388l1006290M178677N4533345M4094119
27201A12143246j9445031n2507491k1735821J3435577k817023m7780836o6736597
$$ plain form
27250 -55757549 -87264280 -113785488 -110572974 -91173966 -65461864 -18851721 47535504
27243 47535504 91606790 73037276 6750759 -46394953 -40760792 8613394 42629878
27236 42629878 23180792 -22333569 -37337128 -14107893 -2449746 -30050045 -58093564
27229 -58093564 -47157537 -23715349 -30496279 -45846323 -19398938 32021065 40797235
27222 40797235 -1481323 -29866451 -15910000 -11542734 -50877035 -84014764 -60627558
27215 -60627558 -16984695 -14920966 -40303323 -33505458 9396439 39134884 40378188
27208 40378188 43499452 53567783 40343395 9337105 13515782 68049127 112143246
27201 112143246 92698215 40190724 18454903 31890480 29073457 -18707379 -85443976
27194h5443976m6910960j5798601M003682J3595708K7394085N3979271P4904420
27187B5723629N2199364j5523503o1540661k5596373M8100332N4604162k0943874
27180E7023076p4738558l9143417J6930603M982867m0893263l1913770J7675631
27173i0076831J6222439m0734859n3959702J5595499Q1413986P1895723L3652953
27166C4009208L2670901M1475173N497499m7164145n3692440k6588550k3416380
27159c7208734l9998448k8000494K353676l749135l4391189j5056433O0769396
27152i5281361J01391428N2108048k2001147l5405175K874390K6360911J0985218
27145D1032312j6317832l1353924k6550598K67511L1443175L1835202p61411k0218216
$$ plain form
27194 -85443976 -132354936 -148153537 -144149855 -130554147 -103160062 -49180791 25723629
27187 25723629 77922993 62399490 858829 -24737544 23362788 77966950 57023076
27180 57023076 -17715482 -56858899 -39928296 -34945429 -75838692 -107752462 -90076831
27173 -90076831 -73854392 -114589251 -168548953 -152953454 -71539468 356255 34009208
27166 34009208 66680109 108155282 113652781 66488636 12796196 -13792354 -37208734
27159 -37208734 -77207182 -105207676 -102854000 -106603135 -140994324 -156050757 -95281361
27152 -95281361 6110067 58218115 36216968 811793 3686183 30047094 41032312
27145 41032312 24714480 -6639444 -33190042 -32922531 -1479356 30355846 29594435 9376219
27137I376219p34959J8325642j903865l0323639j6819480K1302772K8903060P479298
27129C5605048R272341M2716866N4086712J4484849l5992152n1691299l8599104
27122B9883261k3738959j0619343N483036J1261567m496461k6534690l3848190
27115e2609779k6498543j2210885J2462105M5118998O2102871M7347600K1774216
27108I7486583J5497139K1581174Q454320k6717258n0530078m3037001k3188896
27101d54017j3405515q439319J224865J669672j9213389l7027358j8452512K2603275
27093g1494298L5424293M257787k7345717j7845703J9739597M5579248M3092671
27086C1407878J9337162j4340859l5914411j8625070K4460192L5438404p924603
$$ plain form
27137 9376219 8641260 26966902 25063037 -5260602 -22080082 -777310 28125750 35605048
27129 35605048 44877389 87594255 141680967 156165816 120173664 68482365 29883261
27122 29883261 6144302 -4475041 1007995 12269562 7773101 -18761589 -52609779
27115 -52609779 -79108322 -91319207 -78857102 -33738104 28364767 75712367 97486583
27108 97486583 112983722 134564896 143019216 116301958 65771880 22734879 -454017
27101 -454017 -13859532 -22298851 -21073986 -19404314 -38617703 -75645061 -94097573 -71494298
27093 -71494298 -36070005 -31812218 -59157935 -77003638 -57264041 -11684793 31407878
27086 31407878 50745040 36404181 489770 -18135300 6324892 41763296 33838693
27079C3838693m2451322o075211N7788331N5436142j5696037o4596577m4189636
27072b5945617k968786J4341896K5953860M2255412K7207759k0921303l4946730
27065B4976491J3202424M7804052O156137n2418832m2168897Q140088J3311475
27058A9002938j8076031q742154L8920298M2862333j2540852m9576779l2645801
27051b0796048j7821750l5647755l2234542K2076661O0590752K4437233l4602727
27044c3998176k9371271L5016525P8381642N8042741N578993k8502761k4010608
27037F1137085j745630q368129o3248893j10569632p5923273J4529990M6072767
27030a38115715j7291122o4462524l242422Q9315824Q2877618l220658l7637800
$$ plain form
27079 33838693 -8612629 -14687840 43100491 98536633 82840596 18244019 -25945617
27072 -25945617 -28914403 -14572507 11381353 53636765 80844524 59923221 24976491
27065 24976491 38178915 85982967 92139104 39720272 -2448625 5691463 19002938
27058 19002938 926907 -7815247 31105051 73967384 61426532 11849753 -20796048
27051 -20796048 -38617798 -74265553 -106500095 -84423434 -23832682 604551 -33998176
27044 -33998176 -63369447 -28352922 50028720 108071461 113650454 85147693 61137085
27037 61137085 59391455 51023326 -12225567 -122795199 -198718472 -184188482 -138115715
27030 -138115715 -155406837 -219869361 -223111783 -133795959 -50918341 -54138999 -91776799
27023i1776799J3836614N1985142K0499261j4358165K434620K0001208j4898005
27016a2276124n5801399l9684705j033700j1743084n3159361m3229808K8076426
27009a88851755Q0687048O5675954K6748685J9701454L3259932K3881556j3243374
27002D7859500m4502115m5642041k0847901J1214164K9987823K3850267L787408
26995E707105n104295L881276J0698649K732357m581173J557629L715269j5098763
26987C508054l2240076j4091162K4651265L2426195l859001l6053024k4220482
26980d9878231O903069Q478760k1047674l8740886j9137015J7886917L8803242
26973e6731818L1902519R947766o011678o053716n318368k9734837p4125168q9899295
$$ plain form
27023 -91776799 -77940185 -25955043 -5455782 -19813947 -17379327 2621881 -12276124
27016 -12276124 -68077523 -107762228 -108795928 -120539012 -173698373 -216928181 -188851755
27009 -188851755 -108164707 -42488753 -15740068 3961386 37221318 61102874 47859500
27002 47859500 3357385 -42284656 -63132557 -51918393 -21930570 1919697 5707105
26995 5707105 602810 4484086 15182735 17915092 13333919 14891548 18606817 3508054
26987 3508054 -28732022 -42823184 -18171919 14254276 10395275 -25657749 -49878231
26980 -49878231 -42975162 -34496402 -55544076 -94284962 -113421977 -95535060 -56731818
26973 -56731818 -24829299 -14881533 -20893211 -26946927 -32265295 -62000132 -136125300 -226024595
26965b26024595l9842496M4484909R0239984O6170228R817096k6887097k7452696
26958a09494667l230613K7885488M1580434J8670743k2526475l1965046J0005684
26951f9074452N8961204O2384819K9873443J2749890K4587683K3902132j7023804
26944A26360915o3758816o4412811k1236482J2541124K116118l1034857m7016366
26937h6441175l7146214j7122068Q602237M3033271O4365815L8298845k4691407
26930a1100696o0458744k5970446M2081607P2725788M4892363n119039m1493100
26923A5557733n5277071m4475497j1200211K1440374K7411695J5161643J4114738
26916a7266596K6284023K8747456K1125758K5273047L5165059J7189522k8884317
$$ plain form
26965 -226024595 -265867091 -221382182 -131142198 -64971970 -55154874 -82041971 -109494667
26958 -109494667 -112725280 -84839792 -43259358 -24588615 -47115090 -79080136 -69074452
26951 -69074452 -10113248 52271571 82145014 94894904 119482587 143384719 126360915
26944 126360915 62602099 -1810712 -23047194 -10506070 -8389952 -39424809 -86441175
26937 -86441175 -123587389 -140709457 -132107220 -89073949 -24708134 13590711 -11100696
26930 -11100696 -71559440 -97529886 -55448279 17277509 62169872 57050833 15557733
26923 15557733 -39719338 -84194835 -95395046 -73954672 -46542977 -31381334 -17266596
26916 -17266596 9017427 37764883 58890641 84163688 119328747 136518269 107633952
26909A07633952n9189801n1935349l5045682k9666492j9338184N37818J88207
26902h6815531k3547036k2511750K1463357M9003642J5495104k4367758o52319
26895g1932291M7107534K3938090o0990530r0873458j0624134Q9945823R8790470
26888B5361504K1163184m7681159m4368827J1178025N9290938N9366147J6914202
26881A01224014k7242956m0548081l2903815l2562785l7770799k5210426j541415
26874i6556263j436172k5660848k7646447J6115698O1958933N6384361R955609
26867f885129j9144784p18965L6475345M5192058J3640966k2602968k1136620
26860B4819903J1921635K0456116k8898891q9342437q5829348j5663082M9623226
$$ plain form
26909 107633952 48444151 -3491198 -38536880 -68203372 -87541556 -87003738 -86815531
26902 -86815531 -110362567 -132874317 -111410960 -62407318 -46912214 -71279972 -71932291
26895 -71932291 -24824757 -886667 -61877197 -152750655 -163374789 -73428966 25361504
26888 25361504 46524688 -1156471 -45525298 -34347273 24943665 84309812 101224014
26881 101224014 73981058 33432977 529162 -32033623 -69804422 -95014848 -96556263
26874 -96556263 -97992435 -123653283 -151299730 -135184032 -73225099 -16840738 -6885129
26867 -6885129 -26029913 -26748878 9726467 54918525 68559491 45956523 24819903
26860 24819903 36741538 57197654 28298763 -61043674 -146873022 -162536104 -112912878
26853a12912878O3947177N3749645N1273837L9814350j38128l9166533l9261342
26846A7306128j2576745L741924L821581J901384p628163l1483256m2086296j3901425
26838h0904868K1736782J5918576j3491072j929962N3272365P3654762J4735465
26831H2992048o0341603o5891555r231011L0680053J5045359j8202972k2497522
26824d7447203K311506L1080643M9487954N1255520K8469460j1975229l9319792
26817F3862859k8881992P010408L4506270L5795074J4676688k2883840o6598309
26810C7487158q5583097m9863506K1007378O2219363L7403497j6127913l9582474
26803c3039594k6525640j2144823q757873K264445J8684863P691967l6411286
$$ plain form
26853 -112912878 -48965701 4783944 56057781 95872131 95734003 56567470 17306128
26846 17306128 4729383 8471307 12292888 14194272 6566109 -24917147 -67003443 -80904868
26838 -80904868 -59168086 -43249510 -56740582 -58670544 -5398179 68256583 82992048
26831 82992048 22650445 -43241110 -52472121 -21792068 -6746709 -24949681 -47447203
26824 -47447203 -45135697 -14055054 35432900 86688420 115157880 103182651 63862859
26817 63862859 34980867 41991275 76497545 112292619 126969307 104085467 37487158
26810 37487158 -48095939 -97959445 -76952067 -14732704 22670793 6542880 -33039594
26803 -33039594 -59565234 -71710057 -80467930 -78203485 -59518622 -51826655 -88237941
26796h8237941o5072747l3029393M1140431R6037417R2432585L9258415k6384951
26789E6143816o3986315n1206550o181126K0628451r14413m2244096n0084211
26782a37844444j2562875L0708578M2824313L0110722K0317508J8373661K727005
26775e345532l4440992n9806451l0158237M6846385J04495693Q8775735K4335787
26768A34702388j8915817j6825734j1121218l5193569o2795925n2260333p916735
26761g0326943L1488398M2051733K5445622q163198m0199539m6219605k6475702
26754i2399234j4561909k6944408k8171334J5248131O9271166P2124321K8584454
26747B3151187O454146L4260779N9976630L2784495k2900040m8442926l2243276
$$ plain form
26796 -88237941 -153310688 -186340081 -145199650 -49162233 43270352 82528767 56143816
26789 56143816 -7842499 -59049049 -65230175 -44601724 -45516137 -87760233 -137844444
26782 -137844444 -150407319 -119698741 -76874428 -46763706 -26446198 -8072537 -5345532
26775 -5345532 -39786524 -99592975 -129751212 -82904827 21590866 110366601 134702388
26768 134702388 115786571 98960837 87839619 52646050 -10149875 -62410208 -70326943
26761 -70326943 -38838545 3213188 28658810 20495612 -19703927 -65923532 -92399234
26754 -92399234 -106961143 -133905551 -162076885 -146828754 -77557588 -5433267 23151187
26747 23151187 29605333 63866112 123842742 156627237 133727197 85284271 53040995
26740E3040995j3173501k1222050m6963293o2543991m9792648j1504678K9552745
26733a22606421M6951198L5855744J5921882L964258l655125j4122335j9958445
26726e7649244j1892490J242980J135960j5478531l1004844k4320725Q124258
26719a29842636M3532433M8517250J5996430j7818932j2737303K1346194L6066923
26712E060359J2762432j3967237j2425362K340609L388679l896287n731416j8164305
26704c0632528n6630244q6602264n7398044J7883114O7398036N4561513K0744270
26697g0676147J6755435L4517639L5482923J3905203m110947n802670k242725
26690A7828711k869999p399656j7544263l2848848l8940088k1827180Q566091
$$ plain form
26740 53040995 39867494 18645444 -28317849 -90861840 -140654488 -152159166 -122606421
26733 -122606421 -75655223 -39799479 -23877597 -19913339 -23568464 -37690799 -57649244
26726 -57649244 -69541734 -68298754 -67162794 -82641325 -113646169 -137966894 -129842636
26719 -129842636 -86310203 -37792953 -21796523 -39615455 -52352758 -31006564 5060359
26712 5060359 17822791 3855554 -8569808 -6229199 -2840520 -6736807 -12468223 -30632528
26704 -30632528 -87262772 -173865036 -231263080 -213379966 -145981930 -91420417 -70676147
26697 -70676147 -53920712 -19403073 16079850 29985053 25874106 20071436 17828711
26690 17828711 14958712 7559056 -9985207 -42834055 -81774143 -103601323 -95035232
26683i5035232K8417933L0317779K4784422J6303433M93321j5907859j6076045
26676b6702248J416863J7855966K0019353J3299269N660133l905215j6460949
26669A1183172k7687746l2540960k1797469J7091013P1535272Q9616093L7023368
26662A44422743l6212358m2741312J7075005M3624307j5585821p7937297m5584160
26655a2938893M4850030P7399698K5348521l2541638m9806883o0243834p7184432
26648h5117431n3580699J5873951M9998677K840112m9185696k0007892M8984269
26641i0194709N4833299o557613m3784849j5222836K5074495K9416489J6604991
26634b9830733J1049150k038094k9886362m2157630k2464634p13532o34371R13291
$$ plain form
26683 -95035232 -66617299 -36299520 -11515098 4788335 5281656 -10626203 -26702248
26676 -26702248 -25285385 -7429419 12589934 25889203 31549336 27644121 11183172
26669 11183172 -16504574 -49045534 -70843003 -53751990 17783282 107399375 144422743
26662 144422743 108210385 65469073 82544078 126168385 110582564 32645267 -12938893
26655 -12938893 31911137 109310835 134659356 102117718 52310835 -7932999 -85117431
26648 -85117431 -138698130 -122824179 -72825502 -69985390 -119171086 -139178978 -90194709
26641 -90194709 -35361410 -41919023 -85703872 -100926708 -75852213 -46435724 -29830733
26634 -29830733 -18781583 -20819677 -50706039 -92863669 -115328303 -116041835 -116676206 -115762915
26626a15762915K6777309N1139758L9102628N062957j0452879k655596p18796
26619g507534j4293829j9035381K603188L1288648K8771218k1196780q7157244
26612h6527714j06284362m4955652N1567585R4883575N2512612j3706209k6477568
26605g8987733J6451100N7249202N8916675L4309404Q023946j0609617j7603775
$$ plain form
26626 -115762915 -88985606 -37845848 1256780 6319737 -4133142 -6788738 -7507534
26619 -7507534 -21801363 -40836744 -38233556 -6944908 21826310 629530 -86527714
26612 -86527714 -192812076 -237767728 -186200143 -91316568 -38803956 -52510165 -78987733
26605 -78987733 -62536633 -5287431 53629244 87938648 95962594 85352977 67749202
$$ [...]
##END NTUPLES=NMR SPECTRUM
##END=
